##TITLE=1H_UK_23_9_14
 CD2Cl2
 128 sc, 
 16.2.2023
##JCAMPDX= 6.0         $$ Bruker NMR JCAMP-DX V2.0
##DATA TYPE= NMR FID
##DATA CLASS= NTUPLES
##ORIGIN= UXNMR, Bruker Analytische Messtechnik GmbH
##OWNER= root
$$ XWIN-NMR		Version 3.5
$$ Thu Feb 16 14:14:08 2023 Russian Standard Time (UT+4h)  she@DPX200
##.OBSERVE FREQUENCY= 200.13135
##.OBSERVE NUCLEUS= ^1H
##.DELAY= (6, 6)
##.ACQUISITION MODE= SIMULTANEOUS
##.ACQUISITION SCHEME= undefined
##.AVERAGES= 112
##.DIGITISER RES= 18
##SPECTROMETER/DATA SYSTEM= spect
##.PULSE SEQUENCE= zg30
##.SOLVENT NAME= CD2Cl2
##.SHIFT REFERENCE= (INTERNAL, CD2Cl2, 0, 15.7039)
##AUDIT TRAIL= $$ (NUMBER, WHEN, WHO, WHERE, WHAT)
$$ ##TITLE= Audit trail, XWIN-NMR		Version 3.5
$$ ##JCAMPDX= 5.01
$$ ##ORIGIN= Bruker BioSpin GmbH
$$ ##OWNER= she
$$ F:/spectra/data/she/nmr/H-F/1/audita.txt
$$ ##AUDIT TRAIL=  $$ (NUMBER, WHEN, WHO, WHERE, WHAT)
(   1,<2023-02-16 14:12:54.75 +0400>,<she>,<DPX200>,
      <continue with go, POWCHK disabled, PULCHK disabled
       configuration hash MD5:
       00 E9 B6 7A A2 85 ED C7 34 08 36 98 17 FE 4E 26
       data hash MD5: 16K
       2F 6C C2 1E 3D D0 32 74 8E D7 93 65 86 DF 4A 0B>)
$$ ##END=
$$ 
$$ hash MD5
$$ 2C 70 8B 7F A1 BE 9A B7 18 6F 00 25 66 DC 0D 96
##$RELAX= 
##$RELAX= 
##$RELAX= 
##$RELAX= 
##$RELAX= 
##$RELAX= 
$$ Bruker specific parameters
$$ --------------------------
##$DU= <F:/spectra>
##$EXPNO= 1
##$NAME= <H-F>
##$PROCNO= 1
##$TYPE= <nmr>
##$USER= <she>
##$AMP= (0..31)
100 100 100 100 100 100 100 100 100 100 100 100 100 100 100 100 100 100 
100 100 100 100 100 100 100 100 100 100 100 100 100 100 
##$AQSEQ= 0
##$AQ_mod= 1
##$AUNM= <au_zg>
##$AUTOPOS= <>
##$BF1= 200.13
##$BF2= 200.13
##$BF3= 200.13
##$BF4= 200.13
##$BF5= 200.13
##$BF6= 200.13
##$BF7= 200.13
##$BF8= 200.13
##$BYTORDA= 1
##$CFDGTYP= 0
##$CFRGTYP= 5
##$CHEMSTR= <none>
##$CNST= (0..31)
1 1 145 1 1 1 1 1 1 1 1 1 1 1 1 1 1 1 1 1 1 1 1 1 1 1 1 1 1 1 1 1 
##$CPDPRG= <>
##$CPDPRG1= <>
##$CPDPRG2= <>
##$CPDPRG3= <>
##$CPDPRG4= <mlev>
##$CPDPRG5= <mlev>
##$CPDPRG6= <mlev>
##$CPDPRG7= <mlev>
##$CPDPRG8= <mlev>
##$CPDPRGB= <>
##$CPDPRGT= <>
##$D= (0..31)
0 1.2 0 0 0 0 0 0 0 0.06 0 0.03 0 0 0 0 0.0002 0 0 0 0 0 0 0 0 0 0 0 0 
0 0 0 
##$DATE= 1676541916
##$DBL= (0..7)
120 120 120 120 120 120 120 120 
##$DBP= (0..7)
150 150 150 150 150 150 150 150 
##$DBP07= 0
##$DBPNAM0= <>
##$DBPNAM1= <>
##$DBPNAM2= <>
##$DBPNAM3= <>
##$DBPNAM4= <>
##$DBPNAM5= <>
##$DBPNAM6= <>
##$DBPNAM7= <>
##$DBPOAL= (0..7)
0.5 0.5 0.5 0.5 0.5 0.5 0.5 0.5 
##$DBPOFFS= (0..7)
0 0 0 0 0 0 0 0 
##$DE= 6
##$DECBNUC= <off>
##$DECIM= 32
##$DECNUC= <off>
##$DECSTAT= 4
##$DIGMOD= 1
##$DIGTYP= 9
##$DL= (0..7)
0 120 120 120 120 120 120 120 
##$DP= (0..7)
150 150 150 150 150 150 150 150 
##$DP07= 0
##$DPNAME0= <>
##$DPNAME1= <>
##$DPNAME2= <>
##$DPNAME3= <>
##$DPNAME4= <>
##$DPNAME5= <>
##$DPNAME6= <>
##$DPNAME7= <>
##$DPOAL= (0..7)
0.5 0.5 0.5 0.5 0.5 0.5 0.5 0.5 
##$DPOFFS= (0..7)
0 0 0 0 0 0 0 0 
##$DQDMODE= 0
##$DR= 18
##$DS= 0
$$ [...]
##$SUBNAM2= <"">
##$SUBNAM3= <"">
##$SUBNAM4= <"">
##$SUBNAM5= <"">
##$SUBNAM6= <"">
##$SUBNAM7= <"">
##$SUBNAM8= <"">
##$SUBNAM9= <"">
##$SW= 18.05172834244
##$SWIBOX= (0..15)
0 0 2 0 0 0 0 0 0 0 0 0 0 0 0 0 
##$SW_h= 3612.71676300578
##$TD= 16384
##$TD0= 1
##$TE= 0
##$TE2= 300
##$TE3= 300
##$TEG= 300
##$TL= (0..7)
0 120 120 120 120 120 120 120 
##$TP= (0..7)
150 150 150 150 150 150 150 150 
##$TP07= 0
##$TPNAME0= <>
##$TPNAME1= <>
##$TPNAME2= <>
##$TPNAME3= <>
##$TPNAME4= <>
##$TPNAME5= <>
##$TPNAME6= <>
##$TPNAME7= <>
##$TPOAL= (0..7)
0.5 0.5 0.5 0.5 0.5 0.5 0.5 0.5 
##$TPOFFS= (0..7)
0 0 0 0 0 0 0 0 
##$TUNHIN= 0
##$TUNHOUT= 0
##$TUNXOUT= 0
##$USERA1= <user>
##$USERA2= <user>
##$USERA3= <user>
##$USERA4= <user>
##$USERA5= <user>
##$V9= 5
##$VALIST= <valist>
##$VCLIST= <CCCCCCCCCCCCCCC>
##$VD= 0
##$VDLIST= <DDDDDDDDDDDDDDD>
##$VPLIST= <PPPPPPPPPPPPPPP>
##$VTLIST= <TTTTTTTTTTTTTTT>
##$WBST= 1024
##$WBSW= 4
##$XGAIN= (0..3)
0 0 0 0 
##$XL= 0
##$YL= 0
##$YMAX_a= 1666441
##$YMIN_a= -1315025
##$ZGOPTNS= <>
##$ZL1= 120
##$ZL2= 120
##$ZL3= 120
##$ZL4= 120
##$ABSF1= 10
##$ABSF2= 0
##$ABSG= 5
##$ABSL= 3
##$ALPHA= 0
##$AQORDER= 0
##$ASSFAC= 0
##$ASSFACI= 0
##$ASSFACX= 0
##$ASSWID= 0
##$AUNMP= <proc_1d>
##$AZFE= 0.1
##$AZFW= 0.1
##$BCFW= 1
##$BC_mod= 2
##$BYTORDP= 1
##$COROFFS= 0
##$CY= 11.3945322036743
##$DATMOD= 1
##$DC= 2
##$DFILT= <>
##$DTYPP= 0
##$F1P= 2.36226072786647
##$F2P= -0.459571619588291
##$FCOR= 0.5
##$FTSIZE= 0
##$FT_mod= 4
##$GAMMA= 1
##$GB= 0.15
##$INTBC= 1
##$INTSCL= 1
##$ISEN= 128
##$LB= 0.24
##$LEV0= 0
##$LPBIN= 0
##$MAXI= 10000
##$MC2= 0
##$MEAN= 0
##$ME_mod= 0
##$MI= 1.114404
##$NCOEF= 0
##$NC_proc= 0
##$NLEV= 6
##$NOISF1= 3.799351
##$NOISF2= 2.8
##$NSP= 1
##$NTH_PI= 0
##$NZP= 0
##$OFFSET= 15.70392
##$PC= 1
##$PHC0= -19116.71
##$PHC1= 17.60078
##$PH_mod= 1
##$PKNL= yes
##$PPARMOD= 0
##$PSCAL= 0
##$PSIGN= 0
##$REVERSE= no
##$SF= 200.130013532006
##$SI= 16384
##$SIGF1= 3
##$SIGF2= 2
##$SINO= 400
##$SIOLD= 16384
##$SREGLST= <1H.CDCl3>
##$SSB= 0
##$STSI= 0
##$STSR= 0
##$SW_p= 3612.71676300578
##$SYMM= 0
##$S_DEV= 0
##$TDeff= 0
##$TDoff= 0
##$TI= <>
##$TILT= no
##$TM1= 0
##$TM2= 0
##$TOPLEV= 0
##$USERP1= <user>
##$USERP2= <user>
##$USERP3= <user>
##$USERP4= <user>
##$USERP5= <user>
##$WDW= 1
##$XDIM= 8192
##$YMAX_p= 0
##$YMIN_p= 0
$$ End of Bruker specific parameters
$$ ---------------------------------
##NTUPLES= NMR FID
##VAR_NAME=  TIME,          FID/REAL,        FID/IMAG
##SYMBOL=    X,             R,               I
##VAR_TYPE=  INDEPENDENT,   DEPENDENT,       DEPENDENT
##VAR_FORM=  AFFN,          ASDF,            ASDF
##VAR_DIM=   8192,          8192,            8192
##UNITS=     SECONDS,       ARBITRARY UNITS, ARBITRARY UNITS
##FACTOR=    0.0002768,     1,               1
##FIRST=     0,             0,               0
##LAST=      2.2672688,     0,               0
##MIN=       0,             -1315025,        0
##MAX=       2.2672688,     1666441,         0
$$ Real data points
##PAGE= N=1
##DATA TABLE= (X++(R..R)), XYDATA
$$ [...]
$$ plain form
2722 1456 4123 -184 -914 2733 -747 -4110 -69 922 -3118 -1968 1971 -264 -1819 3790 2211
2737 2211 -514 2372 2989 -2842 -2569 2544 -1123 -3553 1943 2162 -2107 658 4688 199 -2009 3026
2753 3026 43 -3815 144 2056 -3786 -188 4006 965 -1263 1979 2180 -2986 206 2145 -3094
2768 -3094 -3277 1211 -353 -1768 2099 3197 -1338 1798 2955 -270 -2366 828 -428 -2362 -86
2783 -86 275 -1736 -369 2443 2729 863 1932 1555 -1227 -190 -537 -1720 -2727 -546 -508 -167 1308
2800 1308 1915 1157 2039 1427 -140 886 -680 -1771 -807 -928 -1332 -307 1526 340 1163 2394 988
2817 988 -724 1255 514 -3131 -956 -236 -1554 -2157 1377 1165 -940 1804 3511 -432 -1358 879
2833 879 -2037 -3222 381 565 -2376 241 3021 -3 -938 3589 1549 -1681 906 797 -3701 -1782
$$ packed form
2722A456K667m307p30L647l480l363M041R91m040J150L939k235j555N609j579
2737B211k725K886O17n831K73N113l667k430N496K19m269K765M030m489k208N035
2753C026k983l858L959J912n842L598M194l041k228L242K01n166L192J939n239
2768c094j83M488j564j415L867J098m535L136J157l225k096L194j256j934K276
2783h6L61k011J367K812K86j866J069l77k782J037l47j183j007K181L8L41J475
2800A308O07p58Q82o12j567J026j566j091R64j21m04J025J833j186Q23J231j406
2817I88j712J979p41l645K175P20j318o03L534k12k105K744J707l943r26K237
2833H79k916j185L603J84k941K617K780l024r35M527k040l230K587j09m498J919
$$ plain form
2849 -1782 2455 -1887 -2893 2846 1579 -1931 1575 3587 -1386 -1887 2173 -1558 -4720 168 1001
2864 1001 -1333 276 4289 509 -464 1964 171 -3388 233 1295 -2499 -1387 1639 -116 -1148
2879 -1148 2857 3033 -1537 622 2565 -905 -1480 214 -1602 -3032 -13 1528 -782 812 2645
2894 2645 1308 243 2889 154 -1324 -145 -233 -3062 -1545 1035 11 46 1970 2362 1075 1545
2910 1545 557 -1134 -2030 -870 -339 -1454 278 -673 308 1119 476 1060 1008 3 -747 -409 -440 -1957
2928 -1957 -1551 468 -206 -1247 1593 1280 444 2051 1461 -2428 -1465 124 -1067 -2392 190 151 -1432
2945 -1432 723 2321 -545 -254 2078 119 -3131 417 -233 -3146 -1308 2871 -1540 -1581 3729 1442
2961 1442 -1030 1471 2042 -2344 -1984 315 -1326 -2797 1016 871 -1302 1542 4369 -626 -143 2773
$$ packed form
2849a782M237m342j006N739j267l510L506K012m973n01M060l731l162M888Q33
2864A001k334J609M013l780r73K428j793l559L621J062l794J112L026j755j032
2879a148M005J76m570K159J943l470n75J694j816j430L019J541k310J594J833
2894B645j337j065K646k735j478J179q8k829J517K580j024L5J924L92j287M70
2910A545r88j691q96J160N31j115J732r51R81Q11o43N84n2j005p50L38l1j517
2928a957M06K019o74j041K840l13q36J607n90l889R63J589j191j325K582l9j583
2945a432K155J598k866K91K332j959l250L548o50k913J838M179m411m1N310k287
2961A442k472K501N71m386L60K299j641j471L813j45k173K844K827m995M83K916
$$ plain form
2977 2773 337 -3722 -16 431 -3574 -1168 1952 -485 -1049 2974 2415 -1175 1121 2146 -2195 -2858
2993 -2858 -277 -1986 -2411 1930 2323 -30 1556 3056 710 -1108 1999 148 -2520 -785 -311 -1042
3009 -1042 -378 685 890 931 2160 1849 -1004 1469 -814 -1702 -1577 -489 -1447 -128 2237 857 591
3026 591 976 1864 708 79 -1007 -928 -655 -975 -1331 -623 733 548 1753 1516 601 263 30 -1351 -1632
3045 -1632 -1620 -693 -180 -1734 908 1385 432 2286 2356 -497 -177 808 -1568 -3557 -794 -141 -2048 278
3063 278 3603 -34 649 3107 2044 -546 692 138 -3216 -1536 699 -1863 -1512 1791 1569 -510
3079 -510 1862 2543 -1109 -1870 1720 -2339 -3533 -720 -733 -1754 547 3289 160 -323 2203 391
3095 391 -1601 506 1746 -2972 -1403 1210 -1091 -1906 2659 1658 20 1198 2289 -1398 -703 319
$$ packed form
2977B773k436m059L706M47m005K406L120k437n64M023n59l590K296J025m341o63
2993b858K581j709m25M341L93k353J586J500k346j818L107j851k668J735M74p31
3009a042O64J063K05M1J229l11k853K473k283q88J25J088r58J319K365j380k66
3026E91L85Q88j156o29j086P9K73l20l56P08J356j85J205k37r15l38k33j381k81
3045a632J2R27N13j554K642M77r53J854P0k853L20R85k376j989K763O53j907K326
3063B78L325l637O83K458j063k590J238n54l354J680K235k562L51L303k22k079
3079e10K372O81l652p61L590m059j194K813j3j021K301K742l129m83K526j812
3095C91j992K107J240m718J569K613k301q15M565j001j638J178J091l687O95J022
$$ plain form
3111 319 -389 -1750 525 -472 -206 883 1907 929 387 1704 74 -1820 -60 -1008 -1250 -295 -235 449
3129 449 -613 878 1143 1331 455 -427 -847 -482 -1562 -926 -1411 307 -376 449 1027 1805 1537 1606 144
3148 144 592 -404 -1063 -2565 -1011 176 -497 -19 1519 2207 599 1218 861 -891 -102 227 -2676 -1191
3166 -1191 138 -385 -1615 928 1581 -386 1135 2341 207 -1917 -220 -427 -2631 -103 100 -513
3182 -513 -1027 2520 1004 -221 1607 616 -1518 -1008 1247 -1882 -2186 1755 570 -911 1116 3061
3198 3061 472 794 1377 -568 -2520 1306 475 -2280 -136 1698 169 237 2767 1503 -1119 -11
3214 -11 1126 -835 -235 -110 -803 -1437 1032 544 -62 856 2309 671 -207 1098 -1188 -1357 -556 -1135
3232 -1135 -1877 211 1236 -24 332 2086 375 -890 -896 443 -302 -2275 -722 -930 -1568 791 235
$$ packed form
3111C19p08j361K275r97K66J089J024r78n42J317j630j894J760r48k42R55O0O84
3129D49j062J491K65J88q76q82m20L65j080O36m85J718o83Q25N78P78k68O9j462
3148A44M48r96o59j502J554J187o73M78J538O88j608O19l57j752P89L29k903J485
3166a191J329n23j230K543O53j967J521J206k134k124J697k07k204K528K03o13
3182e13n14L547j516j225J828r91k134N10K255l129l04L941j185j481K027J945
3198C061k589L22N83j945j952L826q31k755K144J834j529O8K530j264k622J108
3214a1J137j961O00J25o93o34K469m88o06R18J453j638q78J305k286j69Q01n79
3232a135p42K088J025j260L56J754j711j265oJ339p45j973J553k08o38K359n56
$$ plain form
3249 235 336 1120 646 712 603 -153 -570 -1577 -1518 -1861 -867 732 1379 949 1421 406 110 -60 169 -1543
3269 -1543 -380 -1289 -1889 -1274 964 557 -848 820 540 -181 95 456 -2179 -722 -876 -578 -1118 -306
3287 -306 1358 -844 1304 1998 168 -796 1267 -1277 -2375 -1269 350 -1915 -889 1338 666 210
3303 210 1770 2161 -1403 -150 -166 -440 -2708 -175 -598 -699 1271 1419 -908 625 2250 420 -820
3320 -820 171 326 -2187 -820 939 -674 156 1957 622 366 1755 373 -779 -1139 474 -1082
3336 -1082 -1847 234 -185 -1498 -889 1722 -369 1488 2555 522 209 -586 -555 -1649 -1296 -696 -1063
3353 -1063 -292 1223 921 1421 2243 801 -1323 -811 -961 -2059 -1232 -209 -743 566 839 715 411 649
3371 649 189 -588 -107 -427 -1788 -1456 -527 175 144 1304 556 1110 1648 1502 -289 460 245 -2088 -1946
$$ packed form
3249B35J01P84m74O6j09p56m17j007N9l43R94J599O47m30M72j015k96j70K29j712
3269a543J163r09o00O15K238m07j405J668k80p21K76L61k635J457j54K98n40Q12
3287c06J664k202K148O94j830r64K063k544j098J106J619k265J026K227o72m56
3303B10J560L91l564J253j6k74k268K533m23j01J970J48k327J533J625j830j240
3320h20R91J55k513J367J759j613Q30J801j335k56J389j382j152l60J613j556
3336a082p65K081m19j313O09K611k091J857J067k033l13p95L1j094L53O00l67
3353a063P71J515l02N00Q22j442k124N12j50j098Q27J023n34J309K73j24l04K38
3371F49m60p77M81l20j361L32R29P02l1J160p48N54N38j46j791P49k15k333J42
$$ plain form
3390 -1946 -299 307 -686 1425 1069 -259 -239 1997 40 -1993 378 -1220 -1358 -408 1335 -1092 381
3407 381 1600 769 129 1254 1274 -1127 -1249 348 -2579 -1848 951 -5 -113 824 2134 250 732 1985
3425 1985 -499 -439 980 -482 -1205 -831 1288 -388 -113 1914 573 -406 1268 748 -1539 -1641 -892
3442 -892 -1889 -305 449 -278 -636 1159 944 1174 -357 1224 -783 -1374 -927 -790 -1198 -577 387 307 -874
3461 -874 1212 1552 1342 732 -302 -1083 -714 153 -2041 -760 -39 424 986 688 899 226 867 843 -659
3480 -659 -894 -1287 -876 171 -531 -257 341 747 883 704 842 599 -1402 -1394 -68 -1635 -1207 146 -757
3499 -757 -424 486 270 187 448 439 -195 -1192 -133 -491 -1836 -709 387 -384 434 1404 920 58 565 -675
3519 -675 -1374 -737 -668 -1736 -1398 -279 -198 -93 1431 1272 46 924 666 -1174 -659 209 630 -917 -99
$$ packed form
3390a946J647O06r93K111l56j328K0K236j957k033K371j598j38R50J743k427J473
3407C81J219q31o40J125K0k401j22J597k927P31K799r56j08R37J310j884M82J253
3425A985k484O0J419j462p23L74K119j676K75K027j341r79J674n20k287j02P49
3442h92r97J584P54p27l58J795k15K30j531J581k007n91M47J37m08O21R64q0j181
3461h74K086L40k10o10j034p81L69Q67k194J281P21M63N62k98K11o73O41k4j502
3480f59k35l93M11J047p02K74N98M06J36j79J38k43k001QJ326j567M28J353r03
3499g57L33R10k16q3K61ro34r97J059l58j345J127J096p71Q18R70m84q62N07j240
3519f75o99O37O9j068L38J119Q1J05J524j59j226Q78k58j840N15Q68M21j547Q18
$$ plain form
3538 -99 1544 438 945 1167 -110 -1164 671 532 -1492 -792 -754 -1646 -425 1323 -37 -675 1032
3555 1032 1411 -764 79 52 -1086 -237 86 -874 103 -16 1505 699 550 1280 228 -536 9 -241 -1087
3574 -1087 -484 -369 -580 -187 1112 782 1388 1699 680 -162 201 -1253 -1097 -1043 -787 -616 213 288 1138
3593 1138 1556 1155 112 -209 881 -664 -709 -843 -1607 -802 -909 1184 474 40 570 1270 53 877
3611 877 -103 -1073 -714 -80 219 -1359 15 698 681 738 364 -33 -737 397 50 -1383 -1075 -427 -695
3630 -695 -384 1062 596 -11 1199 1080 -250 -452 677 -1283 -862 376 -545 -1018 857 -5 -506 231
3648 231 1561 -915 -417 275 -777 -1796 -365 127 -942 814 1834 -42 234 1231 85 -856 91
3665 91 -23 -996 -897 227 -240 450 1078 2989 -7 931 -135 -530 204 -1269 -780 -2158 -202 -195 536
$$ packed form
3538i9J643j106N07K22j277j054J835j39k024P00L8q92J221J748j360o38J707
3555A032L79k175Q43k7j138Q49L23r60R77j19J521q06j49P30j052p64N45k50q46
3574a087O03J15k11L93J299l30O06L11j019q42L63j454J56N4K56J71Q29P5Q50
3593A138M18m01j043l21J090j545m5j34p64Q05j07K093p10m34N30P00j217Q24
3611H77r80r70L59O34K99j578J374O83j7N7l74l97p04J134l47j433L08O48k68
3630f95L11J446m66o07J210j19j330k02J129j960M21J238r21m73J875q62n01P37
3648B31J330k476M98O92j052j019J431M92j069J756J020j876K76R97j146r41R47
3665I1j14r73R9J124m67O90O28J911k996R38j066l95P34j473M89j378J956PP31
$$ plain form
3684 536 699 975 1524 619 1434 100 -1041 -237 -633 -792 -810 -35 -466 409 93 1308 -196 1954 75
3703 75 -1025 221 -1739 -628 228 -347 -255 -335 718 541 604 94 95 -805 361 381 476 -750 -537 936
3723 936 292 1752 -102 72 1018 105 -1345 -166 -89 -658 -483 1059 472 -1111 1304 836 233 -395
3741 -395 862 -925 -812 -26 -30 -1300 -73 1152 -397 303 2433 859 -1175 -395 301 -733 -553
3758 -553 110 -1733 -1326 103 521 571 662 177 -343 565 1290 -167 -219 377 -255 -616 -1029 1551 -634
3777 -634 655 1447 1040 235 765 152 -861 -496 -858 -686 -774 770 634 231 -5 1689 747 -204 -301
3796 -301 -101 -1146 326 -631 8 -662 918 -94 1215 534 485 258 -256 -278 -748 592 -113 -1632
3814 -1632 175 22 -109 344 704 -678 260 163 -1397 -555 -249 345 -1495 1208 181 708 -214 1441
$$ packed form
3684E36J63K76N49r05Q15j334j141Q04l96j59j8P75m31Q75l16J215j504K150j879
3703G5j100J246j960J111Q56n75R2q0J053j77O3n10Jr00J166K0R5j226K13J473
3723I36o44J460j854J74R46r13j450J179P7n69J75J542n87j583K415m68o03o28
3741c95J257j787J13P86mj270J227J225j549P00K130j574k034P80O96j034J80
3758e53O63j843M07J429M18N0R1m85n20R08P25j457n2N96o32l61m13K580k185
3777f34J289P92m07q05N30o13j013L65l62J72q8J544j36m03k36J694r42r51r7
3796c01K00j045J472r57O39o70J580j012J309o81m9k27n14k2m70J340p05j519
3814a632J807j53j31M53L60j382R38r7j560Q42L06N94j840K703j027N27r22J655
$$ plain form
3832 1441 148 -1354 -296 198 -738 -480 167 -1169 -873 1049 760 -60 1118 971 -7 -255 188 -588
3850 -588 -708 320 -1492 -1146 7 1418 -256 356 987 770 -666 -147 170 -545 -525 109 -511 -734
3868 -734 1313 299 -306 250 265 -461 98 920 616 -1266 -102 740 -387 -515 746 314 82 824
3886 824 626 -228 -251 370 -378 -312 1002 -390 -170 428 30 913 604 645 -951 454 382 -1332 -929 -881
3906 -881 813 -865 -14 503 -582 -116 543 -582 -717 -444 -1378 -217 11 -69 173 318 375 686 -126
3925 -126 240 203 138 -623 -1347 -272 -267 -235 -219 382 953 413 -964 976 658 -631 73 -412 -985 -52 670
3946 670 -487 -148 587 449 199 1522 13 -738 1311 145 -1843 -590 561 245 -92 386 897
3963 897 783 -270 1008 80 -387 239 -268 -545 454 469 44 468 1305 450 1074 323 578 -1021 -783
$$ packed form
3832A441j293j502J058M94r36K58O47j336K96J922k89q20J178j47r78k48M43p76
3850e88j20J028j812L46J153J411j674O12O31k17j436N19L17p15K0O34o20k23
3868g34K047j014o05N56J5p26N59Q22l04j882J164Q42j127j28J261m32k32P42
3886H24j98q54k3O21p48O6J314j392K20N98l98Q83l09M1j596J405p2j714M03M8
3906h81J694j678Q51N17j085M66O59j125j35K73r34J161K28q0K42J45N7L11q12
3925a26L66l7o5p61p24J075NL2J6O01N71n40j377J940l18j289P04m85n73R33P22
3946F70j157L39P35j38k50J323j509p51K049j166j988J253J151l16l37M78N11
3963H97j14j053J278r28m67O26n07k77R99J5m25M24Q37q55O24p51K55j599K38
$$ plain form
3982 -783 522 178 -1282 154 194 107 106 820 -111 -939 722 729 -227 -531 -169 100 261 573 -291 167 691
4003 691 -325 135 1061 11 -769 -742 -184 -1436 -242 1457 -385 -203 1367 -128 -249 692 946 -365
4021 -365 -46 156 -1154 462 -255 -829 414 562 -153 -334 -85 -195 -443 -294 -735 231 -186 -118 -273
4040 -273 108 -185 829 403 13 1119 -419 -1036 -455 55 -705 -882 -67 -272 807 402 315 202 1105
4059 1105 308 -460 -311 332 -1234 328 -901 -196 168 -411 881 -992 576 861 178 -909 805
4076 805 8 -634 70 554 -535 184 234 -381 -318 651 571 -1279 -381 -997 -976 63 1090 348 194 704
4096 704 -149 223 367 497 -354 -663 337 -84 -832 -78 -703 -471 76 650 -698 457 714 -706 -753
4115 -753 -559 -176 360 467 22 1135 679 271 820 -748 -817 633 -570 -179 334 154 -747 113 961
$$ packed form
3982g83J305l44j460J436M0q7jP14r31q28J661Pr56l04L62K69J61L12q64M58N24
4003F91j016M60R26j050p80K7N58j252J194J699j842J82J570j495j21R41K54j311
4021c65L19K02j310J616p17n74J243J48p15j81K49j10k48J49m41R66m17O8j55
4040b73L81k93J014m26l90J106j538o17N81N10p60j77Q15k05J079m05q7j13R03
4059A105p97p68J49O43j566J562j229P05L64n79J292j873J568K85o83j087J714
4076H05p97o42P04M84j089P19N0o15O3R69q0j850Q98o16K1J039J027p42j54N10
4096G04q53L72J44J30q51l09J000m21p48P54o25K32N47N74j348J155K57j420m7
4115g53J94L83N36J07m45J113m56m08N49j568o9J450j203L91N13j80r01Q60Q48
$$ plain form
4134 961 229 315 863 -922 -304 -331 -408 205 111 -344 -627 -816 369 -55 798 49 268 165 559 -359 -1037
4155 -1037 -61 -105 246 -268 34 -150 -405 392 -451 -364 1354 776 -685 -357 975 -1204 -34 792 307
4174 307 384 1048 106 1591 -52 347 -1561 -226 809 -96 -801 551 255 110 -98 -308 -312 -594 332
4193 332 -697 12 413 291 -345 -113 280 422 -1099 1098 -950 -938 88 -600 93 104 -80 87 -253
4212 -253 836 550 -530 1245 892 95 1017 -399 -182 -595 893 187 -431 141 1163 918 393 -554
4230 -554 217 -82 -427 191 -35 -314 -593 -1009 -208 237 -314 -46 805 -396 -805 109 -171 -634 -683 -263
4250 -263 139 835 -925 327 371 513 17 -105 -549 -257 -581 1071 -1122 -448 -8 87 -157 535 44
4269 44 424 124 11 716 700 -717 261 665 -391 -263 1576 1450 -313 964 -435 -1075 204 -53
$$ packed form
4134I61p32Q6N48j785O18k7p7O13r4m55k83j89J185m24Q53p49K19j03L94r18o78
4155a037R76m4L51n14L02j84k55P97q43Q7J718n78j461L28J332k179J170Q26m85
4174C07P7O64r42J485j643L99j908J335J035r05p05J352k96j45k08k10mk82R26
4193C32j029P09M01j22o36K32L93J42j521K197k048J2J026o88O93J1j84J67l40
4212b53J089k86j080J775l53p97R22j416K17m13J488p06o18N72J022k45n25r47
4230e54P71k99l45O18k26k79k79m16Q01M45n51K68Q51j201m09R14k80m63m9M20
4250b63M02O96j760J252M4J42m96j22m44K92l24J652k193O74M40R5k44O92m91
4269D4L80l00j13P05j6j417R78M04j056J28J839j26j763J277j399o40J279k57
$$ plain form
4287 -53 -352 -237 -371 -139 -202 41 -368 -658 155 1122 -1078 -667 282 -95 -1047 999 -304 -284 -761 247
4307 247 165 382 573 -18 -233 533 -129 -1273 -901 437 -457 -911 -69 -746 -12 236 556 224 487 367
4327 367 -245 -337 -647 617 -401 -40 1382 -189 220 357 -591 -841 1380 -724 107 -334 -209 -394
4345 -394 -536 606 1329 -12 -185 629 245 418 -136 443 458 1182 -293 1254 125 603 -513 644
4363 644 980 -814 -898 -293 -874 -907 617 -367 149 371 166 -499 227 379 -1272 -715 163 -727 -634 -428
4383 -428 845 287 311 183 114 1067 9 136 -233 72 -318 264 1056 225 -603 308 -82 -392 238 -528
4403 -528 517 -1563 517 614 -437 700 201 -772 -326 -29 286 -487 -113 2105 -552 -280 69 212
4421 212 -205 -302 1226 -288 -291 1100 -38 321 -708 15 -125 84 47 64 746 -295 542 84 287 232
$$ packed form
4287e3k99J15j34K32o3K43m09k90Q13R67k200M11R49l77r52K046j303K0m77J008
4307B47q2K17J91n91k15P66o62j144L72J338q94m54Q42o77P34K48L20l32K63j20
4327C67o12r2l10J264j018L61J422j571M09J37r48k50K221k104Q31m41J25j85
4345c94j42J142P23j341j73Q14l84J73n54N79J5P24j475J547j129M78j116J157
4363F44L36j794q4O05n81l3J524r84N16K22k05o65P26J52j651N57Q78q90R3K06
4383d28J273n58K4j28o9R53j058J27l69L05l90N82P92q31q28R11l90l10O30p66
4403e28J045k080K080R7j051J137m99r73M46K97L15p73L74K218k657K72L49J43
4421B12m17r7J528j514lJ391j138L59j029P23j40K09l7J7O82j041Q37m58K03n5
$$ plain form
4441 232 -169 -268 669 496 -359 -649 -568 29 -183 -820 6 255 -121 -207 461 -169 -1144 -377 773 -207 -498
4462 -498 585 -187 285 351 1265 246 293 644 98 -170 -331 -369 981 732 590 -339 -624 304 104 101 714
4483 714 -783 -21 110 -651 332 -25 917 -454 -643 -159 -666 670 -261 116 124 -538 -820 597 -978
4502 -978 -67 362 -124 -401 1158 -38 -137 1270 51 -479 138 89 -679 -87 302 -625 122 918 -838
4521 -838 20 -498 948 -485 -713 -352 -93 -569 379 607 75 -1133 42 -6 -484 -558 194 -244 45
4540 45 222 -161 -840 376 -246 -361 -517 -313 58 -601 -709 -29 517 528 -949 -950 -190 311 -169 113 1017
4561 1017 -250 343 876 -295 -709 -269 491 5 -185 1139 706 745 -62 -168 -229 218 -32 275 -41
4580 -41 -150 -1135 492 622 -100 -370 -103 -453 725 -276 -650 1237 456 -719 905 33 15 -210 -606
$$ packed form
4441B32m01r9R37j73q55k90Q1N97k12o37Q26K49l76q6O68o30r75P67J150r80k91
4462d98J083p72M72O6R14j019M7L51n46k68j61l8J350k49j42r29k85R28k00lO13
4483G14j497P62J31p61R83l57R42j371j89M84n07J336r31L77Qo62k82J417j575
4502i78R11M29m86k77J559j196r9J407j219n30O17m9p68N92L89r27P47P96j756
4521h38Q58n18J446j433k28L61K59m76R48K28n32j208J175m8m78p4P52m38K89
4540D5J77l83o79J216o22j15j56K04L71o59j08O80N46J1j477jP60N01m80K82R04
4561A017j267N93N33j171m14M40P60m86j90J324m33L9q07j06o1M47k50L07l16
4580d1j09r85J627J30p22k70K67l50J178j001l74J887p81j175J624q72j8k25l96
$$ plain form
4599 -606 829 814 -455 -234 -116 122 820 -488 666 -1067 75 229 -447 754 815 -420 -323 -318 416
4618 416 -983 784 387 606 50 974 -641 -279 -273 43 161 235 -59 -460 898 -49 579 -687 238
4637 238 -580 -555 -790 718 -950 -235 87 -301 -2 412 720 -355 20 694 -814 -284 473 109 -868
4656 -868 179 -737 379 -229 1115 -841 -524 279 -340 -401 -1123 117 240 -807 89 370 -1120 -369
4674 -369 -653 -324 -999 -41 -806 332 261 -992 -1130 -75 -21 -819 -597 326 29 -132 -98 332 -268 69
4694 69 666 -185 1582 -330 166 455 500 -1040 -302 -7 -37 -272 225 33 660 -139 995 -277 -228 347
4714 347 246 -786 -550 -300 -919 -88 446 522 475 791 573 -139 396 1220 -819 478 13 -1137 -673
4733 -673 588 532 -825 290 87 11 183 16 877 81 474 -244 -60 140 517 -390 -632 -519 -97 -139
$$ packed form
4599f06J435j5j269K21J18K38O98j308J154j733J142J54o76J201O1j235R7NP34
4618D16j399J767l97K19n56R24j615L62OL16J18P4k94m01J358r47O28j266R25
4637B38q18K5k35J508j668P15L22l88K99M14L08j075L75O74j508N30P57l64r77
4656h68J047r16J116o08J344j956L17Q03o19o1p22J240J23j047Q96K81j490P51
4674c69k84L29o75R58p65J138p1j253j38J055N4p98K22R23k97j61L4M30o00L37
4694F9N97q51J767j912M96K89M5j540P38K95l0k35M97j92O27p99J134j272M9N75
4714C47j01j032K36K50o19Q31N34P6m7L16k18p12N35Q24k039J297m65j150M64
4733f73J261n6j357J115k03p6J72j67Q61p96L93p18J84K00L77r07k42J13M22m2
$$ plain form
4753 -139 93 -356 400 -113 412 872 273 911 -199 -603 -274 -10 -280 148 -535 -844 -1178 1125 -268
4772 -268 229 204 857 21 4 998 198 -622 -348 171 -600 142 527 -755 826 256 -337 545 278 -28
4792 -28 -134 607 -1012 485 -438 575 -901 -222 581 124 76 -420 -57 133 11 -921 -364 216 -154
4811 -154 49 126 475 -146 -30 703 900 625 -212 -496 -645 -726 -665 455 -357 -531 375 72 1004 -346
4831 -346 -825 116 -44 1156 -285 -456 -144 865 -637 236 406 -645 618 278 -461 -364 987 -843
4849 -843 761 1119 -619 -313 -29 447 -769 -232 777 299 169 540 -123 -485 514 -325 -896 -723 128
4868 128 -112 1034 162 1245 -825 391 363 -241 43 309 -189 563 502 16 1207 -300 -409 457 269
4887 269 -258 310 -203 -532 282 -121 -139 700 198 -125 221 -521 -347 -645 -280 -460 94 383 -631 425
$$ packed form
4753a39K32m49P56n13N25M60n99O38j110m04L29K64k70M28o83l09l34K303j393
4772b68M97k5O53q36j7R94q00q20K74N19p71P42L85j282J581n70n93Q82k67l06
4792b8j06P41j619J497r23J013j476O79Q03m57m8m96L63J90j22r32N57N80l70
4811a54K03P7L49o21J16P33J97k75q37k84j49q1O1J120q12j74R06l03R32j350
4831c46m79R41j60J200j441j71L12J009j502Q73J70j051J263l40p39R7J351j830
4849h43J604L58j738L06K84M76j216N37J009m78j30L71o63l62R99q39n71J73Q51
4868A28k40J146q72J083k070J216k8o04K84K66m98P52o1m86J191j507j09Q66j88
4887B69n27N68n13l29Q14m03j8Q39n02l23L46p42J74k98L65j80N54K89j014J056
$$ plain form
4907 425 135 389 416 -90 -428 -431 -81 334 -503 121 -419 -223 491 967 652 -351 -378 -209 262 -970 -849
4928 -849 -267 558 533 26 121 691 715 250 544 585 -619 -561 1088 -335 -5 -101 643 30 -302 79 225
4949 225 -289 949 -688 -171 163 -225 -447 -254 449 800 -768 -457 635 -1078 -107 186 -754 1123
4967 1123 1010 -378 -541 846 -490 347 503 782 -22 -1183 1005 37 126 -1414 655 198 -20 -50
4985 -50 297 -927 236 273 -229 -384 812 -851 325 61 198 -273 457 890 94 -185 364 -970 -278
5004 -278 -296 -553 109 -74 -210 608 100 -229 -608 -1409 552 -257 248 -984 314 -56 -85 -444 448 -1289
5024 -1289 276 54 790 123 138 114 19 88 -911 187 136 229 -269 372 722 1237 156 -229 -47 -591 -38
5045 -38 -375 609 -303 -168 -776 -24 53 -211 61 -398 105 -215 -986 755 -1238 593 -470 319 -67
$$ packed form
4907D25k90K54K7n06l38lL50M15q37O24n40J96P14M76l15j003k7J69M71j232J21
4928h49N82Q25k5n07R5N70K4m65K94M1j204N8J649j423L30r6P44o13l32L81J46
4949B25n14J238j637N17L34l88k22J93P03L51j568L11J092j713R71K93r40J877
4967A123j13j388j63J387j336Q37J56K79q04j161K188r68Q9j540K069m57k18l0
4985e0L47j224J163L7n02j55J196j663J176k64J37m71P30M33p96k79N49j334O92
5004b78j8k57O62j83j36Q18n08l29l79q01J961q09N05j232J298l70k9l59Q92j737
5024a289J565k22P36o67J5k4r5O9r99J098n1R3m98O41L50N15j081l85J82n44N53
5045c8l37R84r12J35o08P52P7k64K72m59N03l20p71J741j993J831j063P89l86
$$ plain form
5064 -67 -184 13 -364 869 389 -919 575 1137 -178 367 979 23 162 -548 345 -940 -512 662
5082 662 523 -195 434 -17 -810 515 -783 208 284 67 -32 192 -15 -221 -615 239 373 -16 434 567
5102 567 -124 1060 -378 -515 -1092 922 724 -858 -673 910 112 412 481 211 -412 -954 586 286
5120 286 43 660 -345 315 -941 744 -647 586 -106 -1064 -452 257 397 -53 731 62 -566 -282
5138 -282 397 91 525 750 367 -625 -108 510 -920 -205 526 -275 825 -45 296 -326 -176 538 583 -279
5158 -279 -305 135 80 417 123 -185 508 505 -46 13 -674 615 -317 -124 -390 -288 555 365 -511 597 359
5179 359 -470 445 -440 56 -171 -218 199 -163 454 248 18 -942 -56 797 -330 -729 3 -169 778 180
5199 180 -355 -471 1003 949 -395 -1001 87 410 1118 570 85 147 815 795 33 -159 914 -213 -951
$$ packed form
5064f7j17J97l77J233m80j308J494N62j315N45O12r56J39p10Q93j285M28J174
5082F62j39p18O29m51p93J325j298R91P6k17r9K24k07k06l94Q54J34l89M50J33
5102E67o91J184j438j37n77K014j98j582J85J583p98L00O9k70o23n42J540l00
5120B86k43O17j005O60j256J685j391J233o92r58O12P09J40m50P84o69o28K84
5138b82O79l06M34K25l83r92N17O18j430P15P31q01J100q70L41o22J50P14M5q62
5158b79k6M40n5L37k94l08O93ln51N9o87J289r32J93k66J02Q43j90q76J108k38
5179C59q29R15q85M96k27m7M17l62O17k06k30r60Q86Q53j127l99P32j72R47n98
5199A80n35j16J474n4j344o06J088L23P08n48m85O2O68k0p62j92J073j127p38
$$ plain form
5218 -951 -148 820 398 -38 -176 167 -334 -606 -534 540 -82 -601 -130 477 243 -925 -1046 -739 24 153
5238 153 1971 -256 -107 -360 -523 -809 -498 -326 -264 -165 101 -430 -296 13 -414 -848 -590 24 -760 214
5258 214 -181 -18 551 164 77 227 -485 306 -1540 -848 -830 155 310 77 -281 -12 -400 -642 438 20
5278 20 63 -540 -1074 -1344 50 -776 -61 351 -55 625 516 -110 -31 438 768 -1361 332 326 -97 238 455
5299 455 -8 -96 889 -530 -423 336 887 -357 -1078 -732 -639 -241 -687 -10 -58 -111 395 -763 -280 -18
5319 -18 146 -450 57 -456 -43 21 -217 631 742 292 -379 -605 -359 619 181 388 452 -532 -764 28 510
5340 510 836 -743 246 -19 374 110 149 -213 408 434 203 -340 858 1124 612 1849 -595 -452 -900
5359 -900 -75 -121 756 -32 129 -49 -185 -392 245 899 1045 280 435 -359 25 395 -21 -465 384 -22
$$ packed form
5218i51Q03R68m22m36j38L43n01k72P2J074o22n19M71O07k34j168j21L07P63J29
5238A53J818k227J49k53j63k86L11J72O2R9K66n31J34L09m27m34K58O14p84R74
5258B14l95J63N69l87q7J50p12P91j846O92J8R85J55k33l58K69l88k42J080m18
5278B0M3o03n34k70J394q26P15M12m06O80j09o26P9M69L30k129J693om23L35K17
5299D55m63q8R85j419J07P59N51j244p21L46R3L98m46O77m8n3N06j158M83K62
5319a8J64n96N07n13M13O4k38Q48J11m50o71k26K46R78m38K07O4r84k32P92M82
5340E10L26j579R89k65L93k64L9l62O21K6k31n43J198K66n12J237k444J43m48
5359i00Q25m6Q77p88J61j78j36k07O37O54J46p65J55p94L84L70m16m44Q49m06
$$ plain form
5379 -22 276 -646 -190 -111 -244 -174 -12 -398 801 115 -358 -609 -65 212 -362 1164 90 -500 -996 -408
5399 -408 1007 -662 -439 361 -851 -974 -806 -388 545 440 -331 -304 -560 -63 -991 -326 12 862 -385
5418 -385 -204 1228 -350 -250 472 -871 -613 -178 97 -411 -170 -47 -695 -521 735 -253 -1025 713
5436 713 350 -364 210 147 193 612 949 -131 1043 -19 173 211 652 565 32 343 427 210 140 -156 314
5457 314 530 331 561 -200 -177 2 -348 -96 -34 -28 -435 405 526 -808 627 -271 75 1053 280 -647 -579
5478 -579 -333 3 -1030 490 90 -664 -769 1151 -659 -573 719 199 1059 38 -27 253 -344 -478 -1207
5497 -1207 291 244 -89 -524 375 -488 595 -250 289 159 -507 880 1729 -613 757 28 -441 -675
5515 -675 93 -565 -534 -89 110 672 -600 267 202 455 -17 -322 128 1376 307 -61 -500 615 -1526
$$ packed form
5379b2K98r22M56P9j33P0J62l86J199o86m73k51N44K77n74J526j074n90m96N88
5399d08J415j669K23Q00j212j23J68M18R33j05p71K7k56M97r28O65L38Q50j247
5418c85J81J432j578J00P22j343K58M35K75n08K41J23o48J74J256r88p72J738
5436G13l63p14N74o3M6M19L37j080J174j062J92L8M41q7n33L11Q4k17p0k96M70
5457C14K16j99K30p61K3J79l50K52O2Om07Q40J21j334J435q98L46R78p73r27O8
5478e79K46L36j033J520m00p54j05J920j810Q6J292n20Q60j021o5K80n97j34p29
5497a207J498m7l33m35Q99q63J083q45N39j30o66J387Q49k342J370p29m69k34
5515f75P68o58L1M45J99N62j272Q67o5K53m72l05M50J248j069l68m39J115k141
$$ plain form
5534 -1526 -757 124 -203 506 286 714 280 380 -78 -431 -782 -845 1157 521 -617 354 -664 439 510
5553 510 574 29 695 -223 805 -111 -212 -410 324 506 97 -387 111 771 830 -168 -1 -435 -72 885
5573 885 171 -466 65 700 82 142 -562 266 15 41 135 -499 581 678 404 -10 127 -346 -5 -50 -12 -657
5595 -657 388 479 98 -120 290 -794 -315 1354 -106 93 -1174 831 796 -49 938 -162 696 -15
5613 -15 1224 311 -14 -78 -662 -593 -483 517 414 861 -125 -164 -348 238 -486 -166 488 176 -179 815 15
5634 15 -664 -535 602 -1283 697 -630 -683 121 749 693 147 510 -525 -89 1020 288 275 206 -197 195
5654 195 -445 920 316 -72 -420 -85 -90 -297 578 27 -781 442 486 -290 210 1019 -224 -213 -528 -231
5674 -231 420 459 447 -421 -167 -56 24 -255 181 -875 283 157 -65 -444 440 923 488 569 -308 -278 -734
$$ packed form
5534a526P69Q81l27P09k20M28m34J00m58l53l51o3K002o36j138R71j018J103P1
5553E10O4n45O66r18J028r16j01j98P34J82m09m84M98O60N9r98J67m34L63R57
5573H85p14o37N31O35o18O0p04Q28k51K6R4o34J080R7k74m14J37m73L41m5L8o45
5595f57J045R1l81k18M10j084M79J669j460J99j267K005l5q45R87j100Q58p11
5613a5J239r13l25o4n84O9J10J000j03M47r86l9j84N86p24L20O54l12l55R94q00
5634A5o79J29J137j885J980j327n3Q04O28n6n46L63j035M36J109p32j3o9m03L92
5654A95o40J365o04l88l48L35nk07Q75n51q08J223M4p76N00Q09j243J1l15K97
5674b31O51L9j2q68K54J11Q0k79M36j056J158j26k22l79Q84M83m35Q1q77L0m56
$$ plain form
5695 -734 -391 507 37 20 -584 -1044 -94 434 681 412 -468 -53 -936 280 227 -868 82 -608 -526 -617 94
5716 94 15 -1069 16 -67 650 -1367 -180 142 38 505 582 -384 -303 -798 557 595 537 38 -271 -198 535
5737 535 -311 -174 1126 82 643 -70 -166 1168 1759 -271 490 -607 -712 -157 -420 391 -138 -243 89
5756 89 959 455 -977 -43 464 -989 523 -535 -800 -379 60 116 -361 254 -174 -683 561 -900 156
5775 156 32 1064 854 -463 -678 1189 1006 448 -428 726 -547 691 -16 -91 623 572 -1080 1025
5793 1025 119 52 401 148 1068 132 225 -145 -825 -186 140 339 199 141 545 -609 369 123 861 195
5813 195 -344 -206 391 -50 -273 -353 -214 1083 -460 -19 -249 -799 48 -604 -347 1009 299 264 1009 730
5833 730 191 -55 90 146 -96 125 449 -277 125 321 -612 -749 -752 -222 776 -165 874 -137 -870 -873 -161
$$ packed form
5695g34L43Q98m70j7o04m60R50N28K47k69q80M15q83J216n3j095R50o90Q2r1P11
5716I4p9j084J085q3P17k017J187L22j04M67P7r66Q1m95J355L8n8m99l09P3P33
5737E35q46J37J300j044N61p13r6J334N91k030P61j097j05N55k63Q11n29j05L32
5756H9Q70n04j432R34N07j453J512j058k65M21M39N6m77O15m28n09J244j461J056
5775A56j24J032k10j317k15J867j83n58q76J154j273J238p07p5P14n1j652K105
5793A025r06o7L49k53R20r36R3l70o80O39L26J99j40n8M04j154R78k46P38o66
5813A95n39J38N97m41k23q0J39J297j543M41k30n50Q47o52K57J356p10l5P45k79
5833G30n39k46J45N6k42K21L24p26M02J96r33j37lN30R98r41J039j011p33lP12
$$ plain form
5854 -161 498 -337 175 -846 -475 -368 -298 -418 377 -115 87 207 339 132 -276 338 17 -62 -941 525
5874 525 778 478 644 438 -265 429 272 616 -13 -308 256 603 995 77 1005 -198 401 318 -179 56
5894 56 479 -359 -1026 -164 95 372 179 -15 462 360 -392 -64 603 -8 -506 93 302 -466 -427 510 -1264
5915 -1264 -98 36 28 -1112 -447 253 -299 -540 10 -445 29 1030 310 -404 791 329 -949 -1374 213
5934 213 -275 -580 567 -179 63 575 -64 -595 849 699 402 -526 699 -720 -387 -333 315 -179 167
5953 167 -356 385 1204 422 -854 86 -618 -235 -762 84 1 275 -204 140 454 62 276 -803 263
5972 263 321 549 571 -388 260 18 -866 -353 730 542 67 -108 209 57 -560 231 -1034 33 -361 622
5992 622 293 643 255 -494 610 438 563 747 -747 70 234 381 -224 -10 474 -160 -271 -14 512
$$ packed form
5854a61O59q35N12j021L71J07P0j20P95m92K02J20J32k07m08O14l21p9q79J466
5874E25K53l00J66k06p03O94j57L44o29k95N64L47L92r18R28j203N99q3m97K35
5894E6M23q38o67Q62K59K77j93j94M77j02p52L28O67o11m98N99K09p68L9R37j774
5915a264J166J34qj140O65P00n52k41N50m55M74J001p20p14J195m62j278m25J587
5934B13m88l05J147p46K42N12o39n31J444j50k97r28J225j419L33N4O48m94L46
5953A67n23P41Q19p82j276R40p04L83n27Q46q3K74m79L44L14l92K14j079J066
5972B63N8K28K2r59O48k42q84N13J083j88m75j75L17j52o17P91j265J067l94R83
5992F22l29L50l88p49J104j72J25J84j494Q17J64J47o05K14M84o34j11K57N26
$$ plain form
6011 512 504 319 145 200 191 -225 -272 -378 124 -49 759 206 556 279 -580 -750 -368 -385 -480 483 -37 346 -40
6034 -40 790 216 444 242 -696 -290 407 306 -20 830 15 678 -73 716 -499 -286 -25 63 -309 -63
6054 -63 -533 -123 -498 591 -460 -254 90 15 481 589 -233 514 -899 385 -386 -187 -140 -449 -71 -523
6074 -523 262 -995 1069 656 -133 -851 51 -847 975 338 1242 -413 340 225 -952 -52 -344 62
6092 62 616 373 337 -195 -375 583 -342 -35 -286 -145 -787 574 -537 -208 -70 628 -576 748 973
6111 973 241 -216 293 43 476 647 -363 -1382 -107 81 639 515 -292 -47 543 41 108 886 983 246
6131 246 -1498 -689 1007 -1335 -156 114 -965 -345 838 -289 556 -743 -547 858 -1525 306
6147 306 -293 -1295 294 -110 -42 -435 -269 -37 617 1104 36 -671 -103 644 -978 -544 1637 38
$$ packed form
6011E12qj85j74N5rm16m7j06N02j73Q08n53L50k77q59j70L82j7r5R63n20L83l86
6034d0Q30n74K28k02r38M06O97j01l26Q50q15O63p51P89j215K13K61Q8l72K46
6054f3m70M10l75J089j051K06L44p5M66J08q22P47j413J284p71J99M7l09L78m52
6074e23P85j257K064m13p89p18R02q98J822o37R04j655P53j15j177R00k92M06
6092F2N54k43l6n32j80R58r25L07k51J41o42J361j111L29J38O98j204J324K25
6111I73p32m57N09k50M33J71j010j019J275J88N58j24q07K45N90n02O7P78R7p37
6131B46j744Q09J696k342J179K70j079O20J183j127Q45j299J96J405k383J831
6147C06n99j002J589m04O8l93J66K32O54M87j068p07N68P47j622M34K181j599
$$ plain form
6165 38 -1261 613 916 549 -295 56 487 647 -605 -399 -335 -563 765 -314 -772 -855 200 182 -885
6184 -885 -214 -387 254 -290 -518 227 -75 -332 957 -403 -412 130 48 -214 332 63 -945 -708 244 -448
6204 -448 599 170 1392 -360 -507 -74 201 -860 -628 -260 -57 624 1271 79 479 -345 -23 -197
6222 -197 495 -526 95 -1022 -415 1307 144 -700 512 -80 -103 344 -472 559 -303 902 -209 -582
6240 -582 636 612 -523 805 106 523 -365 -1096 -80 850 -1000 -14 404 562 -450 -167 316 426
6258 426 -517 779 -72 183 966 -247 316 20 458 113 -474 363 353 -98 550 -1181 101 441 573
6277 573 780 -887 208 774 777 696 61 628 309 -85 1047 110 337 -226 393 -214 731 91 120 588
6297 588 -190 222 209 341 62 125 297 -1481 -398 -422 -197 427 -55 1053 -716 -357 -44 183 -226 181
$$ packed form
6165C8j299J874L03l67q44L51M31J60j252K06O4k28J328j079m58q3J055j8j067
6184h85O71j73O41n44k28P45l02k57J289j360rN42q2k62N46k69j008K37R52o92
6204d48J047m29J222j752j47M33K75j061K32L68K03O81O47j192M00q24L22j74
6222a97O92j021O21j117O07J722j163q44J212n92k3M47q16J031q62J205j111l73
6240e82J218k4j135J328o99M17q88p31J016R30j850R86M18J58j012K83M83J10
6258D26r43J296q51K55P83j213N63k96M38l45n87Q37j0m51O48j731J282L40J32
6277E73K07j667J095N66Lq1o35N67l19l94J132r37K27n63O19o07R45o40K9M68
6297E88p78M12j3J32k79O3J72j778J083k4K25O24m82J108j769L59L13K27m09M07
$$ plain form
6317 181 35 42 268 15 -482 -224 522 1172 666 280 -275 -631 -69 -1040 -825 314 -167 -520 335 379 582
6338 582 -376 -456 1025 -125 329 -1590 -317 -1144 56 -667 1021 -163 258 -539 -536 319 -18 478 -858
6357 -858 -729 -433 -712 101 846 94 234 852 129 -770 377 -481 -1346 -965 -486 -601 520 596 60 277
6377 277 273 586 106 319 439 -188 542 -476 172 307 -31 -653 -441 299 202 -589 -31 -483 -14 -1880
6397 -1880 1306 -140 -661 710 -210 300 -128 572 739 263 294 -482 -814 -618 -427 -47 637 -7 132
6416 132 -236 246 -100 381 -597 314 316 -475 304 -254 -27 -337 -288 155 214 937 351 -235 -530 -752 -781 378
6438 378 668 -525 469 591 -365 -848 -533 988 403 -110 -318 -697 162 189 -439 -272 159 -186 -325 -30
6458 -30 776 -315 255 -199 -360 -1405 223 221 -813 -299 178 -279 437 484 45 -234 -977 -667 -1114 -416
$$ packed form
6317A81j46PK26k53m97K58P46O50n06l86n55l56N62r71K15J139m81l53Q55M4K03
6338E82r58q0J481j150M54j919J273q27J200p23J688j184M21p97LQ55l37M96j336
6357h58J29K96k79Q13P45p52J40O18p23q99J147q58q65L81M79j15J121P6n36K17
6377B77mL13m80K13J20o27P30j018O48J35l38o22K12P40r7p91N58m52M69j866
6397a880L186j446n21J371r20N10m28P00J67m76L1p76l32J96J91L80O84o44J39
6416A32l68M82l46M81r78R11Kp91P79n58K27l10M9M43N9P23n86n86k95k22k9J159
6438C78K90j193R94J22r56m83L15J521n85n13k08l79Q59K7o28J67M31l45j39K95
6458c0Q06j091N70m54j61j045J628kj034N14M77m57P16M7m39k79p43L10m47O98
$$ plain form
6478 -416 612 159 391 1244 369 -539 41 304 235 -772 351 -1023 265 -720 622 215 -256 1143
6496 1143 -1006 -41 1111 82 -110 -75 -359 105 -1179 170 946 -105 750 -201 -331 -48 -988 -938
6514 -938 421 -521 -620 -315 -729 -799 -792 -36 519 33 -175 -226 -869 0 -69 484 729 187 -841 -440 -7
6535 -7 255 811 561 673 -117 -820 29 113 181 230 -259 -516 195 2 -736 817 -33 -147 -1393 -40 -809
6556 -809 -476 577 302 -352 972 403 82 221 -365 515 -237 269 -108 -345 754 662 13 202 551
6575 551 345 -519 815 -539 -205 -921 -430 375 -528 340 1121 950 781 296 -632 1104 584 201 73
6594 73 234 -332 -349 -31 295 -405 -415 530 318 13 -668 392 -684 -1388 -201 -744 -121 345 714 -306
6614 -306 -55 376 794 -506 -146 -731 115 812 553 1145 683 1219 158 -185 220 -475 -537 356 -1237
$$ packed form
6478d16J028m53K32Q53q75r08N80K63o9j007J123j374J288r85J342m07m71J399
6496A143k149R65J152j029j92L5k84M64j284J349P76j051Q55r51j30K83r40N0
6514i38J359r42r9L05m14p0PP56N55m86k08n1o43Q69o9N53K45n42j028M01M33
6535gK62N56k50J12p90p03Q49Q4O8M9m89k57P11j93p38J553q50j14j246J353p69
6556h09L33J053k75o54J324n69l21J39n86Q80p52N06l77k37J099r2o49J89L49
6575E51k06q64J334j354L34p16M91Q05r03Q68P81j71j69m85r28J736n20l83j28
6594G3J61n66j7L18L26p00j0R45k12l05o81J060j076p04J187n43O23M66L69j020
6614c06K51M31M18j300L60n85Q46O97k59N92m62N36j061l43M05o95o2Q93j593
$$ plain form
6633 -1237 -1141 -185 -426 382 851 438 628 192 355 916 -761 -381 -621 -420 -551 500 -781 -678 588
6652 588 296 91 191 -297 -792 -128 -194 195 -596 -229 -568 -953 303 -89 935 -54 8 -561 -387 1316
6672 1316 -684 -460 111 378 97 345 -378 -463 40 333 -112 -901 520 -340 -496 -565 -55 247 659 974
6692 974 -12 214 -88 1158 246 172 -322 -308 -740 443 -525 -451 -325 187 644 -550 159 -387 -32 -187
6712 -187 546 158 -788 -553 -152 470 -256 -365 -226 557 532 22 -826 -461 26 98 -639 300 -795 1553
6732 1553 -68 349 -192 9 112 -378 -621 -437 -637 212 -141 -258 148 1127 231 570 310 -253 464
6751 464 -115 -550 -470 -956 -390 428 1019 1059 387 -298 -925 -330 95 -652 1050 575 -834 45 296 -421
6771 -421 -506 376 163 219 -538 446 188 -85 -770 -1089 231 -215 -942 439 -503 -185 552 98 -783 199
$$ packed form
6633a237R6R56k41Q08M69m13J90m36J63N61j677L80k40K01j31J051j281J03J266
6652E88k92k05J00m88m95O64o6L89p91L67l39l85J256l92J024r89O2n69J74J703
6672A316k000K24N71K67k81K48p23q5N03K93m45p89J421q60j56o9N10L02M12L15
6692I74r86K26l02J246r12p4m94J4m32J183r68P4J26N12M57j194P09n46L55j55
6712a87P33l88r46K35M01O22p26j09J39P83k5n10q48L65M87P2p37R39j095K348
6732A553j621M17n41K01J03m90k43J84k00Q49l53j17M06R79q96L39k60n63P17
6751D64n79m35Q0m86N66Q18N91M0o72o85o27N95M25p47J702m75j409Q79K51p17
6771d21q5Q82k13N6p57R84k58k73o85l19J320m46p27J381r42L18P37m54q81R82
$$ plain form
6791 199 597 -602 -182 -287 697 550 -191 -56 117 614 -346 -276 -362 -629 -222 -398 748 -24 443 454
6811 454 -116 53 668 -257 -302 -1353 145 87 -448 -817 77 115 548 1089 805 19 20 764 -27 632 34
6832 34 -484 -745 -635 548 -45 -479 1151 872 -1020 -34 -624 -678 -97 504 -436 241 -418 -20 -96 104
6852 104 368 217 -165 -164 -168 -421 576 -592 -75 418 286 -257 315 588 497 218 252 -308 -645 -97 -368 -212
6874 -212 418 -121 -203 723 37 385 1006 -538 -261 -171 -594 -154 98 -179 204 1262 1043 752 -204 -535
6894 -535 -232 -485 -392 381 -326 -318 35 235 -334 954 727 -119 21 785 39 177 -939 -603 -494 -518 6
6915 6 1612 337 244 335 -328 -4 -1267 452 -566 -122 -26 646 713 172 -618 104 568 621 543 -356 116
6936 116 -265 -525 -472 578 396 702 1098 71 796 34 1182 -759 -104 187 -1272 -657 214 289 -309
$$ packed form
6791A99L98j199M20j05R84j47p41J35J73M97r60P0q6k67M07j76J146p72M67J1
6811D54n70J69O15r25m5j051J498n8n35l69Q94L8M33N41k84p86JP44p91O59n98
6832C4n18k61J10J183n93m34J630k79j892R86n90n4N81O01r40O77o59L98p6K00
6852A04K64j51l82Jmk53R97j168N17M93j32n43N72K73r1k79L4n60l37N48k71J56
6874b12O30n39q2R26o86L48O21j544K77R0m23M40K52k77L83J058k19k91r56l31
6894e35L03k53R3P73p07QL53K00n69J288k27q46J40P64p46J38j116L36J09k4N24
6915FJ606j275r3R1o63L24j263J719j018M44R6O72O7n41p90P22M64N3p8q99M72
6936A16l81k60N3J050j82L06L96j027P25p62J148j941O55K91j459O15Q71P5n98
$$ plain form
6955 -309 444 -1039 54 873 1514 -92 -197 513 -16 -521 -729 -124 -40 -185 371 -17 154 294 -3
6974 -3 263 -95 -1215 -130 552 265 -196 -232 -557 298 531 -55 926 258 -282 -793 -743 -412 622 -249
6994 -249 -188 156 62 201 -342 -241 -193 -772 -448 -409 -162 -306 653 508 -359 -574 186 -148 730 -51 99
7015 99 -473 -1391 432 853 702 609 608 329 213 549 -203 -606 -706 55 42 283 -1045 15 -274 479 326
7036 326 466 -176 -678 524 -450 -940 -388 991 -211 -780 -578 -86 233 332 -541 935 -890 -239 809
7055 809 -267 -348 -218 225 1268 433 -157 -153 537 219 -692 423 -82 -255 -239 -723 -854 -481 225 541
7075 541 -289 -984 185 780 12 -169 171 263 -430 80 766 -238 -137 195 14 369 428 983 -746 -491
7095 -491 -207 -385 -695 -85 1211 1009 -317 737 105 377 -243 -103 576 -514 -956 179 429 -413
$$ packed form
6955c09P53j483J093Q19O41j606j05P10n29n05k08O05Q4j45N56l88J71J40k97
6974cK66l58j120J085O82k87m61l6l25Q55K33n86R81o68n40n11N0L31J034q71
6994b49O1L44r4J39n43J01M8n79L24L9K47j44R59j45q67k15P60l34Q78p81J50
7015I9n72r18J823M21j51r3jk79j16L36p52m03j00P61j3K41j328J060k89P53j53
7036C26J40o42n02J202r74m90N52J379j202n69K02M92L19R9q73J476j825O51J048
7055H09j076q1J30M43J043q35n90MO90l18r11J115n05j73J6m84j31L73P06L16
7075E41q30o95J169N95p68j81L40R2o93N10O86j004J01L32j81L55N9N55j729K55
7095d91K84j78l10O10J296k02j326J054o32K72o20J40O79j090m42J135K50q42
$$ plain form
7113 -413 -533 -308 581 619 110 -544 -209 -51 -809 377 -893 -430 -568 511 -98 170 325 62 399
7132 399 -247 -464 -984 -539 -510 -111 64 572 480 342 228 -172 687 -140 -594 585 140 254 -214 -427
7152 -427 -133 401 733 447 195 33 -29 133 -263 -675 -656 -32 -333 746 644 -421 58 1197 -637
7171 -637 -161 241 648 -315 -319 686 -159 -18 -106 -393 -305 245 599 -781 571 -261 -773 83 -1222 -66
7191 -66 -575 333 147 -601 355 176 -510 -808 -828 -1 -270 -331 137 -399 -224 -282 -513 -487 353 -172 -328 377
7213 377 -326 -65 -194 -330 140 12 312 -398 1038 -580 -438 834 381 -122 -24 -688 -20 -1404 457
7232 457 -251 893 258 499 396 -480 202 46 -622 -630 -506 32 -248 -130 -88 33 -52 -48 796 519 -455 -224
7254 -224 179 -658 -439 -27 -480 519 -565 -52 75 366 -86 354 751 -476 -398 -440 -835 599 -594
$$ packed form
7113d13j20K25Q89L8n09o54L35J58p58J186j270M63j38J079o09K68J55k63L37
7132C99o46k17n20M45K9L99J75N08r2j38j14m00Q59q27m54J179m45J14m68k13
7152d27K94N34L32k86k52j62o2J62l96m12J9O24l01J079j02j065M79J139j834
7171f37M76M02M07r63mJ005q45J41q8k87Q8N50L54j380J352q32n12Q56j305J156
7191f6n09R08j86p48R56j79o86k98k0Q27k69o1M68n36J75n8k31K6Q40n25j56P05
7213C77p03K61j29j36M70j28L00p10J436j618J42J272m53n03R8o64O68j384J861
7232D57p08J144o35K41j03q76O82j56o68qJ24N38k80J18M2J21q5MQ44k77r74K31
7254b24M03q37K19M12m53R99j084N13J27K91m52M40L97j227P8m2l95J434j193
$$ plain form
7273 -594 -160 -383 -244 415 -176 -73 328 -445 -1020 -366 80 155 -363 -102 129 679 612 -619 -694 -117 656
7294 656 -229 -403 -235 126 -1353 -62 184 1306 599 -128 -12 301 -681 -557 -30 -127 386 956 312
7313 312 -419 789 85 -563 -13 89 107 189 -1463 -216 -749 -1209 1066 1079 473 214 147 97 -150 401
7333 401 575 469 -425 387 446 98 -287 -457 98 -934 404 -872 -151 -388 -611 -763 -162 464 302
7352 302 -174 -198 126 665 191 369 99 451 -422 260 -94 -51 372 55 1281 154 21 -103 -29 -60 124
7373 124 -690 -849 379 -116 -736 948 -326 -195 -358 -800 662 37 -22 -334 -100 -27 200 288 1043 142
7393 142 -204 257 785 1280 -44 375 611 456 -126 -255 235 915 588 38 911 -170 883 -497 -159
7412 -159 -375 294 -71 128 609 -786 1078 -615 288 785 -752 616 65 550 734 -435 500 -79
$$ packed form
7273e94M34k23J39O59n91J03M01p73n75O54M46P5n18K61K31N50o7j231p5N77P73
7294F56q85j74J68L61j479J291K46J122p07p27J16L13r82J24N27r7N13N70o44
7313C12p31J208p04o48N50J02J8Q2j652J247n33m60K275J3o06k59o7n0k47N51
7333D01J74j06q94Q12N9l48l85j70N55j032J338j276P21k37k23j52O01O26j62
7352C02m76k4L24N39m74J78k70L52q73O82l54M3M23l17J226j127j33j24P4l1J84
7373A24q14j59J228m95o20J684j274J31j63m42J462o25n9l12K34P3K27Q8P55r01
7393A42l46M61N28M95j324M19K36j55n82j29M90O80l27n50Q73j081J053j380L38
7412a59k16O69l65J99M81j395J864j693R03M97j537J368n51M85J84j169R35n79
$$ plain form
7430 -79 -241 -1187 69 788 1067 209 522 46 -245 -68 595 873 -217 -420 633 -153 435 -447 112
7449 112 441 -735 -452 -536 201 -98 -297 1272 357 -171 -567 477 -391 1071 7 -82 -327 115 271
7468 271 -592 1190 536 652 178 -488 219 939 950 168 -517 -201 -63 -1000 763 890 608 859 815 246
7488 246 474 -457 -293 -498 -599 -81 -7 -605 1038 -75 -164 512 -1536 -356 417 766 -341 197 -235
7507 -235 456 -322 -367 183 -364 -353 47 681 -608 -33 -461 987 299 -196 35 160 -224 -190 -1147 -36
7527 -36 -260 -1184 848 -33 -547 -1139 106 241 -105 382 -374 629 159 -113 -618 182 -752 -401 446
7546 446 154 250 107 410 262 155 -279 97 283 -143 -604 480 -578 82 751 456 857 223 265 -492
7566 -492 416 218 352 -792 89 313 -543 -286 300 656 -66 222 -527 246 -9 -870 194 1197 803
$$ packed form
7430g9j62r46J256P19K79q58L13m76k91J77O63K78j090k03J053p86N88q82N59
7449A12L29j176K83q4P37k99j99J569r15n28l96J044q68J462j064q9k45M42J56
7468B71q63J782o54J16m74o66P07P20J1p82o85L16J38r37J763J27k82K51m4n69
7488B46K28r31J64k05j01N18P4n98J643j113q9O76k048J180P73L49j107N38m32
7507b35O91p78m5N50n47J1M00O34j289N75m28J448o88m95K31J25l84L4r57J111
7527c6k24r24K032q81n14n92J245J35l46M87p56J003m70k72n05Q00r34L51Q47
7546D46k92R6j43L03j48j07m34L76J86m26m61J084j058O60O69k95M01o34M2p57
7566d92R08j98J34j144Q81K24q56K57N86L56p22K88p49P73k55q61J064J003l94
$$ plain form
7585 803 32 395 17 -258 384 -408 -8 880 -432 -510 -566 128 -271 -294 72 -978 -51 145 -387 -624
7605 -624 327 7 -1206 -324 1009 -23 193 -1117 -89 33 -487 -553 -32 205 -338 1257 101 18
7623 18 453 -656 225 348 85 391 -248 413 -251 372 -477 569 -695 -578 -400 944 19 -323 -185
7642 -185 175 574 -371 -374 1766 -37 477 -745 -57 422 33 728 -806 -354 -668 211 -739 651 -340
7661 -340 68 282 -30 23 -413 -417 648 -584 41 -122 894 232 -424 61 51 262 18 478 971 -53
7681 -53 -435 1041 -348 84 391 -1173 -546 -199 -189 321 910 670 -678 263 882 -528 -284 -40 -138
7700 -138 687 339 -1197 502 391 51 219 -283 -1302 18 748 -486 61 -373 -331 161 640 -535
7718 -535 -852 343 -855 -777 219 464 1342 -53 -126 132 -310 -153 -69 -514 224 573 -369 -26 998 190
$$ packed form
7585H03p71L63l78k75O42p92M00Q88j312p8n6O94l99k3L66j050R27J96n32k37
7605f24R51l20j213Q82J333j032K16j310J028J22n20o6N21K37n43J595j156q3
7623A8M35j109Q81J23k63L06o39O61o64O23q49J046j264J17J78J344r25l42J38
7642a85L60L99r45lK140j803N14j222O88M79l89O95j534M52l14Q79r50J390r91
7661c40M08K14l12N3m36mJ065j232O25j63J016o62o56M85j0K11k44M60M93j024
7681e3l82J476j389M32L07j564O27L47J0N10N89k40j348R41O19j410K44K44r8
7700a38Q25l48j536J699j11l40J68n02j019J320P30j234N47m34M2M92M79j175
7718e35l17J195j198P8R96K45Q78j395p3K58m42J57Q4m45P38L49r42L43J024q08
$$ plain form
7738 190 579 618 -267 -593 -1100 221 -758 -531 -381 224 255 -78 1185 -770 165 -1637 155 32 -124
7757 -124 62 1310 -120 854 148 -242 -692 -181 -136 -299 -89 -517 -796 -854 442 325 -660 203 -48 -226
7777 -226 323 -429 -264 -214 1027 243 -81 -252 1168 -200 -240 17 685 -473 442 -301 165 -605 -1175
7796 -1175 -464 781 -765 88 63 393 -579 338 297 132 166 263 -326 59 -964 598 -898 -479 -154
7815 -154 -427 0 -304 -326 738 -145 350 -67 -233 436 -482 -269 109 -326 -566 -488 49 -570 10 -455
7835 -455 372 -10 -1069 882 907 -629 58 197 -679 590 528 -357 808 531 -823 -633 1040 263
7853 263 188 -241 -62 -517 295 315 -9 115 787 -507 358 199 -571 514 694 379 -136 -154 -1253 -99
7873 -99 724 129 -218 463 81 -434 -334 -580 519 592 -60 639 -173 1003 53 421 537 649 354 -185
$$ packed form
7738A90L89L9q85l26n07J321r79K27J50O05L1l33J263j955R35j802J792j23j56
7757a24J86J248j430R74p06l90m50N11M5j63K10m28k79n8J296j17r85Q63k51j78
7777b26N49p52J65N0J241p84l24j71J420j368m0K57O68j158R15p43M66p70n70
7796a175P11J245j546Q53k5L30r72R17m1j65L4R7n89L85j023J562j496M19L25
7815a54k73M27l04k2J064q83M95m17j66O69r18K13L78m35k40P8N37o19N80m65
7835d55Q27l82j059J951K5j536O87J39q76J269o2q85J165k77j354J90J673p77
7853B63p5m29J79m55Q12K0l24J24O72j294Q65j59p70J085J80l15n15j8j099J154
7873i9Q23n95l47O81l82n15J00k46J099P3o52O99q12J176r50L68J16J12k95n39
$$ plain form
7893 -185 -414 -444 638 -272 -378 -117 581 -703 953 -267 -285 332 126 494 802 -421 -683 -130 908
7912 908 -754 1111 560 154 -267 707 -654 -427 -452 1055 616 -212 147 -463 680 632 -716 -1303 -513
7931 -513 134 -380 -785 -652 -506 48 -49 -298 -742 -143 781 -591 -390 -432 -464 303 198 625 805 -585
7951 -585 -189 729 127 162 -640 192 -93 -1222 251 -257 -301 345 33 211 241 866 -159 486 -1307 560
7971 560 -311 -283 142 -561 187 109 1063 817 530 -142 328 -1053 -804 -138 59 649 -154 154 509 -660
7991 -660 525 101 -188 -193 -1059 -256 -293 399 -106 -434 387 -59 -147 -280 -423 326 -151 352 114 176 -514
8012 -514 -95 503 -469 -96 -414 125 3 64 -305 64 67 374 458 -554 -416 -976 646 -65 653 -8 171
8033 171 382 249 -672 -407 -237 332 294 402 -292 -330 -461 396 96 -397 39 -128 -483 184 -1049 -35
$$ packed form
7893a85k29l0J082r10j06K61O98j284J656j220j8O17k06L68L08j223k62N53J038
7912I08j662J865n51m06m21R74j361K27k5J507m39q28L59o10J143m8j348n87P90
7931e13O47n14m05J33J46N54r7k49m44N99R24j372K01m2l2P67j05M27J80j390
7951e85L96R18o02L5q02Q32k85j129J473n08m4O46l12J78L0O25j025O45j793J867
7971E60q71K8M25p03P48p8R54k46k87o72M70j381K49O66J97N90q03L08L55j169
7991f60J185m24k89nq66Q03l7O92n05l28Q21m46q8j33j43P49m77N03k38O2o90
8012e14M19N98r72L73l18N39j22O1l69L69LL07Q4j012J38n60J622p11P18o61J79
8033A71K11j33r21K65J70N69l8J08o94l8j31Q57l00m93M36j67l55O67j233J014
$$ plain form
8053 -35 412 183 314 505 1300 -339 -806 -333 37 204 45 -147 58 383 891 87 232 331 -833 867
8073 867 915 -94 -353 403 -43 -386 -75 56 497 295 -227 951 219 688 -447 -801 430 -208 83
8092 83 161 -731 163 622 -574 -277 -111 486 801 672 -47 7 -392 -181 43 311 -384 470 889 -279
8112 -279 305 901 -362 -258 -458 -695 227 -787 375 377 -270 356 -446 -229 628 -1021 845 286 -627
8131 -627 165 48 15 -104 -476 -689 -135 174 -420 -5 468 -15 -165 -138 -158 -543 -637 -117 -248 652 158
8152 158 -801 -42 372 535 694 954 104 140 348 -272 -118 41 499 92 -659 307 257 -312 -348 610 -394
8173 -394 -240 -541 -613 91 532 32 115 978 81 152 971 61 620 46 -357 -302 -625 643
$$ packed form
8053c5M47k29J31J91P95j639m67M73L70J67j59j92K05L25N08q04J45R9j164J700
8073H67M8j009k59P56m46l43L11J31M41k02n22J178p32M69j135l54J231o38K91
8092H3P8q92Q94M59j196K97J66N97L15j29p19N4l99K11K24K68o95Q54M19j168
8112b79N84N96j263J04k00k37R22j014J162Ko47O26q02K17Q57j649J866n59r13
8131f27P92j17l3j19l72k13N54L09n94M15M73m83j50K7k0l85r4N20j31R00m94
8152A58r59P59M14J63J59K60q50L6K08o20J54J59M58m07p51R66n0n69l6R58j004
8173c94J54l01p2P04M41n00Q3Q63q97P1Q19r10N59n74m03N5l23J268
8191F43
$$ Imaginary data points
##PAGE= N=2
##DATA TABLE= (X++(I..I)), XYDATA
$$ plain form
0 0 0 0 0 0 0 0 0 0 0 0 0 0 0 0 0 0 13 -112 112 -112 112 -112 113 -224 224 -224 331 -336 365 -448 505 -560
32 -560 666 -729 817 -924 1038 -1157 1289 -1444 1600 -1774 1962 -2173 2402 -2649 2915 -3217
48 -3217 3542 -3897 4291 -4722 5213 -5753 6361 -7043 7841 -8754 9829 -11112 12668
61 12668 -14602 17104 -20435 25115 -32158 43891 -66921 128139 -605764 -1315025 931459
72 931459 552747 -1072392 303138 1340865 -385407 -201884 1529406 575596 -662888
81 -662888 671270 818461 -816649 -359548 855038 -286964 -962911 346449 242596
90 242596 -1031029 -261772 659027 -470476 -781514 431961 48674 -941805 6568 649970
100 649970 -365961 -252900 813117 281717 -381991 494720 708409 -235539 -98547 521358
$$ packed form
0@%%%%%%%%%%%%%%%%J3j25K24k24K24k24K25l37M48m48N55o67P01q13R53j065
32e60J226j395J546j741J962k195K446k733L044l374L736m135M575n051N564o132
48c217O759p439Q188r013R935j0966J2114j3404J4884j6595J8583k0941K3780
61A2668k7270L1706l7539M5550n7273P6049j10812J95060p33903p09261K246484
72I31459l78712j625139J375530J037727j726272J83523J731290r53810j238484
81f62888J334158J47191j635110M57101J214586j142002o75947J309360j03853
90B42596j273625P69257R20799j129503l11038J213475l83287r90479R48373O43402
100F49970j015931J13061J066017n31400o63708Q76711K13689r43948J36992O19905
$$ plain form
110 521358 -96154 -577369 70464 188581 -449170 -260604 303345 -77615 -456007 89206
120 89206 254635 -360720 -261733 319821 -53535 -472028 163208 391914 -248036 -34785
130 -34785 634772 151342 -299639 364538 417087 -379351 -137272 468004 -154884 -536381
140 -536381 251102 264221 -502715 -67040 570651 -172186 -476433 393537 205238 -643091
150 -643091 -30996 524591 -385034 -451766 557855 149772 -592453 285829 595748 -477492
160 -477492 -275243 613039 -150713 -692605 337879 335318 -659052 -73230 680733 -215625
170 -215625 -417681 631622 302782 -588356 149554 582893 -434119 -384823 575082 36580
180 36580 -602174 307316 516200 -450951 -143672 629222 -123259 -559199 323038 214176
$$ packed form
110E21358o17512m81215O47833J18117o37751J88566N63949l80960l78392N45213
120H9206J65429o15355R8987N81554l73356m18493O35236K28706o39950K13251
130c4785O69557m83430m50981O64177N2549p96438K42079O05276o22888l81497
140e36381P87483J3119p66936M35675O37691p42837l04247Q69970j88299q48329
150f43091O12095N55587r09625o6732J009621m08083p42225Q78282L09919j073240
160d77492K02249Q88282p63752n41892J030484k561r94370N85822P53963q96358
170b15625k02056J049303l28840q91138P37910M33339j017012M9296R59905n38502
180C6580o38754R09490K08884r67151L07279P72894p52481m35940Q82237j08862
$$ plain form
190 214176 -649678 -127223 451488 -301184 -389395 479551 211200 -421817 186668 485569
200 485569 -274987 -229511 416035 -3562 -463780 139724 292601 -323866 -124112 423995
210 423995 2957 -319965 219924 234639 -347562 -145144 277404 -154388 -371198 172823
220 172823 182652 -281009 3637 391044 -27380 -200744 277885 189228 -291086 -31242
230 -31242 281325 -151116 -264392 241453 149137 -279958 46391 335521 -145962 -238779
240 -238779 250440 52020 -401858 -10473 248731 -261962 -230789 336010 84828 -311955
250 -311955 179898 351608 -245522 -152131 358571 -45085 -398994 165814 239336 -340425
260 -340425 -73180 422075 -59496 -287472 316684 213185 -383780 -26596 330652 -261713
$$ packed form
190B14176q63854N22455N78711p52672q8211Q68946k68351o33017O08485K98901
200D85569p60556M5476O45546m19597m60218O03504J52877o16467J99754N48107
210D23995m21038l22922N39889J4715n82201K02418M22548m31792k16810N44021
220A72823R829m63661K84646L87407m18424j73364M78629q8657m80314K59844
230c1242L12567m32441j13276N05845r2316m29095L26349K89130m81483r2817
240b38779M89219j98420m53878L91385K59204n10693L1173N66799k51182l96783
250c11955M91853J71710n97130R3391N10702m03656l53909N64808P3522n79761
260c40425K67245M95255m81571k27976O04156j03499n96965L57184L57248n92365
$$ plain form
270 -261713 -341320 300723 83047 -393952 133567 399580 -222056 -144910 431623 28363
280 28363 -390662 168011 241795 -391973 -154440 365584 -103254 -332879 301070 245134
290 245134 -332121 20789 389092 -190608 -310682 273027 57458 -423070 45601 314466
300 314466 -233375 -166121 389975 79319 -295909 188011 279914 -285347 -141087 299097
310 299097 -84811 -327636 185142 198928 -272918 -16702 342266 -79511 -234476 223706
320 223706 108778 -327331 -33008 232657 -184507 -219613 244782 95212 -247328 98956
330 98956 281543 -152716 -142791 247369 10751 -289429 72671 191407 -206453 -99419
340 -99419 278080 21200 -202746 166913 196590 -216007 -85600 215738 -99063 -269237
$$ packed form
270b61713p9607O42043k17676m76999N27519K66013o21636P7146N76533m03260
280B8363m19025N58673P3784o33768K37533N20024m68838k29625O33949n5936
290B45134n77255L52910L68303n79700j20074N83709k15569m80528M68671K68865
300C14466n47841O7254N56096l10656l75228M83920R1903n65261J44260M40184
310B99097l83908k42825N12778J3786m71846K56216L58968m21777j54965M58182
320B23706j14928m36109K94323K65665m17164l5106M64395j49570l42540L46284
330I8956J82587m34259R925L90160k36618l00180L62100J18736l97860J07034
340i9419L77499k56880k23946L69659K9677m12597J30407L01338l14801j70174
$$ plain form
350 -269237 124952 120593 -236083 -12266 280962 -48411 -159783 223013 127233 -244974
360 -244974 -10525 205472 -163640 -209020 192152 66283 -235391 81476 261230 -124209
370 -124209 -113053 246574 22052 -273345 55070 152614 -242925 -141354 229456 -19473
380 -19473 -221905 173833 212593 -188579 -29949 272242 -74863 -242163 158022 101697
390 101697 -276752 -15786 260634 -107418 -163416 263376 114950 -242357 68157 235375
400 235375 -199327 -178902 226450 -7917 -283223 115110 220140 -200126 -63902 301057
410 301057 -23707 -239458 167374 139919 -282955 -60558 237709 -131575 -219903 219435
420 219435 110749 -245637 56477 253236 -163178 -168099 216694 2258 -282437 73130
$$ packed form
350b69237L94189m359l56676K23817K93228l29373j11372L82796r5780l72207
360b44974K34449K15997l69112m5380M01172j25869l01674L16867J79754l85439
370a24209J1156L59627k24522k95397L28415R7544l95539J01571L70810k48929
380a9473k02432L95738L8760m01172J58630L02191l47105j67300M00185n6325
390A01697l78449K60966K76420l68052n5998M26792j48426l57307L10514J67218
400B35375m34702K0425M05352k34367k75306L98333J05030m20266J36224L64959
410C01057l24764k15751M06832k7455m22874K22397K98267l69284q8328M39338
420B19435j08686l56386L02114J96759m16414m921L84793k14436k84695L55567
$$ plain form
430 73130 187131 -191727 -76300 277042 15397 -179506 177108 172893 -201799 -45402
440 -45402 206201 -100869 -207414 149007 90800 -202854 30564 224820 -85269 -120339
450 -120339 185422 41414 -219121 15542 128153 -170969 -131159 160538 14326 -158044
460 -158044 104054 174775 -101806 -43419 179419 -13556 -175599 57182 82429 -168556
470 -168556 -70328 151946 -20923 -129731 118982 124686 -127493 -28234 155229 -60384 -169503
481 -169503 80275 63469 -172228 -18551 179287 -35902 -101583 168314 108854 -143278
491 -143278 21852 171230 -100587 -141089 140736 38681 -189072 47880 182551 -112167
501 -112167 -89306 200409 14172 -209353 68382 125677 -209084 -104364 185201 -54445
$$ packed form
430G3130J14001l78858J15427L53342k61645j94903L56614m215l74692J56397
440d5402K51603l07070j06545L56421n8207k93654K33418J94256l10089l5070
450a20339L05761j44008k60535K34663J12611k99122L9810K91697j46212j72370
460a58044K62098P0721k76581N8387K22838j92975j62043K32781K5247k50985
470a68556R8228K22274j72869j08808K48713N704k52179R9259J83463k15613j09119
481a69503K49778j6806k35697J53677J97838k15189o5681K69897n9460k52132
491a43278J65130J49378k71817m0502K81825j02055k27753K36952J34671k94718
501a12167K2861K89715j86237k23525K77735N7295l34761J04720K89565k39646
$$ plain form
511 -54445 -198479 149905 139895 -190198 -183 228463 -99910 -179761 167813 46844
521 46844 -244479 35819 198886 -138778 -94636 245497 41565 -185020 130755 171912
531 171912 -192266 -74066 196838 -78298 -206765 145241 111196 -192051 23761 228375
541 228375 -80417 -127620 180964 39105 -219917 21511 130135 -164618 -110546 167497
551 167497 3386 -151589 111667 144927 -120889 -27172 159547 -52167 -155079 77433
561 77433 52791 -153137 -18627 135312 -44901 -83953 123203 70295 -108402 6668 103123
572 103123 -77769 -106853 72086 21025 -119020 14884 115972 -37300 -48745 119920
582 119920 54911 -94814 18631 98630 -72246 -85407 91839 29654 -110196 34220 124727
$$ packed form
511e4445j44034L48384j0010l30093J90015K28646l28373p9851L47574j20969
521D6844k91323K80298J63067l37664M4142L40133k03932k26585L15775M1157
531A71912l64178J18200K70904k75136j28467L52006l4045l03247K15812K04614
541B28375l08792m7203L08584j41859k59022K41428J08624k94753N4072K78043
551A67497j64111j54975K63256L3260k65816R3717J86719k11714j02912K32512
561G7433k4642k05928J34510J53939j80213l9052K07156n2908j78697J15070R6455
572A03123j80892k9084J78939n1061j40045J33904J01088j53272j1445J68665
582A19920o5009j49725J13445P9999j70876j3161J77246o2185j39850J44416R0507
$$ plain form
593 124727 -56806 -61598 120791 18999 -145120 17417 85961 -129148 -93433 121632 -9188
604 -9188 -141937 84539 123727 -119767 -32857 163667 -47373 -156338 101921 69359 -175517
615 -175517 -1887 173802 -71279 -97430 183995 71210 -157689 62925 153224 -141824
625 -141824 -102669 155387 -27481 -187351 93279 125188 -149865 -14965 203164 -45433
635 -45433 -140985 140077 63215 -197750 -822 144453 -125960 -114996 163893 29864 -150328
646 -150328 92949 148152 -122125 -49805 155682 -41732 -158857 79237 64870 -151270
656 -151270 -15536 141850 -47085 -87331 123838 57363 -120465 16782 103638 -84596
666 -84596 -85452 89932 9281 -109060 40615 99970 -57012 -30256 106984 9497 -87895
$$ packed form
593A24727j81533m792J82389j01792j64119J62537O8544k15109L5715K15065j30820
604i188j32749K26476L9188k43494Q6910J96524k11040j08965K58259l2562k44876
615a75517J73630J75689k45081k6151K81425j12785k28899K20614R0299k95048
625a41824L9155K58056j82868j59870K80630L1909k75053J34900K18129k48597
635d5433r5552K81062p6862k60965J96928J45275k70413J0964K78889j34029j80192
646a50328K43277N5203k70277P2320K05487j97414j17125K38094j4367k16140
656a51270J35734J57386j88935m0246K11169o6475j77828J37247Q6856j88234
666h4596q56J75384q0651j18341J49675N9355j56982K6756J37240r7487r7392
$$ plain form
677 -87895 36104 58374 -80842 -44758 74424 -4925 -73321 47895 73438 -52728 -24803
688 -24803 79883 -5671 -89770 21700 48090 -83415 -46174 83200 -335 -79755 59910
699 59910 82212 -73852 -24627 99583 -28104 -107336 53696 49142 -112399 -12392 117984
710 117984 -33296 -73970 114426 60861 -109846 18871 110865 -87726 -94571 101268 5540
721 5540 -136699 50119 115508 -92989 -37305 149884 -8305 -121948 83775 71147 -146440
732 -146440 -31595 123369 -70007 -109708 119892 53915 -126910 44422 135648 -85138
742 -85138 -70259 126130 -6707 -144052 53015 86672 -117043 -32950 137025 -21351 -98118
753 -98118 99259 71561 -115744 -3632 108507 -69377 -93391 92818 25101 -111955 32150
$$ packed form
677h7895J23999K2270j39216L6084J19182p9349o8396J21216K5543j26166K7925
688b4803J04686q5554q4099J11470K6390j31505L7241J29374q3535p9420J39665
699E9910K2302j56064M9225J24210j27687p9232J61032m554j61541J00007J30376
710A17984j51280m0674J88396n3565j70707J28717R1994j98591o845J95839r5728
721E540j42239J86818O5389k08497N5684J87189j58189j13643K05723j2628k17587
732a46440J14845J54964j93376l9701K29600o5977j80825J71332R1226k20786
742h5138J4879J96389j32837j37345J97067L3657k03715Q4093J69975j58376p6767
753i8118J97377k7698j87305J12112J12139j77884k4014J86209o7717j37056J44105
$$ plain form
764 32150 102738 -66591 -46940 103483 2518 -101860 37331 60595 -88103 -36489 86381
775 86381 -12105 -71969 58471 60448 -64534 -9585 76949 -24495 -71105 41334 30087
786 30087 -73399 -10136 74149 -17143 -46760 63320 43981 -61778 -1753 65232 -38843
797 -38843 -66956 44159 21340 -75886 4476 76885 -26539 -41374 74588 32026 -72602
808 -72602 11122 63691 -61573 -62376 63683 4984 -84757 31697 80276 -54832 -27917 97887
820 97887 1006 -86980 44630 54380 -95238 -34430 86185 -34559 -83407 74658 55338
831 55338 -85959 11921 103427 -48836 -70069 83279 16536 -106908 22511 83062 -71483
842 -71483 -42484 105913 7595 -85782 60574 73760 -86166 -24908 94121 -35160 -89944
$$ packed form
764C2150P0588j69329J9651J50423j00965j04378J39191K3264j48698N1614J22870
775H6381r8486n9864J30440J977j24982N4949Q6534j01444m6610J12439j1247
786C0087j03486O3263Q4285r1292k9617J10080j9339j05759O0025O6985j04075
797c8843k8113J11115k2819r7226Q0362P2409j03424j4835J15962m2562j04628
808g2602Q3724N2569j25264q03J26059n8699q9741J16454M8579j35108K6915J25804
820I7887r6881q7986J31610R750j49618O0808J20615j20744m8848J58065j9320
831E5338j41297R7880R1506j52263k1233J53348o6743j23444J29419O0551j54545
842g1483K8999J48397r8318r3377J46356J3186j59926O1258J19029j29281n4784
$$ plain form
853 -89944 67445 44567 -93550 4991 94347 -47579 -64681 80862 15008 -101421 18563
864 18563 68762 -73039 -46526 87501 2 -77974 51273 66136 -69135 -19916 81681
875 81681 -24352 -75606 50683 39405 -73044 338 81141 -23411 -45137 70058 31804
886 31804 -67031 7331 58751 -48416 -52191 52315 8265 -67105 22269 60682 -37945 -23690
898 -23690 67673 6851 -60985 22035 40596 -57864 -33248 52048 -8016 -56922 35162 47771
910 47771 -44763 -9336 64769 -9693 -56577 33920 28346 -65703 -17058 54691 -25063 -51662
922 -51662 50393 34001 -56231 7135 65543 -30971 -47369 54619 16115 -68309 12188 61449
934 61449 -41073 -32849 71763 13743 -61505 31900 57836 -55175 -28707 67286 -10662 -68705
$$ packed form
853h9944J57389k2878j38117R8541Q9356j41926j7102J45543o5854j16429J19984
864A8563N0199j41801K6513J34027q7499p7976J29247J4863j35271M9219J01597
875H1681j06033n1254J26289j1278j12449P3382Q0803j04552k1726J15195l8254
886C1804r8835P4362N1420j07167l775J04506m4050p5370Q9374L8413r8627J4255
898b3690R1363o0822o7836Q3020J8561r8460K4616Q5296o0064m8906R2084J2609
910D7771r2534L5427P4105p4462m6884R0497n574r4049M8645P1749p9754k6599
922e1662J02055j6392r0232O3366N8408r6514j6398J01988l8504q4424Q0497M9261
934F1449j02522Q224J04612n8020p5248R3405K5936j13011K6468R5993p7948n8043
$$ plain form
946 -68705 40857 46874 -65351 -11906 73651 -25615 -63779 50459 26065 -80284 -2305
957 -2305 62975 -45121 -51024 66403 16619 -70633 26419 65007 -53213 -34211 68485 -6400
969 -6400 -72331 37746 48497 -62433 -9351 79583 -13973 -53383 59864 36499 -68808
980 -68808 297 63891 -42969 -54043 56373 12960 -68602 20315 62581 -43517 -27402
991 -27402 66651 365 -61935 27936 38847 -61216 -21996 55193 -15780 -50491 42798 34886
1003 34886 -48898 1113 57221 -22667 -43771 38308 14533 -57780 -245 43333 -30491 -33510
1015 -33510 44204 13643 -44921 13642 43264 -31834 -26928 41953 2798 -45392 17103 37953
1027 37953 -31153 -16912 46730 4390 -39064 23817 34943 -34734 -16098 43204 -4393 -42257
$$ packed form
946f8705J09562O017j12225N3445Q5557r9266l8164J14238k4394j06349P7979
957b305O5280j08096n903J17427m9784q7252R7052L8588j18220J9002J02696p4885
969f400o5931J10077J0751j10930N3082Q8934r3556l9410J13247k3365j05307
980f8808O9105O3594j06860j1074J10416m3413q1562Q8917M2266j06098J6115
991b7402R4053o6286o2300Q9871J0911j00063L9220P7189p0973l4711R3289p912
1003C4886q3784N0011N6108p9888k1104Q2079k3775p2313N7535M3578p3824l019
1015c3510P7714l0561n8564N8563K9622p5098M906O8881l9155m8190O2495K0850
1027C7953o9106J4241O3642m2340m3454O2881J1126o9677J8636N9302m7597l7864
$$ plain form
1039 -42257 26100 30247 -41641 -11965 47087 -13429 -47811 29781 22068 -53124 -7695 49658
1051 49658 -23148 -42332 45185 22048 -52874 10940 52815 -34152 -36883 50560 6976 -58023
1063 -58023 20378 48895 -41883 -21876 63512 557 -51322 38262 40112 -57136 -12184 56207
1075 56207 -26114 -53647 45742 23339 -62238 9093 60712 -34601 -35228 60021 7453 -62706
1087 -62706 22362 44861 -52623 -26265 58993 -10162 -54121 38776 37238 -51456 -2508 57956
1099 57956 -22241 -41900 44265 17128 -55218 6020 46200 -33520 -30037 46027 5525 -46530
1111 -46530 19248 37774 -35964 -16556 44447 -4565 -40085 24544 25993 -35407 -7380 38740
1123 38740 -11137 -32726 25889 19958 -32795 -3279 34296 -10491 -26793 24437 17261 -30762
$$ packed form
1039d2257O8357M147p1888K9676N9052o0516l4382P7592p713p5192M5429N7353
1051D9658p2806j9184Q7517k3137p4922O3814M1875q6967k731Q7443m3584o4999
1063e8023P8401K8517r0778K0007Q5388o2955n1879Q9584J850r7248M4952O8391
1075E6207q2321k7533R9389k2403q5577P1331N1619r5313o27R5249n2568p0159
1087f2706Q5068K2499r7484K6358Q5258o9155m3959R2897j538q8694M8948O0464
1099E7956q0197j9659Q6165k7137p2346O1238M0180p9720L483P6064m0502n2055
1111d6530O5778J8526p3738J9408O1003m9012l5520O4629J449o1400K8027M6120
1123C8740m9877k1589N8615n931n2753K9516L7575m4787j6302N1230p176m8023
$$ plain form
1135 -30762 -3549 31058 -12829 -28808 21920 14108 -32705 -2319 31596 -13473 -24133 28883
1147 28883 14442 -33341 3188 32983 -21013 -26309 32980 8425 -41004 10312 36492 -26876
1159 -26876 -20321 44121 5805 -42229 20379 34909 -37804 -17197 46127 -9789 -46986 29138
1171 29138 27727 -47963 -4560 50698 -21419 -39128 42100 17475 -51790 9508 44073 -37675
1183 -37675 -31346 47874 1872 -51973 25723 38753 -43238 -11724 54860 -10164 -42267 37978
1195 37978 27113 -49161 1020 49045 -26573 -35657 43285 9370 -48992 16112 42090 -34076
1207 -34076 -20354 46275 -2418 -43142 23826 25498 -42175 -10922 38518 -15418 -33180 29284
1219 29284 15540 -34754 3006 35580 -16395 -21245 29772 9200 -33255 6017 25383 -20090
$$ packed form
1135c0762K7213L4607m3887j5979N0728p812m6813L0386L3915m5069j0660N3016
1147B8883j4441m7783L6529K9795n3996n296N9289k4555m9429N1316K6180o3368
1159b6876O555O4442l8316m8034O2608J4530p2713K0607O3324n5916l7197P6124
1171B9138j411p5690M3403N5258p2117j7709Q1228k4625o9265O1298L4565q1748
1183c7675O329P9220m6002n3845P7696J3030q1991L1514O6584o5024l2103Q0245
1195C7978j0865p6274N0181M8025p5618r084P8942l3915n8362O5104K5978p6166
1207c4076J3722O6629m8693m0724O6968J672o7673L1253M9440n3936j7762O2464
1219B9284j3744n0294L7760L2574n1975m850N1017k0572m2455L9272J9366m5473
$$ plain form
1231 -20090 -16886 26110 4392 -26218 10329 26020 -16527 -12595 24803 3484 -25868 6628
1243 6628 19265 -18225 -13941 22922 3200 -24267 9518 22071 -17568 -12032 26280 2478
1255 2478 -25107 12725 23666 -23552 -12472 30111 -3522 -31174 17112 20743 -31928 -8916
1267 -8916 34656 -12365 -30503 27439 17761 -38631 -39 37307 -22802 -29492 33851 7340
1279 7340 -43094 12080 34946 -29529 -16976 45009 1510 -35875 28087 31821 -36807 -6588
1291 -6588 43049 -16010 -35492 33110 18111 -42563 6604 41021 -24834 -23631 40420 5075
1303 5075 -43075 15150 26705 -38587 -18236 35400 -11588 -38460 26341 22624 -34412 -832
1315 -832 37947 -15764 -26163 29234 9579 -34655 5045 27578 -21025 -17922 31177 5829
$$ packed form
1231b0090L204M2996k1718l0610L6547J5691m2547L932L7398k1319k9352L2496
1243F628J2637l7490M284L6863j9722k7467L3785J2553l9639N536L8312k3802
1255B478k7585L7832J0941m7218J1080M2583l3633k7652M8286L631n2671K3012
1267h916M3572m7021j8138N7942r678n6392L8592L7346o0109o690O3343k6511
1279G340n0434N5174K2866o4475J2553O1985m3499l7385O3962L734o8628L0219
1291f588M9637n9059j9482O8602j4999o0674M9167L4417o5855J203O4051l5345
1303E075m8150N8225J1555o5292K0351N3636m6988k6872O4801l717n7036L3580
1315h32L8779n3711j0399N5397j9655m4234L9700K2533m8603L103M9099k5348
$$ plain form
1327 5829 -26817 13272 23847 -22331 -9404 27155 -3061 -24520 14741 16059 -21991 -5591
1339 -5591 24893 -3873 -18888 14047 12780 -20146 -3608 21019 -5435 -17092 13442 13041 -16933
1352 -16933 -2287 20385 -6840 -19647 11861 9519 -23107 -5055 20163 -9779 -19766 16627
1364 16627 11489 -23027 -306 23509 -14177 -21221 20257 5189 -30036 4790 25513 -17539
1376 -17539 -13141 31112 7285 -24708 16672 27102 -23940 -11023 31587 -6563 -31190 20013
1388 20013 19050 -30398 -1162 35207 -11274 -23623 28954 11363 -36448 3643 25494 -27714
1400 -27714 -23378 28903 -1012 -35253 16386 24557 -27582 -7970 34785 -9061 -28763 22382
1412 22382 14125 -33306 -657 31757 -15440 -20125 29771 11403 -28134 10640 27982 -20312
$$ packed form
1327E829l2646M0089J0575m6178J2927L6559l0216k1459L9261J318l8050J6400
1339e591L0484k8766j5015L2935j267l2926J6538K4627k6454j1657L0534m01k9974
1352a6933J4646K2672k7225j2807L1508k342l2626J8052K5218k9942r987L6393
1364A6627n138l4516K2721K3815l7686p044M1478j5068l5225L4826K0723m3052
1376a7539M398M4253k3827l1993M1380J0430n1042J2917M2610l8150k4627N1203
1388B0013r63m9448K9236L6369m6481j2349N2577j7591m7811M0091K1851n3208
1400b7714M336N2281k9915l4241N1639Q171n2139J9612M2755m3846j9702N1145
1412B2382q257m7431L2649L2414m7197m685M9896j8368l9537L8774J7342m8294
$$ plain form
1424 -20312 -14416 28828 -1755 -28398 14245 18969 -22720 -5593 26481 -5319 -21662 16831
1436 16831 12086 -24343 -1277 21482 -10865 -16116 19999 9015 -19458 4658 19062 -12634
1448 -12634 -14496 14193 767 -21661 914 14213 -11663 -10011 17687 4205 -14812 6005
1460 6005 14653 -13389 -12207 12594 -1640 -19431 4866 14707 -12068 -5388 21397 4409 -14228
1473 -14228 11651 17091 -15490 -8474 17795 -5034 -20222 10583 12821 -18114 -1571 24566
1485 24566 -3344 -17334 17889 10715 -26004 -2580 19796 -16671 -20717 19044 5121 -25508
1497 -25508 8390 23475 -16699 -11164 25226 -758 -27168 11735 16885 -24008 -7051 27284
1509 27284 -5546 -21463 21377 15121 -25835 3037 27063 -15377 -20490 23041 5958 -27217
$$ packed form
1424b0312N896M3244l0583k6643M2643M724m1689J7127L2074l1800j6343L8493
1436A6831m745l6429K3066K2759l2347n251L6115j0984k8473K4116J4404l1696
1448a2634j862K8689j3426k2428K2575J3299k5876J652K7698j3482j9017K0817
1460F005Q648k8042J182K4801j4234j7791K4297R841k6775O680K6785j6988j8637
1473a4228K5879N440l2581P016K6269k2829j5188L0805K238l0935J6543K6137
1485B4566k7910j3990L5223p174l6719K3424K2376l6467m046L9761j3923l0629
1497b5508L3898J5085m0174N535L6390k5984k6410L8903N150m0893J6957L4335
1509B7284l2830j5917M2840o256m0956K8872K4026m2440n113M3531j7083l3175
$$ plain form
1521 -27217 8583 23339 -19195 -10571 27564 -1185 -25879 12402 14017 -25243 -6309 23474
1533 23474 -8886 -18671 20644 11886 -21062 4368 22275 -13381 -16823 16850 2294 -23599
1545 -23599 4894 16086 -14714 -5876 22009 2190 -15852 11792 12957 -16946 -7398 14426
1557 14426 -7412 -17442 9465 8313 -14090 742 17511 -3241 -9513 11487 6234 -14705
1569 -14705 -2968 9644 -9417 -14041 9409 6045 -12181 3987 16406 -2284 -7846 12432
1581 12432 5069 -15477 -1904 10654 -9309 -11552 12313 4260 -13425 5614 16962 -7366
1593 -7366 -8987 15219 1415 -18568 4496 12581 -15732 -8999 18328 615 -16428 11882 15094
1606 15094 -15869 -5450 20057 -6383 -18548 14493 9955 -19965 1807 22012 -9935 -13384
$$ packed form
1521b7217L5800J4756m2534Q624L8135k8749k4694L8281J615l9260J8934K9783
1533B3474l2360r785L9315q758l2948K5430J7907l5656l442L3673j4556k5893
1545b3599K8493J1192l0800Q838K7885j9819j8042K7644J165k9903R548K1824
1557A4426k1838j0030K6907j152k2403J4832J6769k0752o272K1000n253k0939
1569a4705J1737J2612j9061m624K3450l364j8226J6168J2419j8690n562K0278
1581A2432p363k0546J3573J2558j9963k243K3865q053j7685J9039J1348k4328
1593g366j621K4206j3804j9983K3064Q085k8313O733K7327j7713j7043K8310L212
1606A5094l0963J0419K5507k6440j2165L3041m538k9920K1772K0205l1947l449
$$ plain form
1618 -13384 19779 3696 -24845 4432 16011 -21225 -12575 20525 -2026 -21387 14073 16582
1630 16582 -19293 -1787 22480 -9356 -19021 15642 6178 -23185 3643 21216 -10520 -8022
1642 -8022 24962 6953 -17596 11173 16124 -18004 -8345 16800 -7688 -19354 10382 10830 -16609
1655 -16609 2227 20159 -5828 -11070 13236 2573 -19184 -914 9510 -14252 -10153 12373
1667 12373 1469 -11363 8220 13210 -7505 -2824 12209 -1281 -12786 3387 6342 -10114
1679 -10114 -3383 10683 504 -6441 6411 7827 -6630 -2770 8234 -1249 -11620 1271 5218
1692 5218 -7078 -3734 10554 1206 -7856 6350 9846 -8955 -2858 10834 -2868 -12322 6675
1705 6675 9350 -11066 -925 14665 -3045 -11586 10740 5577 -18384 -3385 10720 -12862 -13371
$$ packed form
1618a3384L3163j6083k8541K9277J1579l7236Q650L3100k2551j9361L5460K509
1630A6582l5875J7506K4267l1836r665L4663r464k9363K6828J7573l1736K498
1642h022L2984j8009k4549K8769M951l4128R659K5145k4488j1666K9736M48k7439
1655a6609J8836J7932k5987n242K4306j0663k1757J8270J0424k3762M099K2526
1667A2373j0904j2832J9583M990k0715M681J5033j3490j1505J6173K955j6456
1679a0114O731J4066j0179o945J2852J416j4457L860J1004r483j0371J2891L947
1692E218j2296L344J4288r348r062J4206L496j8801O097J3692j3702r454J8997
1705F675K675k0416J0141J5590j7710q541K2326n163k3961J4999J4105k3582n09
$$ plain form
1718 -13371 12651 2195 -15933 7292 16824 -11830 -5787 17507 -3079 -18641 9335 10485
1730 10485 -17663 -1871 21266 -3918 -10271 20140 11419 -15597 5487 17664 -14319 -13531 15297
1743 15297 -1645 -20757 7772 13516 -15154 -3799 20550 -3791 -15285 12237 6226 -20904
1755 -20904 -2669 12720 -13300 -12878 14700 3358 -13777 7820 15092 -10150 -4391 15289 -2256
1768 -2256 -14035 6466 6391 -12979 -2058 13358 -3376 -7908 10355 5976 -10271 1413 8780
1781 8780 -5846 -7690 7629 2771 -7331 2660 8227 -2908 -2223 7086 3259 -7159 734 4774
1795 4774 -4006 -5036 5276 3834 -6016 953 7489 -1512 -5333 4379 1081 -10188 -3910 5165
1809 5165 -7102 -8072 6826 3989 -7745 3634 10477 -6084 -7312 9362 701 -13859 2813
$$ packed form
1718a3371K6022j0456j8128K3225R532k8654O043K3294k0586j5562K7976J150
1730A0485k8148J5792K3137k5184o353L0411q721k7016K1084J2177l1983P88K8828
1743A5297j6942j9112K8529N744k8670J1355K4349k4341j1494K7522o011k7130
1755b0904J8235J5389k6020M22K7578j1342j7135K1597P272k5242N759J9680j7545
1768b256j1779K0501p5j9370J0921J5416j6734m532J8263m379j6247J1684P367
1781H780j4626j844J5319m858j0102R991N567j1135O85R309l827j0418P893M040
1795D774q780j030J0312j442r850O969O536r001l821R712l298j1269O278R075
1809E165j2267r70J4898k837j1734J1379O843j6561j228J6674q661j4560J6672
$$ plain form
1822 2813 9569 -8888 -4597 15385 2654 -9688 11396 12718 -10490 -747 14147 -7158 -13962
1835 -13962 10040 3705 -16377 3032 15113 -9164 -6570 17592 1613 -16167 6438 9700
1847 9700 -17192 -6553 12466 -6741 -13025 12288 7854 -14277 2600 17174 -8923 -9333 14367
1860 14367 1113 -16737 4858 10908 -11764 -3955 15344 -2084 -10260 10027 7473 -12216 -104
1873 -104 12512 -6851 -9489 10462 3503 -11063 5258 10291 -6047 -3785 9056 -523 -9805
1886 -9805 3457 5753 -8043 -2805 8971 -639 -4684 5576 5326 -4882 -1595 5328 -3487 -7431
1900 -7431 348 1105 -6096 -1472 5721 981 -2297 3432 4572 -3568 -3567 3847 -1797 -6425 482 4165
1916 4165 -3487 -3107 8087 3149 -3316 6227 9115 -6163 -2792 8010 -1810 -9949 4729 5318
$$ packed form
1822B813O756j8457M291J9982j2731j2342K1084J322k3208R743J4894k1305o804
1835a3962K4002o335k0082J9409J2081k4277K594K4162j5979j7780K2605L262
1847I700k6892J0639J9019j9207o284K5313m434k2131J6877J4574k6097m10K3700
1860A4367j3254j7850K1595O050k2672P809J9299j7428q176K0287k554j9689J2112
1873a04J2616j9363k638J9951o959j4566J6321N033j6338K262J2841r579r282
1886i805J3262K296j3796N238J1776r610m045J0260k50j0208L287O923q815l944
1900g431P779P57p201M624P193m740l278N729J140q140JP414n644m628O907L683
1916D165p652L80J1194m938o465R543K888j5278L371J0802r820q139J4678N89
$$ plain form
1930 5318 -10292 -606 10566 -3219 -6981 9497 4002 -10991 765 9391 -10219 -9261 10363
1943 10363 341 -11974 5482 10302 -7939 -2553 12980 -3327 -11085 9317 5213 -13571 61
1956 61 12166 -7472 -8157 12563 2676 -12286 5916 10495 -10660 -6341 11807 -3147 -11384 8336
1970 8336 7420 -11383 1658 12769 -5508 -8330 9918 1201 -12547 1865 7753 -9359 -4084
1983 -4084 11990 117 -7930 6648 7203 -8080 -1666 6981 -4476 -7478 4968 2251 -7080 1730
1997 1730 8265 -1928 -2495 7606 1422 -5072 1158 3064 -6099 -3749 3975 -1421 -4874 1358 4150
2012 4150 -613 161 4397 2889 -2118 -502 1998 -3275 -5355 1186 582 -3698 -217 5447 -38
2027 -38 -2627 4390 2553 -5114 -731 4089 -4127 -5131 4275 2324 -6381 1025 7107 -3802 -3411
$$ packed form
1930E318j5610R686J1172j3785l762J6478n495j4993J1756Q626j9610R58J9624
1943A0363j0022j2315J7456M820j8241N386J5533j6307p758K0402m104j8784J3632
1956F1J2105j9638o85K0720r887j4962J8202M579k1155M319J8148j4954q237J9720
1970H336r16j8803J3041J1111j8277k822J8248q717j3748J4412N888j7112N275
1983d084J6074j1873q047J4578N55j5283O414Q647j1457l002J2446k717r331Q810
1997A730O535j0193n67J0101o184o494O230J906r163K350P724n396l453O232K792
2012D150m763P74M236j508n007J616K500n273k080O541o04m280L481N664n485
2027c8k589P017j837p667M383M820q216j004R406j951q705P406O082j0909L91
$$ plain form
2042 -3411 7447 256 -8662 3216 6170 -7713 -2400 8158 -784 -7530 6304 5086 -8435
2055 -8435 -162 9125 -4998 -7581 8130 1685 -9775 4382 9198 -8293 -3678 10289 -2223
2068 -2223 -10554 6399 5377 -11318 -2165 9492 -5568 -7057 9484 4226 -10016 3671 9024
2081 9024 -7831 -4841 8246 -381 -10076 5491 6551 -7254 -70 11126 -2095 -4951 8796
2094 8796 3756 -8383 1108 6817 -6115 -6369 6569 -493 -7189 3202 4688 -4640 -500 6614
2108 6614 -1904 -4827 3814 1594 -7223 -1563 3820 -2227 -1864 4257 3430 -3481 677 4838 -1401
2123 -1401 -2121 2909 493 -2660 -253 1244 -476 -2451 1382 2129 -751 -1131 2585 145 -1844 1401
2139 1401 3032 -2619 -1512 4322 1073 -4196 2445 3727 -4937 -1104 4772 -900 -5184 3439 3229
$$ packed form
2042c411J0858p191q918J1878K954j3883N313J0558q942o746J3834j218j3521
2055h435Q273R287j4123k583J5711o445j1460J4157M816j7491M615J3967j2512
2068b223q331J6953j022j6695R153J1657j5060j489J6541n258j4242J3687N353
2081I024j6855K990J3087q627r695J5567J060j3805P184J1196j3221k856J3747
2094H796n040j2139R491N709j2932k54J2938p062o696J0391J486r328M140P114
2108F614q518k923Q641k220q817N660N383o047L63O121q27o911M158M161o239
2123a401p20N030k416l153K407J497j720j975L833P47k880l80L716k440j989L245
2139A401J631n651J107N834l249n269O641J282q664L833N876n672m284Q623k10
$$ plain form
2154 3229 -5342 -1155 6800 -2091 -5416 6158 2520 -8342 1904 4953 -6187 -5504 6977 -373
2168 -373 -6804 4357 5828 -6055 -1074 8460 -2713 -7223 7057 2925 -8720 1080 7838 -4422
2182 -4422 -3866 9689 1089 -7443 5252 7075 -8444 -2706 7708 -4023 -7970 6217 2674 -8697
2196 -8697 1250 8071 -5595 -4845 6871 875 -8212 3489 4211 -7509 -2567 6131 -1930 -5539
2210 -5539 5851 2260 -6392 1302 6779 -3254 -3175 5818 926 -5050 2053 3527 -2968 -2390 4509
2225 4509 -625 -4026 2779 1898 -2368 46 2453 -533 -952 2808 572 -1805 167 303 -1 -614
2241 -614 -183 1202 -103 -1014 1379 1706 -696 -283 1934 -742 -2854 957 587 -2983 -2482 1769 -1941
2258 -1941 -3311 2062 755 -5044 513 4005 -2965 -2500 3729 409 -5199 2433 4750 -4619 -1986
$$ packed form
2154C229q571M187P955q891l325J1574l638j0862J0246L049j1140O83J2481p350
2168c73o431J1161J471j1883M981R534j1173m510J4280m132j1645R800O758j2260
2182d422N56J3555q600q532J2695J823j5519N738J0414j1731l947J4187l543j1371
2196h697R947O821j3666P50J1716n996r087J1701P22j1720M942Q698q061l609
2210e539J1390l591q652P694N477j0033P9Q993m892n976P103J474o495N78O899
2225D509n134l401O805q81m266K414K407k986m19L760k236k377J972J36l04o13
2241f14M31J385j305r11K393L27k402M13K217k676k112L811l70l570N01M251l710
2258a941j370N373j307n799N557L492o970M65O229l320n608P632K317r369K633
$$ plain form
2273 -1986 6927 -1206 -4974 4855 2787 -6229 815 5924 -4349 -4501 5327 578 -7136 2074 5103
2288 5103 -6696 -1737 6642 -1843 -6460 3798 4142 -7632 1110 7406 -4478 -5396 5778 -182
2302 -182 -7339 2556 5786 -5581 -995 7636 -1063 -5312 4241 2776 -6885 89 5470 -4267 -3812
2317 -3812 5404 545 -5928 2806 4546 -3607 -627 6181 -1402 -4092 3544 3500 -4452 -692 2941
2332 2941 -3108 -2589 4867 832 -3722 1547 3075 -1760 -600 2407 -941 -3076 318 1006 -2450
2347 -2450 -1183 1363 304 -519 107 519 -37 -935 268 1086 -801 -804 332 287 -1190 65 1950 -632
2365 -632 -1617 2094 -50 -3162 1589 3060 -1326 -428 3386 150 -3170 2504 2212 -4546 -478 3437
2381 3437 -1685 -2994 3780 1573 -4518 2069 6136 -3043 -1245 5439 -464 -5837 3566 3017 -6396
$$ packed form
2273a986Q913q133l768R829k068r016P044N109j0273j52R828m749p714R210L029
2288E103j1799M959Q379q485m617J0258L44j1774Q742O296j1884r18J1174n960
2302a82p157R895L230j1367M586Q631q699m249R553j465r661O974N381r737M55
2317c812R216m859o473Q734J740q153K980O808p583k690P636m4p952L760L633
2332B941o049N19P456m035m554N269J528m835J160L007l348k135L394O88l456
2347b450J267K546j059q23O26M12n56q98J203Q18j887lJ136m5j477J255J885k582
2365f32r85L711k144l112M751J471m386Q98L814l236l320N674k92o758M068L915
2381C437n122j309O774k207o091O587M067r179J798O684n903n373R403n49r413
$$ plain form
2396 -6396 -608 6056 -3878 -4281 6151 1251 -5071 1714 4961 -4028 -2718 5459 -2114 -5539 2936
2411 2936 2634 -5086 -347 5882 -3774 -3492 5191 1766 -5555 2181 3413 -5645 -2028 4730 -1462
2426 -1462 -4584 2753 3134 -3720 638 4785 -2354 -2475 2863 494 -5333 1290 3839 -3663 -520
2441 -520 3762 -961 -2399 3031 1280 -2281 -227 3065 -1971 -495 2611 851 -592 410 993
2456 993 -1266 127 190 -1285 -1905 22 -253 -499 -687 507 526 -147 -9 1325 751 37 67 507 -1381
2475 -1381 -1064 -230 198 -2359 -330 3283 -118 -1342 2479 1430 -3746 310 1146 -3117 -2285 3438
2491 3438 664 -2724 3082 3594 -2508 1171 4913 -1341 -4181 2030 330 -4725 472 2726 -3022
2506 -3022 -1064 5967 92 -3105 3155 3535 -4972 -1280 4062 -3260 -4304 3523 1791 -5020 1160
$$ packed form
2396f396N788O664r934m03J0432m900o322O785L247q989J310Q177p573l425Q475
2411B936l02p720M739O229r656K82Q683l425p321P736J232r058L617O758o192
2426a462l122P337L81o854M358M147p139j21N338k369n827O623K549p502L143
2441e20M282m723j438N430j751l561K054L292n036J476L106j760j443J002N83
2456I93k259J393O3j475o20J927k75k46j88J194J9o73J38J334n74p14L0M40j888
2475a381L17Q34M28k557K029L613l401j224L821j049n176M056Q36m263Q32N723
2491C438k774l388N806N12o102L679L742o254k840O211j700n055N197K254n748
2506c022J958P031n875l197O260L80q507L692N342p322j044P827j732o811O180
$$ plain form
2521 1160 5628 -2422 -1579 5267 32 -4018 2211 1603 -4410 -810 5186 -1245 -2876 4712 1715
2536 1715 -4228 957 2904 -3855 -2252 3636 -281 -4249 2924 2224 -2504 189 4181 -1291 -1611
2551 -1611 2530 -126 -4209 -209 1122 -3270 -896 2751 650 -520 2737 1398 -1735 -1070 1085
2566 1085 -1277 -1812 154 261 -1889 829 1561 101 830 1345 449 -338 -388 -1881 -467 -1380 -1368 761
2584 761 544 -365 2033 1859 1393 28 962 716 -2380 -616 1189 -2171 -1485 1149 -520 -514 2444 2206
2602 2206 -1396 241 2610 -2424 -3713 1015 -491 -3163 195 2572 -2350 -28 4077 -233 -3195
2617 -3195 1652 995 -4209 -589 2189 -2178 -2349 4032 1685 -2775 2684 4083 -3416 -588 3811
2632 3811 -2097 -3552 2805 1013 -3926 841 4334 -1638 -1631 4090 -271 -3515 1067 1552 -3975 -1364
$$ packed form
2521A160M468q050Q43O846n235m050O229o08o013L600N996o431j631P588k997
2536A715n943N185J947o759J603N888l917l968P173p00m728K693L992n472l20
2551a611M141k656m083M000J331m392K374L647k101j170L257j339l133O65K155
2566A085k362n35J966J07k150K718P32j460P29N15q96p87n0j493J414r13J2K129
2584G61k17r09K398j74m66j365R34k46l096J764J805l360O86K634j669OK958k38
2602B206l602J637K369n034j289M728j506k672L358K377m922K322M105m310k962
2617c195M847o57n204L620K778m367j71O381k347m460N459J399p499K828M399
2632C811n908j455O357j792m939M767L493n972PN721m361l244M582M85n527K611
$$ plain form
2648 -1364 2530 -1992 -2516 4703 2388 -1949 1386 2959 -2283 -2413 1526 -1916 -4029 485 1595
2663 1595 -2795 589 3948 1102 345 2300 244 -2272 83 34 -2530 -1165 442 123 -933 2901
2679 2901 1884 -128 1393 721 92 -964 -185 -1491 -1749 -977 -276 858 828 1368 875 619 -790 -418
2697 -418 -277 -979 -1630 -535 349 -1929 -108 1992 1247 129 1633 1731 -1146 -468 280 -1904 -1964 624
2715 624 -179 -1610 1252 2425 -1228 85 4349 -526 -3188 1247 331 -2936 528 2458 -2330 -753
2731 -753 3753 579 -2990 2424 1262 -3644 -344 3207 -3448 -3294 2982 583 -2855 2262 4418
2746 4418 -1236 160 3328 -572 -4260 1026 85 -4692 -625 3097 -1417 -194 4249 1869 -2580
2761 -2580 1612 1721 -3441 -2874 1826 -1413 -3791 1791 960 -1370 1881 4196 -299 -262 2453 -390
$$ packed form
2648a364L894m522n24P219k315m337L335J573n242j30L939l442k113M514J110
2663A595m390L384L359k846p57J955k056k516K355m9k564J365J607l19j056L834
2679B901j017k012J521o72o29j056P79j306k58P72P01J134l0N40m93k56j409L72
2697d18J41p02o51J095Q84k278J821K100p45j118J504R8k877O78P48k184o0K588
2715F24q03j431K862J173l653J313M264m875k662M435r16l267L464J930m788J577
2731g53M506l174l569N414j162m906L300L551o655J54O276k399l438N117K156
2746D418n654J396L168l900l688N286r41m777M067L722m514J223M443k380m449
2761b580M192J09n162N67M700l239k378N582q31k330L251K315m495L7K715k843
$$ plain form
2777 -390 -2471 -382 934 -2464 -643 1463 -2 252 2273 1527 -1619 401 516 -1752 -1778 401
2793 401 -2222 -568 752 -134 -191 765 2281 1154 377 93 -1968 -1310 -1340 -1118 -1252 1410 636 1039
2811 1039 1875 327 730 810 219 -1565 -1178 -181 -1711 -1558 2027 964 -1267 2107 2827 -1017 -342
2828 -342 1116 -1778 -2665 733 -2077 -3495 104 1786 -1375 617 3960 203 -1286 1714 424
2843 424 -4585 -1508 1574 -3097 -1294 3156 1129 -1415 3184 2852 -671 607 2567 -1964 -3710
2858 -3710 797 216 -3882 1080 2892 -1743 -898 4415 989 -2485 1812 716 -3877 -1819 1478
2873 1478 -2758 -2419 1737 1584 -1732 2228 2652 -1485 -1356 2346 -1829 -4109 809 338 -2483 840
2889 840 2343 -340 217 1680 -26 -646 -546 -137 -1978 -1550 -60 543 -1185 1176 873 376 1089
$$ packed form
2777c90k081K089J316l398J821K106j465K54K021p46l146K020J15k268k6K179
2793D01k623J654J320q86n7R56J516j127p77k84k061O58l0K22j34K662p74M03
2811A039Q36j548M03Q0n91j784L87R97j530J53L585j063k231L374P20l844O75
2828c42J458k894q87L398k810j418L599J682l161J992L343l757j489L000j290
2843D24n009L077L082m671J803M450k027k544M599l32l523J278J960m531j746
2858c710M507n81m098M962J812m635Q45N313l426l474M297j096m593K058L297
2873A478m236L39M156j53l316L960M24m137J29L702m175k280M918m71k821L323
2889H40J503k683N57J463j706o20J00M09j841M28J490O03j728K361l03m97P13
$$ plain form
2906 1089 344 -283 -994 394 -2032 -376 -529 -479 9 1387 980 1006 898 1561 -120 -347 -1164 -1289 -635
2925 -635 -331 -1371 -414 2215 487 614 1224 1476 -1302 -733 875 -2221 -2292 39 -774 -1571 2169 2614
2943 2614 -1062 750 2155 -110 -1325 1556 -1065 -3698 -658 177 -1610 -800 3175 920 -907
2958 -907 2797 2169 -3105 -1486 729 -3468 -2934 1447 -462 -1593 2475 2100 -311 649 2685 -385
2974 -385 -2145 1122 -513 -3705 -398 1849 -1383 -953 2686 405 -410 2616 1153 -3066 -1525 315
2990 315 -1539 -1339 1407 505 -845 1181 2175 -187 192 1689 -1401 -2298 195 -952 -2329 -603
3006 -603 1906 -553 609 2585 963 607 341 843 -2049 -1321 -1089 -1640 -2573 1287 956 1066 2138
3023 2138 1323 691 600 -1044 -1249 -953 -2602 -1491 -1382 474 526 1219 2777 1959 645 1536 152 -1054
$$ packed form
2906A089p45o27p11J388k426J656j53N0M88J378m07K6j08O63j681k27q17j25O54
2925f35L04j040R57K629j728J27O10K52k778N69J608l096p1K331q13p97L740M45
2943B614l676J812J405k265j215K881k621k633L040Q35j787Q10L975k255j827
2958i07L704o28n274J619K215m197N34M381j909j131M068l75k411R60K036l070
2974c85j760L267j635l192L307K247l232M30L639k281q15L026j463m219J541J840
2990C15j854K00K746r02j350K026R94k362L79J497l090q97K493j147j377J726
3006f03K509k459J162J976j622l56k66N02k892P28K32n51r33L860l31J10J072
3023B138q15o32r1j644k05K96j649J111J09J856N2O93J558q18j314Q91j384j206
$$ plain form
3041 -1054 -847 220 -1973 -1798 -189 302 509 1478 1047 -432 -242 875 -1382 -1723 74 -1635 -2292
3058 -2292 74 795 -1691 514 3930 630 -550 1441 -165 -2328 -699 897 -2246 -632 1358
3073 1358 844 -712 1533 1687 -1561 376 1425 -1970 -2618 791 -1337 -2531 760 1160 -1470 -168
3089 -168 3444 30 -558 579 -199 -3074 -134 -985 -1806 -1037 2701 937 84 1621 898 19 -130
3106 -130 813 -1777 -1430 -577 -713 -2137 486 1833 -231 1424 1868 261 128 -587 -83 -3756 -1415
3123 -1415 128 -1864 719 1265 1066 -128 2025 855 81 730 -909 -1094 -1804 -1002 -1571 -1283 675
3140 675 925 1038 1675 1214 547 -484 -1123 -1136 -2254 -1121 -989 395 929 1336 524 1925 1099 -909
3158 -909 172 -214 -1840 -1293 1275 -448 -1161 1322 1738 63 558 1812 -1153 -445 1188 -1311 -1941
$$ packed form
3041a054K07J067k193J75J609M91K07R69m31j479J90J117k257l41J797j709o57
3058b292K366P21k486K205L416l300j180J991j606k163J629J596l143J614J990
3073A358n14j556K245J54l248J937J049l395o48L409k128j194L291M00k630J302
3089a68L612l414n88J137p78k875K940q51q21P69L738j764q53J537p23q79j49
3106a30R43k590L47Q53j36j424K623J347k064J655M44j607j33p15N04l673K341
3123a415J543j992K583N46j99j194K153j170p74O49j639j85p10Q02n69K88J958
3140F75K50J13O37m61o67j031o39j3j118J133J32J384N34M07q12J401q26k008
3158i09J081l86j626N47K568j723p13K483M16j675M95J254k965P08J633k499o30
$$ plain form
3175 -1941 564 159 -1048 209 2730 1126 163 2414 2026 -548 -835 407 -2498 -1223 959 -63
3191 -63 -1501 2174 1297 492 1183 1846 -213 -1488 65 -941 -3101 163 251 -1591 95 2285 1136
3208 1136 -915 2687 1292 -1781 -818 622 -2121 -2596 599 -15 102 1654 2025 261 345 2243 -465
3225 -465 -1554 1 -427 -2360 -112 98 -32 1240 1790 693 -638 1159 -171 -1150 -1166 -332 -1061
3242 -1061 -621 576 82 -141 1874 1204 488 339 226 -33 -158 -2100 -1982 -333 1323 653 621 2012
3260 2012 519 551 952 -230 -673 -150 -944 -1511 -1632 1207 -724 -164 2095 1637 -165 723 150 -1250
3278 -1250 -1031 -309 -1072 -1920 -339 283 -245 191 3244 422 -156 1649 863 -1201 344 -159 -1782
3295 -1782 -150 725 691 868 3243 1991 127 1105 906 -1506 -1667 145 -1232 -2371 -109 1696 -1170
$$ packed form
3175a941K505m05j207J257K521j604r63K251l88k574k87J242k905J275K182j022
3191f3j438L675q77q05O91O63k059j275J553j006k160L264Q8j842J686K190j149
3208A136k051L602j395l073R63J440k743m75L195o14J17J552L71j764Q4J898k708
3225d65j089J555m28j933K248K10j30J272N50j097j331J797j330r79j6Q34p29
3242a061M40J197m94k23K015o70p16j49j13k59j25j942J18J649J656o70l2J391
3260B012j493L2M01j182m43N23p94n67j21K839j931N60K259m58j802Q88n73j400
3278a250K19P22p63q48J581O22n28M36L053k822n78J805p86k064J545n03j623
3295a782J632Q75l4J77K375j252j864R78j99k412j61J812j377j139K262J805k866
$$ plain form
3312 -1170 769 2313 97 -282 1446 -522 -1570 -964 -328 -2317 -1848 798 -165 375 960 1061 -1086
3329 -1086 -407 1161 -1386 -1017 -158 -915 -1339 564 2409 376 1233 1304 -598 -82 296 -1752 -1080 -995
3347 -995 -568 -1118 844 597 1046 1282 1501 1160 969 -233 493 -2076 -2217 835 -943 -18 534 819
3365 819 655 1104 730 4 -211 -699 -1821 -1300 -944 -713 748 1674 732 683 2117 1596 -471 319 -24
3384 -24 -1764 -864 -396 -585 -296 757 1069 14 1523 1821 161 71 641 -1076 -1899 98 252 -1926
3402 -1926 -1112 1940 175 124 2473 755 -310 180 585 -1623 -1057 -167 -1926 -1080 1383 1850 -2
3419 -2 1080 2415 -1316 318 402 -1581 -1587 631 1060 -1310 944 1211 -426 277 1713 1135 -1390 -56
3437 -56 -410 -2361 -881 1696 -386 225 436 1212 80 851 1424 -279 -949 694 -1664 -2120 199
$$ packed form
3312a170J939J544k216l79J728j968j048O06O36j989M69K646r63N40N85J01k147
3329a086O79J568k547L69Q59p57m24J903J845k033Q57P1j902N16L78k048O72Q5
3347i95M27n50J962k47M49K36K19l41j91j202P26k569j41L052j778R25N52K85
3365H19j64M49l74p26k15m88j122N21L56K31J461R26r42m9J434n21k067P90l43
3384b4j740R00M68j89K89J053L12j055J509K98j660r0N70j717q23J997J54k178
3402a926Q14L052j765n1K349j718j065M90M05k208N66Q90j759Q46K463M67j852
3419bJ082J335l731J634Q4j983oK218M29k370K254K67j637P03J436n78k525J334
3437e6l54j951J480K577k082O11K11P76j132P71N73j703o70J643k358m56K319
$$ plain form
3454 199 188 332 1005 1775 269 -268 850 532 -1789 -1557 -426 -1817 -546 -984 -1226 -1 -142 503
3472 503 832 921 49 -2572 -272 111 -686 91 -698 -812 782 1348 916 582 1265 324 -506 -364 -998
3491 -998 -1384 -705 -1111 -984 191 1436 1536 -350 465 703 -975 -423 516 -971 -1931 -319 -361 -1133
3509 -1133 1150 1370 489 810 1456 167 -897 233 -727 -1464 -666 584 -167 555 1303 1731 692 -569
3527 -569 26 -1196 15 -81 -1413 -1100 445 397 -1168 647 1407 -127 469 997 -151 -1893 -1416 -134
3545 -134 -1175 -570 496 433 585 1394 632 178 977 253 -1137 -962 366 -1385 -1381 633 1138 658 1002
3564 1002 767 368 -219 114 72 -1079 -760 -874 -1436 -257 956 545 1221 1084 236 454 -31 -6 27 -2329
3584 -2329 -204 -79 -286 -595 966 1109 1281 -414 23 -443 -663 -1322 -568 277 -202 -813 1235 951
$$ packed form
3454A99j1J44O73P70j506n37J118l18k321K32J131j391J271m38k42J225j41O45
3472E03L29Q9q72k621K300L83p97P77p89j14J594N66m32l34O83r41q30J42o34
3491i98l86O79m06J27J175J245J00j886Q15K38j678N52R39j487r60J612m2p72
3509a133K283K20q81L21O46j289j064J130r60p37P98J250p51P22P48M28j039j261
3527e69N95j222J211r6j332L13J545m8j565J815P60j534N96N28j148j742M77J282
3545a34j041O05J066o3J52Q09p62m54P99p24j390J75J328j751MK014N05m80L44
3564A002k35l99n87L33m2j151L19j14n62J179J213m11O76j37q48K18m85K5L3k356
3584b329K125J25k07l09J561J43J72j695M37m66k20o59P54Q45m79o11K048k84
$$ plain form
3602 951 707 1767 716 -720 441 475 -1681 -1470 -460 -846 149 -138 393 73 731 1004 202 987
3620 987 137 -895 -1338 -312 -270 -833 -755 541 579 -34 2030 312 -157 617 49 -2289 -981 -189 -683
3639 -683 -1586 1021 -219 518 444 1619 -188 -632 -326 -1002 -1239 -428 -415 -533 -404 839 651 1001 1583
3658 1583 701 -399 218 -742 -1713 -708 -238 -183 -538 1352 308 593 770 481 -774 4 56 -1199
3676 -1199 -1268 287 19 -589 -154 976 491 688 683 408 -811 -840 901 -973 -955 -530 -1352 -641 22 1075
3696 1075 358 217 595 -286 -1119 -823 -1247 -569 -207 -50 610 703 946 341 193 365 -618 102 -200 -1008
3716 -1008 -1312 -529 -546 420 582 119 713 811 1211 -315 -775 461 -2295 -1201 -16 -175 -1112 920
3734 920 1978 -280 1323 442 442 -581 348 -660 -1452 -372 890 -669 422 926 1689 1074 781 975
$$ packed form
3602I51k44J060j051j436J161L4k156K11J010l86R95k87N31l20O58K73q02P85
3620I87q50j032m43J026M2n63P8J296L8o13K064j718m69P74n68k338J308P92m94
3639f83r03K607j240P37p4J175j807m44L06o76k37Q11J3j18J29J243j88L50N82
3658A583q82j100O17r60r71J005M70N5l55J890j044K85J77k89j255P78N2j255
3676a199o9J555k68o08M35J130m85J97nk75j219k9J741j874J8M25q22P11O63J053
3696A075p17j41L78q81q33K96m24O78L62J57O60R3K43o05j48J72r83P20l02q08
3716a008l04P83j7R66J62m63N94R8M00j526m60J236k756J094J185j59r37K032
3734I20J058k258J603q81%j023R29j008p92J080J262j559J091N04P63o15k93J94
$$ plain form
3752 975 -878 -14 -62 -1190 -1280 409 -839 -724 784 1748 398 138 952 641 -601 -396 -654 -1359
3770 -1359 -315 372 38 666 897 396 -748 402 303 -1001 -230 582 -985 -968 89 1090 -561 1285
3788 1285 602 -264 -617 247 971 -561 -456 -826 -328 -282 -107 -176 -247 793 41 632 -503 -879 -1419 -220
3808 -220 51 -1097 -420 932 -485 -246 -47 316 40 523 -508 -869 -1045 -87 -748 -753 -172 -225 772 634
3828 634 770 297 444 349 -1392 -602 -98 -373 835 1176 337 -162 1071 954 635 281 850 -1138 -1008
3847 -1008 395 -1019 -733 -176 178 -624 900 949 67 -612 679 139 -1524 -192 -581 -301 -299 929
3865 929 215 -60 1522 397 -912 99 434 -1581 -999 64 -993 -770 -978 1269 726 426 836
3882 836 717 -14 -1277 -741 -586 -837 -375 -1073 -762 1449 576 -312 1792 1002 -1060 1203 192 -619
$$ packed form
3752I75j853Q64m8j128r0J689j248J15J508R64j350k60Q14l11j242K05k58p05
3770a359J044O87l34O28K31n01j144J150r9j304P71Q12j567J7J057J001j651J846
3788A285o83q66l53Q64P24j532J05l70M98M6J75o9p1J040p52N91j135l76n40J199
3808b20K71j148O77J352j417K39J99L63k76M83j031l61j76R58o61nN81n3R97j38
3828F34J36m73J47r5j741P90N04k75J208L41q39m99J233j17l19l54N69j988J30
3847a008J403j414K86N57L54q02J524M9q82o79J291n40j663J332l89K80KJ228
3865I29p14k75J582j125j309J011L35k015N82J063j057K23k08K247n43l00M10
3882H36j19p31j263N36J55k51M62o98L11K211q73q88K104p90k062K263j011q11
$$ plain form
3900 -619 -617 -389 -295 -598 549 -379 278 573 370 117 -743 188 -244 8 -60 535 -693 269 260 525 560 729
3922 729 -321 -361 -721 -638 182 266 -119 -1354 763 41 -133 508 699 -367 362 437 302 -119 -524 -543
3942 -543 -620 97 1167 -597 -445 -84 -10 -166 -231 168 -1343 -410 -381 591 47 1379 316 372 1129 671
3962 671 -774 -1108 183 -176 -861 -1127 105 353 -118 878 -272 509 292 -289 -1323 -301 523 -899
3980 -899 -248 1027 -711 168 393 861 37 -335 -232 -268 -666 -717 -517 -1051 -806 -823 196 109 643 -20
4000 -20 1124 745 70 -510 -100 331 -1315 -855 14 365 405 895 103 -48 409 -338 -183 -494 148 -240
4020 -240 -174 -202 -580 365 -182 943 315 649 342 299 -610 189 -315 -302 -95 655 575 1466 459 424 486 -87
4042 -87 401 -735 -640 -413 -1024 544 1063 -806 -55 1395 797 95 773 -438 742 -250 -474 -1334 -360
$$ packed form
3900f19KK28R4l03J147r28O57K95k03k53q60R31m32K52o8N95j228R62rK65L5J69
3922G29j050m0l60Q3Q20Q4l85j235K117p22j74O41J91j066P29P5j35m21m05j9
3942e43p7P17J070j764J52L61P4j56o5L99j511R33K9R72n44J332j063N6P57m58
3962F71j445l34J291l59o85k66J232K48m71R96j150P81k17n81j034J022Q24j422
3980h99O51J275j738Q79K25M68q24l72J03l6l98n1K00n34K45j7J019q7N34o63
4000b0J144l79o75n80M10M31j646M60Q69L51M0M90p92j51M57p47J55l11O42l88
4020b40O6k8l78R45n47J125o28L34l07m3r09P99n04J3K07P50q0Q91j007l5O2n73
4042h7M88j136R5K27o11J568N19j869P51J450n98p02O78j211J180r92k24q60R74
$$ plain form
4061 -360 317 -657 546 347 907 -688 472 -608 -506 -117 397 -1452 250 490 292 -307 551 1975
4079 1975 667 198 613 103 -763 -353 -465 -600 170 1143 -86 -309 854 -120 -315 -99 -221 -535 457
4098 457 669 -238 -550 761 876 -268 942 1208 -179 -182 894 -73 -371 -777 35 -254 -268 948 45
4117 45 890 547 -486 434 293 -883 -460 -1050 246 -311 137 370 323 -201 1505 730 -370 -505 -118
$$ packed form
4061c60O77r74J203j99N60j595J160j080J02L89N14j849J702K40j98n99Q58J424
4079A975j308m69M15n10q66M10j12j35P70R73j229k23J163r74j95K16j22l14R92
4098D57K12r07l12J311J15j144J210K66j387lJ076r67k98m06Q12k89j4J216r03
4117D5Q45l43j033R20j41j176M23n90J296n57M48K33m7n24J706p75j100j35L87
$$ [...]
8191B65
##END NTUPLES=NMR FID
##END=
