##TITLE=1H_UK_23_9_11
 CD2Cl2
 64 sc, 
 9.2.2023
##JCAMPDX= 6.0         $$ Bruker NMR JCAMP-DX V2.0
##DATA TYPE= NMR FID
##DATA CLASS= NTUPLES
##ORIGIN= UXNMR, Bruker Analytische Messtechnik GmbH
##OWNER= root
$$ XWIN-NMR		Version 3.5
$$ Thu Feb  9 14:05:06 2023 Russian Standard Time (UT+4h)  she@DPX200
##.OBSERVE FREQUENCY= 200.13135
##.OBSERVE NUCLEUS= ^1H
##.DELAY= (6, 6)
##.ACQUISITION MODE= SIMULTANEOUS
##.ACQUISITION SCHEME= undefined
##.AVERAGES= 64
##.DIGITISER RES= 18
##SPECTROMETER/DATA SYSTEM= spect
##.PULSE SEQUENCE= zg30
##.SOLVENT NAME= CD2Cl2
##.SHIFT REFERENCE= (INTERNAL, CD2Cl2, 0, 15.7039)
##AUDIT TRAIL= $$ (NUMBER, WHEN, WHO, WHERE, WHAT)
$$ ##TITLE= Audit trail, XWIN-NMR		Version 3.5
$$ ##JCAMPDX= 5.01
$$ ##ORIGIN= Bruker BioSpin GmbH
$$ ##OWNER= she
$$ F:/spectra/data/she/nmr/H-F/1/audita.txt
$$ ##AUDIT TRAIL=  $$ (NUMBER, WHEN, WHO, WHERE, WHAT)
(   1,<2023-02-09 14:03:49.10 +0400>,<she>,<DPX200>,
      <continue with go, POWCHK disabled, PULCHK disabled
       configuration hash MD5:
       00 E9 B6 7A A2 85 ED C7 34 08 36 98 17 FE 4E 26
       data hash MD5: 16K
       39 12 31 93 7E D3 10 48 13 5C F9 74 96 E4 68 9F>)
$$ ##END=
$$ 
$$ hash MD5
$$ 08 80 33 92 AF A2 71 AC 11 80 3E 72 13 35 DF 45
##$RELAX= 
##$RELAX= 
##$RELAX= 
##$RELAX= 
##$RELAX= 
##$RELAX= 
$$ Bruker specific parameters
$$ --------------------------
##$DU= <F:/spectra>
##$EXPNO= 1
##$NAME= <H-F>
##$PROCNO= 1
##$TYPE= <nmr>
##$USER= <she>
##$AMP= (0..31)
100 100 100 100 100 100 100 100 100 100 100 100 100 100 100 100 100 100 
100 100 100 100 100 100 100 100 100 100 100 100 100 100 
##$AQSEQ= 0
##$AQ_mod= 1
##$AUNM= <au_zg>
##$AUTOPOS= <>
##$BF1= 200.13
##$BF2= 200.13
##$BF3= 200.13
##$BF4= 200.13
##$BF5= 200.13
##$BF6= 200.13
##$BF7= 200.13
##$BF8= 200.13
##$BYTORDA= 1
##$CFDGTYP= 0
##$CFRGTYP= 5
##$CHEMSTR= <none>
##$CNST= (0..31)
1 1 145 1 1 1 1 1 1 1 1 1 1 1 1 1 1 1 1 1 1 1 1 1 1 1 1 1 1 1 1 1 
##$CPDPRG= <>
##$CPDPRG1= <>
##$CPDPRG2= <>
##$CPDPRG3= <>
##$CPDPRG4= <mlev>
##$CPDPRG5= <mlev>
##$CPDPRG6= <mlev>
##$CPDPRG7= <mlev>
##$CPDPRG8= <mlev>
##$CPDPRGB= <>
##$CPDPRGT= <>
##$D= (0..31)
0 1.2 0 0 0 0 0 0 0 0.06 0 0.03 0 0 0 0 0.0002 0 0 0 0 0 0 0 0 0 0 0 0 
0 0 0 
##$DATE= 1675936770
##$DBL= (0..7)
120 120 120 120 120 120 120 120 
##$DBP= (0..7)
150 150 150 150 150 150 150 150 
##$DBP07= 0
##$DBPNAM0= <>
##$DBPNAM1= <>
##$DBPNAM2= <>
##$DBPNAM3= <>
##$DBPNAM4= <>
##$DBPNAM5= <>
##$DBPNAM6= <>
##$DBPNAM7= <>
##$DBPOAL= (0..7)
0.5 0.5 0.5 0.5 0.5 0.5 0.5 0.5 
##$DBPOFFS= (0..7)
0 0 0 0 0 0 0 0 
##$DE= 6
##$DECBNUC= <off>
##$DECIM= 32
##$DECNUC= <off>
##$DECSTAT= 4
##$DIGMOD= 1
##$DIGTYP= 9
##$DL= (0..7)
0 120 120 120 120 120 120 120 
##$DP= (0..7)
150 150 150 150 150 150 150 150 
##$DP07= 0
##$DPNAME0= <>
##$DPNAME1= <>
##$DPNAME2= <>
##$DPNAME3= <>
##$DPNAME4= <>
##$DPNAME5= <>
##$DPNAME6= <>
##$DPNAME7= <>
##$DPOAL= (0..7)
0.5 0.5 0.5 0.5 0.5 0.5 0.5 0.5 
##$DPOFFS= (0..7)
0 0 0 0 0 0 0 0 
##$DQDMODE= 0
##$DR= 18
##$DS= 0
##$DSLIST= <SSSSSSSSSSSSSSS>
$$ [...]
##$SUBNAM2= <"">
##$SUBNAM3= <"">
##$SUBNAM4= <"">
##$SUBNAM5= <"">
##$SUBNAM6= <"">
##$SUBNAM7= <"">
##$SUBNAM8= <"">
##$SUBNAM9= <"">
##$SW= 18.05172834244
##$SWIBOX= (0..15)
0 0 2 0 0 0 0 0 0 0 0 0 0 0 0 0 
##$SW_h= 3612.71676300578
##$TD= 16384
##$TD0= 1
##$TE= 0
##$TE2= 300
##$TE3= 300
##$TEG= 300
##$TL= (0..7)
0 120 120 120 120 120 120 120 
##$TP= (0..7)
150 150 150 150 150 150 150 150 
##$TP07= 0
##$TPNAME0= <>
##$TPNAME1= <>
##$TPNAME2= <>
##$TPNAME3= <>
##$TPNAME4= <>
##$TPNAME5= <>
##$TPNAME6= <>
##$TPNAME7= <>
##$TPOAL= (0..7)
0.5 0.5 0.5 0.5 0.5 0.5 0.5 0.5 
##$TPOFFS= (0..7)
0 0 0 0 0 0 0 0 
##$TUNHIN= 0
##$TUNHOUT= 0
##$TUNXOUT= 0
##$USERA1= <user>
##$USERA2= <user>
##$USERA3= <user>
##$USERA4= <user>
##$USERA5= <user>
##$V9= 5
##$VALIST= <valist>
##$VCLIST= <CCCCCCCCCCCCCCC>
##$VD= 0
##$VDLIST= <DDDDDDDDDDDDDDD>
##$VPLIST= <PPPPPPPPPPPPPPP>
##$VTLIST= <TTTTTTTTTTTTTTT>
##$WBST= 1024
##$WBSW= 4
##$XGAIN= (0..3)
0 0 0 0 
##$XL= 0
##$YL= 0
##$YMAX_a= 907870
##$YMIN_a= -703272
##$ZGOPTNS= <>
##$ZL1= 120
##$ZL2= 120
##$ZL3= 120
##$ZL4= 120
##$ABSF1= 10
##$ABSF2= 0
##$ABSG= 5
##$ABSL= 3
##$ALPHA= 0
##$AQORDER= 0
##$ASSFAC= 0
##$ASSFACI= 0
##$ASSFACX= 0
##$ASSWID= 0
##$AUNMP= <proc_1d>
##$AZFE= 0.1
##$AZFW= 0.1
##$BCFW= 1
##$BC_mod= 2
##$BYTORDP= 1
##$COROFFS= 0
##$CY= 11.3945322036743
##$DATMOD= 1
##$DC= 2
##$DFILT= <>
##$DTYPP= 0
##$F1P= 2.36226072786647
##$F2P= -0.459571619588291
##$FCOR= 0.5
##$FTSIZE= 0
##$FT_mod= 4
##$GAMMA= 1
##$GB= 0.15
##$INTBC= 1
##$INTSCL= 1
##$ISEN= 128
##$LB= 0.24
##$LEV0= 0
##$LPBIN= 0
##$MAXI= 10000
##$MC2= 0
##$MEAN= 0
##$ME_mod= 0
##$MI= 1.114404
##$NCOEF= 0
##$NC_proc= 0
##$NLEV= 6
##$NOISF1= 3.799351
##$NOISF2= 2.8
##$NSP= 1
##$NTH_PI= 0
##$NZP= 0
##$OFFSET= 15.70392
##$PC= 1
##$PHC0= -19112.48
##$PHC1= 10.40079
##$PH_mod= 1
##$PKNL= yes
##$PPARMOD= 0
##$PSCAL= 0
##$PSIGN= 0
##$REVERSE= no
##$SF= 200.130013532006
##$SI= 16384
##$SIGF1= 3
##$SIGF2= 2
##$SINO= 400
##$SIOLD= 16384
##$SREGLST= <1H.CDCl3>
##$SSB= 0
##$STSI= 0
##$STSR= 0
##$SW_p= 3612.71676300578
##$SYMM= 0
##$S_DEV= 0
##$TDeff= 0
##$TDoff= 0
##$TI= <>
##$TILT= no
##$TM1= 0
##$TM2= 0
##$TOPLEV= 0
##$USERP1= <user>
##$USERP2= <user>
##$USERP3= <user>
##$USERP4= <user>
##$USERP5= <user>
##$WDW= 1
##$XDIM= 8192
##$YMAX_p= 0
##$YMIN_p= 0
$$ End of Bruker specific parameters
$$ ---------------------------------
##NTUPLES= NMR FID
##VAR_NAME=  TIME,          FID/REAL,        FID/IMAG
##SYMBOL=    X,             R,               I
##VAR_TYPE=  INDEPENDENT,   DEPENDENT,       DEPENDENT
##VAR_FORM=  AFFN,          ASDF,            ASDF
##VAR_DIM=   8192,          8192,            8192
##UNITS=     SECONDS,       ARBITRARY UNITS, ARBITRARY UNITS
##FACTOR=    0.0002768,     1,               1
##FIRST=     0,             0,               0
##LAST=      2.2672688,     0,               0
##MIN=       0,             -703272,         0
##MAX=       2.2672688,     907870,          0
$$ Real data points
##PAGE= N=1
##DATA TABLE= (X++(R..R)), XYDATA
$$ [...]
2551B224j236j485O76J97j183L76J70j22q99J486M37r40J95J925p87k453J658
$$ 2224 988 -497 179 376 -807 -431 -261 -383 -1282 204 641 -299 -104 1821 1034 -1419 239
2568B39M18j404m27J761q04j433K213J417k748L47L712k588k642K293P58l324
$$ 239 657 -747 -1174 587 -217 -1650 563 1980 -768 -421 3291 703 -1939 354 1112 -2212
2584b212J147L018k605j099L193m4l637K413K749l969j064M046j202l995L845
$$ -2212 -1065 1953 -652 -1751 1442 1398 -2239 174 2923 -1046 -2110 1936 734 -3261 584
2599E84R41l904K088K787k737k358N222j366l676J918K896m720n91N140r16l724
$$ 584 1525 -2379 -291 2496 -241 -2599 2623 1257 -2419 -501 2395 -2325 -2916 2224 1308 -2416
2615b416L400J193m010N64L910k859k505L714o28l286J839L193j847k118M445
$$ -2416 984 2177 -1833 -1269 2641 -218 -2723 991 363 -2923 -1084 2109 262 -1856 2589
2630B589j364l691K623J765l772m48L491j463k306L825P22k728R06K467k421j196
$$ 2589 1225 -2466 157 1922 -1850 -2298 1193 -270 -2576 1249 1971 -757 149 2616 195 -1001
2646a001J645l62k717J197K393j879j131K844j25k421K281R77k021j251J681j143
$$ -1001 644 282 -2435 -1238 1155 -724 -1855 989 864 -1557 724 1701 -320 -1571 110 -1033
2662a033r30J485J537j872j42K187k89j152J318J024k417j462J461Q57k202L94
$$ -1033 -1963 -478 1059 -813 -955 1232 943 -209 1109 2133 -284 -1746 -285 572 -1630 -1236
2678a236K272l67k018K366K91j835L50K070k573r34K083m07j591J026J627k052
$$ -1236 1036 669 -1349 1017 1308 -527 -177 1893 -680 -1614 469 62 -1529 -503 1124 -928
2694i28J58L152q97k508J522J412l974N27K670j769j965M074m50k089Q77L200
$$ -928 -770 2382 1485 -1023 499 1911 -2063 -1536 1134 -635 -2600 1474 1024 -1065 -188 3012
2710C012l512j380K881K9l811K288K303l120k4L603j619k845L292J045m159P18
$$ 3012 -500 -1880 1001 1030 -2781 -493 1810 -1310 -1334 2269 650 -2195 1097 2142 -2017 -1299
2726a299L339l155n71L009p48k841K188K387k932O75K984k401k432K701l47k791
$$ -1299 2040 -1115 -1686 1323 575 -2266 -78 2309 -623 52 3036 635 -1797 904 557 -2234
2742b234J575K178k934p73M184m27k729J224J733k746j57K030j194k092K238J178
$$ -2234 -659 1519 -1415 -2188 1996 1569 -1160 64 1797 -949 -1106 924 -270 -2362 -124 1054
2758A054j975M02J925m56j064J328l13j554j13J695j250n93J124n79O08j34J226
$$ 1054 -921 -519 1406 950 -114 1214 901 -653 -766 929 -321 -914 210 -369 239 105 1331
2775A331o08n21j34O48j468N08M23r71n79J342J460j508j22J654o67j025R08J09
$$ 1331 723 202 68 716 -752 -244 179 -792 -1371 -29 1431 -77 -199 1455 788 -237 671 780
2793G80k066J84J880j288l86J386J126k486L42K121j332r20R65K21l065J393K388
$$ 780 -1286 -1102 778 -510 -896 490 1616 -870 -528 1593 261 -659 306 527 -2538 -1145 1243
2810A243j877n0J610J56k465J920J099l047j89K784r36k790L018K74k427P07M024
$$ 1243 -634 -684 926 1082 -1383 537 1636 -1411 -1600 1184 248 -2542 476 750 -1677 -970 3054
2827C054k529j884L735j432k785J370J363k554J52K497o38j685K677R09k231K15
$$ 3054 525 -1359 2376 944 -1841 -471 892 -1662 -1510 987 349 -1336 1341 2250 19 234
2843B34J846k250k202K737k34k502K024J212j147r74L158j064j544J445O00k046
$$ 234 2080 -170 -2372 365 131 -2371 -347 865 -282 -1256 1902 838 -706 739 1339 -707
2859g07n20J790j378j020K055O11j975J767J315j235p87J31J90k005Q90M67p37
$$ -707 -1227 563 -815 -1835 220 831 -1144 623 1938 703 -84 47 237 -1768 -878 -411 -1148
2876a148O30J070o35L9J11L87n64k59J162j130j054O38M91N05n24P67K67m32j16
$$ -1148 -518 552 -83 -44 67 454 -110 -369 793 -337 -1391 -753 -262 243 -281 486 753 321 205
2895B05R20j118l79J349j128o31m88K210j306l15J506N58j916R50M94j555l44
$$ 205 1125 7 -372 977 -151 -782 -1270 940 -366 -681 825 1383 -533 417 911 -644 -988
2912i88J232r14j021J574J053j594K78K716j245j188M07L74k128M40J833k252
$$ -988 244 -670 -1691 -117 936 -658 -380 2336 1091 -97 310 684 -1444 -1004 829 -1423
2928a423K53J113P29j142J095J601k131m43J185l19k114J205Q51k703J553J979
$$ -1423 -1170 -57 672 -470 625 2226 95 -348 837 518 -1596 -391 460 -2243 -690 1289
2944A289r48o33K036j020j204O03R03j976j223K059J87k235K683J408j881m29
$$ 1289 341 -292 1744 724 -480 123 1026 -950 -2173 -114 73 -2162 521 1929 48 -381
2960c81J725p21j251J015J69k839J487J481j210r77K775N28k130J353l76j265
$$ -381 1344 623 -628 387 556 -2283 -796 685 -525 -1502 1273 1801 -329 1024 648 -617
2976f17J51N57l08n50O65M43j059N49O75J120j273q3j2q92m14J213j063n86J426
$$ -617 -466 91 -217 -767 -102 341 -718 -169 506 1626 353 270 258 -634 -1048 165 -898 -1484 -58
2995e8Q2O18n59J129q39l80n4k00p56p58J003M41n71N00J099p6m14J223q98p08
$$ -58 24 642 83 1212 373 -7 -61 -261 -1017 -1775 -772 -331 -902 -402 697 621 207 1430 532 -176
3015a76K74K83j265m12Q01j61n88J847J008j490p3K072j740j064J172K60k419
$$ -176 98 381 -884 -1296 -495 -656 -1244 603 1611 121 48 2120 380 -684 488 748 -1671
3032a671Q90J274j853O1K426m91j169J889J41j979m1J750j985l96J202J49j333
$$ -1671 -781 493 -1360 -1299 1127 636 -533 1356 1497 -482 -523 1227 -758 -1154 48 197 -1136
3049a136R80K237k491L95J666j480l60L5N02j787O68J347j75q27J105N55j234
$$ -1136 -156 2081 -410 -15 1651 171 -189 -154 348 -1439 -771 576 401 -426 679 1234 0
3066@N32J733j569k813K186j93j083J465R11j846N85J755r22j045Q42p6j209n35
$$ 0 532 2265 696 -2117 69 -124 -1207 258 1169 -677 -92 1663 741 -304 538 462 -747 -1282
3084a282J491j339O96J307m33l91Q63K56j496M85M92q59r32N26N33q69R2J136
$$ -1282 209 -1130 -434 873 440 49 912 1168 -328 157 649 -210 -1142 -616 -83 -952 -860 276
3102B76n23K94M12M3K38k75o9j119j99O13p23O52J25R14N5Q0M8L99j521p1j3M04
$$ 276 -247 47 459 502 740 465 396 -723 -922 -309 -1032 -380 -255 659 714 794 842 1241 -280 -351 -364 40
3124D0j344l92J820p86O83O40L92j152Q16Q61j442j263J714j119j150J036Q53
$$ 40 -1304 -1696 124 -662 21 661 1053 -99 717 1578 136 -1127 587 -532 -1682 -646 207
3141B07r89N86J596k58p88M46m43j338M41J323j831m02K464k59j103P45J243j488
$$ 207 -782 -196 1400 1142 354 800 357 -981 -540 783 -1048 -1450 1014 755 -348 397 1640 152
3159A52o80J850j782k75Q60n36j162J367N27k45q57J339j50j707J280J199j738
$$ 152 -528 1322 -460 -735 125 -411 -1573 -206 321 76 -781 558 408 -1299 -19 1180 -558
3176e58m66J169k92r09J297J257j696M39J203k031M03M67m9j847k51J778o58M88
$$ -558 -1024 145 -147 -1056 241 1498 -198 241 1444 -587 -184 283 234 -1613 -1864 -86 -744 -256
3194b56L43O60n49J112o8j927k69N69j94n10L29k54O79P87o17P43J17L01n16q89
$$ -256 87 747 198 1310 1242 -685 -954 -385 -579 -1089 -760 -1014 -335 452 -165 578 695 996 480 -409
3214d09K12j46n90m05Q55N65M83m92M56K11k33o11P60o04j97j51m58m70R29J54
$$ -409 -197 -343 -933 -1338 -483 82 565 73 529 740 507 -104 656 52 -145 -296 -754 -1224 -295 -141
3234a41O73m86J121o92l95JK56j003k67P54j58m3J002N32j108K2O55r15m25J299
$$ -141 532 46 1167 475 80 81 337 -666 -933 -179 -337 -380 622 1154 46 68 723 -192 -617 682
3254F82j141m18K32N73q97O3J976p56m61R48k15n04n34J184r35j186O18J003j698
$$ 682 -459 -877 -645 -72 -969 -906 1070 314 -147 801 586 82 -452 732 -203 -1389 -771 232 -1466
3273a466K007O56p65p62J649o14j696R29N14k098J045J247j031l38J915l54q49
$$ -1466 541 1197 432 -330 1319 705 -991 -62 452 -1646 -601 646 -385 -723 1192 838 -11
3290a1P45N02k017P33Q3m07j010K55J528j154L72J116k24l42R15r10o29K45o34
$$ -11 734 1236 -781 -48 35 -372 -1382 -1127 401 -753 -381 735 511 169 1084 174 -455 -210 -844
3309h44O03n60J057q85M41R88P48m97j069O37n75p50P7L45j27j54J448j424L20
$$ -844 -241 -801 256 -629 -188 800 1548 1051 -18 619 44 -706 -629 -284 -411 -565 883 -541 -221
3328b21J718n43j040O32m75l06l90n20J146n66J46Q84M44n30n41J406j035l86
$$ -221 1497 954 -86 546 71 -235 -625 -1145 1 -565 -419 465 909 379 -162 1244 209 -177
3346a77N37p80J26r48Q64R6m32Q64J002j051R36L24j825j25L83J83k63K67L75
$$ -177 360 -420 -294 -1242 -378 -282 -714 150 1152 101 1037 1361 -464 -589 -206 -23 -286 -19 356
3365C56p13Q63K56k80j47L18l38j514J34J174j171N11O63K65k06J027M50j523
$$ 356 -357 506 762 482 335 653 315 -1199 -1065 109 -1062 -551 112 377 171 1198 1648 125
3383A25J87O18j362j046J543m06j226N54J576m38N8J361o47r97J152k91k402O01
$$ 125 312 930 -432 -1478 65 -341 -1567 -1013 563 125 183 1544 897 -100 1052 761 -1641 -1040
3401a040O96m31j97R49M11O3o0J013j463L8O25m07j037J219n09m98j91Q98O64
$$ -1040 -344 -775 -972 -23 388 451 391 1404 -59 -21 604 197 -840 379 -130 -628 -819 79 743
3420G43p14N93O22j393J65j54k90n56K74P65L52m91N63m25m81N58J45m92o30N00
$$ 743 29 622 1244 -149 16 -138 -428 -984 -710 55 407 -84 479 54 -427 131 276 -216 -846 -346
3440c46l4j15o88K115j008J79M11O72r66L1O5k72r14P32N01n96m50Q24l89R50
$$ -346 -380 -495 -1183 932 -76 103 514 1186 220 251 316 44 -870 -138 363 -233 -683 141 -248 702
3460G02M30j16m38j71l1j318M96N38r27K4J171L11q43M72O60r60n17M40k23j003
$$ 702 1132 1016 578 407 376 -942 -446 92 -835 -811 360 671 -172 300 960 0 -517 -77 -300 -1303
3480a303O56O10q89J79J623r18N25M21R4k078J130M55p21q50J354o88m95J808
$$ -1303 -647 -37 -926 -747 876 -42 483 904 998 -1080 50 505 -216 -1066 288 -400 -895 913
3498I13N6j426J010M38j026j617K088l92j223M13R70j105N06J420k73j480J444
$$ 913 969 -457 553 991 -35 -1652 436 44 -1179 -766 204 -901 -395 1025 752 -728 716
3515G16q79L10o16J45J42o56N55M85m84N84P25K00o53o41L77q82N45o13N40j80
$$ 716 -163 147 -469 -324 -182 -838 -283 202 -282 302 1027 1227 574 -67 310 -572 -27 -640 -100 -280
3535b80m14O98K74k0l50J84O21o10L64p05l2k59p2Q81m96J551p71j103J660p23
$$ -280 -694 4 278 258 -92 92 713 103 467 -238 -270 -529 -601 280 -216 1335 564 -539 1121 398
3555C98j98p46P79q80Q5J225m74p52N64R49p34N86M52j245n70K81M19j582Q36
$$ 398 200 -546 233 -647 -562 663 189 -563 1 950 216 802 1254 9 -561 -280 139 -1443 -607
3574f07M54J17q37J617O73j400R15J43j596L38L18o39n17O99R9kK44N48n34N53
$$ -607 -153 -36 -873 744 1417 17 932 1075 -521 -183 135 -504 -1021 -322 -223 -225 19 567 33 586
3594E86P57j356r08P39J116j819l96J522j208L74J589O23k482L37J628j310k40
$$ 586 1343 -13 -921 -182 934 -885 -1281 241 -967 -593 996 1619 -863 -526 1102 -208 -448
3611d48O13k17r18J240Q40n32o51K117j888n79K47R45j315k66R16n38o59J307
$$ -448 165 -52 -970 270 1110 578 -73 2044 156 -423 -176 769 -546 -812 104 -434 -1093 214
3629B14K04m44k4Q22o53M78J0o50p03N65Rj93K38L33l20K27L04L37m05j141L16
$$ 214 418 -26 -50 772 119 597 607 -43 -746 -181 -172 -365 -127 206 -114 113 417 754 349 -792 -476
3650d76m46L15l61R31k19n6L64K96K32p11R71k19o41m14R35j447kJ379n17J18
$$ -476 -922 -607 -968 -37 -256 -312 52 348 580 -131 840 621 -20 -434 501 -946 -948 431 -86 32
3670C2L47M68n33L44k47J69r23j10k42r45Q58L09O64lP09n54q73Q80k07q51l52
$$ 32 379 847 314 658 411 580 -343 -453 -695 -1640 -782 -473 191 188 897 343 -530 350 143 -708 -1060
3691a060J384o63K27J72J43l21M21R29j241N5N64q97o85L34M64m93J91Q06n60
$$ -1060 324 -339 -112 60 203 -118 303 1232 -9 46 610 -287 -972 -638 -174 -667 -476 330 -230
3710b30j90J142j05r95N62K97j258M09K20l50p8J062M44r41m58J454n85j201J378
$$ -230 -420 722 617 -378 184 481 -777 -368 -148 -498 -576 486 930 -11 -469 985 400 -801 577
3729E77k71j490K27J428p72L31P61p02M1R07m38j460P41J041j296m40O99k61q5
$$ 577 306 -1184 -957 471 -301 30 791 89 130 1037 599 -861 -120 921 -375 -815 -116 -377 -462
3748d62J193K41L01k77l32o29j01n4j68J41k52N9M20k88N43M07k66o7Q20p90J58
$$ -462 731 972 1273 996 664 35 -66 -120 -288 -147 -399 -340 80 -208 335 742 476 409 1229 439 597
3769E97j032L40o44l51R31N44k13k5j3K62n7m27O37j692P27O16m43r48J216K40
$$ 597 -435 -95 -739 -1090 -159 385 172 147 134 396 339 -88 549 -1143 -416 200 -243 -1191 25 265
3789B65K82l36N50p85k67J65M29j404J116m5l09j26J076j000L56J31M61m54p46
$$ 265 547 211 761 -24 -291 -126 303 -1101 15 -30 -339 -465 611 -389 -33 98 559 105 -641
3808f41P88O1j218J534m41l21j24J308p26m54J724q12j134P25j97p28q62J301
$$ -641 147 208 -1010 524 83 -238 -362 946 220 -234 1490 678 -456 269 72 -656 -1518 -217
3826b17M52n88R51J63j625P17O55l03n85O04n10l88M5J722j421O0J216r25l40
$$ -217 235 -353 598 761 -864 -147 508 205 -380 224 -286 -674 -629 1093 -328 -268 948 23 -317
3845c17K18J006j979Q85N53n85k43R05m0J61M96L5j107L93N45j145m30N83n20
$$ -317 -99 907 -1072 -187 366 -219 -462 443 403 564 1060 1095 -12 381 926 -219 -649 -66 -586
3864e86j14Q12k13J9P55j40l77N50p26L98q09N48K4p68P96m25j03N3J083j030
$$ -586 -700 112 -101 -82 673 533 156 706 -20 378 -431 117 141 -627 169 -256 -359 -306 777 -253
3884b53J166p22k34j73j48j61k15M78J52j55l2J095p59j067J446n37K45j88m93
$$ -253 913 191 -43 -216 -364 -525 -740 -262 -110 -265 -297 798 39 -1028 418 -119 126 -62 -555
3903e55j021Q60J346m03k16L94L65j082j35L50o31K88L59q5l96N43j57j027J768
$$ -555 -1576 -716 630 227 11 405 770 -312 -447 -97 -728 -440 -81 -166 -562 -19 -176 -1203 565
3922E65K74j162M97P24o16n68kK11o97K00J248K29p18Q52m1j438K67O67j115K4
$$ 565 839 -323 174 898 282 -286 -288 -77 -774 -574 674 903 185 1037 996 -442 -175 492 -623 -599
3942e99L80Mj073J832K62j507Q62J007j311Q7k8J63n15J37k47L51n79J181k55
$$ -599 -219 -215 -1288 544 806 -701 161 1168 -143 -56 -84 79 -436 -299 -546 -195 -774 407 152
3961A52j39O49k96n52O47n94k57o12J020n07r2K60J75J112n45k71j16n33J082
$$ 152 13 662 366 -186 461 -133 -390 -1002 18 -489 -581 -321 -146 966 421 150 34 -499 583
3980E83p56l15Q14o80L35L79n14j85j36R25m34l08L3J60K6m9o76M78N49k27q74
$$ 583 -173 -488 326 -354 -19 360 -154 -339 -475 450 16 -292 -259 -99 -73 -122 -798 -320 229 2 -872
4001h72J950j163J65k63P3Q56l11r45L99J189j697J537o96k45R15n10q17N31L87
$$ -872 1078 -85 80 -183 -110 746 435 -510 -111 1078 -619 918 222 -23 892 382 -435 96 483
4020D83r11K96J624j410m82J435j333m07J002O10j131n90J464j134r94N96J233
$$ 483 -428 -132 1492 82 -400 1035 -298 -705 297 907 -224 -814 650 -484 -1478 -882 351
4037C51o43n52K089k297O80J471l28j385N49j34q09M64R19L84k133J737K56j66
$$ 351 -292 -844 1245 -1052 -372 1099 771 -614 -65 -199 -1008 -544 375 759 -1374 363 619 453
4055D53K55K48j033p63J451j235j90J225J27p63N66k79k51K99J34m75m14L17L55
$$ 453 708 956 -77 -840 611 -624 -814 411 538 -225 341 62 -189 110 244 -231 -645 -328 27
4074B7o13N43j23M18p05O31L34j189J028N46o96n67M01k41l80Q28j83J30L19k51
$$ 27 -586 -43 -166 252 -453 178 512 -677 351 897 201 -366 35 -206 -586 242 59 189 508 257
4094B57k55o77R40j54n23J093j383M76j01M80k17M61q6K51J05k62j441R13O27
$$ 257 2 -675 265 111 -412 681 -702 -226 -327 153 -64 397 311 562 667 405 -1036 -123 504
4113E04l40q51N66N22p78M35M82l31o07R24r22l43m5P40m65l31J423k2q43Q01
$$ 504 164 -687 -121 401 -377 58 540 209 -398 526 -396 -739 -784 -44 -509 -840 583 561 -282 519
4133E19L38o31n6K16O5n49K86K8p15R24K49p61J16Q76r17k20M55jj30L31M41j652
$$ 519 857 226 170 386 451 -98 188 216 -499 425 674 -87 29 905 -12 -232 223 222 92 423 864 -788
4155g88L59J26O72j821J980r96m23P13N91q37N01p16N72n81P71R4j160L01Q01
$$ -788 -429 -303 369 -1452 528 -468 -891 -178 413 -424 77 -639 -67 -648 123 217 -943 -642 159
4174A59P22q09Q84r36k91J77J089p43m08N86N2q10J412r34l19R60k12j683K91
$$ 159 881 72 956 20 -271 -94 995 252 -156 430 482 -328 1084 150 -169 791 579 -1104 -813
4193h13J123p11o98Q58L90k08P63J7k29o09O2l45P38p90p3R92o62N81m52P21l63
$$ -813 310 -401 -1099 -241 149 -59 704 721 492 -117 -55 -400 338 -452 -525 467 -195 386 -66 655 292
4214B92j19r0l2j28k67J02j40r4P24n02l84J049K0r41K94J054j430k2Q1N52j33
$$ 292 173 83 51 -77 -344 -242 -382 -476 248 -254 -638 411 431 -510 -216 838 -592 -614 -533 19 -114
4235a14K05K22k89j52J069j457L7N61J06j019k02J343K54p36M17N60r04R47j05
$$ -114 91 313 24 -128 941 -516 -479 82 188 -831 -1033 310 564 -172 245 805 -99 848 743
4254G43q92Q82Q0q26k98K72O89q21N0M24r69J16Q88K64j278N88O25j140N36P92
$$ 743 -149 733 813 -13 -311 -39 650 -171 -121 303 -666 -550 338 602 -676 -88 537 -603 -67 725
4274G25l89n33J243q54j58j68J197j367N53j13p72M23L75J65k77j6L34r7m47M51
$$ 725 336 -197 1046 192 34 -134 1063 -304 249 136 -636 -213 162 327 50 34 368 271 -176 275
4294B75K38m61O46o82p16Q09k09K12k09Q81p01n81K83Q99j001J74m02R07j234
$$ 275 513 52 698 16 -700 109 -100 112 -97 784 83 -498 -215 684 -317 -143 -545 362 -872
4313h72R84%m83o1J791j063K57J86j077K94K90K66p31O9q3k13j10l5N81L28O8
$$ -872 112 112 -371 -432 1359 296 553 739 -338 -44 246 512 -219 -150 -233 -446 -556 -591 -10 318 386
4334C86p65J134l07o83m92Q1Q62j6m4m54O08m64J48K76n56P84o67Q1k37p5l70
$$ 386 -379 755 448 -235 -727 -646 216 200 156 -298 310 -154 -6 270 -286 498 -169 -88 -325 -400 -770
4355g70j63J506n90n20K10K24n5L32k72r0m38K72M72o45N90P89q88J66M36j86
$$ -770 -933 573 -17 -537 -327 -103 -158 174 -98 -188 -626 -354 118 -527 63 852 -36 130 566 380
4375C80r44Q30k01p51L91R00m63p53J356r73l10O83M38j223R08l62P25m44J04
$$ 380 -564 266 65 -686 -295 605 142 -611 745 -228 -538 145 583 -640 268 -94 631 187 291
4394B91o7p21O47k85j52M53k12L22n18K94Q8n91N83J19j40q79R47M7j69P05p86
$$ 291 224 -497 150 -135 -287 166 -46 276 -242 52 140 -451 132 251 111 -768 179 226 57 762 -24
4415b4K37N7o62K35P27L00r41o7M71o39j08O12L52rn09J89l14m05N47rl23k19
$$ -24 213 270 -392 -157 570 870 -71 -138 333 -306 -414 198 550 541 32 221 -93 -498 49 40 -283 -502
4437e02K59M66R2K28p10N48p0k85j75L72K17n35R0N04o38L36p8n2n42K18L55k97
$$ -502 -243 223 315 543 -167 381 311 26 -149 223 440 -95 -5 499 -139 197 119 67 -475 -257 98 -199
4459a99N65k77m19J88Q1n84M11l7j009Q92J82R68j417k39J687l43p52j35J57k20
$$ -199 366 89 -330 -142 -61 -645 -234 -271 -1280 -388 -206 762 -655 -894 793 450 -302 -437 -280 -500
4479e00N38k6Q7j72L48j12m62K60J36n75k07J122l70p73L94J034r74J19M48J55
$$ -500 38 12 99 -73 275 163 -299 -39 97 -478 -685 437 67 -706 -312 722 -252 -133 315 470
4499D70l60L57N54j754p2J600j681O06K03L21p33J83P00r56L70K29K17m04J007
$$ 470 110 467 1021 -733 -805 795 -886 -280 -77 244 -489 -306 394 -562 -192 37 254 -150 857
4518H57m32q23l27J381K0j342P75j82o05Q84n87O35k77K46L99k29n19J12l60J64
$$ 857 425 -398 -725 656 676 -666 109 -73 -678 206 -381 254 -23 223 622 393 -126 -14 -374 -210
4538b10K7j40J26M60J83l39K91p41K63K71O06j267M00l20Q49l22m47P41o54N79
$$ -210 -183 -323 -197 263 446 107 398 -343 -80 191 797 -470 -70 -390 459 137 -310 431 -223 356
4558C56J6l33L2l65M18R2Np4m14Q64r89M08O41n96J05Q13m21j528R20l8l87j06
$$ 356 372 39 71 -294 124 216 221 147 -267 597 -392 16 657 61 166 979 558 -970 -50 -88 -475 -581
4580e81k34O83k31o90J169m39J05O04j06j140J319p44q57R90K73o14N60k51N33
$$ -581 -815 -132 -363 -1053 116 -323 -218 386 280 -860 459 -285 -1142 -152 121 -493 67 -184 349
4599C49o29P10q6p54K37M81j99m3n9J79q67L56R73l22M15n59L17j223N90M17m71
$$ 349 -280 430 344 -410 -173 308 109 66 7 186 -681 -325 648 326 741 182 499 -724 -134 283 -188
4620a88q4J58l70J23N1J19L76m1m45j68j72J283m62m59r0N58k67j31O29k96J53
$$ -188 -272 -114 -484 -361 -310 -191 185 144 -301 -469 -641 642 180 -279 -369 189 -78 -209 420 124 277
4641B77J75l33m91K59j54o8j9O30m72L16m93N49l70N70k73m65K30M48n32M4M23
$$ 277 452 119 -372 -113 -267 -335 -354 276 -196 120 -373 176 -194 376 103 -362 -132 316 -216 -172 251
4662B51k58m00K18j83N37J01m08Q4j13o4m6J177j118K91Q6K04r03J22P01m30m36
$$ 251 -7 -407 -189 -372 165 266 -142 -58 -171 -235 -281 896 -222 69 155 359 -544 -422 279 -151 -587
4683e87Q00k50L4l34O17n87l8O92r65j7P03J00l27j31M26L02j113J012P3p74Q47
$$ -587 213 -37 -3 -337 280 -307 -345 347 -618 -635 68 168 -159 -290 136 438 -675 337 410 -364 483
4704D83J03n84n53M97j27p0P42l34o32M70L44M46q67m16J105p49N94N88j024o89
$$ 483 586 2 -551 -54 -181 -251 491 157 -475 -5 339 785 -82 -498 607 -142 452 1040 16 -673
4724f73O06j88L82p1j44j04L40N95j049K50L37J00j248R86L75o98l14N0R5M69
$$ -673 -67 -255 127 56 -88 -192 148 743 -306 -56 281 381 -867 119 494 -204 -518 -468 -373 96
4744I6N31n88k08M14j29j87l7Q7L01n78L81K0p33O23M92r82L91K24m39L83k49
$$ 96 627 39 -169 245 116 -71 -108 -21 280 -298 83 103 -630 -7 485 -497 -106 118 -321 62 -187
4765a87P40m53q18Q88k89M78J83p06L70m7j111J185J07p22Q18l06N05j036M04
$$ -187 553 100 -718 170 -119 359 542 -164 206 159 -952 233 340 -382 436 130 635 -401 3
4784CR4R0j07%k76l36L03N49j030J69K38J43m47P87L06p65m2J006n49m92j62M64
$$ 3 97 187 80 80 -196 -532 -229 320 -710 -541 -303 -160 -607 180 486 -279 -321 685 136 -356 -518 -54
4806e4M02j16M68p65K76o05K23m92J346o67k71Q28P0j127J305m72k05p0N90j02
$$ -54 348 232 700 -65 211 -394 -171 -663 683 16 -255 573 643 -484 821 349 144 74 664 562
4826E62l41j0M44o97P65j22n80r50P70k20K83l60P74K13n98N44q33N45n2l31J52
$$ 562 221 211 655 -42 723 601 21 -929 -159 -379 -96 -456 318 531 -67 477 -356 189 137 -194 -42
4847d2k33N64j21p61R76J60R0j60m49Q27l7j003M70p98L73l39LM50k55L04L73
$$ -42 -275 289 168 -593 383 543 633 473 24 851 814 -189 281 -517 -144 -483 -480 -30 -285 19 392
4868C92k90J11l43L74n84J12m8n18R78p11M01L01n6P4l54nj026J808j232J291
$$ 392 102 213 -130 244 -340 -228 -276 -794 184 -527 -126 175 119 193 -161 -166 -1192 616 -616 675
4888F75m45j072J657l01m50LK96n12O34n0k4r97P39N78q77j88L12k02K85M06j002
$$ 675 230 -842 815 514 64 67 363 -149 485 435 411 -586 153 731 -146 -334 -22 -224 61 467 -535
4909e35P4L82K2r4l11O56N09q65M14q8j60N1J94M84j263J86M53q56l20J351m87
$$ -535 -461 -79 -57 -151 -462 194 703 -162 252 164 4 55 249 733 -530 -344 109 -747 -1067 284 -203
4930b03O04j96l40l50P73N14j038J44O15l21j080Q72j0P7P30r22N31j030J007
$$ -203 401 205 -135 -485 288 802 -236 -92 523 202 -878 -6 -16 61 791 -131 400 -630 377
4949C77m78m78M0P94J44m31l66K5N50m15M73M27m01J14j165M41Q95l13m99M77
$$ 377 -101 -579 -539 255 399 -32 -398 -373 177 -238 235 662 261 375 -790 -349 546 233 -266 211
4969B11k90j98O28j04j71j80M15j038M36L24j82k6l00M47J50j93M95m18o70K67
$$ 211 -79 -277 351 247 76 -104 311 -727 -291 33 -149 -175 -475 -28 122 -71 424 6 -664 -397
4989c97Q89J3j112J333p94N4O54L2m99p40P70l51K88K35o99r8Q77j364R94O05
$$ -397 492 505 -607 726 -68 -14 640 672 173 -567 203 -148 140 375 -324 -422 455 -909 85 690
5009F90o48m45R18l31Q3l46P11j321N09K35m31L62J0l11l98J378M39r84L8m72
$$ 690 42 -403 515 184 267 -79 632 -689 -180 55 -376 -14 -4 -315 -713 665 1104 120 158 -314
5029c14k47k28Q52k57Q20q57P44j404J101k99j64p25J637k5j201L87O21j61l57
$$ -314 -561 -789 63 -194 626 -231 513 -891 210 -89 -253 -978 659 634 -567 -180 441 280 -77
5048g7M76q82J01N90J53j232R22j368J439kn30Q71m9k35J66m48n9K43j38K84l59
$$ -77 399 -483 -382 208 361 -871 51 -1317 122 120 -410 461 412 177 343 -105 -164 79 -59 225 -134
5069a34P34r27O59j98j56k84N9O90n00K68J97j294Q95J98k92k09M45K14p32j32
$$ -134 600 -327 332 134 -22 -306 -247 443 -57 211 408 -886 9 207 -85 -294 151 365 -367 -499
5089d99L35O86k62n85l54N08J75m02L36n8M38n69M13k4k20j14P81l86o51L15j04
$$ -499 -164 522 260 -325 -679 -171 4 -398 -62 -120 318 -251 162 138 -82 -196 585 199 -452 -137 -241
5110b41J21K38k86K73L62j007k4N36J04j14l83J305j415J44J188q79l64k92J311
$$ -241 -120 118 -168 105 467 -540 -564 -28 76 -38 -421 884 -531 -387 801 -78 -442 -734 577
5129E77o32l83R94k13m90p8N30o47J10R60j052o63N67Q72n73r4K2o66J74N50J97
$$ 577 -55 -438 556 343 -147 -225 305 -342 -232 728 -324 -987 -420 452 -121 -215 -193 -859 -685 -135 62
5150F2o6Q7l52N66k58O07N43j300R7J60n48O27M65n64l33L51Q84j528O63J58J75
$$ 62 -4 83 -269 297 39 646 1189 -111 -14 146 -402 225 690 126 -207 144 1028 -500 163 321 496
5171D96k90o12P11J35N3k89k63k68P10J36k76R03j326M49k23J4k95k35J3j8j22
$$ 496 206 -406 305 440 493 204 -59 -327 383 519 243 1146 -180 269 46 60 -235 -470 -457 -475 -597
5192e97M54L50k99j47L72r37J112P10n44P21j516K82O56j20j460L60R77j31L70
$$ -597 -143 207 -92 -239 133 -804 308 1018 474 1195 -321 -39 617 497 -963 -603 374 243 613
5211F13n75M5O1n68p9P0r8K06Q6M49K07L70r35m62P87p05M69J62j90L6p4j10j00
$$ 613 38 83 144 -424 -503 -433 -531 -325 -239 210 417 787 -148 -610 177 -528 -59 103 -87 -51 -125 -235 -335
5234c35O99r01M14q3O67k63o93K58M69j52L82M35m46l00K67J21j042O19K8K65
$$ -335 364 -537 -123 -206 461 198 -495 -237 232 80 462 897 451 151 418 539 -503 116 144 409
5254D09m33M02l41K36n57J211j080K43L76l30q97O90j47M49r00R43J73L72m08
$$ 409 -24 378 37 273 -284 927 -153 90 466 136 -761 -71 -218 231 -669 274 447 819 411
5273D11k49j85N86k62j127O91rN09j113Q26K25o73O74J69m08j20O51n76m67R35
$$ 411 162 -23 563 301 -826 -135 -144 365 -748 78 303 -370 304 473 65 -55 596 20 -447 488
5293D88o66n87Q13j11m98N23K92j90L24J95p86K76M26m01K78o63m9M01l82N22
$$ 488 -178 -765 48 -63 -561 -38 254 64 388 583 -203 73 499 98 376 -287 -336 65 -317 205
5313B05P4l3p18M59j3L26n65J71j54J36J85l10M64J6j88J82o79o4J069J35j209
$$ 205 279 246 -472 -13 -26 300 -265 -94 -248 -112 73 -237 227 243 55 237 -442 -506 563 698 -511
5334e11L12m18J275q60l5k57L17P4N11n91L29J36M0p79j24Q56j144R10M76p96
$$ -511 -199 -617 658 -202 -237 -494 -177 -103 408 -183 146 282 322 -457 -581 275 -869 41 517 -279
5354b79k58M92J70p79M35N41p57L54Q47j355L89M76m6M9m79L73k81M55J10K40
$$ -279 -537 -45 125 -654 -219 322 -435 -81 766 -589 -200 276 230 279 -200 173 -108 347 457 697
5374F97j285J179l82l96P59L0k6p91O67o89N51O35n44m90l61m7Q2K53J21J0L98
$$ 697 -588 591 209 -187 572 602 576 -215 452 -237 314 949 405 -85 -446 -493 -411 -158 -37 -27 371
5395C71m74O62j104L27Q16r31n66J310p56P88k12l9J51n38P57o71N26q38N32r6
$$ 371 -103 559 -545 -218 598 -333 -899 411 -345 443 231 192 343 -195 562 -109 417 -421 111 15
5415A5J28K98o59P22o66k84q3L18O05q85P14o89K57K62k33J68N24j11n43L01J92
$$ 15 143 441 -218 504 -162 -446 -529 -211 394 -491 223 -466 -209 53 -180 -12 512 401 -142 159 351
5436C51o51R41q94L20R2o25P88K69m71J51p56O98q2N14J38j367N43J08L48m79
$$ 351 -300 641 -253 67 159 -466 322 591 120 271 -485 213 131 645 783 -584 -41 67 415 -64
5456f4J45O60j276O26m02m61Q41J95n60j77m52P49J64o9K37j007J071Rn6J04j1
$$ -64 81 741 -535 91 -311 -772 69 264 -296 -473 -925 -176 -12 -81 156 -851 220 229 173 277 266
5477B66o55k98P42J49n79j10O61n30J1L82L8P3j46lO36j081N87q85N16m52m9P18
$$ 266 -389 -687 55 204 -375 -485 176 -354 -343 39 77 150 4 1 637 -444 143 -742 -226 -678 -727 -9
5499iK31L64o49k21R67j169L88k7R75j783J397j80k27o4M25n38P06m57Q63q47
$$ -9 222 586 -63 -284 683 -486 -98 -125 850 -933 464 284 57 -7 418 -120 586 129 992 145
5519A45M25p66N90m50N0p7j9j83j15K12J41J11k62P38l47K69n06j53J83Q8R6l91
$$ 145 570 -196 394 -56 -6 -83 -102 -285 -400 -188 -47 64 -198 540 193 462 -44 -197 -14 74 170 -221
5541b21J60J44K74k18L52k20p25O46L7m59J83N44k42p4L22q86L48n18J082q3r08
$$ -221 -61 83 357 139 491 271 -454 192 229 -230 -47 497 255 181 503 -383 -35 -553 529 446 -462
5562d62M37N23q49M31k17o91Q64P48p22j083J100M74j47j549R57m97q6J391r13
$$ -462 -25 498 -351 80 -137 -828 36 784 62 -1021 79 553 406 -1143 -186 -683 -769 622 -291
5581b91M92l45r8L12n0N65n76n08M9O3Q6P3R66q70o38J452l56o2k69L94j386R83
$$ -291 201 -144 -242 70 20 585 9 -499 -450 -387 -301 -228 738 -132 -770 682 326 264 -5 389 -997 -14
5603a4P9p86j15Q51m58K24M12M72l07l7K48q3J35o19L41q40N64m74R85l31p8l71
$$ -14 65 -721 -836 15 -443 -219 193 665 358 321 569 486 621 2 343 -497 67 -407 578 247 169 -202
5625b02K80L57p29O7j13J65k21P6N09k10p65J148p79M9M06N13l83o03L4N5N00
$$ -202 78 435 -294 -227 -340 -175 -396 -320 189 -21 -786 362 -417 -368 38 551 168 -435 -401 -346 154
5646A54l31qQo60R77k2l59Q99l97j226J174j95K20k84J24j94O97j15l75o20L85
$$ 154 -177 -185 -177 -837 140 118 -241 658 261 -965 209 14 234 -50 74 -120 577 462 87 -533 -148
5667a48j84P14j37K82o66L47j00n08j88J115l51q7m22Q19r82P4M87n00J53L51
$$ -148 -332 382 245 527 -139 208 108 -400 -588 527 176 89 -333 486 -496 -422 65 -435 -282 69
5687F9o66M61K71k94K82j94O4K34j20M37q5O4m67l24N04m32k62J36l56J113j12
$$ 69 -597 -136 135 -159 123 -71 -7 227 107 544 459 523 56 -268 236 -196 -458 -322 -678 435 323
5708C23o51K7N06k57k7R51n61k03j10J05l52O68j94m98K77j26r9J59n86J692j070
$$ 323 -328 -301 205 -52 -79 872 311 108 -2 103 -249 419 225 -273 4 -122 -221 -62 -648 1044 -26
5729b6m45J486j106L38L96n57q54R64Jl32k8kN83r32M34k14J22k05N21M12m12
$$ -26 -471 1015 -91 247 643 86 -768 196 197 -135 -163 -165 418 -514 -80 -294 -172 -377 144 556 144
5750A44M90o77l65O62K6n10M91k27J76p90O69n32Q06o75J026r19q7l5J91m42M13
$$ 144 634 -43 -408 254 280 -230 261 34 210 -580 89 -443 363 -312 714 -205 -292 -327 -136 -578 -165
5771a65p6M24j016M75L88J79l47K38K23L87r69N64j20k6o83O96j43J80j308J645
$$ -165 -241 183 -833 -358 30 209 -138 100 323 710 -259 305 185 159 -524 172 29 209 -1099 546
5791E46j244J52J037J4k22m11M03M7k08l38q7P14K38m00n11Q26j08r87M13P19
$$ 546 -698 -546 491 505 283 -128 275 322 114 -224 -311 403 641 241 -270 556 448 -539 -126 593
5811E93m82o40K80j54M06M8J03m90m47J051q80J053m50N73j178O44L78m49l6k93
$$ 593 111 -529 -249 -403 3 51 154 -336 -783 268 -612 441 -9 564 -614 30 408 -41 -77 -370
5831c70M52j09P1j18l47L68R33o01m55k79N28n80O61q06N46K94l40O49o21K54
$$ -370 82 -27 44 -74 -421 -53 880 279 -176 -455 73 -507 154 -652 -106 188 -152 497 -124 130
5851A30M11p70K74o60O5p3P40P1j64J50K17o13O25n89n0K69j63J2J5l52M62Q6
$$ 130 541 -229 45 -615 -550 -623 117 188 24 174 391 -222 403 -186 -236 33 -130 -118 -103 -455 7 93
5873I3J5J5L77j97m93K52k84n63N00m40J336j109M94J99N40k34j025J126j135
$$ 93 108 123 500 303 -190 62 -222 -785 -285 -725 611 -498 -4 195 735 501 -524 602 -533
5892e33Q02J92m45p54l00J029j25K2m7Q34q69O41o11L10p39M66R7J88m73K62m01
$$ -533 269 461 16 -738 -1038 -9 -134 -112 -159 675 -194 447 -164 146 -593 -127 -30 158 -315 -53 -454
5913d54j33R14j38O6k27m45k02N4K83o23J015l85nO7L44K13K33o61k64N45q66
$$ -454 -587 327 189 255 28 -417 -619 -565 -282 -905 110 -275 -280 -213 131 344 577 -84 -348 197 -669
5934f69R5J83J193j167k94N45M3k69K26j55P74k20m68r1l93K49J81M48j5l39P82
$$ -669 -574 -391 802 -365 -659 -114 -71 -340 -114 -269 505 285 -183 -274 -667 -418 -237 211 196 -143 639
5955F39q57OL35j68l13N88k69M1Q5N1k22K97k55l39L35k9Q19l71K17l58m34J26
$$ 639 -218 -212 123 -45 -358 230 -39 2 87 138 -84 213 -42 -381 -46 -75 744 373 590 232 -202 -76
5977g6n67P4R80n97L28kJ2M21j648N98K14N50p46O73q41K65O60r9M33k71P9N8
$$ -76 -643 -569 411 -186 142 140 152 573 -1075 -477 -263 287 -459 214 -627 -362 298 199 632 361 440 498
5999D98k0o81K44K16N02r85m31J034l15J42N1L50p97p48J313m84L94n66N42j57
$$ 498 478 -203 41 257 759 -226 -657 377 62 204 255 605 -192 -940 373 -111 283 -283 259 102
6019A02K76O4j173J048q39L85J67p99L95P32q99J47K69j00j80O03p40O88L66r84
$$ 102 378 442 -731 317 -522 -137 30 -769 -374 358 -541 -394 -125 -225 -405 198 -542 146 512 -472
6039d72n82M80R43p33J141l04j56M13m51J80o45k02L52J7k01N20k27L68Jm64L85
$$ -472 -1054 -574 369 -364 777 473 317 730 279 459 -186 -388 -36 -19 -220 300 73 441 442 -22 363
6060C63m14P5K71K23q62J97M74j018R36l45J70M71K19n85o2k68K91Ln49n37Q75
$$ 363 -51 24 295 518 -344 -147 327 -691 245 -100 70 541 760 175 113 -155 136 139 -410 -947 -72
6081g2L3k89j21K07j69m45J491k53r3p47N03m31R4R55j457M55L52M02n72k24J089
$$ -72 -39 -328 -449 -242 -411 -856 635 382 289 -458 45 -386 -292 663 -794 -339 13 415 -157 -381 708
6102G08o35k96M66J56q21q1J327m39m65j57M91q88J717q93k53M08o11p18L15J180
$$ 708 73 -223 243 399 -422 -503 824 385 -80 -237 254 -634 1083 190 -63 345 -266 -984 -669 511
6122E11q63K22J114o18J55j97l85l35J14L38j15k93P12l72O8N60l29k27o02N72
$$ 511 -352 -130 984 366 521 324 -61 -396 -282 56 -59 -352 360 -12 56 616 287 60 -542 30
6142C0J46n76Q43p94N6R85m44k51n83J351k9m08n26L75q79J005O8j026N6j66R29
$$ 30 176 -400 443 -351 -295 690 246 -5 -588 763 734 326 -200 175 -704 301 369 -657 -601 -767 162
6163A62m94N31J01J81q78O86p22j48J97m67Q41J78j51l62K2R75P5k96M64q35L1
$$ 162 -332 199 300 481 -397 289 -433 -581 -384 -851 -10 168 17 -345 -323 652 727 431 895 60 91
6184I1M09q15j79L64K75l67Q3j96P78l97J83j49l39Q51l98K97q79K20m57Q14M07
$$ 91 500 -315 -494 -130 145 -222 -139 -335 443 46 229 80 -259 592 194 491 -388 -168 -625 189 596
6205E96l20p81P13o7p40Q3J68j40M88J34j2n91N85M67l08n4J33Q3n66K41J17k58
$$ 596 276 -505 208 141 -599 -516 -348 -488 0 134 122 -469 116 583 275 221 354 437 -129 112 229 -29
6227b9j74J79L6J32N98m26n80Q69p83K21m94l92O93r27R94k65N95J63m47L48m43
$$ -29 -203 -24 12 144 742 316 -264 605 -178 43 -451 -843 -150 -1077 -83 -348 247 410 -37 311 -132
6248a32RK63r07M94L08j099O04J20P89k95J27n49K39P09p57O69p72J82j46k91
$$ -132 -123 140 -767 -273 35 -1064 -460 -340 449 154 281 -268 -29 680 -77 592 -180 2 -144 -435
6268d35j9N43j47R01J5p04m02Q96p89M30qo43l91R98m52r0N51N13j053N50N0n15
$$ -435 -454 89 -58 843 858 154 -248 648 -141 289 281 -362 -753 245 -207 -297 254 767 -286 264 314 -201
6290b01k61l9Q95l58k13L01o6m14J015N1j360L65J48L3j20lJ53P7k96K63Q9M50
$$ -201 -462 -501 394 36 -177 124 58 -356 659 710 -650 -285 -137 -104 -224 -227 -74 3 -293 -30 59 509
6312E09l70k54J090j097n50L44j72K66j13J21N19k09P50q56o11R28l55M47j78
$$ 509 139 -115 975 -122 -672 -328 -500 -234 -347 -226 293 84 834 -22 -633 295 -60 387 209
6331B09o96M42m82J090l58K71l37Q07l04q39l20k26M66m59P21k05K55N4O26l68
$$ 209 -487 -45 -527 563 205 476 139 946 642 -197 -517 -743 -277 -736 -15 -220 35 89 715 347
6351C47k74P6o45K05J8n6j07M84n79K0L08J90J61Q23j007k21P42q98P1Q02k97
$$ 347 73 149 -496 -291 -273 -329 -436 48 -531 -511 -203 -13 148 971 -36 -257 485 -413 -342 460 163
6372A63p96O56J78o1M42L90j140N82o13M91M31j384O95k02M02l87O90j32K39k06
$$ 163 -633 23 201 140 582 972 -168 414 -199 292 723 -661 34 -168 234 -153 537 405 644 438
6392D38k39l14m67J072o26L9O7K44K35k60mk20K00N22j58o15j92O58r52q5Q34
$$ 438 199 -115 -582 490 -136 -97 -30 214 449 189 185 -35 165 687 529 -86 -278 380 -572 -657 177
6413A77J94n98N1Q66r37M35j20P0n6j84N10n98M78q54Q95k65M47m73j46j65P6
$$ 177 371 -227 -176 690 -247 188 68 138 82 -102 408 -190 288 -566 329 64 511 38 -108 -273 -197
6434a97J10q6n13j68J100k65Q27q98J25Q74p28o10Q37r80Q20p36n51O08l7j18
$$ -197 -87 -173 -686 -854 246 -19 808 -90 35 909 181 -429 408 -572 248 -488 -1039 -431 -468 -586
6454e86L06M87l15k05N83k8n59J03J17J03q58J236k08k58K10j91J33j07n0M33
$$ -586 -280 207 -108 -313 270 242 -317 -214 -97 6 -852 384 176 -82 128 -63 70 -37 -87 346
6474C46j036L82j044J361J38n4R6j40O00j237L08N08k74o68L15L79K34j00n25
$$ 346 -690 -308 -1352 9 147 93 189 49 649 -588 -280 228 -46 -714 -399 -20 214 114 -411
6493d11m7l08J395r1j150J51R19l42K26q75L98J30j17L77l31P86o79l30M93n01
$$ -411 -458 -766 629 538 -612 -461 458 116 342 -533 -135 -5 -122 255 -76 710 31 -299 194 -307
6513c07N29n15n87M84Q15o97O29j77N26n87J110n26j14p52J82j00K16J3l08M42
$$ -307 222 -293 -880 -396 419 -278 351 174 700 113 1223 697 583 -169 13 -87 129 142 -166 276
6533B76k94K59j29O25n34k45n7k21m07N62M5o12P92p96K80Q94K5o64K84j48M10
$$ 276 -18 241 112 737 203 -42 -99 -320 -727 -165 -120 -732 60 -736 -456 438 463 -201 83 -65 345
6554C45q59j333K064n12N95k84N68n21J84l76L13O5M7j38q89J6p0J301l76p68
$$ 345 -514 -1847 217 -295 300 16 584 63 247 -129 184 249 296 158 -731 -715 -785 516 140 -628
6574f28P07j93J04J68j09K40m66k79N07K40o14L9N83p02L70L52K43p93L5mn10
$$ -628 79 -114 -10 158 49 289 -177 -456 51 291 -323 -284 299 -403 -33 319 562 -231 -196 -200 -710
6595g10R75J20m42m14J31Q05o34j88J98K76k94M97n93n03R4J054k14N92j230M22
$$ -710 265 385 -57 -471 -340 465 -169 -357 -159 117 -177 320 -273 -776 -682 372 158 750 -480 -58
6615e8M32k73o32J159j50n66p00J035q2J88J34n9o72M60K75p07K68l58p63P26
$$ -58 374 101 -531 628 478 -88 -788 247 165 353 487 428 -244 216 491 -216 52 -306 -1069 -343
6635c43J054p24k31Q39k50n65K68J07l46J50R2j00j77J41j92l44J151o50m0j32
$$ -343 711 -13 -244 595 345 -220 48 155 -191 -41 51 -49 -226 -85 -277 -621 530 -120 -160 -292
6655b92J244q27k06K94J22J18j079J091l46l25L86K92n46J74l04l72N72K68m44
$$ -292 952 125 -81 213 335 453 -626 465 119 -206 180 472 -74 100 -204 -576 -4 264 -180
6674a80j16R25p84R6k30K77j18M54j05j053N89j40N01n28j8P95r24P59p51J815
$$ -180 -296 629 -155 -59 -289 -12 -130 324 219 -834 -245 -385 116 -412 -430 365 -559 200 -551 1264
6694A264j350L45K00j046M38O91q43O7kN18l31l56K19P66n37j67J7m18N82m95
$$ 1264 -86 259 459 -587 -149 542 -301 -234 -236 282 -49 -405 -186 580 43 -124 -107 -525 57 -438
6714d38R8O5N4j64L22J19J20j87q1J83k18J01n75N62p76N18j99L12k3N79o25M85
$$ -438 -340 -275 -221 -385 -63 56 176 -11 -92 91 -127 -26 -601 -39 -815 -297 -496 -184 -207 372 -253 232
6736B32k84j20l66j77Q94r53Q97O82lp57Q82o25N37q73q69J284o23K94l65M00
$$ 232 -52 -172 -538 -715 179 -774 123 805 802 45 927 302 839 -34 -903 381 -242 52 -313 87
6756H7M95q16R03j38L05p24j75J94n64J06L4M39p70J060j46p53k55Q77L72o82
$$ 87 582 -234 669 531 836 112 -63 131 -433 -327 -293 146 -624 436 290 -463 -718 159 531 -151
6776a51K23j062Q81m07L19n38J131o35K13P15l47O09j135L21l45J36m78N66n54
$$ -151 72 -990 -109 -516 -197 -735 396 -239 -26 689 342 951 -184 137 -208 -72 -550 16 -538
6795e38M01J56P32r53J60O5n80P70k24K01j003J93M55K22O65K17j045K89J29J94
$$ -538 -137 19 751 -202 -42 23 -557 213 -11 190 -813 -620 -165 57 722 939 -106 183 312 506
6815E06m15m33L06K64m58j46Q2l21Q39R1r6R52o37j473J300K47j665P00N84r34
$$ 506 91 -342 -36 228 -230 -376 -294 -615 224 315 219 1171 534 -939 361 608 -1057 -357 227 -707
6835g07q1M52J083m14R7n38R75r25L4m24M26k65N71j13o13M25J097m71o23O40
$$ -707 -788 -336 747 333 430 -108 867 -58 -24 -448 -22 -287 284 171 -442 -17 1080 609 -14 626
6855F26n62L64m65L73k21l7p07q5Q25J49J22J83l65m36J54L30j09p28M09K91o8
$$ 626 64 428 -37 336 115 78 -629 -714 111 260 382 565 200 -236 -82 248 139 -589 -180 111 43
6876D3m13k88Q58L51m12J37K62k42r09K21M46L71j65mL1j94J6l49P35r69Q99n07
$$ 43 -370 -658 200 551 139 276 538 296 -613 -392 54 425 260 256 287 93 109 -240 495 -474 425 -82
6898h2j50j12r8K5P92P8q17Q63l12M16n54j6m3k08O45k20o02J13R82j19q26O8
$$ -82 -232 -344 -442 -417 375 453 -364 499 187 603 49 33 -10 -218 427 207 -395 -282 700 581 -245 -177
6920a77R88n56n82K48o70K40N86j211J606j171J135l88Q0J58J12j294Q84k02o91
$$ -177 811 255 -327 -79 -749 -509 77 -1134 472 -699 436 48 128 286 398 -896 -12 -214 -905
6939i05J044k91J6L62J20r8J85r00O12j94k83L73l61l69R33o95L60J165j032j01
$$ -905 139 -152 -136 226 346 248 433 -467 145 -49 -332 41 -320 -689 244 -451 -91 1074 42 -59
6959e9J33j12K4K21l21m13M65J44q82Q10L21%J92M6l17k3m00m77L95m29J083l53
$$ -59 74 -38 -14 207 -114 -527 -62 82 -800 10 331 331 523 569 252 229 -171 -648 -253 -682 401 48
6981D8j49K66n5L10k53n31N21K65m85j73j25M34K85k73j26j11k82P10K46k01j39
$$ 48 -101 165 110 420 167 -364 157 422 -63 -236 -361 73 358 85 -41 -152 -434 276 522 321 182
7002A82j033N10j31J1m0L24j32M75N48r50N74k93m88K97k29J84L69m74p6M42K9
$$ 182 -851 -341 -472 -461 -501 -177 -309 166 714 -236 338 45 -443 -146 -375 -191 178 -296 -372 70 99
7023I9P08j062J81J66j33J52O40l69L96q15N44q28K05J27K69n39K34K50n84M05
$$ 99 807 -255 -74 92 -41 111 751 382 778 -37 507 -321 -116 11 280 -259 -25 225 -359 46
7043D6J33k64K11M7m6n24M9R57p24M78l78k20J14J43J39j54r40J010k65J02Q25
$$ 46 179 -85 126 173 127 -397 -348 609 -115 363 -15 -235 -121 22 161 7 -933 77 -188 -86 739
7064G39o15j026J092o80Q6L56m97N57j38N76m18J79M04q18J89K14J23k99M36o10
$$ 739 124 -902 190 -490 -404 -48 -545 12 -126 450 32 211 615 -203 -14 200 323 24 460 -150
7084a50J20n76L94Q8K88j45J65K08q02K40%L78M92j229L04m5k78M53O87m40k69
$$ -150 -30 -606 -212 -124 164 19 184 392 -410 -170 -170 208 700 -529 -225 -270 -548 -95 592 152 -117
7105a17L09M3l19K91L99r35pk18K83L48k39L93k94L37j282J410k37k98p12N58
$$ -117 192 235 -84 207 606 -329 -336 -554 -271 77 -162 231 -63 274 -1008 402 165 -133 -845 -287
7125b87O5K10k25L02o18R04j00m68K76N02n80M19m77O55o52j68M17M5K41q01L42
$$ -287 -222 -12 -237 65 -553 351 251 -217 59 561 -19 400 -77 578 -74 -242 175 220 461 -340 2
7146Bk54J09Q3k51K57K44n91N37o1M59L85r42P92o85j42m1k25n01R64o44l15L7
$$ 2 -252 -143 -60 -311 -54 190 -401 136 75 534 919 -23 769 84 -58 -99 -324 -825 139 -505 -820 -783
7168g83R81k90p5L80l47N20M21p69q90L01P69j12l63Q93j32k54O00p55J07M4k85
$$ -783 198 -92 -167 213 -134 386 807 38 -852 -551 218 106 -257 636 504 250 850 95 202 246 -39
7189c9k5K55l92l31Q92k38k53P88n20J47L5k0r21M16K99q7M06q48L28L12k42O38
$$ -39 -64 191 -201 -532 360 122 -131 657 137 284 319 299 -622 -206 93 6 412 -436 -108 204 -38 600
7211F00o03j44K42m92k27M85Q7p59P55N44j42K67m72K1r73O3J65M83l2O52j025
$$ 600 -3 -147 95 -397 -624 -139 -52 -811 -56 488 346 613 141 162 -811 -748 -583 -100 -132 520 -505
7232e05O37k90K01M09o67O64k80m03j34R3K61m14O74l40O38k52NO6K11J88r19
$$ -505 132 -158 43 452 -215 449 169 -234 -368 -275 -14 -428 246 -94 544 292 297 363 574 762 -157
7253a57o00J293n96n01J095o1n86L31M67m66J17n04k23o4J7K06p2J47K59j5J47
$$ -157 -757 536 -60 -561 534 473 -113 218 685 219 336 -168 -391 -455 -438 -232 -304 -157 102 87 234
7274B34m48N94k43l38M20m05J04K36N06j314L50k61R11o97L33k07NJ03j43j25
$$ 234 -214 380 137 -201 219 -186 -82 154 660 -654 -304 -565 346 -351 -18 -225 -220 -117 -260 -385
7294c85Q55q63K62k42L86L72o70N87l08J7N30l9k16j54l35j63j60M14M48k84J82
$$ -385 470 -393 -131 -373 13 385 -285 302 -6 11 541 502 286 132 -203 -366 -526 -112 336 52 234
7315B34m83j83J61O63L48n51n06O47p51K20M89o44O19m11L50n01K03j76j04K63
$$ 234 -249 -432 -271 392 740 189 -317 330 -421 -201 288 -356 263 -148 202 -299 -96 -272 -376 -113
7335a13j177Q40L82N30m04J78L34j083N49J7j79j97K15o9L16K55q21O45r3j26
$$ -113 -1290 -450 -68 462 58 236 570 -513 36 53 -126 -323 -108 -177 139 394 -427 218 125 -1
7355aj73j037J317p2M3N28n61j18j91L43pl59j51P86j062M78O18m25M07m41Q00
$$ -1 -174 -1211 106 34 77 605 44 -74 -265 78 71 -288 -439 347 -715 -237 381 -44 363 -78 722
7376G22j701Q94k7k44M48k5K80k78L22K54j302K44L61J99L06R0m18K94q84N48
$$ 722 -979 -85 -112 -356 92 67 347 69 391 645 -657 -413 -52 147 453 543 125 419 -465 83
7396H3K11r89L90L53n4N93j42P8J40r42M78k34K5l32Q26l41r31J156j345J108
$$ 83 294 -695 -305 48 -6 587 445 523 663 -279 199 -35 -10 -342 484 143 -788 368 -977 131
7416A31K89m53O75l74k13M09j143Q29K54j74O74j138l10M51m20J192n71n84J072
$$ 131 420 -33 642 268 55 464 -679 150 404 230 904 -234 -544 -93 -513 679 108 -476 596
7435E96l13r7j76l38R6n49N80O95j77J46j93L74N5j71l08o56N48m92K72j24m06
$$ 596 283 186 10 -328 -232 -781 -201 494 317 463 270 644 699 528 220 -436 112 -380 -108 -232 -638
7456f38N90o1J110r43m52N49j45rn16Q76o01K53L95k35n39J49j19L06N03o56Q43
$$ -638 -48 -109 1001 58 -394 155 10 1 -515 361 -240 13 408 173 -366 -217 -336 -30 473 -183 660
7477F60q49j60K75n03J29K70M78L78o97P7j12M05l36o4M33p88M61l74J94j65J179
$$ 660 -189 -349 -74 -577 -448 -178 300 678 -19 58 -54 351 15 -49 384 -404 57 -317 -123 -288 891
7498H91j119P6J96M24m13o74J85R01l77p49M45R9n98Q21R3n6m91O29j38q1L16
$$ 891 -228 -152 44 468 55 -619 -434 467 90 -659 -214 -115 -713 108 201 145 -346 283 145 64 380
7519C80k50M68p21K19O7j65o9n94N96M83j260J510k43n75r3Q55o22J15K9K50L12
$$ 380 130 598 -123 96 163 -2 -71 -665 -69 414 -846 664 421 -154 -247 608 -14 101 130 380 692
7540F92j069M97j0q00J504j392J047k98J73k80j50p94P68J43k12o2l62O96m23
$$ 692 -377 120 110 -690 814 -578 469 171 344 64 -86 -880 -112 31 -181 -243 -605 91 -332
7559c32Q29k43O10q05J75K11n93J58K99r87Q41k13R1M69p68n39J291n18J6j63
$$ -332 497 254 864 59 234 445 -148 10 309 -678 163 -50 41 510 -258 -797 494 -24 -8 -171
7579a71k26P5K20j68J22P31o64J062r98R55j073n18Q56K15K95m45k40l15J31K70
$$ -171 -397 -322 -102 -270 -148 583 -81 981 -17 938 -135 -653 203 418 713 268 28 -287 -156 114
7599A14l84N58l15O89l36n75M79n31N22K48p64J016j041J017p30N1O06j330R27
$$ 114 -270 288 -27 662 326 -249 230 -301 221 469 -295 721 -320 697 -33 18 624 -706 221
7618B21k91J04KL28l20J42n95O95p70J31o79J523q68N82M74q20PO67o35k13P09
$$ 221 -70 34 36 364 44 186 -409 286 -484 -353 -1032 491 -377 205 679 -141 -134 533 -102 -315 394
7639C94o72J054p35n99N72o3J21k13K43J26m2j249J198k57N88n84J22n03K55M65
$$ 394 -278 776 41 -558 14 -49 72 -141 102 228 186 -1063 135 -122 466 -118 4 -499 -244 221
7659B21n93jk6O06n09K31k32O90j47m28N23J65J57M0q79L04J13j61k77m5N81o0
$$ 221 -372 -373 -399 207 -302 -71 -303 387 240 -188 335 500 657 697 -182 122 235 74 -203 -248 333 273
7681B73j52l86N44q99R57k05o67J311n11n56N00k15j32J51J71k31K91Q6j44j55
$$ 273 121 -265 279 -620 337 132 -535 776 265 -291 209 -6 -138 13 184 -47 244 330 186 31
7701C1J79n92L38o3L35p87M33k50M43K32m98L63j91O6M00Mj053P64K69l71q31
$$ 31 210 -382 -44 -107 228 -559 -126 -376 67 299 -199 164 -27 39 439 443 -610 154 423 52 -779
7722g79J461p3j099L51n7N55n47J20k05l25K4J165j229J499n00l92N34r98O26
$$ -779 682 609 -490 -139 -196 359 -188 -68 -273 -598 -574 591 -638 861 361 -31 503 -495 131
7741A31k53j51M11n21j85J082j32o57R78j038J34J24M49J98o73m06K19m0O38N50
$$ 131 -122 -273 138 -383 -568 514 382 -275 703 -335 -201 -77 372 570 -103 -509 -290 -330 308 858
7761H58n35l95k62J75J024r27j06Q88p97L14k2N04o43J12J28k9j87m19J86K88
$$ 858 323 -72 -334 -159 865 -62 -168 720 -77 237 215 719 76 188 316 287 100 -319 -133 155
7781A55M40k45l08k68N26m28L31n54L83K13m29l98N90K39k05N75k004J505k33
$$ 155 595 350 42 -226 300 -128 203 -351 32 245 -184 -582 8 247 42 617 -1387 118 -115
7800a15N45j195N78p1K68J90K3k08k88q1J29K87L54q3p79Q12J95m71o30K88l6
$$ -115 430 -765 -187 -258 10 200 223 15 -273 -354 -225 62 416 333 -446 366 561 90 -540 -252 -288
7821b88R9O40jl92K61m87J22J23j65Q3J45j57m00m61Q71o01J080n61q0k58J78
$$ -288 -189 451 450 58 319 -168 -46 77 -88 -5 140 -17 -417 -878 -7 -608 472 -89 -169 -427 -249
7842b49m96R04r93N95K26p1J72M81r00K96O7p67J356j186M61m04Q30j04j89n69
$$ -249 -745 159 -834 -239 -13 -84 88 569 -331 -35 32 -735 621 -565 -104 -508 322 218 29 -540
7862e40P61k13m89P05l43k05J107Rj344L74R39n08l47k3L10J9l72M97j02k35l25
$$ -540 221 8 -481 224 -119 -324 783 792 -552 -178 761 253 -94 -117 193 212 -160 337 235 0 -325
7883c25O50j10K25m43l02Q31L18j012JR5j31m83J230m90M34o63K76q0l25l36M22
$$ -325 325 215 440 -3 -305 526 844 -168 -167 -72 -203 -686 544 54 488 -175 101 21 -304 -640 -218
7904b18P58P8j423N95j20m60J154k95o60N32J05K78j20l70K51N97l80l34Q9L56
$$ -218 540 618 -805 -210 -330 -790 364 69 -591 -59 46 324 204 -166 85 682 302 -32 57 413
7924D13k09j21J1p6o20K05L86L5P45l77k82J54L5m15j39m95J211j033M25J062
$$ 413 204 83 94 18 -602 -397 -11 24 769 392 110 264 299 -116 -255 -750 461 -572 -147 915
7944I15p60q57Q78O0j16p9l54P21p05m78M83q6J46K75j34j51m91pJ92Q1O98m24
$$ 915 155 -702 176 236 120 41 -313 408 -297 -775 -292 -378 -232 43 -91 -242 -733 -740 -548 -467 231 -193
7966a93J48K50j049M75l55J227p61Q36p15K22j68k8KP56k00q54N98J50p33K59
$$ -193 -45 205 -844 -369 -724 503 -258 578 -137 85 -83 -111 -109 647 447 -407 191 341 -392 -133
7986a33j51l5L6j52M68L41k47j17n40M37j40J72q99O08P69p19K84L97o42L82L
$$ -133 -284 -319 -283 -435 33 374 127 10 -530 -93 -233 -61 -960 -352 417 -302 -18 379 -263 119 122
8007A22k26M66r82K61N26l58j2L92J43n8k22J6m17L14N9K49O01l88p94M50q01
$$ 122 -104 362 -620 -359 167 -191 -203 189 332 274 52 68 -349 -35 24 273 874 486 -308 142 -659
8028f59K77M19m74M79L29qm42Q39q33k47M50m94K05O3M79l87m41P98k54n59L12
$$ -659 -382 37 -437 42 371 363 -79 760 -73 -320 130 -364 -159 -96 383 -4 -445 353 99 -460 -148
8049a48Q85p94K16J75L55n88n33L7N8O51m03L80j77l61j56N54o82N26n82J186
$$ -148 737 -57 159 334 689 101 -432 -395 -337 314 -89 291 114 -247 -403 151 -531 -5 -587 599
8069E99n6O9l1k15K2k83l88R99q17K79o9L0L7N9n9m60K65N55k96l5p5l32j16N95
$$ 599 543 612 581 366 388 105 -283 716 -101 178 109 139 176 235 176 -284 -19 536 240 205 130 -202 -318 277
8093B77l71K85P44r70R0o7N44q60O7p2L18j78M73n00j12m47J101N6o50M40%m77
$$ 277 -94 191 935 -35 55 -12 532 -328 -261 -333 -15 -193 280 -220 -332 -779 322 378 -272 168 168 -309
8115c09o0O51N07j998J164j04N9q00N07N07r16J076k70J87k25l59q6L10L80o61
$$ -309 -369 282 789 -1209 -45 -149 -90 -890 -383 124 -792 284 14 201 -24 -383 -469 -159 221 -440
8135d40M51K12l71J06k50Q03o74K62n57j45J015k73L8K00m02L27L28j27r53J67
$$ -440 11 223 -148 -42 -292 511 -163 99 -458 -603 412 139 177 377 -25 302 630 503 -450 -283
8155b83N5O07m50L52o17k99R65J52q76J4j41M65m37M36K01O01k98n80Q3k29M30
$$ -283 -228 379 -71 281 -336 -635 330 482 -394 -380 -521 -56 -493 -57 144 745 447 -133 -50 -279 151
8176A51m13Q67q89J37K27m01R8M33k28j40L96q52P05l05R6
$$ 151 -262 605 -284 -147 80 -321 -223 210 -18 -158 238 -614 91 -214 -118
8191a18
$$ Imaginary data points
##PAGE= N=2
##DATA TABLE= (X++(I..I)), XYDATA
0@%%%%%%%%%%%%%%%%Mo8J28j28J28j28J29j93K56k56L20l84M08m72N60o25P05
$$ 0 0 0 0 0 0 0 0 0 0 0 0 0 0 0 0 0 4 -64 64 -64 64 -64 65 -128 128 -128 192 -192 216 -256 304 -321 384
33C84q14R05j013J140j275J428j591J767j964K178k412K666k946L246l574L939
$$ 384 -430 475 -538 602 -673 755 -836 931 -1033 1145 -1267 1399 -1547 1699 -1875 2064
49B064m340M780n263N799o396P071p826Q685r675J0832j2198J3838j5865J8419
$$ 2064 -2276 2504 -2759 3040 -3356 3715 -4111 4574 -5101 5731 -6467 7371 -8494 9925
63I925k1768K6367l3082M3812o3590J11292m13047l63181J285162k22176q97084
$$ 9925 -11843 14524 -18558 25254 -38336 72956 -340091 -703272 581890 359714 -537370
74e37370P73253N61038r76465J12044R62563n55977p03950P40783P7629r10841
$$ -537370 235883 796921 -179544 -67500 895063 339086 -364864 375919 453548 -457293
84d57293K68382O85152o54365l99431P23666n8810p10855M43046N33090o38253
$$ -457293 -188911 496241 -158124 -557555 166111 107301 -603554 -160508 372582 -265671
94b65671j93871O77700k02474n44936N52908L92054n72166L9276N94905k88416
$$ -265671 -459542 218158 15684 -529252 23656 415710 -156456 -117180 477725 189309
104A89309l76112N07851J46557n48254L1222L35957l55661k90324L76284R5522
$$ 189309 -186803 321048 467605 -80649 -49427 286530 -69131 -359455 16829 112351
114A12351l81396O9277L16363k18181k24287L42711J34338l58781L6631L39823
$$ 112351 -269045 -199768 116595 -101586 -325873 16838 151176 -207605 -170974 168849
124A68849k13739k38656M04837J69967l71705J05989L81170k91267k70484M03136
$$ 168849 -44890 -283546 121291 291258 -80447 25542 406712 115445 -155039 248097
134B48097M8804m77922J11280L31394l84010k37130M71248K8739m50381K34120
$$ 248097 296901 -181021 -69741 261653 -122357 -359487 111761 140500 -309881 -75761
144g5761L58724m41695j79144N27583p4096m80787L49000L21656n27853m1121
$$ -75761 282963 -158732 -337876 189707 115611 -365176 -16176 305480 -222373 -263494
154b63494O07425k00821m21787M91927J74334o34350R1568N24194m14332l23199
$$ -263494 343931 143110 -278677 213250 387584 -246766 -155198 368996 -45336 -368535
164c68535N72494m428n99929L02315M52320m88092j31726N96794j73973n36584
$$ -368535 203959 199531 -400398 -98083 354237 -133855 -265581 331213 157240 -379344
174c79344L96846K89212n47808J6660N62719k83323l98840M97095J64036n31207
$$ -379344 17502 306714 -241094 -224434 338285 54962 -343878 153217 317253 -213954
184b13954J52713M58301m14320l00807M80314k1101m89228K71723L55355m23655
$$ -213954 -61241 397060 -17260 -318067 162247 141146 -348082 -76359 278996 -144659
194a44659j08544M80854j12549l68784L27146K07727m30841k9807L74442j95879
$$ -144659 -253203 227651 115102 -253682 73464 281191 -149650 -179457 194985 -894
204h94k75786L40397J38889l55552O1413L29484k05615k12592L06741N6134l50956
$$ -894 -276680 63717 202606 -152946 -91533 237951 32336 -180256 126485 182619 -168337
215a68337O2552K61304k23702j58393L18107N1623k88975J17218K44004k27615
$$ -168337 -105785 155519 -68183 -226576 91531 143154 -145821 -28603 215401 -12214
225a2214j34462K88453q236l02841J17036K07869k43648r5401L17992j1927k76884
$$ -12214 -146676 141777 133541 -169300 -52264 155605 -88043 -183444 134548 122621 -154263
236a54263J62556J97086k81779q4541L12623p8092k94746K03134J79094l05337
$$ -154263 8293 205379 -76400 -160941 151682 73590 -221156 -18022 161072 -144265
246a44265j5646L58101j13839k64512K64233J25698l56628K4200L28090k01264
$$ -144265 -159911 198190 84351 -180161 84072 209770 -146858 -122658 205432 4168
256D168k37990L12538P1260l52036J24603L23891k53801j69881L44958k7880l68391
$$ 4168 -233822 78716 149976 -202060 -77457 246434 -7367 -177248 167710 139830 -228561
267b28561J81111K53440l19716q8043L73321r2302l11595K79083K00674l47870
$$ -228561 -47450 205990 -113726 -201769 171552 79250 -232345 46738 247412 -100458
277a00458l371L44696k01684k82801L02757R8467l62927R2601L26687k43792j83888
$$ -100458 -103829 240867 39183 -243618 59139 157606 -205321 -112720 213967 -29825 -213713
288b13713L55255K5107l44164J59417K51712l13878j28895L39132o2903l00669
$$ -213713 141542 166649 -177515 -18098 233614 -80264 -209159 129973 67070 -233599
298b33599K33785K06848l07263k6080L34796j25137k54299K51549J07371l33150
$$ -233599 186 207034 -100229 -126309 208487 83350 -170949 80600 187971 -145179
308a45179J9794K81039j76457j83518K85229O4641k89261R2355K47085k10135
$$ -145179 -125385 155654 -20803 -204321 80908 145549 -143712 -51357 195728 -14407
318a4407j40139K68092j0934k84909J21857K02005k20020p2058K83312l3392k38744
$$ -14407 -154546 113546 102612 -182297 -60440 141565 -78455 -150513 132799 99407 -139337
329a39337J61600J55616k41246m4873K47731r4944k19274J80331J17738k33198
$$ -139337 22263 177879 -63367 -108240 139491 44547 -174727 5604 123342 -109856
339a09856J5934K50094j12441j79034J99434O7636k49857L6248K17631j53827
$$ -109856 -93922 156172 43731 -135303 64131 131767 -118090 -81842 135789 -18038
349a8038j49686K21867M7242k28341R3349K13960j71413j19431K23089j1270k45284
$$ -18038 -167724 54143 101385 -126956 -33607 180353 8940 -110491 112598 101328 -143956
360a43956J05216J73817k01785p9324K40818l2299k10488J57138J54594k19229
$$ -143956 -38740 135077 -66708 -146032 94786 62487 -148001 9137 163731 -55498
370e5498m5110K27259r3202k08708J75941J16162k30220J0839K43659j10057j65168
$$ -55498 -100608 126651 33449 -175259 682 116844 -113376 -102537 141122 31065 -134103
381a34103K18464P8779k47479M0573K07153j77894j53305K30127K5020k43795
$$ -134103 84361 163140 -84339 -43766 163387 -14507 -167812 62315 87335 -156460
391a56460J06924K03732j96799r1037K57789k8534k41382J44420J51073k44266
$$ -156460 -49536 154196 -42603 -133640 124149 95615 -145767 -1347 149726 -94540
401i4540m7144K60740p8435k02430K07125J23061k49852J8914K47101j45490j82298
$$ -94540 -141684 119056 40621 -161809 45316 168377 -81475 -62561 184540 39050 -143248
412a43248K17836M2241k70303O7929K18102j83957j13925K54069k763k40685J29793
$$ -143248 74588 116829 -153474 -85545 132557 -51400 -165325 88744 85981 -154704 -24911
423b4911J73008k17276o2726K42727o5230k07998J73437J30112k11586Q724K33158
$$ -24911 148097 -69179 -131905 110822 45592 -162406 11031 141143 -70443 -61719 171439
434A71439j05869j68046J83200N8246k28280L3190J83352j47809j25442J92879
$$ 171439 65570 -102476 80724 138970 -89310 -56120 127232 -20577 -146019 46860
444D6860K2053j94963Q5565J59663j55979q0189J83521k3748j76833J06056J24134
$$ 46860 68913 -126050 -40485 119178 -36801 -116990 66531 42783 -134050 -27994 96140
455I6140j53792l2416J86585l3942j38503J23531R5819j62247k5755J49014p3673
$$ 96140 -57652 -90068 96517 62575 -75928 47603 143422 -18825 -44580 104434 30761
466C0761j42796J14494O8269j57013p15J58944o8019j15186J35555O1139j62611
$$ 30761 -112035 2459 70728 -86285 -87000 71944 3925 -111261 24294 85433 -77178
477g7178J0686J46933r1920j10442J51311N0903j56483M9402J60302j03435r1059
$$ -77178 -66492 80441 -11479 -121921 29390 80293 -76190 -26788 133514 30079 -60980
488f0980J64697J3648j84546N5431J30196j54500q3178J79168j5045j78227J08140
$$ -60980 103717 117365 -67181 -11750 118446 -36054 -119232 59936 44891 -133336 -25196
499b5196J33379j71593m1687J98500n9684j75806J43165R6859k00491Q610K11015
$$ -25196 108183 -63410 -105097 93403 33719 -142087 1078 97937 -102554 -93944 117071
510A17071r8689j36886J95102N5356k13951O0084J78613j63197j11424K03228
$$ 117071 18382 -118504 76598 131954 -81997 -21913 156700 -6497 -117921 85307
520H5307j5431k13096J15092J50933j86225m2183K16993o4317j81223J54137R4292
$$ 85307 69876 -143220 -28128 122805 -63420 -105603 111390 47073 -134150 19987 114279
531A14279k06879Q518J97304j10274j32623J87520N0507j89695O4170J63432j45437
$$ 114279 -92600 -84082 113222 2948 -129675 57845 108352 -81343 -17173 146259 822
542H22r3786J74474j6876j78981Q9638J15384j52510l6939J71676l8920j32308
$$ 822 -92964 81510 64634 -114347 -24709 90675 -61835 -98774 72902 33982 -98326
553i8326J15303P6242j47744r468J36864o7712j04760J12859N0069j24104K3094
$$ -98326 16977 93219 -54525 -63993 72871 5159 -99601 13258 63327 -60777 -37683
564c7683J25599o4039p7449J05311K7284j25587J4919R7239p7832p4674J04395
$$ -37683 87916 23877 -53572 51739 79023 -46564 -31645 65594 -12238 -86912 17483
575A7483K5297j08621L3932J08217p0222o5937J08442J6289j22319L0411R7082
$$ 17483 42780 -65841 -31909 76308 6086 -59851 48591 64880 -57439 -27028 70054
586G0054q7848o2935J20933J2398j19495N6842J05140j04895n4035J31333j8583
$$ 70054 -17794 -80729 40204 52602 -66893 -10051 95089 -9806 -63841 67492 48909
597D8909j40520P2637R3758j35615k9973J58138l9847j30043J21068P9699j57879
$$ 48909 -91611 -18974 74784 -60831 -90804 67334 27487 -102556 18512 98211 -59668
608e9668M083J59163r0115j20909J47166L8052j68451N3849J51813j22169p9750
$$ -59668 -55585 103578 13463 -107446 39720 77772 -90679 -36830 114983 -7186 -86936
619h6936J70799r719j69347Q9971J13040j61261l9468J72675n5705j41986J37506
$$ -86936 83863 74144 -95203 -5232 107808 -53453 -92921 79754 24049 -117937 19569
630A9569Q0595j67949J6191J63324j01506j13039J51689K3893j71029N9249J34996
$$ 19569 100164 -67785 -51594 111730 10224 -102815 48874 72767 -98262 -39013 95983
641I5983j25345n9580J63898j6398j42421R3319R0252j41569k5899J36023n4836
$$ 95983 -29362 -88942 74956 58558 -83863 9456 99708 -41861 -67760 68263 13427
652A3427j13446J05584N8248j23385J4907J23535o2017p9494J02712K6689j18654
$$ 13427 -100019 5565 63813 -59572 -44665 78870 16853 -62641 40071 66760 -51894
663e1894K0719R1341p3783n8979J00424J4408r6318M0576Q3916p0095m2757Q7258
$$ -51894 -31175 60166 -13617 -72596 27828 42236 -54082 -13506 70410 315 -42442 44816
675D4816k668r5069L3210O7494p1688l6540R0409K587q3152M5089P2193p3345
$$ 44816 42148 -52921 -19711 47783 -23905 -60445 29964 32551 -50601 -5512 66681 -6664
687f664l6740Q9212j0597r6670M6508O8551q6378k7384J07801j7711r4909P3490
$$ -6664 -43404 45808 35211 -61459 -14951 53600 -32778 -60162 47639 29928 -64981 8509
699H509O5993j07071j4427J12234n0658r6202R5058M7356j19280J7804J20266
$$ 8509 74502 -32569 -46996 65238 14580 -81622 13436 60792 -58488 -40684 79582
710G9582p1690p8146J17299J9693j31256M2352J03408j04727n7470J31640j0383
$$ 79582 7892 -70254 47045 66738 -64518 -22166 81242 -23485 -80955 50685 40302
721D0302j23809Q0808R0712j22433k2420J34177n1000j14733J02497N3185j36153
$$ 40302 -83507 -2699 88013 -34420 -56840 77337 26337 -88396 14101 67286 -68867
732f8867J6560J28354p7486p9239J27630K1171j29994M9677R9745j06724n1580
$$ -68867 -52307 76047 -1439 -80678 46952 68123 -61871 -12194 87551 -19173 -70753
743g0753J22807j9439j14958P5883P6684j07813j3093J21449m0781r4204Q6055
$$ -70753 52054 32615 -82343 -6460 70224 -37589 -50682 70767 29986 -64218 21837
754B1837M3504j14968N192J00751o1368o8761R6167K4756r7921L2976Q8435o9104
$$ 21837 65341 -49627 -44435 56316 -5052 -73813 22354 47110 -50811 -17835 70600 1496
766A496m9768Q9032j987r2482L6867O5477p0247l1084Q5509n642p4469M7316N6105
$$ 1496 -48272 40760 38773 -53709 -16842 48635 -21612 -52696 32813 27171 -47298 18 56123
779E6123o9158k3702P6099j7651p4219M6178M8486p0051j3296Q1957j9795o4784
$$ 56123 -13035 -36737 39362 21711 -52508 -6330 42156 -27895 -41191 40766 20971 -43813
791d3813N5696M2647p7238p953P6280l4413o7692O5041L3755q0755P608Q2928
$$ -43813 11883 54530 -22708 -30661 45619 11206 -56486 8555 42310 -38445 -30837 52091
803E2091m4571n8947P6911K0279r1080J9739P9205o5210m9553R1705O614r0534
$$ 52091 7520 -51427 25484 45763 -45317 -25578 53627 -11583 -61136 30569 37183 -53351
815e3351M4807P5596p9528l3795R6485j8821r3102O1103N6703r5121r925J00774
$$ -53351 -8544 67052 -12476 -46271 50214 31393 -61709 -606 56097 -39024 -48949 51825
827E1825l8782p6942Q4490L8247j00910J2509R2272o5464o2609R1335J3437r8270
$$ 51825 13043 -63899 20591 58838 -42072 -29563 62709 -2755 -65364 25971 39408 -58862
839e8862M0914Q1699p4523l5687R9482j0284r2525N4756N6860r0521j8496R2215
$$ -58862 -17948 63751 -10772 -46459 53023 42739 -49786 4970 61830 -28691 -47187 45028
851D5028l4295p6928P2917M1694q9107Q094Q8300m9777o2059P8050J6902q9421
$$ 45028 10733 -66195 6722 48416 -40691 -32597 55703 5926 -56133 21917 38819 -50602
863e0602K4198P3916n9891l9803Q4521L821p7202M0565O0330o8222k6409P5715
$$ -50602 -26404 47512 -12379 -52182 32339 36160 -41042 -477 59853 -8369 -34778 40937
875D0937j6870p2722M6968M3935o8633j0088P4653k4246n9620N5204L2169p0199
$$ 40937 24067 -48655 -1687 42248 -26385 -36473 38180 13934 -45686 9518 41687 -28512
887b8512K3O7716l5418n1068N9053K4256o7175J3222O4183m0870m1884O1029J1757
$$ -28512 -28489 39227 3809 -47259 11794 36050 -31125 -17903 46280 5410 -36474 24555 36312
900C6312o9351J7645N5616m8818l4066O4809K916o5699L0856N2727n6202k4894
$$ 36312 -33039 -15394 40222 -8596 -42662 22147 25063 -40636 -9780 42947 -13255 -38149
912c8149O5981r636o4628L9215M5435o1539j1555P1633j7375n8852N3044L5138
$$ -38149 27832 18196 -46432 -7217 38218 -23321 -34876 36757 19382 -39470 13574 48712
924D8712p0074j836O8747l7081n5790O0018K2314p2386J4712O8849m6611m2342
$$ 48712 -21362 -23198 45549 8468 -47322 12696 35010 -37376 -22664 46185 -426 -42768
936d2768P0161Q328p5463K7281N8891o0642l1782P5214p991o9494M5067N1316
$$ -42768 27393 35721 -39742 -12461 46430 -14212 -45994 29220 21229 -48265 -3198 48118
948D8118o6781j3286P6345k4654o5527N4714L1868p6009L683P0867m0041n0092
$$ 48118 -18663 -31949 44396 19742 -45785 8929 40797 -35212 -31529 39338 -703 -50795
960e0795O8114J8234p2927K2494O4418n3201l7619P0196k53p1719L6116N2958
$$ -50795 17319 35553 -37374 -14880 49538 -3663 -41282 28914 28661 -43058 -6942 46016
972D6016o1935j9588P3182j6144o2620M8289L7214o7335n505O5705l1042n1303
$$ 46016 -15919 -35507 37675 21531 -41089 7200 44414 -22921 -28426 37279 6237 -45066
984d5066N5438K2687o5179J0218O0123m0049l6713N8060Q413o1543K2166M8958
$$ -45066 10372 33059 -32120 -21902 38221 -1828 -38541 19519 27932 -33611 -11445 37513
996C7513m5513k5536N7902j431n4423K9206M0437m9776j6666N3810j1392m9766
$$ 37513 -8000 -33536 24366 22935 -31488 -2282 38155 -11621 -28287 25523 14131 -35635
1008c5635L2524L3448m8379q996N3259j4889m3140L7338K6176m9333k579M9415
$$ -35635 -3111 30337 -18042 -27038 26221 11332 -31808 5530 31706 -17627 -20206 29209
1020B9209k3511l9510M2115J9386m9125O744M8961k8256l5058M7220J1118n4346
$$ 29209 5698 -33812 8303 27689 -21436 -14692 34269 6013 -29045 18175 29293 -25053
1032b5053J2295M5897l9196k9876N2102M337n5486K3816M7546m5804k2780N8357
$$ -25053 -12758 33139 -6057 -35933 16169 20506 -34980 -11164 36382 -9422 -32202 26155
1044B6155o187n6483L3882L8468n6044j0787O2072j9703n0679M7569K9095o1064
$$ 26155 19968 -36515 -2633 35835 -20209 -30996 31076 11373 -39306 8263 37358 -23706
1056b3706L943O0405l6059m3287N6003J3198o4148J7273N5622m6719k9753O2325
$$ -23706 -19763 40642 4583 -38704 17299 30497 -33651 -16378 39244 -7475 -37228 25097
1068B5097m86o1962L4228M4498n6943j6539O4998j7730n6022M6118L0973o1806
$$ 25097 24611 -37351 -3123 41375 -15568 -32107 32891 15161 -40861 5257 36230 -25576
1080b5576J581O0553l2008m3334N3738J3942n9796J6322N0402m0820k7233N3651
$$ -25576 -23995 36558 4550 -38784 14954 28896 -30900 -14578 35824 -4996 -32229 21422
1092B1422N73n3067K5502L8546m5979j4407N0898j1141m3886L2808K7754m5019
$$ 21422 21995 -31072 -5570 32976 -13003 -27410 23488 12347 -31539 1269 29023 -15996
1104a5996m209M7419j7172l8720L6493J7557m4819K359M2033k2204l0760L6141
$$ -15996 -20205 27214 10042 -28678 7815 25372 -19447 -17088 24945 2741 -28019 8122
1116H122J2566m0099Q612L5920k2273k4557L3726P672l8754Q881L2493k4652k2843
$$ 8122 20688 -19411 -10799 25121 2848 -21709 12017 19689 -19065 -10184 22309 -2343 -25186
1129b5186L6096O099l8193J3605L3830k9752j9725L9041J594m2432J9488L3145
$$ -25186 10910 17009 -21184 -7579 26251 -3501 -23226 15815 17409 -25023 -5535 27610
1141B7610l8033j5283M6177p500m2954K9613L0638m4587p452M9352j6560m1940
$$ 27610 -10423 -25706 20471 12971 -29983 -370 30268 -14319 -21771 27581 11021 -30919
1153c0919L9273K1335n1017K703M9264k7435l6161M7756J1089n4574J6859M7020
$$ -30919 8354 29689 -21328 -18625 30639 3204 -32957 14799 25888 -28686 -11827 35193
1165C5193m1637k4319N3662l154n3942L1463L7027n1696j0029N6454j9723m6634
$$ 35193 -6444 -30763 22899 19745 -34197 -2734 34293 -17403 -27432 29022 9299 -37335
1177c7335M4976K3811n4944N791N1618l2167l3537M8334Q719n2882J8021M1675
$$ -37335 7641 31452 -23492 -17701 33917 1750 -31787 16547 25266 -27616 -9595 32080
1189C2080l9749k0863M9866m107m6489K8532L0768m2670q106M5931j5371l8062
$$ 32080 -7669 -28532 21334 17227 -29262 -730 30038 -12632 -20738 25193 9822 -28240
1201b8240L2645J9649m2239K338L9244k2100k7851L6004R701l8898J0054L2952
$$ -28240 4405 24054 -18185 -15847 23397 1297 -26554 9450 19151 -19747 -9693 23259
1213B3259k5460j9673L2395L808l3815J2657K7092k5007j4215L1118J240k9756
$$ 23259 -2201 -21874 10521 14329 -19486 -6829 20263 -4744 -18959 12159 13399 -16357
1225a6357J3041K4427k3389j4179L0266j85l0659J4192K3182k6014j2504L2615
$$ -16357 -3316 21111 -2278 -16457 13809 13624 -17035 -2843 20339 -5675 -18179 14436
1237A4436m348l0639J8503K1978k7955q848L4136q102l0318K3276K0870l5282
$$ 14436 10088 -20551 -2048 19930 -8025 -16873 17263 9161 -21157 2119 22989 -12293
1249a2293l680L7797j6633l1708L1906J7027m0767N380L9969k5119k8440L9726
$$ -12293 -15973 21824 5191 -26517 5389 22416 -18351 -12971 26998 1879 -26561 13165
1261A3165P257m5136J5404L6174l5942j9634M6686m117m4161K7919L0907m2344
$$ 13165 20422 -24714 -9310 26864 -9078 -28712 17974 13857 -30304 -2385 28522 -13822
1273a3822o437M7585j7426l8379L7847J7381m6549N160M5163k9603k7399M3188
$$ -13822 -20259 27326 9900 -28479 9368 26749 -19800 -14640 30523 920 -26479 16709
1285A6709M969m4806J8221L5619l6265j8032M3355o503m1622K6292K6439m0117
$$ 16709 21678 -23128 -4907 30712 -5553 -23585 19770 13267 -28355 -2063 24376 -15741
1297a5741n521M1561j4910l1925L2199J5680l9498N413L4534k1865k2472L3585
$$ -15741 -21262 20299 5389 -26536 5663 21343 -18155 -12742 21792 -73 -22545 11040
1309A1040N072l4501J2261K7642k5853j3018L0506r47l0246J5483K1125k4851
$$ 11040 16112 -18389 -6128 21514 -4339 -17357 13149 12202 -18044 -2561 18564 -6287
1321f287p843K7600l960k5685J6541J7408k5518n734K6618o656k3033J6582J5325
$$ -6287 -14130 13470 9510 -16175 366 17774 -7744 -13478 13140 6484 -16549 33 15358
1334A5358k2918l436K5570p346k2681J8840J2160k4769l095K6057j1326k1880
$$ 15358 -7560 -10996 14574 7228 -15453 3387 15547 -9222 -12317 13740 2414 -19466
1346a9466K1321J2986k6964J581K8091j4573k0400K5202Q811l1893O404K7461
$$ -19466 1855 14841 -12123 -10542 17549 2976 -17424 7778 16589 -15304 -8900 18561
1358A8561k1603j9022L1905L711l3127J4452K7936k7864j2352L4762m917l4699
$$ 18561 -3042 -22064 9841 13552 -19575 -5123 22813 -5051 -17403 17359 12442 -22257
1370b2257K1658K2468l3961o404L8392j3439k9190L0715J5208l7643M786L4697
$$ -22257 -599 21869 -12092 -18496 19896 6457 -22733 7982 23190 -14453 -9667 25030
1382B5030k3903k3421L4500M597l8676J5098K9819l0489j4285L8487n783l3944
$$ 25030 1127 -22294 12206 16803 -21873 -6775 23044 -7445 -21730 16757 10974 -22970
1394b2970K2883K1771l5952k637L5714j4788k7322K8704J3842l4654N839L1189
$$ -22970 -87 21684 -14268 -16905 18809 4021 -23301 5403 19245 -15409 -9570 21619
1406B1619k0990j9383L0271L537l1844J2546K4799k4622j2228L0826l522k7240
$$ 21619 629 -18754 11517 15054 -16790 -4244 20555 -4067 -16295 14531 11009 -16231
1418a6231J6225J7791k6339n772K7183q715k2380J9453J2518k3174m01K5226j1986
$$ -16231 -6 17785 -8554 -14326 12857 4142 -18238 1215 13733 -9441 -9842 15384 3398
1431C398j6990J9365Q525k4059J928K0678j2916j4673J8750O533k0147M136J9900
$$ 3398 -13592 5773 14298 -9761 -7833 12845 -71 -14744 4006 10539 -9608 -5472 14428
1444A4428j2526j3939J9435K295k1230M323J8768j5099j1907K0996L597k1536
$$ 14428 1902 -12037 7398 9693 -11537 -7214 11554 -3545 -15452 5544 9141 -12395
1456a2395R001J9416j7148j0844K2701j548k3953J1811J7767k2232o549K5577
$$ -12395 -3394 16022 -1126 -11970 10731 9183 -14770 -2959 14808 -7424 -13973 11604
1468A1604m067k2578J7508J5370k5465j926K6061j1732k2645K1359J2008k9485
$$ 11604 7537 -15041 2467 17837 -7628 -9554 16507 4775 -17870 3489 15497 -13988
1480a3988M097K7628j7823j7520K7301M105l0658J1268K5279k5067j3567L1672
$$ -13988 -9891 17737 -86 -17606 9695 13800 -16858 -5590 19689 -5378 -18945 12727
1492A2727l070k9863J8860K0908k9276l978L1090j1217k5874K4573J1220k9789
$$ 12727 9657 -20206 -1346 19562 -9714 -13692 17398 6181 -19693 4880 16100 -13689
1504a3689L512K9242j9395j7984K9131M041l0190J1720K2725k3511j1944K7655
$$ -13689 -10177 19065 -330 -18314 10817 14858 -15332 -3612 19113 -4398 -16342 11313
1516A1313l867k6335J7586J7927k4793l088K7026r676k0810J9574R188k6254L031
$$ 11313 7446 -18889 -1303 16624 -8169 -11257 15769 6093 -14717 4857 14045 -12209 -9178
1529i178K2244j4407j4135K1236M219k1374R167J7832j6765r095J9787j456k0395
$$ -9178 13066 -1341 -15476 5760 9979 -11395 -2228 15604 -1161 -10256 9531 8075 -12320
1542a2320Q607J4733j6791n910J8556j376j5894J1418J1666j4361n446J5980m641
$$ -12320 -3713 11020 -5771 -11681 6875 5499 -10395 1023 12689 -1672 -7118 8862 4221
1555D221j5300R564R998j5072k064J7068l307j4626J2209J0069j6344l101J6570
$$ 4221 -11079 -1515 8483 -6589 -8653 8415 5108 -9518 2691 12760 -3584 -6685 9885
1568I885o530j5914J2667R050j7097J05J8447p834j4557J6831O552k0316L040
$$ 9885 3355 -12559 108 9158 -7939 -7834 10613 2779 -11778 5053 11605 -8711 -5671
1581e671J8093j3383j3352J9310M360k1734P827J9705j6122j1108K2833j566k3220
$$ -5671 12422 -961 -14313 4997 9357 -12377 -4550 15155 -967 -12075 10758 9192 -14028
1594a4028J3188J6038k2698n349K5470p180k0905J9583J2021k5567K170K3531
$$ -14028 -840 15198 -7500 -12849 12621 5441 -15464 4119 16140 -9427 -7257 16274
1606A6274j4809j9032K4549L866k6547J0004K2055k0126j0239K6586l513k4425
$$ 16274 1465 -17567 6982 10848 -15699 -5695 16360 -3766 -14005 12581 9068 -15357
1618a5357J5887J4649k4600l943K4740r088j9524K0820J0372k4120M965K1625
$$ -15357 530 15179 -9421 -13364 11376 2288 -17236 3584 13956 -10164 -5199 16426
1630A6426j4522j4262K1595J518k3143Q744J5889j7322p181K1761j902j8555J3116
$$ 16426 1904 -12358 9237 10755 -12388 -3644 12245 -5077 -12258 9503 7601 -10954 2162
1643B162J2002j8539k770J7252q164j3677J1944O832j5450R73J5721o979j0271
$$ 2162 14164 -4375 -7145 10107 1943 -11734 210 7042 -8408 -7435 8286 1307 -8964
1656h964J3518L047j3141K549R987p542q206J0051L395j1172K997J1659p519o665
$$ -8964 4554 7601 -5540 -2991 6996 -546 -8752 1299 4694 -6478 -3481 8178 659 -6006
1670f006J0028L152j2509J832J0154p491p803J1685K881j3206L798J2724r379
$$ -6006 4022 7174 -5335 -3503 6651 -840 -8643 3042 5923 -7283 -3485 9239 -140
1683a40p793J3569J849j5749N238J2633j1872q029J7277J6j7028J0686J1621j5408
$$ -140 -7933 5636 7485 -8264 -3026 9607 -2265 -10294 6983 6999 -10029 657 12278 -3130
1697c130n741J9100n808j7653J3717R390j8825l67K1151j0345j4467J9006N834
$$ -3130 -8871 10229 4421 -13232 485 9875 -8950 -9317 11834 1489 -12978 6028 11862
1710A1862k3583O628J8477j6545j1256K2115j124k0477J3545J5135k0161k993
$$ 11862 -11721 -5093 13384 -3161 -14417 7698 6574 -13903 -358 14777 -5384 -8377
1722h377K3980r765j9006J7782Q544k3684K118K0835j2895j2692K1578L453k2185
$$ -8377 15603 5838 -13168 4614 13158 -10526 -8408 12427 -468 -13160 8418 11871 -10314
1735a0314R910J4439j6522q513K0509m981j9144J3487J0220j8114O43J8682q299
$$ -10314 -404 14035 -2487 -11000 9509 4528 -14616 -1129 9091 -9023 -8380 10302 2003
1748B003j2791J5209M730j6941K970J3467j0452q539J3468J763j3392P072J0673
$$ 2003 -10788 4421 9151 -7790 -4820 8647 -1805 -10344 3124 4887 -8505 -1433 9240
1761I240j0115n179J2639r65j1603M879P360q997l385R457q7q695N367O221p229
$$ 9240 -875 -6054 6585 5620 -5983 -1104 6256 -2741 -6126 3331 3244 -5451 -84 6137 -1092
1776a092k876Q073p18q997M192N892p099l052R985k60q341M704P336r408m155
$$ -1092 -3968 4105 3387 -5610 -1418 4474 -2625 -5677 4308 4048 -4293 411 7747 -1661 -5816
1791e816J0902j863j1630O289Q317j0558k611J3693l500j1708R856P215j4718
$$ -5816 5086 3223 -8407 -2118 6199 -4359 -6970 6723 3223 -8485 1371 8586 -6132
1804f132j011J5547r555j0659J3517M624j4877M593J5171j1318q232J6976J76
$$ -6132 -7143 8404 -1151 -11810 1707 6331 -8546 -3953 11218 -100 -8332 8644 8820
1817H820j8161Q006J2329j5623m857J8465n268j5104J4759Q612j8565J317J7763
$$ 8820 -9341 -1335 10994 -4629 -9486 8979 3711 -11393 3366 11978 -6587 -5270 12493
1830A2493j1065j3057J6261J942j8609P562J5412j5610n935J8737j988j5661J1524
$$ 12493 1428 -11629 4632 6574 -12035 -4473 10939 -4671 -10606 8131 6143 -9518 2006
1843B006Q786j7296j063J5368o953j1861J3634N700j5882M193J3780j0228q094
$$ 2006 10792 -6504 -7567 7801 848 -11013 2621 8321 -7561 -3368 10412 184 -7910
1856g910J5117j786j3262O587R196j1492l743J3552k628j1456Q601O973j0701
$$ -7910 7207 5421 -7841 -1254 7942 -3550 -7293 6259 3631 -7825 776 7749 -2952
1869b952j100J0631m966q115P282L774q294L61R622n402n006O510K633q033O1
$$ -2952 -4052 6579 1613 -6502 780 4554 -3740 -3379 6243 841 -4165 2345 4978 -3055 -2994
1884b994P212l937n509N140L341o049k19P400k274o824N404L335p066j442Q374
$$ -2994 4218 281 -5228 -88 3253 -2796 -3015 4385 2111 -4713 691 4026 -3040 -4482 3892
1899C892m057o628P419L780q423Q38J0040m838o100Q162J775j1260K080J0335
$$ 3892 -165 -6793 626 4406 -4017 -3179 6861 2023 -4077 4085 5860 -5400 -3320 7015
1913G015q751n983J1925J204j2169O414R875j1549l012J2052k704j3425Q856P690
$$ 7015 -1736 -7719 4206 5410 -6759 -345 9530 -2019 -5031 7021 4317 -9108 -252 7438
1927G438j4673L92J4463o837j0277J3195M640j5351M572J2334j1772p343J4323
$$ 7438 -7235 -6843 7620 783 -9494 3701 8341 -7010 -2438 9896 -1876 -9219 5104
1940E104j26j4340Q110J0424j3543j451J4497n460j1451J0796O127j4789J982
$$ 5104 4978 -9362 -1252 9172 -4371 -5822 8675 3215 -8236 2560 8687 -6102 -4120
1953d120J2058q816p736J3553J032j3253O137J0442j1512m976J3439l034j1390
$$ -4120 7938 -878 -8614 4939 5971 -7282 -1145 9297 -2215 -7191 6248 3214 -8176
1966h176Q543O091j1115M25J1207n622p676R439K035j0255J597Q997o355n658
$$ -8176 367 6458 -4657 -4232 6975 1353 -6323 3116 5151 -5104 -3507 5490 -865 -6523
1980f523R099J232q268L299O438n741k488O571n14p594L097M591n430j890O601
$$ -6523 2576 3808 -4460 -1161 5277 -464 -2952 3619 3105 -4489 -1392 3199 -2231 -4121 2480
1995B480j87n256K948M535m420l215O265o39o315J866M615m126k255N539N24n288
$$ 2480 2293 -2963 -15 4520 100 -3115 3150 2511 -3804 -1938 2677 -1449 -3704 1835 2359 -2929
2011b929K074N600m692m355P902j014p684M551M792o550l159R325j124p220N466
$$ -2929 -855 4745 53 -4302 3600 2586 -5098 -547 4245 -2305 -5464 3861 2737 -4483 983
2026I83N543r857m96J0159o097o382P651L790j1222K420J0201p053n902J1235
$$ 983 6526 -3331 -3827 6332 235 -6147 1504 5294 -5928 -3508 6693 -360 -6262 4973
2040D973K55j1462N307P983r577l103J1784l561j0291Q449O727j2139M79J1270
$$ 4973 5228 -6234 -927 7056 -2521 -5624 6160 2599 -7692 757 7484 -4655 -4176 7094
2054G094o798q334J0929J857j1279L261J0520r395m809J2464k717j0294Q192O527
$$ 7094 296 -8038 2891 4748 -6531 -3270 7250 -2145 -6954 5510 2793 -7501 691 7218
2068G218j1188j595J1151m675q132R672L778j1269K475R112p012m418R017K44
$$ 7218 -3970 -5565 5586 911 -7221 2451 6229 -5040 -2565 6547 -465 -4883 4134 4378
2082D378j0563M990O778q123j764Q148j783o649N262M120p035q2P060l979m767
$$ 4378 -6185 -1195 5583 -2540 -4304 3844 2061 -4588 674 4794 -2241 -2323 4737 758 -4009
2097d009M431K074n780J583M807l299k071L614J547l890J61K877j158l242K615
$$ -4009 422 2496 -3284 -1701 3106 -193 -2264 1350 2897 -993 -832 2045 887 -2355 260
2112B60J715m099J58M215q51l696L301K576n086Q3M191k363l872L852K385n152
$$ 260 1975 -2124 -1966 2249 1398 -2298 1003 3579 -1507 -1424 2767 404 -3468 384 2769 -2383
2128b383n34O566k496m855N348K365o269N90O399n133m157P797n90p245K331P903
$$ -2383 -2917 3649 1153 -3702 1646 4011 -2258 -1668 4731 -402 -4559 3238 2648 -4597 -2266 5637
2144E637p281k311P919j973q035O197N236r621l15R740m220o701Q240K140j0309
$$ 5637 -1644 -3955 3964 1991 -6044 153 5389 -4232 -4547 5193 973 -5728 2512 4652 -5657
2159e657K501R682q095l774R396M03j0549O465O044q741j716J0154m386p242O946
$$ -5657 -3156 6526 -1569 -5343 4053 4456 -6093 372 6416 -2325 -4041 6113 1727 -5515 1431
2174A431M588j0488R07R482o480n202R008L09q414N080N990p691m029R387k672
$$ 1431 6019 -4469 -3562 5920 -560 -5762 3246 3555 -4859 221 6211 -1480 -5509 3878 1206
2189A206o619N353L715p378O03P507l389n123O065J288o681K282N362n655j432
$$ 1206 -5413 -60 3655 -3723 -3120 4387 998 -4125 1940 3228 -3453 -1171 4191 -1464 -2896
2204b896M758o15m832K639M350m276q66L962o04l924K207K323k975j152K721R56
$$ -2896 1862 1247 -3585 -946 3404 -872 -1738 2224 1620 -2304 -97 2226 -749 -1901 820 1776
2220A776l567J316J622j323q08J753Q74l050J210L150l147j390L053K27m517J149
$$ 1776 -1791 -475 1147 -176 -984 769 1643 -1407 -197 2953 -194 -1584 1469 1696 -2821 -1672
2236a672M324k475l201M288L05m840K145M092l873k594N532p00n080K615M682
$$ -1672 2652 177 -3024 1264 1569 -3271 -1126 2966 -907 -3501 2031 1331 -3749 -1134 3548
2251C548n162k148P335l427m989N814L238p320R35P276n213m465P509L14q157
$$ 3548 -1614 -3762 3573 146 -4843 971 4209 -3111 -2176 5100 -113 -4578 2931 3245 -4912
2266d912M470N544p048j884Q060k985n906N666M090q416R20P595n359n153P098
$$ -4912 -442 5102 -1946 -3830 4230 1245 -4661 1005 5095 -3321 -2401 5194 -165 -5318 1780
2281A780J226p332K800N863o548j903P709k223n845N224L923p427m32Q015m813
$$ 1780 3006 -4326 -1526 4337 -2211 -4114 3595 1372 -4473 751 4674 -2753 -3185 4830 17
2296A7m814O445K168p655J943N970n216k072N567O08o444L393L411n023j004M937
$$ 17 -4797 1648 3816 -3839 -1896 4074 -1142 -3214 2353 2961 -3483 -90 3321 -1702 -2706 2231
2312B231j565l955L453K366n019Q84M071k271k720L737J194l612O90K179j624
$$ 2231 666 -3289 164 2530 -2489 -1605 2466 195 -2525 1212 2406 -1206 -516 1663 39
2327C9j382K015mk066N2K397o57j647J726J471k222j358K625j016j830J225J745
$$ 39 -1343 672 668 -1398 -1346 1051 394 -1253 473 1944 -278 -1636 989 -27 -1857 -632 1113
2344A113k170j355M093o68k200J714K540l547j067M740k896l006L330J518m253
$$ 1113 -1057 -2412 1681 1013 -1187 527 3067 -480 -1547 3193 297 -2709 621 2139 -2114
2359b114K15M808k281m536N657R13n369J213M800n496j300O293j625m816L402
$$ -2114 -1899 2909 628 -3908 1749 2662 -2707 -1494 3306 -2190 -3490 2803 1178 -3638 -236
2374b36L782n909p84P409m068m653O267R79n431P18O597n244l079P491j000o856
$$ -236 3546 -2363 -3147 4262 194 -4459 1808 2787 -2644 -1926 4671 -573 -3652 3839 2839 -4017
2390d017M582L517n384k134O674k711m503N251K711o684J245N560m162l568O188
$$ -4017 565 4082 -1302 -3436 3238 527 -3976 1275 3986 -2698 -1453 4107 -55 -3623 2565
2405B565j173n133L544L016m249j566N932j515m670M789K135n415M02M208k813
$$ 2565 1392 -3741 -197 2819 -1430 -2996 2936 1421 -3249 1540 3675 -1740 -1338 2870 57
2420E7l319M724L22l337P41L093k691j157L223L09l020P70J817k020j652L172
$$ 57 -3262 1462 1784 -1553 -812 2281 -410 -1567 1656 1965 -1055 -285 1532 -488 -2140 1032
2436A032l27k451K42K549j168p63J875k89j070N0J295q86j512K248J02j967J37
$$ 1032 705 -1746 -1504 1045 -123 -886 989 700 -370 -320 975 89 -1423 825 927 -1040 -903
2453i03K223l42j765K475K0l034Q01J667j966j341L301L96l886J328L376k340
$$ -903 1320 978 -787 1688 1708 -1326 -525 1142 -824 -2165 1136 1532 -2354 -1026 2350 10
2469A0k075M217q11l942K822J466l397o44M895j146l793M158J070m133M95M151
$$ 10 -2065 2152 1341 -2601 221 1687 -1710 -2354 2541 1395 -2398 1760 2830 -1303 -808 3343
2485C343l928l213N755l28m176K382L684m319j401O246k624n186M572K150n360
$$ 3343 -585 -3798 1957 1629 -2547 -165 3519 -800 -2201 4045 1421 -3765 807 2957 -2403
2500b403P41M626l844k916N169N53m098K544K965m616k045N390j218m624L418
$$ -2403 -1662 2964 -880 -3796 1373 1926 -2172 372 3337 -1279 -3324 2066 848 -3776 -358
2515c58K560m467R39L767j266l545M622J31m310M63M208m145j517L938R9l523
$$ -358 2202 -2265 -1326 2441 1175 -2370 2252 2383 -1927 -1464 2744 -1401 -2918 1020 1119 -2404
2531b404K238K987l137k56K276k24l560K437M77j643o72K904k024j194K510J175
$$ -2404 -166 2821 -316 -572 1704 1480 -2080 357 834 -809 -1481 1423 -601 -1795 715 1890
2547A890k350M29K105j105k473J071Q40k084P91P68N43p30K58J522r52j188J490
$$ 1890 -460 -31 2074 969 -1504 -433 407 -1677 -886 -118 425 -305 -47 1475 523 -665 825
2564H25m93j353j39J990j290l59K369r92j172J102R26k148l51K435p22k520K350
$$ 825 332 -1021 -1160 830 -460 -819 1550 558 -614 488 1414 -734 -1085 1350 628 -1892 458
2581D58J618l451J39L600j828k302L431K87m177J025L119l620r80M248r14l568
$$ 458 2076 -1375 -1236 2364 536 -1766 1665 1952 -2225 -1200 1919 -1701 -2681 1567 653 -2915
2597b915M196J885m702O15L761k647k926L552M22m033J851K923k572k017M763
$$ -2915 1281 3166 -1536 -921 2840 193 -2733 819 1241 -2792 -941 1982 -590 -2607 2156
2612B156O14m770K766K421m648l65M147j676m245L579J780l881J622L274k772
$$ 2156 2770 -2000 766 3187 -1461 -1826 2321 645 -3600 -21 1759 -2122 -500 2774 2
2627Bk031L930r37l152K031J861l021j213M027j381j974L091N65k806O13K135
$$ 2 -2029 1901 964 -2188 -157 1704 -1317 -2530 1497 116 -1858 1233 1798 -1008 -395 1740
2643A740j931j836K123O73k476M36K598j634k58J787q1j883J214K73j623l7J716
$$ 1740 -191 -2027 96 769 -1707 -1271 1327 -307 -565 1222 1141 -742 472 745 -878 -915 801
2660H01p08q31J178K47k79n2K67P8m89j91J10mj696J882R50k577M56J609m58p63
$$ 801 93 -738 440 687 408 356 623 701 212 21 131 127 -1569 313 1263 -1314 -858 751 293 -470
2680d70J229L59k059O7J391j736r53K322P85k821J924J984j804j364J593M58k797
$$ -470 759 1118 -941 -874 517 -1219 -2172 150 935 -1886 38 2022 218 -1146 447 905 -1892
2697a892J674J157l000j08K938L69k888K697K124m091L73K646k357k137L188J24
$$ -1892 -218 939 -2061 -2169 769 1138 -1750 947 3071 -1020 -647 1999 -358 -2495 693 817
2713H17k988K265J885l393O70L645j421k463J939K72k751K38L041k429j725L966
$$ 817 -2171 94 1979 -1414 -744 2901 1480 -983 956 1228 -1523 -1285 1756 -673 -2398 1568
2729A568j3l414J389K758l316K63K981j984l194L485J07k646J602K615j917j375
$$ 1568 1555 -1859 -470 2288 -1028 -765 2216 232 -2962 523 630 -2016 -414 2201 284 -1091
2745a091K396j14j608p48J946r63j267J549j64r51J339J263k038L71J037q83j190
$$ -1091 1305 1191 -417 -1165 781 -182 -1449 100 -64 -1015 324 1587 -451 -80 957 74 -1116
2762a116R15P73j471M46M15Q19j526K013m5m97j95P0N26k501P90m65N4J7J319
$$ -1116 -201 572 -899 -453 -38 781 -745 1268 1223 726 531 601 1127 -1374 -584 -1049 -995 -978 341
2781C41k98k28j6J464p05M22pJ93k779M84J052m91o02J822K07j769J034J284j002
$$ 341 43 -185 -201 1263 558 980 973 1166 -1613 -1129 -77 -568 -1170 652 859 -910 124 1408 406
2800D06j147K206j969j222J445M25j260K03K464p25j999K694R33l516Q19K419
$$ 406 -741 1465 -504 -1726 -281 144 -1116 -913 1551 826 -1173 1521 2454 -1062 -243 2176
2816B176l249p42K547j326r95K391P42k629J009K618k598j277K023j06k229P31
$$ 2176 -1073 -1815 732 -594 -1589 802 1544 -1085 -76 2542 -56 -1333 690 584 -1645 -914
2832i14K406k033j110K919Q91l360K660O99l535J4K668j611j786K736O51j479
$$ -914 1492 -541 -1651 1268 2159 -1201 1459 2158 -1377 -1363 1305 -306 -2092 644 1295 -184
2848a84j5K692j473q08J429q02k457N16J456k419J55K206j9j277K598Rj067n28
$$ -184 -199 2493 1020 212 1641 839 -1618 -1102 354 -2065 -1910 296 277 -1000 1598 1607 540 12
2866A2J183j681o96N29N50k002J063J510o21N43J108o18q73Q77m10j006m24K22
$$ 12 1195 -486 -1182 -653 -103 -2105 -1042 468 -153 390 1498 880 7 884 474 -532 -956 -734
2884g34j72j99Q29N75J82j70P16J79n06j637J951o51j462M45J23j66L49J529j24
$$ -734 -906 -1105 -276 299 481 311 1027 1206 700 -937 1014 363 -1099 -654 -531 -697 -348 1181 1057
2903A057j408J712j79j553j66J932k542m96J925J04j243J266J720j930n35J944
$$ 1057 -351 1361 1182 -371 -537 1395 -1147 -1643 282 386 -857 409 2129 199 -336 1608
2919A608j657j559J302J306k423P0J955k48j658K855M01k188P89J835k436k359
$$ 1608 -49 -1608 -306 1000 -1423 -1353 602 354 -1304 1551 1952 -236 553 2388 -48 -2407
2935b407K751J85k120J829J247k322O69J899r61k291K575l97j783n4J854j701
$$ -2407 344 529 -1591 238 1485 -837 -168 1731 770 -1521 1054 657 -1126 -1180 674 -1027
2951a027r08K423Q7j340K027O66k530j47J766r6k311Q25M21j651J665J994k657
$$ -1027 -1935 488 575 -765 1262 1928 -602 -749 1017 921 -1390 -565 -144 -1795 -130 1864 -793
2968g93J046Q95J96j862L63J623k898k34J261J34j11R0J073m93K41J54n32m5K0
$$ -793 253 1148 1344 -518 -155 1468 -1430 -1664 -403 -269 -380 -290 783 290 531 685 153 108 128
2987A28q4j196M61J95L0O05O05l3P1p74Q20m48j057K01N37l75m87J78J87J72O66
$$ 128 44 -1152 -691 -496 -466 139 744 711 782 8 828 380 -677 -476 61 -314 -801 -623 -436 -264 402
3008D02J47n02M35M55l38j696P60O69m95o31M12J532j304Q59Q14j180o24J326
$$ 402 549 47 482 937 599 -1097 -337 332 -163 -794 -382 1150 -154 705 1519 339 -285 1041
3026A041p83j649O02J069j441n9J319J292k311K508r96p90N77M58j442j529K110
$$ 1041 258 -1391 -789 280 -1161 -1220 99 1391 -920 1588 592 -198 379 837 -605 -2134 -24
3043b4m86o05J266J316k259M5K637k074j075J942k48j174n96J728j146k87K290
$$ -24 -510 -1115 151 1467 -792 -747 1890 -184 -1259 683 435 -739 -1335 393 -753 -1040 1250
3060A250L20j495J189J095k632M5N64j196j270J871P58j402J345Q70j163p08J485
$$ 1250 1570 75 1264 2359 -273 -228 336 -860 -2130 -259 499 -903 442 1312 149 -559 926
3077I26j076p71J744o96j509M07Q19n55R07L85R96j874J80K91l13l87N06q27j75
$$ 926 -150 -921 823 127 -1382 -975 -156 -711 196 581 1577 -297 -117 174 -139 -526 -20 -847 -1022
3096a022J047N13j173P99J424q46j49n42L21m12n57l62M02o08P22J97K71m01J634
$$ -1022 25 538 -635 164 1588 742 593 51 372 -40 -597 -959 -557 -1165 -443 -246 25 -376 1258
3115A258q04n72j62P09m89j186M95M96l83O78L09k00o45J260K3j333L21O75o30
$$ 1258 454 -118 -280 429 -60 -1246 -751 -255 -638 40 349 149 -496 764 787 -546 -225 450 -180
3134a80j276K142r97j009J859L07O41o86O4p63j499Q33O20j885R15J189l83J55
$$ -180 -1456 686 -311 -1320 539 846 1487 801 865 102 -1397 -564 56 -1829 -914 275 -108 47
3152D7R49N87j669M52O75j363l62J322r71k203K083J868k336N45K207j242o26
$$ 47 996 1583 -86 366 1041 -322 -684 638 -333 -2536 -453 1415 -921 -376 1831 589 -37
3169c7J130n60j417O85N82j279o75J631P15r34J020q8o57N86J41j081j265Q21
$$ -37 1093 533 -884 -199 383 -896 -1571 60 775 -159 861 773 116 702 843 -238 -1503 -682
3187f82N13p40J5J548r97J81Q48O00j467M88L73j353m38K88P84j506J521N21k27
$$ -682 -169 -909 -894 654 -343 -162 686 1286 -181 307 680 -673 -1111 -823 -39 -1545 -24 497 270
3206B70M09Q7L40j574j32p2K9k94N03m88Q36L2M42l22J35O25J28j274K0O89p96
$$ 270 679 766 1106 -468 -600 -672 -643 -937 -434 -922 -86 -54 388 66 201 826 954 -320 -300 389 -407
3227d07k08O65j58M93k12Q17q30j58Q69p47q73m2Q07o66j34Q64P43j046Q98J016
$$ -407 -615 50 -108 385 173 990 160 2 871 124 -749 -791 16 -650 -784 80 823 -223 675 1691
3247A691j843m3J562j470j326J016L50j598P28J427j93l69J575q93q60M33J9q47
$$ 1691 -152 -195 1367 -103 -1429 -413 -63 -1661 -933 494 301 -68 1507 614 -246 187 206 -641
3265f41p93J798j309n21J761J49r33N73J512j271q54R19m28j249P93L22j126Q99
$$ -641 -1434 364 -945 -1466 295 444 -489 84 1596 325 -529 390 -38 -1287 -494 -172 -1298 -399
3283c99J802j098m57J527n89n52o75J088j585N07m8L70p54J251oo38L34P69l42
$$ -399 1403 305 -152 1375 786 234 -441 647 -938 -431 -479 -109 -863 388 382 -256 78 847 505
3302E05o62K53n1m01r35P74M13k05J145P0o06j29M90q67j063J282k13p66k07R70
$$ 505 -157 96 45 -356 -1291 -517 -104 -309 836 906 300 171 661 -206 -1269 13 -200 -966 -1173 -203
3322b03O80L92l22N06n30nL30j031o69N09l51Q0k85J198L90k65M87j60J20m65
$$ -203 477 869 547 1053 523 518 848 -183 -852 -343 -694 -614 -899 299 689 424 911 751 871 406
3342D06j88o59k90q1J291j622O77P01k70j1N64M90j582M17L99q26r67J025M87
$$ 406 218 -441 -731 -812 479 -1143 -466 235 -35 -46 518 1008 -574 -157 242 -584 -1551 -526 -39
3361c9o26M71O87q48L49J039o95r79J189p95q31J85J233r17k15J878k60j526J163
$$ -39 -665 -194 493 -355 -6 1033 338 -641 548 -247 -1078 -893 340 -577 -792 1086 826 -700 463
3380D63Q63j366n51J59L8l70M09J085j838R09J175p25n36J305j28j409m73J031
$$ 463 1326 -40 -591 -432 -394 -764 -355 730 -1108 -199 976 251 -285 1020 892 -517 -990 41
3398D1o01m56K135p42m51J055J3q31K40M56p61r09J085l08j355O52J444n96O68
$$ 41 -560 -1016 1119 377 -74 981 994 163 403 859 98 -811 274 -34 -1389 -737 707 111 779
3417G79l6j33j5k45K1j147k93j65P16P48l08N34o99P18k7m31Q43j089o71J031
$$ 779 743 610 595 350 371 -776 -1069 -1234 -518 230 -78 456 -243 475 448 17 860 -229 -900 131
3437A31r67m9Q67q09Q68O08j93J04K9R1p99p30J58K38m42O85O27q00N80M21m69
$$ 131 -836 -885 -18 -827 41 649 456 560 589 680 -119 -849 -691 -453 -895 -210 417 -383 197 618 149
3458A49K3Q91p19m72M51J50j344l4R71N06j115J679r2q99R9P01j649p5J65M29
$$ 149 172 1063 344 -128 323 473 -871 -905 66 572 -543 1136 1044 145 244 945 -704 -779 -614 -185
3478a85j208J253J083n47r05J865j61j678M78M02p64m6J014j779l76K255k33n13
$$ -185 -1393 -140 943 396 -509 1356 1195 -483 -5 397 -367 -413 601 -1178 -1554 701 468 -45
3496d5J55J447q89r58J075o66j398Q20P07j061R15J198j009k95J450p13l54j91
$$ -45 110 1557 668 -290 785 119 -1279 -459 248 -813 102 1300 291 -4 1446 733 379 188
3514A88k99m84j064J508j83p5L94P93m49l51J199o54n01o3j24q62O22J85mM2R38
$$ 188 -111 -595 -1659 -151 -334 -409 -15 778 329 -22 1177 523 22 -41 -165 -1027 -405 -220 -224 -182 756
3535G56m25k41R46o06J58p36r54M02N7K96Q9K01Q4M64j3K61n0o95k87j072R51
$$ 756 331 90 1036 430 588 -148 -1102 -700 -643 -347 -258 -57 27 491 478 739 689 -6 -293 -1365 -414
3556d14j55j21M14K23K66m64J429n67j83j00M57m66r59QP03O5q13J257n23p92
$$ -414 -569 -690 -276 -53 213 -251 1178 611 428 328 785 319 -640 -632 71 136 -677 580 57 -735
3576g35J632j36j469M90J137j758P6J331n54j169J880J057j702j30J002n95o21
$$ -735 897 761 -708 -218 919 -839 -763 568 14 -1155 725 1782 80 -50 952 357 -264
3593b64J56J58k56j88%o17Q37J236q6j006J377n38j250L06N13j415L22M18M93
$$ -264 -108 50 -206 -394 -394 -1011 -174 1062 976 -30 1347 809 -441 -135 378 -1037 -715 -297 196
3612A96j592Q09J878p10MR24j415q65N43J005k577J252O31r46k31Q15Q34j17L55
$$ 196 -1396 -587 1291 581 585 1509 94 -771 -228 777 -1800 -548 83 -863 -1094 -279 555 438 793
3631G93r2j097j27K16m22k4O96N88p46J49N14M53j18K81q58j48k16L29r43M38
$$ 793 701 -396 -523 -307 -729 -753 -57 531 -215 -66 448 901 783 1064 206 58 -158 171 -772 -334
3651c34N5M18J46R9J54J87j227P48n83L97j309J170N97q94O62l17N08q64Q26L18
$$ -334 -279 139 285 384 538 725 -502 246 -337 60 -1249 -79 518 -376 286 -31 477 -387 439 757
3671G57o52q14P92P4l0l46L9O07OO78p50J08K00l90o91k34P2j13N01J097j982
$$ 757 105 -709 83 157 127 -219 -180 427 433 1111 361 469 669 279 -412 -646 -574 -687 -186 911 -1071
3692a071J036J103M0p54k82J263j500n00Q65m28k83Q61K72o50L47N00M81j814
$$ -1071 -35 1068 1108 354 72 1335 -165 -665 200 -228 -511 350 622 -28 319 819 1300 -514
3710e14J145K96j677K43J113p85q82J055j33L92R49k18m31m19K64l63n06O15M89
$$ -514 631 927 -750 -507 606 -179 -1061 -6 -139 253 1202 984 553 134 398 35 -471 144 633
3729F33j739N63Q15m15J63J217q26m54m63Q78q16j29P56k11k25J05O49r63O36
$$ 633 -1106 -543 272 -143 20 1237 411 -43 -506 372 -444 -573 183 -28 -253 -148 501 -462 174
3748A74P34k27o75j3J40k47k49M7J7m73J289n84J17J77Q59r04m20l79N59l6j84
$$ 174 908 681 6 -7 133 -114 -363 -316 -299 -772 517 -67 50 227 1086 182 -238 -617 -58 -94 -278
3769b78P89j94j02o64Q02j65k4M33M33j396L03q97O61n15Q02K96n68K2O81r89
$$ -278 511 317 215 -449 353 188 164 597 1030 -366 -63 -960 -299 -814 -12 284 -284 -262 419 -570
3789e70j81J147l89p96O39L06l75o64J324k73k3O82l16q89K9R87r89o63K001p52
$$ -570 -751 396 7 -789 -150 156 -219 -883 441 168 145 827 511 -378 -349 638 -351 -1014 987 235
3809B35j259J369Q29k200J217M39k75q47N99J84j537P21J380j245Q8N92q9J04
$$ 235 -1024 345 1174 -1026 191 630 355 -492 107 291 -1246 -525 855 -390 -302 290 201 305
3827C05N01L84j275K40K44p70m49J147p29J81L15J39l78l36N95q5o23J060o85
$$ 305 806 1190 -85 155 399 -371 -820 327 -402 -221 94 233 -145 -481 114 29 -594 466 -219
3846b19m13O21n7J44n41J054r0l29P07q31k23J89m82N11j076P18L66n09R30j71
$$ -219 -632 -11 -68 76 -465 589 499 170 877 46 -177 12 -470 41 -1035 -317 49 -460 470 299
3866B99j47o45N37K05n6l29l70n4m06O89l20J285m06L14n35J156j429L07J01r3
$$ 299 152 -493 44 249 193 -136 -506 -560 -966 -277 -597 688 282 596 61 1217 -212 95 196 103
3886A03m82o1k76L63J349R4q10m24P85r3j088O54n88k69PM73O54m89P64j80r73
$$ 103 -379 -440 -716 -353 996 1090 280 -144 641 548 -540 114 -474 -743 -736 -263 391 -98 666 486 -487
3907d87J153J51j618J223k36n39L10J59lq46P96N17l89K65J059j505o82Q06l6
$$ -487 666 817 -801 422 186 -353 -43 116 113 -733 63 580 191 456 1515 10 -672 134 98
3926I8n24k97J282j177L13Q48k25q10J246R7k084J224O44p08o20Q10O79j514J280
$$ 98 -426 -723 559 -618 -305 543 318 -492 754 851 -1233 -9 635 -73 -693 117 796 -718 562
3945E62L19q08l12Q86n20r92P23q68M56R34n26k65l61J359r0r77K77J036j782
$$ 562 881 73 -239 647 127 -865 -142 -1010 -554 380 -146 -411 -772 587 497 -480 -203 833 -949
3964i49M11M98k39Q4M22oL48o21J46k65L64J75r17K8m51Q34k97p7K52M39Ml50
$$ -949 -538 -40 -279 -195 227 221 569 -52 94 -171 193 368 -549 -521 -972 -138 -435 -512 -260 179 183 -167
3986a67O41K64m58p58L43K79l09o83o9R57J70J9J27p71P00L75j359K63J34K64
$$ -167 474 738 280 -478 -135 144 -165 -848 -917 40 210 229 356 -415 285 660 -699 -436 -302 -38
4006c8j6l34M03n88n3J492k66j078J240o75n14N72j97m12L96M43l23L04Q18j054
$$ -38 -54 -388 15 -573 -626 866 600 -478 762 87 -427 145 -52 -464 -68 375 52 356 1174 120
4026A20j152J623J04l82j983J862m59k19J90R9K93O04M44j399k96J029j57n90
$$ 120 -1032 591 695 313 -1670 192 -267 -486 -296 -197 96 700 1144 -255 -551 478 321 -269
4044b69N96J91r32L91O05l72j81N40j26j252R49P9J50r60P88n50k62O88J183j976
$$ -269 327 518 -414 -23 582 210 29 569 443 -809 140 219 369 -591 197 -353 -615 73 1256 -720
4064g20N25Q63j057m85J160J61j486N77L68l5k01J32L65l95J49P95j279N82Rl72
$$ -720 -195 668 -389 -874 286 447 -1039 -462 -94 -129 -330 -198 167 -228 -79 716 -563 19 28 -344
4084c44j73O70k18k95O29l94J022m87O18o44l59m38L22o85P82Lp98R58l87k01
$$ -344 -517 153 -65 -360 269 -125 897 410 1028 384 25 -413 -91 -776 6 9 -789 169 -218 -419
4104d19O75k70N47o66L72n53L79p4o34L07J69mL53m08R46j50p15O16r21l14J104
$$ -419 256 -14 533 -133 239 -314 65 -9 -643 -336 -167 -171 182 -226 720 570 -145 471 -450 -764 340
4125C40p55M53m63P24l39n07J301n69q27J052J51j059l22M66L56l98K59Q07j040
$$ 340 -415 38 -425 299 -40 -547 754 185 -642 410 561 -498 -820 -354 2 -396 -137 670 -370
4144c70J53Q22L8j077K37J66l89O83N09o94k20J113j025k55K86K81j346N89J208
$$ -370 -217 605 643 -434 -197 -31 -420 263 772 78 -142 971 -54 -309 -23 258 -1088 -499 709
4163G09j421N97P64p13K76o6k4q6o0P20J39o76q6k24k75k1L94L68L85n77J2n06
$$ 709 -712 -115 649 -64 212 146 122 36 -24 696 835 159 73 -151 -426 -447 -53 315 700 123 135 -371
4185c71l5O60o24L50j94M78p59M85J80k56N78M37j243J135j020l8J90R0p1m15
$$ -371 -406 254 -370 -20 -214 264 -495 -10 170 -86 492 929 -314 821 -199 -237 -47 43 -28 -443
4205d43L49J17J93J20l8j19n5K45n25k34L45K36p34J232pj598O77J016j127M25
$$ -443 -94 23 216 336 298 179 124 369 -156 -390 -45 191 -543 689 682 -916 -239 777 -350 75
4225G5L94q70l4L4O20q16L50N31l16J06N51p48o04J564q33j96L95m18m52J7J371
$$ 75 469 -401 -435 -401 219 -597 -247 284 -32 74 625 -123 -727 837 4 -192 203 -215 -667 -650 721
4246G21j299Q8Q44j9r41R81j23j309O15J415l71j631J351m15J98RM0o72M59k6
$$ 721 -578 -490 354 335 -606 375 252 -1057 -442 973 602 -1029 322 -93 105 114 154 -518 -59 -85
4266h5M50j289P51O36r79K89L78J68l39K75K19o22m69J192o33q08J273r35J59
$$ -85 365 -924 -173 463 -516 -227 151 319 -20 255 474 -148 -617 575 -58 -866 407 -528 -369
4285c69K50N18o06R69o31K3j75P14n60l78L92O25p03J42N18o92J53M33j174N70
$$ -369 -119 399 -207 762 131 154 -21 693 133 -245 147 772 69 211 729 37 190 623 -551 19
4305A9j30K11K36p4q7l26L3k47J300j627R90j47n78J8J286j916J710p01L63j38
$$ 19 -111 100 336 262 175 -151 -118 -365 935 -692 298 151 -427 -409 877 -1039 671 -30 333 195
4325A95L95n84l97O11o99R29j56K13j009P8O32k59nL06M39q53j90P49j24o78M27
$$ 195 590 6 -391 220 -479 450 294 507 -502 -424 208 -51 -56 250 689 -164 -354 395 271 -407 20
$$ [...]
8191b17
##END NTUPLES=NMR FID
##END=
