##TITLE=1H_UK_23_6-3
 CD2Cl2
 108 sc, 
 24.10.2022
##JCAMPDX= 6.0         $$ Bruker NMR JCAMP-DX V2.0
##DATA TYPE= NMR FID
##DATA CLASS= NTUPLES
##ORIGIN= UXNMR, Bruker Analytische Messtechnik GmbH
##OWNER= root
$$ XWIN-NMR		Version 3.5
$$ Mon Oct 24 14:59:58 2022 Russian Standard Time (UT+4h)  she@DPX200
##.OBSERVE FREQUENCY= 200.1313499994
##.OBSERVE NUCLEUS= ^1H
##.DELAY= (6, 6)
##.ACQUISITION MODE= SIMULTANEOUS
##.ACQUISITION SCHEME= undefined
##.AVERAGES= 108
##.DIGITISER RES= 18
##SPECTROMETER/DATA SYSTEM= spect
##.PULSE SEQUENCE= zg30
##.SOLVENT NAME= CD2Cl2
##.SHIFT REFERENCE= (INTERNAL, CD2Cl2, 0, 15.7039)
##AUDIT TRAIL= $$ (NUMBER, WHEN, WHO, WHERE, WHAT)
$$ ##TITLE= Audit trail, XWIN-NMR		Version 3.5
$$ ##JCAMPDX= 5.01
$$ ##ORIGIN= Bruker BioSpin GmbH
$$ ##OWNER= she
$$ F:/spectra/data/she/nmr/H-F/1/audita.txt
$$ ##AUDIT TRAIL=  $$ (NUMBER, WHEN, WHO, WHERE, WHAT)
(   1,<2022-10-24 14:57:16.98 +0400>,<she>,<DPX200>,
      <continue with go, POWCHK disabled, PULCHK disabled
       configuration hash MD5:
       00 E9 B6 7A A2 85 ED C7 34 08 36 98 17 FE 4E 26
       data hash MD5: 16K
       4C 04 56 84 B3 9F 32 1C 43 EE C0 7E 48 8A F7 07>)
$$ ##END=
$$ 
$$ hash MD5
$$ 8B 10 D6 BE FF 47 42 1E 62 F6 C2 C6 75 09 B1 D7
##$RELAX= 
##$RELAX= 
##$RELAX= 
##$RELAX= 
##$RELAX= 
##$RELAX= 
$$ Bruker specific parameters
$$ --------------------------
##$DU= <F:/spectra>
##$EXPNO= 1
##$NAME= <H-F>
##$PROCNO= 1
##$TYPE= <nmr>
##$USER= <she>
##$AMP= (0..31)
100 100 100 100 100 100 100 100 100 100 100 100 100 100 100 100 100 100 
100 100 100 100 100 100 100 100 100 100 100 100 100 100 
##$AQSEQ= 0
##$AQ_mod= 1
##$AUNM= <au_zg>
##$AUTOPOS= <>
##$BF1= 200.13
##$BF2= 200.13
##$BF3= 200.13
##$BF4= 200.13
##$BF5= 200.13
##$BF6= 200.13
##$BF7= 200.13
##$BF8= 200.13
##$BYTORDA= 1
##$CFDGTYP= 0
##$CFRGTYP= 5
##$CHEMSTR= <none>
##$CNST= (0..31)
1 1 145 1 1 1 1 1 1 1 1 1 1 1 1 1 1 1 1 1 1 1 1 1 1 1 1 1 1 1 1 1 
##$CPDPRG= <>
##$CPDPRG1= <>
##$CPDPRG2= <>
##$CPDPRG3= <>
##$CPDPRG4= <mlev>
##$CPDPRG5= <mlev>
##$CPDPRG6= <mlev>
##$CPDPRG7= <mlev>
##$CPDPRG8= <mlev>
##$CPDPRGB= <>
##$CPDPRGT= <>
##$D= (0..31)
0 1.2 0 0 0 0 0 0 0 0.06 0 0.03 0 0 0 0 0.0002 0 0 0 0 0 0 0 0 0 0 0 0 
0 0 0 
##$DATE= 1666608634
##$DBL= (0..7)
120 120 120 120 120 120 120 120 
##$DBP= (0..7)
150 150 150 150 150 150 150 150 
##$DBP07= 0
##$DBPNAM0= <>
##$DBPNAM1= <>
##$DBPNAM2= <>
##$DBPNAM3= <>
##$DBPNAM4= <>
##$DBPNAM5= <>
##$DBPNAM6= <>
##$DBPNAM7= <>
##$DBPOAL= (0..7)
0.5 0.5 0.5 0.5 0.5 0.5 0.5 0.5 
##$DBPOFFS= (0..7)
0 0 0 0 0 0 0 0 
##$DE= 6
##$DECBNUC= <off>
##$DECIM= 32
##$DECNUC= <off>
##$DECSTAT= 4
##$DIGMOD= 1
##$DIGTYP= 9
##$DL= (0..7)
0 120 120 120 120 120 120 120 
##$DP= (0..7)
150 150 150 150 150 150 150 150 
##$DP07= 0
##$DPNAME0= <>
##$DPNAME1= <>
##$DPNAME2= <>
##$DPNAME3= <>
##$DPNAME4= <>
##$DPNAME5= <>
##$DPNAME6= <>
##$DPNAME7= <>
##$DPOAL= (0..7)
0.5 0.5 0.5 0.5 0.5 0.5 0.5 0.5 
##$DPOFFS= (0..7)
0 0 0 0 0 0 0 0 
##$DQDMODE= 0
##$DR= 18
##$DS= 0
$$ [...]
##$SUBNAM2= <"">
##$SUBNAM3= <"">
##$SUBNAM4= <"">
##$SUBNAM5= <"">
##$SUBNAM6= <"">
##$SUBNAM7= <"">
##$SUBNAM8= <"">
##$SUBNAM9= <"">
##$SW= 18.0517283424941
##$SWIBOX= (0..15)
0 0 2 0 0 0 0 0 0 0 0 0 0 0 0 0 
##$SW_h= 3612.71676300578
##$TD= 16384
##$TD0= 1
##$TE= 0
##$TE2= 300
##$TE3= 300
##$TEG= 300
##$TL= (0..7)
0 120 120 120 120 120 120 120 
##$TP= (0..7)
150 150 150 150 150 150 150 150 
##$TP07= 0
##$TPNAME0= <>
##$TPNAME1= <>
##$TPNAME2= <>
##$TPNAME3= <>
##$TPNAME4= <>
##$TPNAME5= <>
##$TPNAME6= <>
##$TPNAME7= <>
##$TPOAL= (0..7)
0.5 0.5 0.5 0.5 0.5 0.5 0.5 0.5 
##$TPOFFS= (0..7)
0 0 0 0 0 0 0 0 
##$TUNHIN= 0
##$TUNHOUT= 0
##$TUNXOUT= 0
##$USERA1= <user>
##$USERA2= <user>
##$USERA3= <user>
##$USERA4= <user>
##$USERA5= <user>
##$V9= 5
##$VALIST= <valist>
##$VCLIST= <CCCCCCCCCCCCCCC>
##$VD= 0
##$VDLIST= <DDDDDDDDDDDDDDD>
##$VPLIST= <PPPPPPPPPPPPPPP>
##$VTLIST= <TTTTTTTTTTTTTTT>
##$WBST= 1024
##$WBSW= 4
##$XGAIN= (0..3)
0 0 0 0 
##$XL= 0
##$YL= 0
##$YMAX_a= 1780045
##$YMIN_a= -1393810
##$ZGOPTNS= <>
##$ZL1= 120
##$ZL2= 120
##$ZL3= 120
##$ZL4= 120
##$ABSF1= 10
##$ABSF2= 0
##$ABSG= 5
##$ABSL= 3
##$ALPHA= 0
##$AQORDER= 0
##$ASSFAC= 0
##$ASSFACI= 0
##$ASSFACX= 0
##$ASSWID= 0
##$AUNMP= <proc_1d>
##$AZFE= 0.1
##$AZFW= 0.1
##$BCFW= 1
##$BC_mod= 2
##$BYTORDP= 1
##$COROFFS= 0
##$CY= 11.3945322036743
##$DATMOD= 1
##$DC= 2
##$DFILT= <>
##$DTYPP= 0
##$F1P= 2.36226072786647
##$F2P= -0.459571619588291
##$FCOR= 0.5
##$FTSIZE= 0
##$FT_mod= 4
##$GAMMA= 1
##$GB= 0.15
##$INTBC= 1
##$INTSCL= 1
##$ISEN= 128
##$LB= 0.24
##$LEV0= 0
##$LPBIN= 0
##$MAXI= 10000
##$MC2= 0
##$MEAN= 0
##$ME_mod= 0
##$MI= 1.114404
##$NCOEF= 0
##$NC_proc= 0
##$NLEV= 6
##$NOISF1= 3.799351
##$NOISF2= 2.8
##$NSP= 1
##$NTH_PI= 0
##$NZP= 0
##$OFFSET= 15.70392
##$PC= 1
##$PHC0= -18035.38
##$PHC1= 13.2007
##$PH_mod= 1
##$PKNL= yes
##$PPARMOD= 0
##$PSCAL= 0
##$PSIGN= 0
##$REVERSE= no
##$SF= 200.130013532006
##$SI= 16384
##$SIGF1= 3
##$SIGF2= 2
##$SINO= 400
##$SIOLD= 16384
##$SREGLST= <1H.CDCl3>
##$SSB= 0
##$STSI= 0
##$STSR= 0
##$SW_p= 3612.71676300578
##$SYMM= 0
##$S_DEV= 0
##$TDeff= 0
##$TDoff= 0
##$TI= <>
##$TILT= no
##$TM1= 0
##$TM2= 0
##$TOPLEV= 0
##$USERP1= <user>
##$USERP2= <user>
##$USERP3= <user>
##$USERP4= <user>
##$USERP5= <user>
##$WDW= 1
##$XDIM= 8192
##$YMAX_p= 0
##$YMIN_p= 0
$$ End of Bruker specific parameters
$$ ---------------------------------
##NTUPLES= NMR FID
##VAR_NAME=  TIME,          FID/REAL,        FID/IMAG
##SYMBOL=    X,             R,               I
##VAR_TYPE=  INDEPENDENT,   DEPENDENT,       DEPENDENT
##VAR_FORM=  AFFN,          ASDF,            ASDF
##VAR_DIM=   8192,          8192,            8192
##UNITS=     SECONDS,       ARBITRARY UNITS, ARBITRARY UNITS
##FACTOR=    0.0002768,     1,               1
##FIRST=     0,             0,               0
##LAST=      2.2672688,     0,               0
##MIN=       0,             -1393810,        0
##MAX=       2.2672688,     1780045,         0
$$ Real data points
##PAGE= N=1
##DATA TABLE= (X++(R..R)), XYDATA
$$ [...]
196 -339177 436746 80856 -436496 180910 372803 -312032 -162161 420562 -13174 -395301
206 -395301 148029 210048 -361183 -129182 374314 -12886 -256600 271508 264998 -270608
216 -270608 -35150 359863 -85331 -299969 199043 134105 -351703 -49818 326621 -98509
226 -98509 -230967 266822 140856 -342853 -40025 259615 -208325 -295469 216890 64157
236 64157 -356790 48671 351934 -126198 -130120 392749 122517 -326881 112307 306014
246 306014 -261404 -179404 349166 -7758 -372115 179257 294833 -283894 -83839 382028
256 382028 -107374 -401979 169178 138312 -412560 -70035 345540 -172829 -287836 335582
266 335582 190061 -304057 130543 401836 -215650 -239141 333883 40894 -374521 151914
276 151914 322012 -278880 -145139 382396 -12487 -333190 209667 213576 -386781 -150595
286 -150595 284804 -170643 -334224 257806 176626 -328674 35460 378660 -135952 -205302
296 -205302 334448 109195 -357379 57608 292535 -224013 -167640 352759 69358 -293110
306 -293110 157493 269522 -260374 -142561 279762 -89803 -362851 112715 147962 -309757
316 -309757 -64824 327252 -60801 -224683 253582 174635 -281636 -1509 291184 -148993
326 -148993 -232125 246248 104974 -273589 84850 312310 -137358 -138954 280584 28721
336 28721 -315042 57516 177469 -269811 -165536 237529 -46519 -273148 162888 216032
346 216032 -209137 -35607 295053 -68510 -252452 171655 137906 -254708 -8058 278625
356 278625 -85731 -175093 244100 137229 -221098 42310 225855 -179686 -214879 169699
366 169699 7733 -276842 49610 199175 -172545 -118575 249633 41157 -211470 114775
376 114775 185434 -207845 -117337 223105 -14591 -209648 151085 189239 -181826 -37284
386 -37284 261908 -39064 -207834 147743 99425 -276399 -65855 209414 -115018 -191697
396 -191697 214769 117866 -227377 52134 266400 -129548 -161942 230665 34636 -290537
406 -290537 59442 221309 -187872 -113428 283352 14798 -250672 144496 186616 -255867
416 -255867 -100251 236382 -115936 -278398 172977 134504 -254998 28726 307910 -92577
426 -92577 -157942 268818 95195 -268567 55314 221370 -201930 -156223 245078 10413
436 10413 -242804 136931 205022 -203630 -73675 236898 -82866 -255633 124466 96126
446 96126 -251183 -19552 238515 -81939 -137437 231724 119950 -180772 61814 204108
456 204108 -142491 -147953 161163 6758 -213520 54911 148901 -143034 -84618 177307 -4170
467 -4170 -179290 62745 95862 -177340 -90075 151309 -16861 -134801 125206 154807 -92049
478 -92049 5950 210668 10659 -123181 100775 86764 -170138 -61791 140273 -53397
488 -53397 -150425 104885 85607 -164885 -29305 154004 -85253 -171144 99694 42667 -208714
499 -208714 -4326 192664 -69830 -96396 218337 100370 -164289 82259 206508 -138535
509 -138535 -125222 182052 -22675 -243904 81214 152946 -194989 -66710 227051 -56137
519 -56137 -209316 148109 105507 -247451 -29474 212545 -120329 -164893 228541 106006
529 106006 -190459 107393 255103 -126276 -94218 237579 -3677 -247227 83016 128784
539 128784 -229980 -84853 204867 -74626 -200197 147573 92473 -221130 -10649 180328
549 180328 -131462 -161514 166409 51433 -178607 82205 202632 -85491 -48639 212023
559 212023 39616 -144868 81338 114101 -152074 -78362 130129 -41170 -151393 76654
569 76654 80482 -136791 -33868 131410 -47827 -130255 75332 53570 -139788 -18974 138064
580 138064 -21683 -74282 127783 98657 -86174 19957 142080 -37673 -104325 76591
590 76591 30891 -149986 -24242 111293 -66887 -107104 103549 44141 -146679 6411 123902
601 123902 -102227 -120421 116137 17476 -160965 59505 163624 -84839 -43866 198597
611 198597 31304 -136450 104904 130061 -153092 -58121 157269 -61948 -164521 120920
621 120920 90745 -169523 136 172816 -97097 -142321 142906 25359 -214875 21519
631 21519 144311 -142418 -92057 197884 22996 -157597 120065 153986 -145080 -35592
641 -35592 184711 -57290 -163259 121254 79476 -169842 13007 173253 -80697 -108535
651 -108535 147701 34259 -174014 25053 112679 -136051 -102259 130820 -113 -139798
661 -139798 76147 122798 -100940 -33346 149417 -11617 -119422 79615 74429 -122268 -18626
672 -18626 133544 -26650 -83553 106323 66702 -107547 -486 105296 -65734 -107946 63647
683 63647 14945 -131193 -6130 101779 -51602 -72438 99326 40900 -106277 20238 103315
694 103315 -71206 -77570 100047 21912 -108769 54093 125056 -63187 -35826 134696 9211
705 9211 -117094 55870 80431 -124457 -64032 104422 -38656 -127155 76683 79193 -115990
716 -115990 -18559 126986 -48845 -112223 94527 49497 -138859 4627 129693 -65640
726 -65640 -71777 146425 51562 -117522 59047 127678 -98558 -64576 129539 -19717 -147946
737 -147946 58659 82613 -125889 -34857 132361 -39683 -119972 84785 56322 -135439 -11764
748 -11764 115799 -69363 -96437 113261 51589 -109229 47162 136207 -65818 -60065 129523
759 129523 17967 -122922 45783 91267 -106332 -54461 117681 -13042 -111717 63369
769 63369 66723 -114342 -35614 98368 -49663 -110270 65532 44269 -108270 3277 121818
780 121818 -29406 -61177 108716 55487 -95050 25248 109646 -60845 -70579 94885 17839
791 17839 -107590 36119 93532 -75912 -53265 93435 -14522 -117826 34207 53716 -109937
802 -109937 -48430 90879 -27057 -90060 81024 77532 -79664 3536 118639 -26241 -73432
813 -73432 87894 48482 -100672 5896 100287 -50670 -62929 95489 27649 -103817 17849
824 17849 75043 -86606 -68607 76886 -16155 -114532 33295 71554 -76594 -24617 111934
835 111934 881 -78673 67707 72232 -77327 -12485 100101 -23561 -77654 72691 56556
846 56556 -82283 2544 91907 -48933 -82553 62529 13513 -114751 -3898 69713 -74883
857 -74883 -68013 89334 20136 -89280 41684 89535 -67385 -39902 102286 4217 -88796
868 -88796 56400 78066 -73782 -13922 114056 -7980 -79526 69766 50840 -103925 -19725
879 -19725 83262 -60178 -94550 68429 23814 -107138 15708 98311 -59048 -58475 94943
890 94943 12328 -100649 37265 80925 -77473 -38116 102068 99 -79084 69885 74852
901 74852 -78024 -13696 93223 -36951 -86130 61462 31210 -104279 -5828 83510 -50240
912 -50240 -62871 82459 25447 -90250 18542 74412 -60680 -47019 81561 4918 -80616
923 -80616 40779 70325 -54306 -16045 90413 -2597 -69126 46247 48347 -72486 -17729
934 -17729 70587 -27542 -70562 46989 37894 -70338 -8031 67455 -35640 -66670 47585
945 47585 22533 -75078 -1083 65208 -36720 -47309 67726 30734 -60393 23331 71956 -40643
957 -40643 -38778 72037 13714 -71347 26986 62205 -55226 -31954 78822 1066 -75364 34009
969 34009 47515 -78902 -35509 69416 -27802 -81600 46973 41593 -77421 -572 90676
980 90676 -27245 -57319 76759 33983 -81430 19136 82540 -53552 -49712 85526 14120
991 14120 -81604 39942 72610 -70049 -37437 77340 -20318 -89920 39108 39795 -89339
1002 -89339 -22168 77341 -31265 -62380 71915 40304 -74296 12623 81913 -39351 -45264
1013 -45264 77342 20455 -74280 27798 70562 -49147 -29584 74830 -1684 -74994 27875
1024 27875 40719 -70299 -30254 56909 -26614 -69746 37728 35260 -60574 -5333 66236 -21772
1036 -21772 -48577 53347 33370 -55432 8022 67059 -23789 -37756 60760 28632 -54323 11812
1048 11812 54320 -43492 -45000 46913 1303 -69291 9460 41107 -51340 -34392 55743 877
1060 877 -60195 26803 45297 -52197 -21290 66311 -2073 -54111 43344 51018 -47717 -3897
1072 -3897 75462 -10672 -53243 46191 29731 -69150 -6020 57759 -42713 -57208 50334 11080
1084 11080 -73260 13925 59749 -50421 -41168 63576 3117 -66957 33311 57474 -52035
1095 -52035 -18315 76256 -2118 -53823 53076 49001 -58628 -7332 67412 -27193 -57117 50128
1107 50128 21047 -74948 276 55528 -46223 -47988 56614 6613 -71605 18660 55114 -46710
1119 -46710 -27586 66082 1296 -56893 36457 52543 -43526 -10165 66082 -7214 -50087 41616
1131 41616 36631 -54019 -6265 55535 -28959 -55054 40127 17454 -65158 -2045 48064 -39995
1143 -39995 -45027 49206 13357 -57595 16296 51244 -35937 -25407 60246 11496 -46556 30584
1155 30584 48088 -38830 -14269 60006 -5412 -50902 30764 32348 -55913 -13925 52427 -23288
1167 -23288 -55871 33312 19879 -61848 -5662 50236 -30327 -43614 45435 17170 -51317 15542
1179 15542 56973 -26758 -23753 56660 13586 -45578 28323 46516 -39642 -21134 51811 -5375
1191 -5375 -52090 26881 33139 -51502 -19137 47385 -19102 -52673 29555 21653 -57167 -8918
1203 -8918 47489 -22584 -36759 46146 22545 -45821 13811 54543 -23375 -23482 53151 11191
1215 11191 -49837 18000 43994 -37299 -24924 47101 -3933 -55884 18301 34239 -46698 -22853
1227 -22853 45115 -14654 -53407 28935 29579 -47991 -5905 54393 -16451 -37766 48803 31229
1239 31229 -43421 12880 57600 -24748 -31226 51685 15078 -52887 12293 42109 -41955 -32534
1251 -32534 46023 -4256 -59691 16772 29336 -53890 -22866 46536 -15953 -51062 33696 29308
1263 29308 -48130 3059 59621 -15503 -33324 52355 25360 -44581 16888 54938 -26305 -26947
1275 -26947 49186 7604 -48546 17387 35482 -43621 -26717 36369 -13646 -51104 19989 24401
1287 24401 -44993 -12292 43350 -11721 -35179 34863 25570 -38461 1687 46303 -13381 -26934
1299 -26934 38846 20274 -36558 7070 40781 -19567 -24939 30560 2182 -46639 785 25513
1311 25513 -33984 -27621 31066 -934 -40198 14544 35094 -24833 -13473 42870 3612 -34524
1323 -34524 24975 37340 -26390 -7603 48400 -878 -32158 30780 29511 -37884 -8249 37129
1335 37129 -23874 -44222 25335 9943 -52159 -6001 35914 -30596 -35417 39648 9745 -48146
1347 -48146 12142 41368 -32272 -20873 52586 8880 -40081 30234 43003 -34086 -7095 53895
1359 53895 -8072 -43167 32127 22219 -51502 -3681 44350 -28411 -40213 37949 9507 -51385
1371 -51385 9186 39585 -35427 -27872 43639 2991 -42716 24761 39872 -31768 -8721 50219
1383 50219 -1806 -33478 31953 24669 -42249 -6497 38385 -22006 -35375 30466 10286 -44979
1395 -44979 975 33355 -25506 -28038 29365 2556 -39809 7705 31072 -21536 -13128 37798
1407 37798 8193 -24793 21722 33234 -17196 -5546 34513 -1598 -29702 17531 21029 -28559
1419 -28559 -11614 28599 -10220 -33797 15603 15220 -35411 -12402 23625 -15492 -33427 19182
1431 19182 16360 -31127 -676 34781 -8606 -19831 34192 20578 -28298 6952 36690 -18207
1443 -18207 -19749 36856 9891 -36387 12142 32456 -29852 -22601 34535 -5518 -46056 11526
1455 11526 22649 -39366 -15001 38428 -9967 -35558 29193 24569 -35100 3617 45048 -17064
1467 -17064 -26660 39652 15733 -36978 14449 41450 -25198 -21542 41338 3300 -43575 14519
1479 14519 24699 -42173 -22284 32350 -13639 -41192 23873 20517 -37485 -1326 40487 -14401
1491 -14401 -26311 34822 13653 -36051 10457 39503 -17857 -14109 41098 9659 -31279 16702
1503 16702 30014 -26862 -18332 27399 -10416 -38331 10626 16159 -32544 -10893 27475 -10764
1515 -10764 -28021 20232 15856 -28255 -2344 27709 -11357 -19175 28393 18643 -20196 9490
1527 9490 32872 -7670 -14722 26013 9244 -27324 488 17968 -20211 -19687 19725 1707 -29318
1540 -29318 3517 19129 -23212 -17045 22761 -2021 -29550 9549 21735 -19781 -5948 35250
1552 35250 4471 -20723 22310 27001 -21569 -3521 30635 -7875 -28606 18339 13533 -30478
1564 -30478 -2292 29137 -16182 -26496 22095 6803 -38261 -791 24781 -25387 -23811 31310
1576 31310 5796 -28940 19667 34523 -20160 -8237 40883 723 -29008 22256 21363 -33859
1588 -33859 -6568 35527 -12477 -26356 27046 12398 -37531 -427 28424 -26029 -27635 24846
1600 24846 -278 -39080 9520 29205 -21887 -9533 38156 3334 -27136 23327 26384 -26880
1612 -26880 -4947 31858 -10458 -24510 25297 16030 -30229 2311 28004 -19240 -23549 22315
1624 22315 1091 -34809 1085 18943 -23397 -15697 26744 4909 -22640 14863 22461 -16215
1636 -16215 -5311 26957 -261 -20768 14625 16526 -16860 -1072 26870 -2797 -17152 14417
1648 14417 10062 -23605 -7066 14413 -14007 -24661 8908 6882 -21852 -1642 22149 -6730
1660 -6730 -15638 17843 10865 -18934 1671 21053 -10032 -14284 21414 11138 -16396 10525 26477
1673 26477 -11504 -13108 22900 1297 -29634 3240 15452 -26793 -17792 22006 -1988 -25490
1685 -25490 15755 21025 -23661 -5749 30196 -7189 -25503 21622 14403 -26563 3887 33879
1697 33879 -9948 -15750 31515 10371 -30924 8373 24949 -27497 -21064 24627 -6662 -37379
1709 -37379 13156 20041 -29501 -8940 30082 -10510 -26670 22409 14194 -30684 1141 30181
1721 30181 -13361 -14084 34589 13757 -23216 16221 29315 -17139 -10416 26299 -3824 -30231
1733 -30231 11153 14864 -26773 -7893 24481 -10398 -24448 13112 5951 -27705 -5034 16264
1745 16264 -15134 -17251 18459 7401 -15836 11086 23564 -6662 -5161 20104 6331 -16107
1757 -16107 5847 14490 -12808 -10801 12789 1164 -14789 4737 11796 -12811 -12427 10708 -3549
1770 -3549 -19547 1343 8589 -15027 -7663 18653 5079 -10512 13928 19715 -9722 -3106 21756
1783 21756 977 -18914 9414 12973 -18785 -6332 20722 -3799 -20526 12611 8100 -25557
1795 -25557 -7809 16339 -16702 -24299 15186 3839 -27362 5535 26774 -13665 -10286 29263
1807 29263 6801 -22851 16362 24004 -18703 -7479 29797 -1526 -21481 22568 17420 -25469
1819 -25469 -1894 24802 -17156 -25093 17795 1317 -34641 1420 20050 -23256 -14170 27665
1831 27665 256 -26298 15504 20556 -21969 -5007 27696 -5666 -19099 21347 14611 -18514
1843 -18514 5586 25379 -11249 -15654 18266 1060 -26196 2284 13261 -21373 -14218 16940
1855 16940 -2464 -17977 10093 14435 -15465 -5022 17315 -1974 -13265 12000 11509 -12146
1867 -12146 1212 18415 1139 -5666 13718 9454 -11810 -1017 9665 -8281 -15238 3742
1879 3742 1049 -16115 -4623 10334 -5829 -12456 7489 5637 -14209 -2791 13291 -5159 -11267
1892 -11267 12508 9490 -10011 5845 20740 -1435 -7656 17280 7204 -16219 2779 15689
1904 15689 -13444 -12881 15055 267 -21906 6793 14159 -19560 -12431 18394 -5866 -22569 10938
1917 10938 12970 -21454 -2717 24860 -5204 -13215 23705 12575 -20308 5703 22998 -13912
1929 -13912 -13754 22553 454 -25858 8740 17217 -21735 -8828 21651 -8820 -25520 10684
1941 10684 8985 -25262 -2953 20011 -11171 -14946 21558 9616 -16474 10860 22784 -10830
1953 -10830 -7027 22246 1492 -18508 11679 14598 -16362 -4954 18878 -4963 -17017 11211
1965 11211 4663 -22087 -4707 11762 -11803 -15343 10035 2037 -14950 4612 15551 -5790
1977 -5790 -4483 15483 4815 -9821 6802 12873 -6420 -4404 13131 1994 -9382 4939 9370
1990 9370 -8628 -6950 7507 -2998 -14551 -575 3854 -11913 -7238 6951 -658 -10729 5728
2003 5728 9759 -6256 -3055 13586 1633 -9415 9446 12877 -7578 -2614 15671 1333 -10409
2016 -10409 10764 9556 -15552 -7025 11548 -8952 -18187 8576 2988 -20046 -1963 14856 -11114
2029 -11114 -11045 16485 3432 -17696 7181 16958 -12452 -5728 21956 2153 -14949 15401 17327
2042 17327 -14426 -1049 21373 -7288 -19015 13174 4147 -23492 -517 14246 -15548 -14152
2054 -14152 15943 348 -20227 6697 14298 -17841 -6736 19485 -2413 -15231 15207 13231
2066 13231 -12309 2780 23129 -2644 -9649 16309 5670 -17291 2502 12521 -12856 -11693
2078 -11693 10944 -1894 -17816 4543 8713 -13474 -7263 11264 -4690 -13731 8230 9137 -10161
2091 -10161 -444 13771 540 -4398 12299 9100 -7258 1399 9608 -3522 -6030 7197 2652
2104 2652 -10585 -2136 5385 -6261 -8815 3669 443 -10960 -3981 5338 -5180 -9162 6822
2117 6822 5544 -6810 1461 13061 210 -3924 11563 7903 -7749 1704 12282 -5101 -7018
2130 -7018 10583 2718 -12831 2361 9797 -10570 -9379 10435 -4055 -18622 2892 7654 -15639
2143 -15639 -6759 14998 -3235 -12745 14300 12303 -12355 1674 19540 -6956 -9757 16870 6419
2156 6419 -15077 6529 15541 -12434 -7306 17119 -1290 -19739 7497 8296 -18968 -7197 14970
2169 14970 -8249 -16179 11241 6357 -17603 3444 17213 -8567 -7985 16872 3529 -13721 10257
2182 10257 15064 -10418 -3101 17793 -1242 -13176 10685 7573 -15091 -3295 9318 -8797
2194 -8797 -13196 8704 1970 -14325 297 8530 -7734 -6309 10779 1039 -8842 5475 9676
2207 9676 -5454 64 12606 2678 -5697 6433 8878 -4386 -1562 7647 -955 -8915 484 2642
2221 2642 -8057 -5288 3991 -1770 -9214 63 3578 -5155 -4161 6546 539 -7336 3633 8758
2235 8758 -3515 -684 11470 3411 -6826 8085 10175 -6453 -2280 10988 -2161 -11213 4864
2248 4864 5204 -13338 -5037 8614 -8331 -11917 7061 4142 -13373 1624 11614 -7609 -7613 14302
2262 14302 3460 -12507 8115 13086 -9845 -3016 18262 -99 -12509 10995 9020 -13793
2274 -13793 91 13651 -9260 -13472 10045 55 -17851 2414 10709 -13637 -8163 13792 -1449
2287 -1449 -12829 9287 10679 -11367 -1237 16384 -2215 -7477 13048 8184 -11055 3057 13005
2300 13005 -6237 -6943 11131 247 -12817 3610 5417 -11478 -6134 7415 -4368 -11443 4602
2313 4602 4601 -8984 -1330 9718 -2424 -5509 8302 5815 -4478 3086 10192 136 -2803 6642
2327 6642 3743 -4436 -310 5452 -3832 -5458 3220 373 -7397 -2839 3338 -5577 -7034 1791 1305
2342 1305 -8151 -1830 5795 -2422 -4627 7402 5942 -4168 2454 10682 -346 -2258 9469 5165
2356 5165 -7290 1289 7381 -7081 -6077 7590 -667 -11317 1774 6552 -10124 -5914 7952
2369 7952 -3391 -12863 4708 5201 -10316 -838 13007 -2064 -7136 13347 8092 -7684 4672
2382 4672 13200 -5809 -7154 11621 398 -12634 4941 7871 -12311 -5447 11310 -4880 -12209
2395 -12209 6471 3693 -14748 -3075 9738 -6185 -7973 11573 4389 -9007 6671 12496 -4646
2408 -4646 -1185 12619 1011 -7721 7418 7610 -8754 -1774 10904 -3799 -8861 5979 2785
2421 2785 -11557 -2486 4956 -7532 -9126 4294 358 -8248 1861 6990 -4160 -2075 8405
2434 8405 1548 -4146 4925 6629 -4829 -799 7579 2277 -2778 3983 4589 -3391 -2621 3703 -1423
2449 -1423 -8141 -1658 285 -7145 -5532 2906 -687 -4800 1840 4887 -3425 -1437 5803 155 -4706
2464 -4706 3506 6141 -3966 164 9389 1401 -3576 7002 6252 -6001 -1750 6015 -6022 -10403
2478 -10403 3049 847 -10118 -1699 7410 -4808 -6470 6822 2901 -8509 4088 8117 -7547
2491 -7547 -2879 11413 1099 -6601 9065 9514 -6601 156 12123 -1978 -8149 7380 2472
2504 2472 -12990 -1035 6799 -8722 -8973 7623 -558 -11653 4341 6772 -9199 -3772 9252
2517 9252 -1942 -7803 7948 7655 -5759 3724 13118 -1334 -4710 10277 4589 -8527 822 6514
2531 6514 -7508 -5419 6262 -793 -7898 3798 4106 -7652 -3596 4024 -4003 -8612 2264 1535
2545 1535 -6380 519 7918 299 -1255 7891 5345 -1803 2830 6225 -2612 -3076 3095 289 -5102
2560 -5102 -265 3769 -2904 -3568 2626 -1694 -6105 -3046 2063 -5237 -5592 1301 709 -4014 1955 6442
2576 6442 660 -347 7320 3813 -3109 1686 6067 -2441 -4956 4801 1330 -5534 2344 5689 -5146
2591 -5146 -4631 4525 -2465 -9950 293 1112 -9365 -4280 6617 -2319 -5436 8218 6173 -5942
2605 -5942 1457 9902 -2753 -4947 8546 2682 -6996 4265 9156 -3921 -2681 9334 -459 -8370
2619 -8370 3079 2826 -11012 -4586 5422 -6299 -9328 6003 3685 -8264 1889 7877 -3722
2632 -3722 -3806 7947 1134 -7932 2895 6622 -4191 -10 10317 2038 -4016 6096 4135 -7282
2646 -7282 -1965 4362 -6550 -9238 1655 -192 -7619 590 5565 -3093 -3312 5674 773 -4701 1663
2661 1663 3239 -4796 -1074 5143 1804 -1458 6341 6853 -1551 1113 5119 51 -5418 112 455
2676 455 -6826 -3772 1561 -1714 -3681 1951 2265 -3281 -636 3459 -1478 -3956 1764 1030 -4082 -588
2692 -588 6770 3195 82 6526 5419 -2250 613 4206 -2065 -5784 2085 -40 -7129 -842 4766
2707 4766 -3237 -3778 3311 962 -7576 -649 3294 -6551 -5220 4400 51 -5658 6012 8524 -2134
2722 -2134 2118 10068 -166 -5105 6220 2378 -8211 -1234 5518 -3703 -4746 6783 3074 -6260
2736 -6260 1259 4221 -7816 -6532 3339 -4162 -8914 2110 3221 -5262 1329 10824 1177 -2285
2750 -2285 7860 4473 -5272 1058 4900 -4597 -4108 4974 1492 -3865 3305 5192 -3194 -2092 2693
2765 2693 -3060 -8262 -307 -946 -7769 -2529 5756 91 -1209 6082 5168 -1785 1333 4930 -853
2780 -853 -2605 3001 1816 -3785 2026 4964 583 -529 3632 1264 -4980 -1805 -240 -5936 -5889 -1228
2796 -1228 -1827 -3925 39 4311 -260 -535 4815 1599 -2634 2028 3201 -2770 -1360 4285 2077
2811 2077 -1576 4465 6451 -855 -260 4013 -994 -6063 -352 -761 -7685 -4452 3119 -2928 -4406
2826 -4406 5209 3636 -3240 1163 5426 -3654 -4811 3494 1761 -5559 2722 6246 -44 1423 8406
2841 8406 2516 -3906 2580 2955 -7764 -4485 2192 -5095 -7660 1633 2348 -5778 1067 5947 -3106
2856 -3106 -4061 4198 478 -6110 -501 4221 -4404 -1659 7292 3478 -280 7129 5806 -2260 -590
2871 -590 4788 -2654 -6454 943 -220 -6687 -1224 4127 -1984 -3281 3395 536 -6277 -1374 1131
2886 1131 -4405 -4036 2999 1094 -1710 4684 6873 1035 1504 5563 1890 -3812 693 1053 -4895 -2287
2902 -2287 2809 -1597 -2794 2335 2995 -2778 -1760 1766 -3559 -5619 -990 -1541 -4308 -1323 3814
2917 3814 1179 1434 6481 5536 997 2131 5296 -2574 -2430 1793 -366 -4372 -330 3628 -670 -310
2933 -310 4634 464 -4871 -1125 -9 -6648 -5118 1170 -2283 -5235 1893 4148 -269 1954 6598
2948 6598 1193 -1878 3231 2151 -4369 -786 4954 -1482 -2844 5160 3254 -2626 1389 4612 -3988
2963 -3988 -5803 1279 -3086 -7387 -1311 1709 -3844 -1087 5826 1446 -1502 5173 4126 -3408 -275
2978 -275 3278 -1994 -3272 4959 3011 -1026 2709 6881 -293 -1811 3081 -1427 -6835 -2069 -1019
2993 -1019 -6860 -4345 2478 -424 -3100 2987 4246 -1688 -342 3552 -2308 -3587 1953 1240 -3093
3008 -3093 1794 5953 2276 949 5625 3863 -1917 -124 646 -4605 -4968 -1458 -2797 -4615 -209
3023 -209 2117 -1295 -587 3299 412 -4428 438 656 -4398 -1849 2170 92 -856 4032 5246 862
3039 862 2326 5314 -139 -2091 544 -1151 -5428 -3388 686 -1619 -2754 2875 1997 -1924 -146
3054 -146 2453 -3303 -3906 -241 -1117 -4469 1501 4615 -66 1459 6974 4220 111 3423 2528 -3216
3070 -3216 -2017 1414 -1983 -4363 867 1634 -2638 -291 3333 -1862 -3950 1177 -1140 -6804 -2777
3085 -2777 1059 -4075 -2164 4464 3077 -324 4505 6953 919 44 2543 -1390 -5549 627 579 -2934
3101 -2934 469 4610 18 -1816 3522 1792 -4805 -2015 122 -5326 -5452 357 -848 -2539 1912
3116 1912 4786 916 1713 6106 1468 -2819 314 1470 -3418 -1893 2413 -161 -1359 3667 3358
3131 3358 -1596 612 2261 -2723 -5807 -1320 -2656 -6117 -2295 2466 -665 -830 3959 2956 -659
3146 -659 1587 2882 -1159 -2030 780 46 -1847 2339 4073 725 920 4586 1575 -2795 735 67
3162 67 -4658 -4569 -809 -3311 -4302 2 1246 -1180 643 3435 891 -1621 2249 1957 -3958 -868
3178 -868 1169 617 112 5495 4679 -928 1965 4544 -2035 -3876 -191 -2503 -6253 -1477 336 -3766
3194 -3766 -1072 3098 1526 -2152 2550 2140 -3478 -2068 764 -2619 -3630 2873 2090 -698 3902
3209 3902 6091 2104 -160 3642 1187 -3516 -1779 -55 -4843 -4570 1183 -68 -1990 1403 2718
3224 2718 -1242 -1451 2660 -2035 -4840 -611 185 -3634 -616 4739 1126 1488 5374 4493 -801 1430
3240 1430 3108 -2274 -3909 697 -1274 -3674 1169 1934 -1312 -1166 2484 -51 -3120 -13 -390 -5552
3256 -5552 -2639 1264 -1234 -2152 3690 4424 341 2357 4737 1259 -1034 432 461 -4978 -1802 1938
3272 1938 -928 -1838 3014 1616 -1302 499 1202 -2346 -3517 -2034 -3746 -5612 -291 1547 -522
3287 -522 767 3516 3405 327 2646 2518 -1656 -2225 637 -1519 -2855 1382 2062 259 1393 2856
3303 2856 687 -2380 444 -1647 -5978 -3697 -624 -3650 -4003 1632 1465 38 1936 5276 1384
3318 1384 129 2447 450 -3608 -135 1712 -1212 -315 4232 1837 -33 3087 3585 -2009 -2279 1108
3334 1108 -5363 -5716 -994 -338 -4369 754 3841 -895 -1036 3614 1995 -1928 -197 1957 -2342 -2133
3350 -2133 2984 459 -426 3926 4284 39 762 3504 -1096 -4681 -381 -1693 -5621 -2427 786 -1773
3366 -1773 -1490 4099 2399 -900 1183 2674 -1795 -2343 1223 -709 -1972 1742 3295 529 3182
3381 3182 5206 1868 -690 1594 -392 -2835 -2168 -762 -3538 -3020 -339 715 -659 237 2701 -770
3397 -770 -774 -104 -1314 -3460 -1017 -109 -375 -356 3167 2801 2156 2639 3237 321 -167 261 -1392 -3619 -2326
3416 -2326 -1177 -1415 -1447 1538 1921 -424 386 1540 -2887 -3578 27 -2425 -4240 554 1868 -984
3432 -984 1478 4537 3108 503 3737 2865 -2068 -492 828 -1744 -3217 550 1141 -2309 404 3802
3448 3802 33 -3450 585 -1456 -5243 -1910 -123 -4367 -1752 2505 911 90 4178 3998 -630
3463 -630 1108 3754 -1452 -2111 1134 190 -3405 526 3217 -1880 696 4108 799 -3226 -165 -1747
3479 -1747 -5578 -3733 -801 -2915 -2500 2886 1981 84 3106 4778 225 -558 2147 -370 -2649 -755
3495 -755 1230 -674 -439 3891 1492 -9 1742 1195 -1327 -1838 -1464 -3394 -4782 -688 -1913 -1141
3511 -1141 -51 1516 1025 516 1710 1535 -390 -1312 836 -857 -146 445 1639 612 2110 3758
3527 3758 1900 -30 209 -310 -3409 -3034 -1970 -2574 -3474 621 1079 -997 665 3293 -246 -1272
3543 -1272 1316 178 -2865 -1171 1192 -938 175 4665 2912 806 2376 4286 -935 -1350 965
3558 965 -1303 -4471 -1056 -1020 -3592 -654 2999 -314 -1728 1303 -125 -3462 -1337 1339 -3765 -3436
3574 -3436 2188 1262 -407 2670 4487 1083 2212 4237 316 -2310 824 -526 -4034 -1657 1876
3589 1876 -1511 -1709 2332 1018 -1234 773 1126 -3357 -2280 703 -1713 -2902 1071 1537 92 2215
3605 2215 3829 1040 1224 2851 838 -1828 143 379 -1816 -1451 986 714 -880 743 1780 -866
3621 -866 -645 149 -1564 -2842 -1609 -1819 -1794 -934 889 1323 2004 3247 2639 1502 -162 848 83 -822
3639 -822 -320 392 -224 243 2886 1758 14 -41 717 -2997 -2684 -1986 -2556 -3931 -2747 -120 -785 412
3657 412 2827 2856 166 2233 2090 -919 2 2122 -577 -2050 2004 1369 -344 1337 3359 -114
3673 -114 -918 1468 -345 -4000 -1496 -431 -4057 -3200 1424 -440 -1316 2434 2816 -472 -462 1986 -1398
3690 -1398 -2024 2046 -131 -2926 1975 2910 204 64 4698 1510 -2139 669 12 -3849 -2624 187
3706 187 -1894 -2006 454 1260 -1105 542 2577 -158 -328 903 -532 -1929 461 1617 -691 227
3722 227 3546 2429 897 2013 1623 -1250 -545 -740 -2504 -3153 -1046 -501 -2248 161 1132 244 101
3739 101 -210 -1331 -2233 -1172 -1071 -987 -771 1295 2114 600 1453 3490 2790 1675 1211 297 -1007 -1867
3757 -1867 -8 -1278 -866 -703 912 -1131 52 1394 5 -963 -309 -645 -2215 -2133 513 -1581 -1533
3774 -1533 2008 1772 1311 2346 2909 393 -920 1499 274 -3414 94 215 -1967 -1818 1656 761
3790 761 -2342 1457 377 -3059 -1817 331 -2077 -3114 590 300 -2012 1800 2071 -491 661 2679
3806 2679 898 -1267 1056 1079 -1676 -355 2117 816 -1898 3087 1839 -1940 551 773 -2151 -2223
3822 -2223 -436 -1984 -3552 -733 910 -1461 684 3091 1090 547 2575 137 -1084 344 1431
3837 1431 -798 -671 1897 -547 -323 2179 2044 471 -475 772 -1422 -2306 -1057 -1472 -1785 -755 514
3854 514 316 -506 1858 1620 1276 210 258 -167 5 -305 231 1046 355 113 1874 1644 1091 551 51
3873 51 -114 -1780 -1724 -2505 -1782 -135 -364 -982 2112 1461 -736 933 1963 -1051 -1110 578 81 -1624
3891 -1624 452 2372 44 1431 2738 1396 -1565 1465 1621 -2684 -2259 56 -2224 -2570 718 -526
3907 -526 -1463 148 1958 -1525 -354 1768 -641 -1997 565 0 -1710 1196 3450 334 -110 3168
3923 3168 593 -580 1477 1483 -2031 -1521 637 -893 -2248 894 1380 -1551 -21 1924 -1950 -1408
3939 -1408 540 -693 -3254 99 515 -1111 156 2849 421 1031 2881 1489 -71 596 1274 -1657
3955 -1657 -1358 521 -324 -1068 363 638 -526 -314 1198 -533 -1212 -772 -1241 -2161 -579 -531 -721 43
3973 43 2013 1325 566 2547 1528 1236 1419 -31 1118 359 -97 -75 492 309 14 1068 -244 -602
3991 -602 -453 11 -2439 -2173 -894 -1475 -944 307 390 888 863 2305 317 -154 1325 938 -780 -192
4009 -192 865 -1947 -70 3398 581 -1418 2058 736 -2717 -1490 897 -1799 -2316 -235 75 -3156
4025 -3156 -483 2162 23 21 3028 83 -948 589 1017 -1638 47 2223 -2 -1075 1737 1201
4041 1201 -913 1087 1020 -1605 -2077 621 -1536 -2616 -276 905 -2189 -398 2378 56 -428 1419
4057 1419 1977 -1120 612 1919 -619 -400 2287 1138 466 1622 1775 -378 1635 583 -1978 -1822
4073 -1822 -163 -1244 -2024 -1127 -579 -1022 337 1374 -1254 -1343 -353 -266 -1018 -1037 -159 -329 -119 381 1111
4092 1111 1881 1686 1438 1161 561 -16 -310 -114 -746 -1578 -274 -813 -365 567 -571 -1353 -927 -148 -978
4111 -978 -936 -67 -314 -1961 133 1102 -479 482 3277 1615 332 1957 1221 -681 -837 426 -1094
4128 -1094 -1475 904 664 -1600 -677 1683 -1008 -752 681 -1150 -2348 -414 -398 -1532 -76 1819
4144 1819 -199 315 1965 1260 -298 1758 1510 -1580 -427 1576 -83 -1841 1102 935 -2550 -626
4160 -626 1662 -281 -2265 474 -839 -2287 555 -120 -1854 -1145 806 -373 719 1154 1300 -900
4176 -900 651 1593 150 197 936 644 -269 -56 915 -136 922 542 -786 -2410 -876 -401 -1402 -1030
4194 -1030 -390 -1024 -346 -398 -35 327 1091 307 365 305 796 -444 951 79 311 1016 504 547 508 -271 555
4215 555 -263 1082 -630 -1372 -555 -1096 -1438 -411 296 -32 -49 -145 733 -524 1494 731 73 -294 1207
4234 1207 1259 -1146 1438 1468 -1017 378 1886 -371 -226 1139 -1438 -1337 656 -2 -2493 -581 802
4251 802 -1467 -1411 825 -109 -1792 546 1303 -1931 -463 2515 -557 -565 1719 2425 -400 -89 1903
4268 1903 -477 -1390 1767 -449 -1858 12 34 -2066 -972 1372 -968 -1013 164 -229 -1485 252
4284 252 293 -884 -988 1642 474 -1547 1683 1059 632 412 1354 -731 -316 354 664 -1204 -63 248
4302 248 -1180 499 462 -678 -504 -786 -1103 -136 -1359 -267 -100 -197 371 126 746 551 360 971 1240
4321 1240 -195 215 -213 312 -12 353 422 -482 321 -754 -475 -872 482 -502 -1116 -693 -64 -1121 -199
4340 -199 1207 -279 -116 1003 745 -231 1333 1282 -12 196 870 106 -782 246 927 -525 486 1413
4358 1413 -899 -692 119 -671 -2172 -453 1187 -1235 -1630 920 -1681 -709 266 564 -131 -174 1723
4375 1723 493 -458 1025 775 90 1348 2532 -528 509 827 -9 -539 923 -444 -1848 -623
4391 -623 -198 -1635 -1768 91 -837 -495 548 1 115 749 1619 54 -290 1389 107 116 728 2117
4409 2117 -458 818 679 170 424 604 -221 -98 -629 -784 -609 -1174 -225 -455 -1242 -1259 234 -377 869
4428 869 -473 7 370 -24 88 800 395 535 -228 1077 -516 -194 487 30 807 -2 170 -1304 -312
4447 -312 -473 -1237 -1389 -540 -371 -972 -138 558 -1040 -241 1008 448 -261 1481 1185 -332 650 1203 43
4466 43 703 937 -502 -522 409 702 -1044 -275 446 -952 -554 -363 -707 -1834 -85 834 -1157 -1260 550
4485 550 175 -575 707 983 -844 767 1435 -85 -43 1083 797 -1309 -538 1179 -1070 -930 873
4502 873 -806 -1449 185 -538 -2123 -107 -177 -425 -1532 45 -652 -1193 702 508 236 110 786 756
4520 756 72 1087 452 -287 569 511 -664 -1157 -184 -215 -1638 -100 89 -913 -1029 411 -389 -1194 -86
4539 -86 -364 -1011 -57 -172 189 458 448 643 717 100 485 11 317 644 95 35 -1307 -580 194 -123 -138
4560 -138 597 -1129 -1402 -114 -7 -987 -482 621 -602 -677 432 915 -242 302 1507 332 228 1683
4578 1683 1342 377 623 1341 -1073 -650 854 178 -1217 113 -21 -1101 -1635 26 -598 -1695 -430
4595 -430 333 -965 -340 659 -683 -80 502 1023 -803 389 379 -602 691 1291 226 -120 838 -42
4613 -42 -480 964 411 199 -749 774 -639 -1532 -521 -1036 -1129 -978 247 -99 -131 304 347 -632 1155
4632 1155 1442 -616 -281 1073 920 -427 715 -178 365 270 883 -56 -213 69 -563 -685 -829 -350 -1359
4651 -1359 -657 -226 -9 -73 704 -50 378 966 485 542 -187 485 191 296 -622 536 450 887 -1114 670
4671 670 251 -802 -682 -121 -550 -765 -1335 -1104 -895 -169 210 -414 -834 -19 -34 -555 517 255 109 -182
4691 -182 1069 -180 396 1795 1433 -38 -9 -60 -374 -1434 -211 116 -1212 -1033 -420 -791 -851 466
4709 466 -473 -959 -439 -345 -651 -758 1521 741 -1217 1646 1233 15 546 1405 570 247 1375 755 -1315
4728 -1315 -554 81 -503 -327 441 185 -534 -105 14 -1309 -634 8 24 -320 1034 -128 -89 155 293
4747 293 780 414 527 919 576 -475 824 -176 -61 -61 -594 31 222 720 -303 -598 -677 -109 -955 400
4767 400 3 -905 495 -461 495 395 758 -306 181 -101 -362 -206 475 -18 499 -709 -466 606 705
4786 705 -856 519 -65 -309 -773 -497 -377 -534 -168 758 420 463 362 -36 1182 1170 589 239 125 536
4806 536 -551 -501 113 624 420 678 1070 -1075 -689 -229 -1282 -275 -415 -89 -912 -396 180 -473 -824
4825 -824 334 29 -55 -14 716 650 -1463 848 -884 -13 1766 564 -468 -134 592 285 -477 610
4843 610 -316 -1622 -157 -182 -1231 -604 -767 -317 -520 -548 140 -31 28 106 -254 -170 406 1014 183 48 1073
4864 1073 946 720 740 517 -464 1066 198 -1190 -796 -1330 336 40 -47 -233 -1166 -163 345 115 127
4883 127 -432 -934 -24 -683 -32 788 401 1252 549 803 619 440 112 -541 -155 246 394 -30 -66 353
4903 353 -477 -946 479 -256 -215 -138 -61 -512 -306 175 -43 360 103 179 1131 1785 941 851 -32 -175 992
4924 992 362 465 -189 -117 296 948 333 -387 28 323 156 -1013 -518 -214 -1059 573 -389 -11 59 191
4944 191 -6 1387 554 26 959 665 724 505 642 196 71 -532 430 309 330 -176 3 -987 -182 -259 -416
4965 -416 -762 -1405 -79 -1166 770 127 12 -297 1507 -310 -26 133 268 26 570 758 344 499
4983 499 1145 192 346 477 83 -1063 -1035 -399 -754 -998 -579 -891 -597 529 168 -58 -245 -142 890
5002 890 808 -725 -317 727 763 372 840 207 954 51 483 -254 -646 472 216 -1002 -1453 -982 -707
5021 -707 -724 -797 32 465 289 208 -437 376 535 97 92 1050 -127 -112 743 595 -667 388 472 678 -644
5042 -644 -261 679 -606 -555 -780 -449 327 -323 192 -252 7 171 -598 -286 -277 -421 -153 517 410 144 48
5063 48 1301 1170 115 335 681 -20 492 286 548 16 -196 805 -51 -40 296 -565 -608 -47 -1037 -522
5083 -522 460 268 -498 -247 880 443 -325 454 577 267 416 1598 -547 -770 -620 63 658 586 -220
5102 -220 -828 -243 694 -1561 -982 89 -62 -428 -256 812 -844 -649 102 1143 704 443 202 358
5120 358 160 -640 230 -363 85 618 -744 127 164 -181 -69 90 720 -1053 -955 -693 145 -187 234 33
5140 33 -450 1143 -97 -175 115 626 -191 -341 133 -264 -437 394 753 -123 758 278 396 88 -677 259
5160 259 -1568 -854 -658 -549 272 266 193 913 19 266 -194 -315 94 -505 525 -275 -17 931 -232 108
5180 108 207 1021 604 -16 193 -912 -347 194 -1492 -1013 -1505 -197 -787 -887 52 228 -847 167 644
5199 644 714 463 145 -474 -433 736 815 486 818 666 602 528 187 252 -521 341 -320 -466 -254 -68 -762 -634
5221 -634 -1204 385 -472 -685 375 -322 -771 49 412 -144 -407 -293 500 584 706 1236 -90 251 -78
5240 -78 -1151 -64 -630 585 390 25 -1012 -121 -266 561 60 -587 -388 -413 -509 -394 329 96 982 63
5260 63 196 -456 529 711 556 72 -242 -226 -76 -226 -376 333 -65 -696 -403 -855 -159 -842 -251 84 702
5281 702 -1081 -347 -175 52 -57 -272 802 594 536 161 1640 -24 -211 1505 -521 -179 -57 -37 -107
5300 -107 -269 366 -599 -791 -188 -257 -1141 -452 -38 -741 243 3 -188 5 562 436 541 323 576 168
5320 168 -160 1012 865 -180 47 -108 -766 -318 319 430 -297 -1361 -645 -19 -1099 771 -425 -465
5338 -465 -432 684 -204 -297 -580 -148 -287 826 -330 -214 926 947 -115 337 -25 -67 1109 -294 448
5357 448 -248 -694 827 -939 -1382 -963 -507 -505 -153 -61 -163 300 -94 436 -671 623 -177 -175 -193 1168
5377 1168 305 150 522 587 890 -9 926 159 -230 -451 405 -1181 -776 -247 -189 -324 -691 -15 7 151
5397 151 636 -983 196 350 -177 1218 -22 1054 844 309 -909 32 440 9 110 383 30 139
5415 139 160 165 -199 -451 -238 -1579 173 357 -45 410 535 -121 -547 1175 556 86 137 943 -271 -13
5435 -13 1094 785 1296 160 221 -1060 -210 229 -1442 -691 -339 115 -2039 -148 -11 -808 -898 -553 289
5454 289 -703 443 654 1233 65 1219 462 -135 452 644 146 -105 388 311 225 -151 -49 -1118 631
5473 631 705 -1095 83 502 -364 -1180 -289 562 491 -191 -436 372 -225 449 44 -211 145 301 702 -16
5493 -16 389 -274 967 45 174 1492 -53 -61 -1391 -64 -332 -69 -599 366 -809 -198 264 -241 -377
5512 -377 -322 -44 184 308 296 1105 850 3 -104 846 1282 857 -625 -458 157 -203 -208 -303 -370 -105 49 202
5534 202 -963 -26 448 -790 -756 72 -382 -741 147 388 228 259 1277 735 -52 633 244 -241 886
5553 886 -417 131 -539 343 -108 -783 30 -449 -595 -336 86 -643 -768 -256 14 -441 851 1160 -849
5572 -849 -25 574 71 86 572 159 388 494 -236 -1 184 1330 -307 31 -312 -523 -305 -348 -388 -867
5592 -867 -359 398 82 -778 -141 588 3 643 -445 -701 599 315 -1076 34 416 349 359 -553 -55
5611 -55 402 -209 574 -101 -557 88 122 413 -111 -239 80 430 -39 -884 -295 39 331 -21 83 525 -202
5632 -202 1167 866 1175 179 649 -153 199 236 -11 -432 -519 -947 -274 636 -856 117 -1224 -18 -370
5651 -370 -365 -24 -90 -614 -391 -214 -859 -82 664 -302 419 734 776 -18 227 335 177 -840 259 95 -1273
5672 -1273 -218 203 -289 10 324 -126 -1430 -476 80 -120 -357 -302 -207 -276 -293 -1069 -378 303 547 207
5692 207 53 1252 277 -488 305 884 -160 313 -297 318 -216 -323 -207 -15 -797 498 11 191 -834
5711 -834 530 -296 68 1150 638 959 -12 -385 751 -186 421 661 292 524 -733 -18 320 -1 703
5730 703 347 -618 402 381 -790 -1027 -878 63 231 12 -18 -364 161 -733 -448 261 -327 -832 -30 206
5750 206 -433 301 -218 385 31 -569 -163 -151 -180 -382 -39 -51 -1078 27 -1051 -1162 167 511 636 -338
5770 -338 296 47 -35 219 -168 -618 -142 295 -444 298 519 173 -114 252 158 -23 -467 -566 -714 -253 787
5791 787 968 -567 191 5 -317 593 1225 167 550 84 379 -228 203 80 526 -422 775 702 102
5810 102 -159 1309 310 -52 -15 -101 -265 366 -296 -426 247 -600 152 -64 89 -176 -80 -79 -240 -303 413 232
5832 232 -122 126 -76 558 -67 108 171 410 -1063 525 -305 333 -916 -208 -820 -256 119 -703 -691 340
5852 340 -460 -140 -482 726 -726 640 711 849 1329 -265 819 771 467 -10 259 37 -508 -481 -531 -236
5872 -236 -544 -459 807 56 170 619 -717 -1006 -383 17 -620 -21 841 -745 429 343 50 792 547
5891 547 831 598 173 -472 -717 -924 -198 -656 -315 -13 438 -122 -116 311 -489 -846 -36 100 315 -741
5911 -741 -10 434 -291 -301 1139 64 202 661 -355 263 740 551 -454 475 129 -1108 717 -251
5929 -251 -515 467 78 -557 290 -226 -435 -108 216 -741 -280 -108 -332 510 1263 783 112 -869 335 -427
5949 -427 215 572 119 528 891 -157 1120 -713 303 -202 97 -224 -1062 -410 -57 -96 177 219 12
5968 12 402 17 156 -7 -923 -722 416 100 -3 511 880 274 1485 -63 573 -436 -291 543 -287
5987 -287 -926 -593 -730 -73 -81 142 -1385 579 377 -1260 219 266 -738 -110 60 647 536 658 108
6006 108 -849 516 -139 -286 4 47 -247 -490 -842 157 -203 -292 -130 259 -14 -19 569 306 1371 836 -740
6027 -740 165 205 267 -685 1160 359 528 804 -268 258 202 -821 -714 -532 851 -435 -150 301 1038
6046 1038 -491 416 -644 -340 -359 -220 -1005 -1469 -1014 -283 -518 247 1763 253 842 1357 331 1083
6064 1083 416 -431 416 184 13 -363 -459 125 153 -120 429 -186 -186 -155 385 -1263 -138 -400 -144 -705 1244
6085 1244 -256 189 -95 789 -507 877 208 -482 795 298 846 -564 473 446 804 -591 -47 -347
6103 -347 -100 -512 -267 -924 -593 336 -72 -561 -482 259 -24 239 459 -187 -349 236 -426 -570 722 1233
6123 1233 -572 -109 -573 -190 -598 130 -1305 -1661 -227 -187 -869 -568 -355 121 214 -421 -331 -1018 -547 770
6143 770 -55 262 -92 -920 685 1194 68 -252 1285 610 1193 -370 -218 -642 -872 24 -861 -1182 -100
6162 -100 -329 -596 -475 -27 178 -149 52 139 63 -705 379 -528 187 920 293 684 932 1437 -440 712
6182 712 -115 -357 -371 -426 -385 -640 168 -107 -288 390 -1 -665 -295 100 -334 237 891 1096 -299 353 421
6203 421 989 1097 418 1195 282 -191 -543 -143 442 -573 -374 111 -162 -443 185 1037 -89 -320 -1097
6222 -1097 -290 -1198 -531 82 212 461 -174 847 320 659 442 -295 372 -467 -624 -433 -16 -696 -163
6241 -163 157 -5 -97 367 767 -818 -314 -764 279 -2158 -318 -1117 -539 210 -123 414 287 779 -824
6260 -824 316 925 371 -718 -335 664 -947 34 18 334 114 -202 -558 392 -477 -842 -113 -762 -791 -120
6280 -120 -967 135 55 652 441 -185 67 116 607 -195 20 -224 284 -168 -132 -254 792 755 480 407 -217
6301 -217 141 -724 -1043 -1802 -557 347 -139 316 599 -239 -53 272 -160 -519 -586 234 799 -46 -509 -229
6321 -229 497 -770 -286 680 119 347 -251 -512 -730 -1193 -131 -919 -1031 -367 450 -10 47 734 -258 -131
6341 -131 -856 1136 -435 18 508 -148 194 623 828 -164 800 288 -371 -511 -605 -360 -969 -444 -184 -615
6361 -615 417 -321 -176 -542 66 -192 -1474 -398 -124 -452 -172 -271 162 18 754 1240 546 -1139 274
6380 274 -75 415 -78 -8 -435 -836 -179 16 -652 417 -10 -174 96 -87 -712 -288 269 -897 -597 275
6400 275 320 474 1932 -332 544 -335 -73 -599 94 -517 -21 405 409 -10 -218 810 -272 -397 -570 -324
6420 -324 -400 226 -686 74 -393 1406 455 281 -117 961 489 -333 -166 401 -499 -140 135 -109 667 59
6440 59 -238 87 727 -428 611 -493 -47 355 -854 350 -358 278 47 569 -329 114 654 311 1271
6459 1271 563 -527 -227 -216 704 -235 -193 783 -421 509 661 154 -599 -71 -772 -152 -1200 -488 -783
6478 -783 -364 -34 688 896 817 432 344 -197 174 200 -620 -1030 385 -95 -894 887 784 372 86 -878
6498 -878 -751 -98 -610 214 -1287 -21 221 -693 -28 -133 -216 284 735 -769 -1214 -279 -1626 -654 480
6517 480 1003 236 -321 284 216 514 590 410 -38 -216 -446 -1151 -1407 -167 314 -223 608 -628 373 503
6537 503 -50 -1156 -241 -199 96 -311 -74 -261 834 1073 622 1050 -434 -93 1329 134 -443 -587 876
6556 876 414 -203 -422 -6 -132 -807 -299 -223 -541 -816 -308 -838 -26 -436 243 434 210 64 1304 478
6576 478 -10 -70 -92 -388 -577 -605 -612 -62 -6 -685 547 -92 327 -927 -86 -255 -150 -280 -216 -454 6 1150
6598 1150 -277 53 1454 725 293 63 707 -661 -271 271 119 -756 -117 1049 -208 -152 388 -259
6616 -259 539 1056 537 385 255 -862 -560 1653 554 -146 -449 532 -594 -830 128 -74 151 74 118
6635 118 509 706 58 437 1042 1633 21 160 -656 -313 -1022 -475 -424 -35 -1089 -1791 414 -177 679
6654 679 543 401 828 99 -938 -1192 -228 188 961 152 -230 110 427 6 -176 36 -352 -517 -924 352
6674 352 -609 -767 -58 139 161 709 630 -435 -962 -514 -1236 -362 -85 279 7 -82 1138 -253 353 1038
6694 1038 582 -303 119 -35 -108 -1565 -341 -432 -51 545 241 -949 -269 671 562 -376 -34 472 -260
6713 -260 -281 -176 -140 243 904 782 327 444 560 590 710 -399 -726 291 285 201 287 354 711 -1166 -957 300
6735 300 -336 474 -361 -383 -47 -189 484 -546 -367 616 -40 728 1433 321 -341 -347 588 78 -701 -19
6755 -19 -335 198 203 -619 28 -18 -370 -498 -803 -1296 -143 -404 -789 61 350 -35 798 256 567 -586 -628
6776 -628 551 526 -595 79 -331 553 686 275 602 56 933 -450 -243 133 -426 -762 -644 -417 -471 353
6796 353 -183 610 974 -64 86 1500 -181 -160 240 48 -157 -173 643 247 97 1223 -170 -78 154
6815 154 -1580 -1362 -665 -1414 -627 -24 -167 138 -98 29 139 674 550 -24 -151 104 473 -54 913 377
6835 377 672 714 289 -668 -331 889 -767 -228 -622 -1126 -1186 443 218 664 253 -250 125 780 222 277
6855 277 -8 51 331 -520 234 256 465 -500 307 1133 124 161 569 464 -689 -278 705 -990 334 171
6875 171 386 -184 198 7 672 -345 -321 175 -164 -634 -243 -163 155 439 189 124 713 548 1018 775 -399
6896 -399 -835 450 -1114 -294 486 -340 -286 62 194 -188 266 -249 71 -539 61 -153 676 -400 -70
6915 -70 238 361 -126 779 -554 48 148 525 1 -573 -726 -34 -8 9 911 -369 -888 -267 197 164 -438
6936 -438 -1235 419 119 -973 253 648 679 839 215 963 -456 633 81 -432 -639 356 343 -334 -287
6955 -287 606 147 -1537 -343 319 -488 -800 -449 773 -564 -653 -52 -570 1027 -17 205 422 575
6973 575 -224 -151 473 -848 -226 798 -321 82 271 50 -428 193 101 -1235 442 -750 -1133 -579 192
6992 192 273 206 -304 -1112 720 644 592 -309 98 -373 965 -730 187 -312 235 -95 1084 -403 -1082 401
7012 401 -23 170 -805 -56 -857 -24 515 -548 -279 727 44 -147 807 -280 -114 474 750 -467 -76
7031 -76 -199 -49 -123 111 914 325 223 -486 -308 -419 715 -703 -282 -776 -108 28 264 -14 -378 448
7051 448 812 -144 -152 -538 -240 -526 170 1262 75 625 738 552 -494 913 77 -71 -564 -296 -50
7070 -50 -410 -367 -581 510 -255 164 -180 -446 -427 351 -426 -829 -36 -558 14 132 -668 252 526 348 -101
7091 -101 -421 57 244 25 -1396 -741 195 -871 -344 -309 -948 217 -670 -193 -204 -1394 -1516 111 -245
7110 -245 -771 1360 -357 831 128 298 524 23 -814 392 -42 -163 286 -424 350 672 188 -654 209
7129 209 1415 -111 -494 719 210 -513 -670 462 -577 -476 -59 416 -326 514 -304 -476 86 45 301
7148 301 -123 208 493 700 531 236 70 791 1294 -352 59 -602 -61 -891 -756 -594 -421 36 688 -681
7168 -681 93 486 465 -374 -998 271 -78 856 -97 606 -131 319 110 -947 876 346 -196 -1188 -959
7187 -959 -413 574 22 816 360 -357 -358 70 327 1032 -248 -793 -590 -323 399 -256 417 363 -78 585 353
7208 353 315 169 157 -137 -1392 -837 -394 -501 117 -270 415 92 -31 -150 123 -14 145 -721 -476 -8
7228 -8 251 462 -549 465 908 87 782 898 -159 397 -644 -213 113 80 0 -521 -378 57 404 -513
7248 -513 -202 263 -196 -132 -420 225 -551 204 -108 36 926 607 -141 215 84 518 -395 -115 -204 -554 -1498
7269 -1498 14 -291 -810 238 480 120 -575 209 134 165 -461 -43 369 -592 -346 577 -711 -506 832
7288 832 323 498 184 -246 584 1217 -585 250 -482 392 -255 253 -248 -657 -461 -39 134 -682 -54 269
7308 269 -741 -18 -58 228 201 -266 659 325 -334 -314 948 -261 123 -235 297 -193 -466 -456 80 -68
7328 -68 750 323 -532 -854 -342 -1178 -832 736 -324 -957 -34 223 163 221 -500 668 267 -556 100 -133
7348 -133 192 -388 38 -369 -477 -294 -257 148 -936 -627 -69 -636 -577 62 -179 -830 -713 167 152 136 -277
7369 -277 -17 -294 -249 281 -22 628 -232 -125 -905 188 271 -289 1310 -290 -116 315 492 -805 -41
7388 -41 -89 757 -239 -830 529 -148 56 43 -204 -598 -215 -1000 110 142 -125 -135 -295 -44 -244 -512 250
7409 250 -353 328 679 66 -387 -355 -27 -310 -201 48 129 -726 -61 -77 56 -577 -191 -624 -698 409 124
7430 124 796 301 -16 547 196 36 381 -99 48 -31 -83 457 -148 -242 -109 -838 -453 -6 449 -247 -120
7451 -120 -739 -202 -21 833 844 670 505 157 336 333 573 561 -422 -283 -678 -89 -415 171 -113 -301 -732
7472 -732 -61 -659 -365 -30 209 -203 173 -145 -1217 503 -86 386 34 51 -441 -673 1004 -510 -387
7491 -387 253 919 -613 -331 618 -399 -894 -13 63 349 -129 -170 -441 633 -495 -691 -43 -887 -474
7510 -474 876 363 122 338 323 789 217 586 -736 -461 1430 395 52 -14 -352 -552 -227 316 -467
7529 -467 -497 -553 -1113 -459 -325 -855 290 -433 323 -104 405 800 -43 -741 155 471 -804 -140 631 536
7549 536 856 -147 284 -417 414 645 -318 -535 -1564 -698 -342 -342 167 236 449 -235 341 800 -402 -446
7569 -446 503 -271 135 -265 -228 148 -140 188 -112 1007 -781 -699 -132 -957 -446 319 -425 -575 -769 -27
7589 -27 -61 765 319 -335 -818 -36 -505 67 234 -42 959 -581 724 -486 -480 -612 226 -191 -647 32
7609 32 -575 -531 534 203 -551 -533 -542 188 -309 -281 308 -726 -139 402 -43 -470 341 151 -28 799 -271
7630 -271 356 433 332 -506 428 101 177 -722 -25 454 364 66 269 -279 185 548 -320 219 67 423 -550
7651 -550 -321 396 -239 -87 -454 -52 453 206 418 346 -19 408 305 -1016 -813 -42 -318 -178 597 -321
7671 -321 -656 -409 -697 -683 -13 108 221 -355 205 184 258 -360 -378 32 -701 -41 475 305 375 402 -440 442
7693 442 -676 -827 393 -243 -122 515 -1095 -611 154 677 -866 230 643 762 -4 121 -426 159
7711 159 220 -132 603 -1149 633 413 991 -364 -171 -61 -510 155 -1234 176 363 -172 323 71 -108
7730 -108 686 418 -54 -1319 -973 622 26 -461 149 568 -120 154 1015 855 -346 636 -90 156 85
7749 85 815 452 -289 -29 -716 -558 54 -243 -276 192 -90 653 -928 8 535 -1202 -56 388 553 81
7769 81 -964 873 112 -860 120 -643 122 640 288 824 -270 72 -10 -311 -683 660 -529 250 266
7788 266 -935 182 -552 -652 50 371 -1011 37 198 -302 171 605 -107 -71 363 377 -106 -200 -186 1163
7808 1163 556 127 -323 414 -313 -661 -284 -377 -134 -497 -340 383 164 -553 640 -138 257 -529 208 158
7828 158 339 -92 23 373 -16 1107 31 458 -550 -636 275 146 125 -162 118 207 -502 -503 511 59
7848 59 341 -285 9 -464 343 -408 232 -130 -376 -234 -268 98 669 -527 311 461 114 -187 -353 -423 189
7869 189 170 -362 -594 708 -341 -518 -428 249 140 -19 -648 -59 -783 -64 650 737 -80 -176 514 -166 519
7890 519 -59 -228 -227 89 -189 96 83 1060 -210 255 -664 143 354 499 -656 -1204 -272 -369 -158 -255 793
7911 793 -45 6 273 805 184 238 -93 -159 239 748 -17 549 266 -299 494 129 -608 597 -1046 -66
7931 -66 -184 -639 87 -483 878 450 -40 203 294 301 238 -398 596 -661 642 159 -152 658 270 197 -227
7952 -227 356 -278 -255 -887 -313 -30 8 -87 -33 -536 205 -448 -319 -580 979 -359 58 451 128 315 854
7973 854 256 140 -271 232 95 145 289 -690 -865 -248 -317 25 -658 -622 239 -484 -494 -8 76 -439 -1263 605
7995 605 288 -771 698 -370 476 724 -132 339 -26 -147 -682 -282 212 -871 -499 -257 -112 -434 46
8014 46 115 -655 143 -156 167 -93 541 111 -233 -160 -829 552 538 -96 -31 496 16 83 367 10 18 164
8036 164 581 -249 173 -438 -285 -72 457 -444 -274 -153 -372 62 -1021 291 172 500 -202 -733 198
8055 198 154 382 -301 769 656 289 -482 282 0 430 -145 261 412 -844 352 -53 -554 125 241
8074 241 -77 -169 -568 -791 112 141 743 311 191 -468 653 -1068 34 -852 -489 -129 -617 275 235 749
8094 749 117 -161 -211 3 68 -400 -399 -101 -189 -271 -363 -1017 601 365 -324 668 385 -721 521 113 653
8115 653 60 271 -477 -193 352 -456 447 -488 876 -436 -213 66 -75 -299 -353 -17 -994 -552 -692 143
8135 143 315 325 108 -407 318 649 -413 287 -9 -131 -72 537 -560 518 -230 -686 218 171 -445 -334
8155 -334 101 -497 261 470 -534 150 107 622 288 -638 -229 -261 850 -61 648 93 -1174 480 158
8174 158 530 69 -141 333 -260 -254 34 317 -43 -148 -9 36 -141 1058 -936 166 491
8191D91
$$ Imaginary data points
##PAGE= N=2
##DATA TABLE= (X++(I..I)), XYDATA
0 0 0 0 0 0 0 0 0 0 0 0 0 0 0 0 0 0 108 -108 108 -108 108 -108 216 -216 216 -324 324 -397 432 -537 565 -648
32 -648 756 -857 962 -1077 1203 -1340 1498 -1669 1861 -2062 2279 -2529 2796 -3083 3396 -3742
48 -3742 4126 -4539 5010 -5506 6070 -6701 7415 -8216 9125 -10187 11424 -12901 14690
61 14690 -16912 19759 -23549 28834 -36752 49928 -75493 143041 -675075 -1393810 890186
72 890186 394600 -1174733 263248 1197774 -540382 -229574 1439725 413215 -716067
81 -716067 627283 673908 -883001 -349375 773609 -393790 -1018299 219310 69244
90 69244 -1131391 -344068 545946 -542850 -828393 350520 342 -906649 68036 717856
100 717856 -255019 -141708 853845 317163 -278323 605606 794199 -104834 21828 537514
110 537514 -101583 -523308 99934 189953 -416648 -285281 170325 -206073 -556175 -12712
120 -12712 211395 -357141 -309950 255832 -71018 -477092 193395 509835 -114484 34210
130 34210 678553 202594 -253143 424487 519350 -276160 -100863 445937 -182058 -571592
140 -571592 200747 240477 -518179 -159054 429519 -286582 -591088 288410 177668 -644397
150 -644397 -79728 485822 -381660 -460149 575801 250286 -483995 348039 670511 -390314
160 -390314 -224014 675904 -34557 -597561 374212 372074 -639082 -131688 618517 -216819
170 -216819 -453567 538077 253372 -638499 14637 486256 -429620 -416445 513447 63365
180 63365 -593281 219756 495049 -382058 -131459 643481 -19711 -513306 287525 264436
190 264436 -554090 -100514 505401 -194084 -391586 402487 214070 -416129 117983 474567
200 474567 -239153 -310644 302275 -5562 -469766 75523 322831 -254621 -184723 352079
210 352079 39818 -318030 179109 301045 -272236 -184538 267963 -74324 -349255 182975
220 182975 290043 -214705 -42395 382823 1492 -248335 240806 236570 -296864 -117533
230 -117533 252189 -153537 -333274 200460 188779 -295655 -33341 316877 -145597 -293108
240 -293108 245813 123721 -381768 -31081 292836 -214234 -238958 369774 172490 -285557
250 -285557 163654 384347 -217298 -176151 368969 13134 -393978 128190 242237 -345621
260 -345621 -141509 381916 -48045 -325599 244083 201212 -392725 -90644 323942 -198346
270 -198346 -338593 277950 138499 -361981 85099 417443 -142653 -159567 403113 99334
280 99334 -363782 110554 280337 -303087 -182503 340709 -32652 -350244 195414 252822
290 252822 -301699 -71526 348828 -129562 -359711 184308 118804 -377147 -26576 344133
300 344133 -136240 -222537 327278 170685 -269603 112920 340636 -191608 -212461 265575
310 265575 17073 -332518 112490 268132 -224986 -127073 308762 -12812 -291932 154345
320 154345 185589 -317293 -144634 240634 -115890 -282709 214427 196779 -242500 13925
330 13925 330401 -79901 -190901 258859 118700 -295332 10812 241699 -175699 -169798
340 -169798 279264 77399 -259349 97635 229999 -219391 -156789 231873 -50248 -323580
350 -323580 78924 163703 -237913 -66908 304774 174 -194531 200604 181732 -223424
360 -223424 -32506 248292 -101816 -223329 177387 110661 -227401 35029 266777 -98418
370 -98418 -159820 203414 50061 -278300 -3109 168572 -195221 -181281 201999 43040
380 43040 -216775 109186 243796 -131363 -83531 248008 2306 -248108 89123 155796
390 155796 -218826 -84597 248998 -27138 -207322 175368 170099 -220181 -36420 238423
400 238423 -121699 -253043 159557 90696 -265673 24730 282456 -107142 -149498 270607
410 270607 97329 -247426 84047 227652 -220273 -169507 234976 -22667 -276118 141938
420 141938 204002 -236471 -72799 274738 -75679 -250520 176972 116403 -293483 -30136
430 -30136 255862 -116305 -164267 268373 120581 -224505 86852 247337 -164755 -136765
440 -136765 226017 -16528 -274842 84020 161013 -208431 -67040 247833 -40696 -207221
450 -207221 146153 118792 -221928 -30150 203314 -99483 -171028 174856 103934 -158464
460 -158464 66049 223963 -74618 -104736 165232 28913 -200956 11353 111581 -158307
470 -158307 -132114 132417 5716 -169086 60265 140823 -118420 -81156 150653 -853
480 -853 -167364 61318 131342 -111491 -43145 196007 43379 -108028 120274 154291 -116828
491 -116828 -54352 154168 -51192 -198841 60337 75965 -192570 -57077 177502 -58761
501 -58761 -166736 140525 101287 -194602 -5764 197270 -105618 -158316 187183 82016
511 82016 -188378 85377 233805 -120359 -96818 228069 7904 -236760 83370 129464
521 129464 -245987 -110340 201691 -76791 -215971 165594 127356 -223559 71 238325
531 238325 -107705 -162294 210558 71044 -225362 77544 233588 -119427 -68720 260063
541 260063 27289 -200926 110746 137103 -215398 -86650 167303 -107901 -220414 116396
551 116396 81690 -196213 5269 189064 -92768 -132521 152749 47754 -176306 37428
561 37428 152299 -97637 -68378 179818 55811 -106891 93517 140207 -104324 -66288 118886
572 118886 -35669 -167862 29522 61492 -141137 -60668 126083 -9580 -110932 78594
582 78594 91965 -108128 -37478 121999 -21770 -112926 79767 96205 -87403 1981 162980
593 162980 3581 -92659 98929 78769 -140179 -40239 111354 -86298 -156004 85353 48962
604 48962 -162872 4888 155260 -85485 -115754 139733 35227 -174996 39305 143840
614 143840 -121463 -78109 187616 29917 -135307 122645 155316 -133531 -37324 179980
624 179980 -52307 -170552 112025 72845 -198598 -13652 178184 -90496 -130045 167118
634 167118 47326 -200430 34570 147209 -150173 -105613 167275 -10830 -172119 108568
644 108568 145945 -126759 -11494 195681 -37055 -138732 121901 72868 -168074 -8375
654 -8375 143015 -88386 -114956 136106 53232 -140669 34564 126394 -105241 -98596 111334
665 111334 -6319 -153106 37550 94060 -104724 -41720 145167 13029 -91615 87773
675 87773 93219 -98949 -26272 115448 -29568 -105416 70539 66903 -96592 -6351 122303
686 122303 -23295 -92180 70152 45325 -123721 -32851 86258 -66854 -111193 75437 44081
697 44081 -108412 19803 128225 -49850 -71260 113487 34896 -120911 32621 111420 -83023
708 -83023 -62814 130988 26500 -107318 68760 111925 -99923 -57645 113158 -32243 -143571
719 -143571 52161 63108 -137945 -34758 132640 -37873 -103002 111974 67175 -134266
729 -134266 7344 129938 -78145 -93971 125416 34315 -129043 59364 140266 -75333
739 -75333 -44755 142747 -816 -136334 53189 75023 -133342 -56420 109565 -48026 -122716
750 -122716 88325 74486 -116355 -3459 125627 -61231 -105229 98345 39765 -127802
760 -127802 21737 122279 -62029 -52747 140267 44070 -98291 54532 98307 -93173 -60871
771 -60871 97520 -22060 -124870 42265 64180 -103542 -31315 110744 -24069 -102210 62823
782 62823 51872 -111761 -21106 102446 -41150 -84317 93160 64094 -82426 32288 126859
793 126859 -37636 -61480 97261 24074 -109579 19952 81751 -83834 -64188 93110 -60
804 -60 -104877 42349 72074 -97570 -51864 87787 -27047 -106752 55640 65723 -89095
815 -89095 -8523 120290 -8813 -64089 93965 63690 -89853 3712 97631 -51736 -75683
826 -75683 79598 22334 -105260 18642 88497 -67910 -62401 82706 -3531 -114306 20262
837 20262 65093 -82443 -47906 93178 298 -78577 67057 89497 -58306 -8035 106954
848 106954 -13362 -79778 65149 53232 -92367 -12242 89516 -42663 -77982 75705 35889
859 35889 -104018 -3250 77469 -72406 -81773 72951 9908 -107413 22009 86194 -61786
870 -61786 -36583 112425 19005 -81547 56363 81715 -77616 -25944 103938 -17774 -89481
881 -89481 66547 59914 -93638 -7041 102020 -44972 -89277 68469 26153 -113596 595
892 595 83683 -66591 -67634 89627 21214 -89457 42556 87581 -68779 -38057 95677
903 95677 -4541 -86086 55482 64566 -80869 -15617 99227 -19800 -74945 66117 41594
914 41594 -96100 -11940 76230 -52641 -72621 65778 20795 -87365 17199 79744 -46300
925 -46300 -41305 79292 8206 -80502 29358 63360 -56851 -27756 81208 3189 -63109
936 -63109 49535 65702 -54311 -19378 70705 -16984 -74657 34159 37316 -72473 -22820
947 -22820 64000 -25378 -62498 50192 37062 -71259 -8037 64603 -37649 -60068 57133
958 57133 28270 -71775 13222 77810 -32718 -37964 81442 28894 -71535 24146 68445
969 68445 -55523 -41547 74921 2055 -81963 32116 56748 -71682 -29702 79053 -23082
980 -23082 -85472 46268 41086 -85503 -9207 85509 -33599 -63983 78961 40805 -77296
991 -77296 22158 87908 -48515 -50279 82335 15058 -81790 34723 67289 -68742 -34718
1002 -34718 79032 -14412 -83416 40502 40774 -87537 -26226 71916 -32826 -67888 61144
1013 61144 36865 -74254 11619 83019 -31857 -42614 73661 22365 -69505 23595 66529
1024 66529 -43555 -31232 68875 3011 -66628 28590 46733 -60611 -31358 51995 -20967
1035 -20967 -71410 28280 34381 -61361 -15393 62503 -14873 -49213 51735 43392 -51221 1318
1047 1318 65742 -18450 -42612 54414 30756 -54088 6614 57223 -32467 -42607 50485 11635
1059 11635 -68093 4208 44739 -50397 -42721 51344 2084 -68563 19667 51884 -47754 -24847
1071 -24847 69640 4634 -58142 39705 52872 -49775 -7835 74062 -12458 -55033 49687
1082 49687 35883 -64484 -2080 63121 -40368 -59581 50435 13706 -76216 8055 56606
1093 56606 -50927 -45021 63147 7217 -67492 30297 56998 -53124 -24178 73132 -1352
1104 -1352 -54760 49673 49767 -56820 -4303 70476 -22509 -54866 48858 21454 -74173 -2480
1116 -2480 55564 -42098 -50674 52459 9741 -67083 14725 53759 -43363 -33103 57222 2937
1128 2937 -56739 32058 52104 -39978 -11322 67124 -653 -46839 43048 41423 -52454 -11570
1140 -11570 55078 -25698 -54710 38452 21987 -62781 -6160 48669 -34336 -45803 44976 14315
1152 14315 -58636 8107 48556 -34090 -26694 58022 13815 -48839 27294 52486 -35559 -15469
1164 -15469 62446 7 -53562 30542 39497 -50460 -16209 52762 -19062 -57104 30044 21784
1176 21784 -60351 -9940 47122 -29890 -46786 40631 18806 -50413 12577 54284 -27844 -26736
1188 -26736 54676 15202 -47143 23911 49573 -35475 -21579 55508 3911 -48579 25383 36045
1200 36045 -49169 -21770 46734 -16154 -53919 26435 22030 -55209 -9747 48846 -20155 -39517
1212 -39517 41421 22539 -47389 9276 54666 -21968 -29651 50916 17638 -47347 16288 50278
1224 50278 -31807 -28974 46459 1405 -54053 17550 36367 -46574 -27138 43792 -14681 -55367
1236 -55367 27177 29566 -51569 -11388 53061 -15548 -39108 47909 33146 -44643 9698 60235
1248 60235 -19918 -30524 52826 19004 -51871 12552 45242 -38305 -29194 47827 -2769 -59818
1260 -59818 16252 31117 -53179 -23831 45956 -18500 -55479 30178 27508 -48838 -633 56065
1272 56065 -15817 -33176 48818 27274 -40594 15272 50528 -25539 -25823 46723 10705 -44435
1284 -44435 17070 36837 -38222 -24946 38489 -7270 -47943 15666 23259 -44175 -17909 41215
1296 41215 -8897 -36411 28534 27435 -34176 -2192 46808 -7063 -25645 33311 20674 -34161
1308 -34161 4429 39728 -16801 -29571 29131 8725 -45677 -531 28321 -29820 -33207 26304
1320 26304 2045 -44418 8991 36137 -25394 -21577 42515 8597 -36123 24016 40337 -26954
1332 -26954 -10735 48940 2281 -33018 33091 34379 -37284 -7159 43374 -17511 -44761 27599
1344 27599 12736 -55560 -9727 36626 -31369 -38982 38778 11459 -50209 10741 43246 -32055
1356 -32055 -23069 51563 4091 -44780 26876 40801 -36395 -6179 56511 -7513 -40629 36332
1368 36332 25784 -48664 -3573 41800 -30354 -42608 34167 8722 -49935 7525 40922 -31615
1380 -31615 -25114 44336 5514 -40441 21593 34303 -34384 -11189 47091 -1839 -31790 32501
1392 32501 28630 -35837 -2709 39993 -16536 -35534 22695 8486 -43515 -4285 29577 -21920
1404 -21920 -28434 26655 5657 -36851 3191 27216 -20699 -19686 29844 7254 -25393 17787
1416 17787 35866 -12957 -7720 36914 7364 -27300 15732 25962 -26486 -17478 26816 -5607
1428 -5607 -33822 14516 21020 -30986 -14873 27863 -11079 -35363 14937 15180 -36057 -9477 34031
1441 34031 -9685 -23997 34687 25079 -28847 8670 43507 -14997 -23645 35869 9801 -41055
1453 -41055 7514 34385 -27417 -20566 38527 -911 -44221 14086 23891 -39974 -17277 34819
1465 34819 -16347 -40543 26988 22582 -35134 4451 47401 -13695 -24613 41345 19227 -37278
1477 -37278 10517 38222 -26884 -22314 40228 4276 -39202 17288 27575 -37277 -19442 33485
1489 33485 -14664 -41615 18518 14462 -41513 -4316 37190 -13586 -25222 33555 17538 -31976
1501 -31976 9532 37766 -16060 -17530 34387 9550 -28312 15652 31455 -20273 -14192 28020
1513 28020 -3590 -33955 8888 14072 -33766 -18047 21041 -10963 -28928 18311 18628 -24636
1525 -24636 -2605 29388 -6787 -20659 21722 17987 -22217 1935 30026 -3723 -14056 26424
1537 26424 16985 -22028 2612 23100 -15597 -23543 16819 -63 -35618 -2182 19789 -20524
1549 -20524 -18084 26625 4196 -28906 10052 25781 -21547 -12770 30102 1841 -27307 19295
1561 19295 28637 -18263 -1657 36738 -2346 -25416 21935 16739 -33600 -7419 25713 -19720
1573 -19720 -32283 24040 9427 -37315 1907 30927 -23584 -23609 31210 4216 -35576 12097
1585 12097 28596 -24930 -8983 42341 3554 -25389 26376 24958 -29968 -4298 34469 -15179
1597 -15179 -32341 22894 10190 -37711 787 31568 -21332 -24563 27640 2647 -38118 7173
1609 7173 24110 -27680 -15189 32173 611 -25687 24687 28039 -21879 -302 34139 -6963
1621 -6963 -23869 21049 11678 -31658 -2237 24906 -15258 -20251 23393 6405 -30392 279
1633 279 18731 -21751 -19115 17455 -441 -25610 7717 21585 -12287 -2634 29293 5651 -15318
1646 -15318 15517 18768 -15477 -5788 21172 -2824 -20987 11065 14688 -18075 -6923 19958
1658 19958 -7314 -24109 6911 8794 -24230 -9649 16868 -8906 -20899 16123 15720 -17982
1670 -17982 2735 26013 -7041 -15617 22991 12538 -24223 4105 25192 -13675 -14882 26181
1682 26181 6633 -27296 6052 21020 -24126 -18791 22981 -4377 -31474 11789 19268 -25963
1694 -25963 -5246 32038 -4178 -24325 23907 16956 -28044 2241 32804 -13637 -20463 30393
1706 30393 11642 -28520 12057 29929 -22441 -17472 25097 -6840 -36318 10448 14080 -33694
1718 -33694 -11509 25880 -12054 -24786 23804 13880 -27574 2283 29499 -14053 -17392 28200
1730 28200 9342 -23194 14602 29110 -12975 -5580 30583 1385 -23790 11809 13405 -24750
1742 -24750 -9866 17527 -12810 -23518 10757 7609 -21594 -1950 17863 -11845 -17977 13701
1754 13701 6740 -18528 1699 18793 -6051 -7802 19040 11474 -9414 5739 16256 -8374
1766 -8374 -11876 11294 2781 -18861 -1345 9602 -12848 -12626 12542 2548 -18353 553 12722
1779 12722 -14140 -13248 15496 4360 -16843 8901 22152 -8025 -2575 26991 7275 -16092
1791 -16092 12398 17706 -18060 -8006 21360 -6025 -23460 12913 11391 -25932 -3895 21616
1803 21616 -16467 -26104 15199 2803 -32825 1546 23215 -16902 -13353 29217 7454 -19508
1815 -19508 19282 26148 -18393 -5159 29972 -4334 -23171 19760 14861 -26312 868 27681
1827 27681 -13401 -19931 22733 2814 -32914 1901 16630 -24197 -17132 22279 -2378 -25085
1839 -25085 15325 20716 -17010 -259 27821 -5232 -17874 19252 10775 -20409 4063 22106
1851 22106 -11005 -12555 19678 5375 -19149 2862 12405 -18829 -14713 11150 -2749 -20078
1863 -20078 4381 10401 -11398 -4058 16229 2109 -9911 9423 11943 -9447 -2377 15833 1330
1876 1330 -7761 9395 12363 -6345 -306 14530 -1574 -13720 2808 4849 -16660 -10658 9122
1889 9122 -5079 -17001 5574 9476 -13346 -3239 15230 -3987 -15769 10552 9595 -15001 1622
1902 1622 20544 -4125 -8552 19919 11595 -13888 6222 20893 -13533 -15688 16135 -1904 -25216
1915 -25216 4028 13221 -20436 -10370 20320 -3522 -20784 13499 13051 -23762 -3499 22879
1927 22879 -9901 -16719 21793 11177 -19903 9695 26839 -11368 -9737 24430 700 -24876
1939 -24876 8623 13979 -22202 -10117 19359 -9147 -21639 13865 10357 -22758 -1652 18935
1951 18935 -13888 -16343 18275 5043 -18928 7500 20773 -9803 -4550 24620 4236 -14564
1963 -14564 11047 13443 -15849 -5942 15486 -5201 -16970 9379 6335 -16855 -2590 12007
1975 12007 -10471 -13827 7028 630 -15936 75 11463 -5608 -6591 14334 8803 -5056 6617
1988 6617 13710 -3025 -6420 9659 3779 -9755 833 9546 -5727 -7848 8436 3500 -11732
2001 -11732 -505 6176 -10496 -11772 7004 -2540 -14366 1344 10906 -6863 -4897 16432 6314
2014 6314 -9542 9370 15155 -9716 -5273 16773 156 -14248 9835 11006 -14847 -3917 16042
2027 16042 -6091 -16493 10633 3315 -22421 -2917 13837 -13556 -14288 16255 3592 -18909
2039 -18909 8472 18777 -12848 -5633 23068 496 -15589 14544 15760 -15053 289 21570
2051 21570 -5171 -14249 16216 6288 -22257 -166 13877 -16996 -15822 15648 -1282 -21499
2063 -21499 5310 12201 -15846 -5837 18983 -2310 -14932 12723 10760 -13307 2131 19823
2075 19823 -3943 -8463 15488 6819 -12946 4446 13993 -10795 -10556 10228 -2746 -18156 2252
2088 2252 7121 -13743 -6637 9901 -1657 -11504 5575 6984 -9831 -2791 10638 -203 -4879
2101 -4879 8826 8745 -3350 951 12030 949 -4623 6063 5439 -9841 -4767 5234 -3872 -10438
2115 -10438 2250 2411 -11268 -5984 7561 -2785 -10191 5070 5491 -10690 -1026 12044 -708
2128 -708 -6219 11085 9945 -7845 4557 16930 -2309 -8133 13397 4308 -14320 2365 11996
2141 11996 -11610 -10784 11542 -2697 -18921 4433 10508 -16130 -7307 14760 -5737 -16034 12694
2154 12694 9819 -15702 1902 19186 -6497 -8994 19157 6826 -15565 6846 16005 -12511
2166 -12511 -7902 18676 -865 -17739 8529 9239 -18046 -5252 14899 -9112 -17018 10319 4602
2179 4602 -17786 2332 14871 -10286 -7190 16678 4237 -12040 9408 13649 -10685 -2824 15251
2192 15251 -1635 -10576 9189 7035 -13009 -1308 10299 -6156 -10621 6424 653 -14045 -1029
2205 -1029 6430 -7632 -6401 8479 1907 -7803 3926 10836 -2460 -2268 9577 3448 -4871 3721
2219 3721 8776 -1538 -3778 6577 1451 -7108 641 5119 -5672 -7291 3041 -186 -9250 -1442
2233 -1442 5166 -6042 -6663 6435 1298 -9181 3839 10808 -4940 -2782 11977 3091 -8019
2246 -8019 7544 12608 -6628 -2345 12459 -1915 -11925 6923 6585 -13500 -3322 10785 -7977
2259 -7977 -12115 8859 2266 -16575 760 12053 -10857 -8798 14236 931 -12893 9221 14274
2272 14274 -10147 -1262 19138 -1261 -11106 12187 8954 -14127 -21 13715 -9750 -11139 10663
2285 10663 131 -17267 2645 9372 -14176 -8790 12370 -2533 -13489 8359 9323 -10681 -843
2298 -843 14978 -2230 -7430 11518 7935 -9507 3977 12616 -5518 -4580 10739 414 -11187
2311 -11187 3087 5997 -10700 -7483 6526 -4191 -11061 2671 4089 -7453 -3397 6739 -899
2324 -899 -5032 6005 5390 -3466 748 8051 354 -2413 6449 5748 -2703 1007 6602 -663 -5571
2339 -5571 2487 2493 -7612 -4512 2947 -3891 -8731 1725 2092 -7131 -3423 6566 -1507 -6633 5208
2354 5208 6203 -7371 -245 10610 -485 -4462 10440 5298 -7711 2718 10461 -5946 -6255 8929
2368 8929 -656 -13991 1267 6163 -11256 -7009 9498 -4089 -13126 4955 6189 -11971 -1851
2381 -1851 13154 -4179 -8245 11624 6976 -8844 5411 14536 -6017 -5494 13448 1673 -12370
2394 -12370 5361 8425 -11976 -4497 9675 -5273 -12197 6866 3306 -13232 -2389 8210 -7753
2407 -7753 -9384 8164 1562 -10453 5359 10495 -5087 425 14066 1624 -6144 8069 8074 -8972
2421 -8972 -2076 7818 -3145 -9332 5320 3466 -8634 -1803 4678 -5348 -7336 3799 -521 -9408
2435 -9408 -1367 4214 -3824 -3458 6913 3290 -2000 4943 7464 -1157 -319 7591 3043 -3961 1418
2450 1418 5045 -2396 -3857 4615 685 -6712 -989 1722 -6037 -5949 1784 -1789 -8283 -454 4474
2465 4474 -4533 -2262 7811 1833 -5146 5503 7464 -4102 -1008 9625 738 -6006 6063 6663
2479 6663 -4512 -942 8255 -3245 -9271 3907 1729 -12575 -2324 4528 -7746 -7214 7731
2492 7731 2036 -8988 5504 9065 -7616 -2850 11731 435 -8529 7328 8130 -7126 1312
2505 1312 12646 -640 -6534 9845 3671 -11584 32 5688 -10046 -9790 5868 -2771 -12494
2518 -12494 3589 7480 -8345 -2731 9384 -1953 -8464 7371 5480 -7881 235 10340 -870
2531 -870 -2619 11186 5953 -5485 3518 7572 -5481 -4532 5421 -1673 -10022 445 2063 -7374
2545 -7374 -3557 5328 -1684 -5904 2969 3464 -5365 -1105 5357 -804 -2791 4982 5039 -901 3187 8170
2561 8170 1444 -1122 3681 2098 -4314 -2368 1874 -3595 -5479 1279 1284 -4415 -2360 3400 -2189 -6656
2577 -6656 979 901 -6386 -1658 5450 -456 -3289 7038 6041 -1191 3794 7965 -1343 -3462 5438
2592 5438 397 -7525 1024 3994 -6405 -4432 6805 -259 -7504 2748 3738 -8590 -5392 5748
2606 5748 -4487 -9546 4478 3286 -5196 3909 11430 -939 -2928 10103 3474 -6932 3040 7604
2620 7604 -5915 -3247 8783 -600 -7815 4866 5088 -8203 -2805 5860 -6236 -8918 2921 146
2634 146 -11194 -473 6221 -2874 -2752 10119 3164 -4737 5312 6935 -4956 -2276 7655 -1556
2648 -1556 -6600 5409 5550 -5049 -549 6307 -2765 -5795 1693 -1493 -7824 -3059 1082 -5640 -4455
2663 -4455 3961 2129 -2904 2514 5634 -1921 -794 4273 888 -3040 2556 4125 -981 51 7308
2678 7308 2941 -2534 2212 2528 -3502 -4173 52 -2370 -7241 -1982 707 -4127 -1810 5144 1017
2693 1017 -2897 1128 3389 -4405 -2012 4395 79 -4064 4395 5852 -2000 2495 8968 2008 -4302
2708 -4302 4608 1816 -8432 -2670 2527 -6185 -6441 2766 831 -6722 1806 6218 -5453 -4019 5777
2723 5777 -1713 -7196 4130 4944 -5847 466 9727 1208 -2648 8864 6687 -6038 785 4509
2737 4509 -6076 -6021 4298 -1116 -8161 1789 5174 -4955 -1520 5726 -2268 -8099 2296 1588 -7698
2752 -7698 -1637 6970 -1146 -3292 8265 5929 -2273 3330 6653 -2576 -2784 3312 -715 -5782 -205
2767 -205 2889 -3992 -1284 4193 17 -4310 1895 624 -6973 -4150 1242 -3116 -5771 2042 3403
2782 3403 -1369 3168 7900 2423 455 3208 2555 -2532 -891 2416 -2046 -3754 2439 1773 -2502
2797 -2502 2098 4002 -2194 -4276 283 -1144 -7110 -3507 1056 -3834 -3774 4759 3379 -1231 3492
2812 3492 6657 57 -829 4776 -62 -3819 1404 3127 -2957 -251 5344 1374 -3281 3900 2178
2827 2178 -6864 -2666 1727 -5201 -7910 924 1313 -5285 182 7163 -776 -1406 6610 2665 -5959
2842 -5959 1313 4302 -3752 -1546 6269 1871 -3374 6182 5122 -3217 -399 4866 -3909 -7521 739
2857 739 -1118 -7966 -2412 4042 -2278 -3470 6361 3323 -3845 2427 4580 -4161 -3111 3705 -861
2872 -861 -3319 4931 6859 -1490 2611 7278 949 -3285 2523 -17 -7352 -3864 381 -5102 -4817
2887 -4817 2342 1566 -2813 1532 3891 -1727 -3174 1845 -422 -4127 722 4173 -1031 172 7288
2902 7288 4771 -140 5278 5580 -2578 -2675 1519 -3160 -5532 -815 -129 -4428 -2467 3721 -87 -3900
2918 -3900 1395 370 -4181 -3528 1644 -2824 -3577 2306 3749 -582 3112 7822 2302 -134 4238
2933 4238 1459 -4227 -1118 2578 -3371 -3461 2472 136 -3990 898 3649 -4126 -3543 1817 -2065 -7712
2949 -7712 -1686 1474 -4427 -564 5663 1516 -491 6444 5760 -2611 150 4254 -2387 -4993 2671
2964 2671 1204 -4865 1465 4887 -1752 -1218 4540 -30 -6241 -1137 66 -7100 -5932 2190 -1614
2979 -1614 -3775 4793 5979 -383 2131 8049 212 -2953 3408 948 -5833 -62 4557 -1033 -455
2994 -455 5259 2207 -4097 935 2303 -6106 -4261 152 -3836 -6995 -169 1106 -2351 711 4922
3009 4922 1552 -1686 4144 3911 -2705 -524 2380 -1322 -2115 3071 2567 -882 2649 4382 484 -2403
3025 -2403 1376 -2729 -6682 -1993 -1028 -4554 -3552 2559 71 -1926 2821 4326 -1628 -759 2275
3040 2275 -682 -3279 232 2006 -1625 895 5687 2548 294 4052 2688 -1952 -2144 215 -4502
3055 -4502 -6222 -606 -188 -4813 524 4349 -515 -1856 4146 2013 -4754 -1766 1529 -3962 -1740
3070 -1740 4205 1990 45 5860 6774 -23 1572 4692 -1455 -4934 111 -189 -6024 -3719 2122
3085 2122 -2146 -2793 2498 2460 -3565 861 2262 -3675 -5039 1178 -1073 -3523 2993 5245 766 2766
3101 2766 6799 2597 -514 2726 2352 -3922 -3400 1350 -2698 -3271 2338 2629 -2658 96 3111 -1567
3117 -1567 -3378 890 -1976 -5898 -2139 832 -1217 -509 5089 4019 -193 4667 4772 -1149 311
3132 311 2531 -2180 -4333 -292 886 -3098 165 2772 1220 -1538 2193 918 -4117 -3340 -1688
3147 -1688 -4245 -3778 143 938 -1469 2937 5858 1802 1456 4311 1936 -3356 -786 885 -2075 -1591
3163 -1591 3824 1210 -696 2343 3018 -834 -1327 360 -1853 -5988 -2749 -1040 -5153 -1687 1917
3178 1917 -45 465 3521 3627 -518 1968 2073 -1043 -2774 371 1028 -2644 2193 3555 544 1565
3194 1565 4251 1632 -2247 -618 -6 -5789 -4611 191 -2052 -3492 1296 3733 -851 833 4884
3209 4884 805 -2632 1310 871 -4106 -651 4172 897 -480 5899 3925 -253 2763 3624 -2831
3224 -2831 -2954 -475 -2927 -5479 -1664 1507 -2689 -97 3994 388 -2811 2172 1153 -2796 -1966
3239 -1966 1943 -1442 -2814 3054 3937 -483 3510 5803 643 101 2479 5 -4112 -2022 -319
3254 -319 -4644 -3240 1661 -2 -2167 2686 2237 -1877 -839 742 -2906 -5246 -67 120 -2064 613
3270 613 4058 1919 1000 5534 3159 20 601 173 -2707 -3657 41 -1204 -2151 185 2720 -325
3286 -325 -497 2120 -72 -3037 -1934 -1362 -3512 -2586 1206 308 821 3231 4361 2019 2046 4435 1369
3303 1369 -2286 203 146 -3337 -1583 2004 -107 -1069 2158 2156 -1778 -1179 667 -3554 -4399 -967 -1663
3320 -1663 -4021 -148 2809 422 409 5793 3275 -144 2145 2659 -2168 -2625 1201 -713 -3002 2201
3336 2201 3168 -870 1005 3242 -324 -3859 -296 -964 -5862 -4045 298 -3218 -1661 3747 2258
3351 2258 -233 3000 4271 -255 673 2019 -1415 -3833 852 1839 -1250 1178 4930 1588 -1017
3366 -1017 2514 1127 -3493 -2422 -220 -4326 -4005 -543 -1430 -2076 2069 3659 119 267 3540 390
3382 390 -1968 1105 776 -1707 -647 2277 1881 1418 3894 3007 224 639 1263 -1427 -4153 -1875 -1101
3399 -1101 -3120 -1487 1070 139 82 2435 1117 -117 331 560 -948 -3065 415 1014 -331 554 3230
3416 3230 2272 1740 3940 2093 -1281 -420 739 -2968 -4958 -1864 -617 -3523 205 2415 175 -977
3432 -977 2412 163 -3159 142 563 -3942 -2047 2659 1123 -661 3917 5186 147 1679 4393
3447 4393 244 -2422 718 -825 -5441 -2480 919 -2010 -1454 2594 -6 -2314 1134 1301 -3595
3462 -3595 -3365 479 -2787 -3346 2054 2818 -874 2755 5337 1943 534 3802 1496 -2926 -581 160
3478 160 -2611 -2005 1821 -760 -1128 2695 1766 -1547 -1117 33 -2947 -4258 576 -1052 -2449 693
3494 693 2160 547 1711 4187 1599 -219 957 765 -1257 -2245 294 135 -1381 721 1399 514
3510 514 619 1363 -224 -2616 -1881 -2313 -3921 -3553 -166 -1191 -510 1399 2292 2032 1123 2920 1821
3527 1821 116 469 1511 -1036 -510 1027 1508 -182 1940 2793 -505 -372 159 -2302 -4641 -1835
3543 -1835 -1459 -5057 -2013 1151 -674 -341 1993 2877 -811 1029 3415 -1519 -1251 1637 -397 -2549
3559 -2549 2011 2932 61 1684 4043 882 -1934 659 378 -4304 -2791 -202 -3113 -2646 1590 1016
3575 1016 -1497 2551 3285 -412 -1036 1733 -728 -3036 373 1448 -1307 1662 4282 1201 612 3647
3591 3647 1733 -2747 -815 597 -3716 -3165 -788 -779 -2196 687 1482 -1106 -22 1161 189 -2348
3607 -2348 -540 -947 -1912 -1004 841 829 1812 3528 3230 2099 2393 3013 -151 -1205 -956 -1650 -2391 -1760
3625 -1760 -55 -719 -375 1844 879 -858 -262 -205 -1705 -1549 -1831 -66 -2406 276 1687 2014 2387
3642 2387 2190 2685 882 937 1075 -319 -2490 -762 -532 -1737 -244 1535 30 -810 1018 391 -2342
3659 -2342 -1107 -706 -2907 -2687 1125 -536 -1035 2310 2547 132 706 3615 92 -2871 554 899
3675 899 -2723 -204 2401 -688 -789 4115 1518 -844 703 949 -2692 -3756 -254 -2507 -3880 495
3691 495 2291 -1858 890 4269 1133 408 3306 708 -2714 -22 1789 -2158 -1997 2709 934 -600
3707 -600 2479 2627 -1114 69 1223 -3029 -4154 -909 -1932 -4184 -615 1329 -594 131 2745 1601
3723 1601 191 1770 1425 -1998 -494 868 703 -128 1625 1441 1401 1396 2824 676 -1252 -697 -1281 -3182
3741 -3182 -1715 -1338 -1605 -1348 -160 186 221 1009 926 949 -1156 -437 553 -252 -1052 1152 875 702 1767
3760 1767 2102 1272 357 1491 -1213 -2642 -1214 -1182 -3376 -2095 336 -185 -1495 881 996 -2010 -369
3777 -369 1587 -332 -1987 285 179 -1999 564 2456 668 916 4689 2738 -596 494 2131 -2244
3793 -2244 -2088 1241 -1836 -2994 718 764 -2049 -57 1817 -1188 -2406 1127 -1368 -4010 -180 734
3809 734 -1427 205 3556 1957 215 2500 2949 -1375 1329 2074 -1770 -2492 1104 -523 -1656 1115
3825 1115 2131 -1633 -48 1436 -480 -2016 -647 -220 -2302 -275 -153 -607 291 2361 1207 380
3841 380 2876 2260 -430 -338 1668 -256 -1136 528 1058 -325 -153 1556 223 -315 -494 -1018 -1648 -2160
3859 -2160 -1360 -1162 -295 -396 222 548 363 1753 1445 1963 264 1609 -503 234 199 1243 -140 1033
3877 1033 2468 1910 504 458 800 -2140 -1374 54 -2097 -2722 -1954 -1144 -1816 -219 2388 31 -428
3894 -428 3651 769 -1163 667 1678 -2074 -797 2532 748 -564 2973 2062 -1661 1595 1874 -2664
3910 -2664 -1902 -55 -1721 -2588 -1218 -144 -2418 -510 2376 -642 -661 2016 1334 -964 288 503
3926 503 -1005 -529 2718 1011 -761 1997 2505 -706 378 1333 -1474 -2444 -494 -578 -3271 -975 710
3943 710 -1838 -1141 1946 149 -1489 1486 42 -1311 -22 1777 727 -797 2016 1355 619 1522
3959 1522 137 1719 718 389 -859 -1878 -439 -1352 -1828 -92 -113 46 -1061 -90 -385 -211 -272 -420
3977 -420 -1235 -965 -1121 -755 379 1152 1849 2524 1954 777 1430 1084 176 -932 1575 -1022 -1755 -397
3995 -397 -356 -1207 845 894 -1369 -899 349 -1635 -2436 -541 -478 -1409 683 2256 187 -297 2941 1772
4013 1772 -786 1425 1874 -604 -304 1338 583 -1906 765 714 -1696 -317 2249 -663 -2200 468
4029 468 -568 -2429 -116 1010 -2016 -945 1686 697 -826 2334 1936 100 200 1981 -447 -647
4045 -647 2192 432 -1690 1547 1950 -554 -923 1698 -634 -2768 -594 -968 -2702 -903 -92 -1107
4061 -1107 -754 1153 555 -505 1166 1743 341 862 1389 -196 -549 943 176 -2 1213 2092 115
4078 115 -446 440 -372 -1109 -1051 -435 -2106 -379 -997 -470 96 599 675 419 384 -126 324 85 -516 71
4098 71 758 -591 142 1820 1127 882 1745 983 -522 -856 -90 -1160 -1859 -986 -798 -1846 -1161 1241
4116 1241 220 -682 388 78 -1227 269 762 -904 -1132 1007 692 -762 2041 1278 -515 335 1751
4133 1751 -517 -1073 1093 -254 -2377 -289 220 -2509 -653 704 451 -2284 1274 -107 -1353 -904
4149 -904 1384 -824 -1424 2010 1096 -696 1744 1807 -114 180 1957 -205 -25 992 464 -2028 -978
4166 -978 598 -2085 -1613 -182 315 -2365 -512 153 -2445 -940 874 -1148 -741 38 1566 -826
4182 -826 1083 1991 229 303 1135 1391 -391 657 1256 -736 1092 50 -559 -193 -7 -736 -1067 -1302
4200 -1302 -993 -1108 -971 -1034 -1861 138 501 -565 1392 1244 463 878 981 157 268 1466 536 -847
4218 -847 556 356 28 769 844 -354 -569 -130 -438 -1384 -1195 14 -1161 -559 1187 -331 -1413 1347
4236 1347 1614 -252 604 2135 -802 -497 2329 1314 -619 1048 2563 -329 590 722 -1113 -1482
4252 -1482 284 -309 -2289 -953 365 -2002 -2163 1127 -205 -1096 1192 1583 -599 588 2055 372
4268 372 -366 1223 172 -915 745 2877 317 -112 1312 159 -1969 1124 637 -1584 -839 333
4284 333 -1488 -1830 233 -564 -1569 -489 787 -171 -935 755 -770 -471 705 448 762 420 2085
4301 2085 829 -76 533 1437 -270 -1289 680 383 -1042 -30 -513 -376 -567 -772 402 288 -721
4318 -721 -733 361 -190 -225 -325 784 111 241 1530 806 846 1023 275 8 239 895 -882 -530 -570 -611
4338 -611 -740 897 -972 -1293 18 -869 -1916 -202 360 -617 -871 736 -1 -414 955 1101 -90
4355 -90 106 1390 201 -15 1192 621 -1602 114 1512 -329 -723 1155 157 -1486 964 -113 -1260
4372 -1260 -1517 514 -1809 -1169 1150 757 -1086 1318 2025 -723 642 1943 262 -1117 2269 1265
4388 1265 -747 4 1299 265 -379 956 -342 -1203 -1080 -28 -1601 -1599 525 -29 -1505 28 -606
4405 -606 -926 -177 935 -803 -888 1566 807 -247 817 406 -36 294 1343 243 124 38 426 -320
4423 -320 -223 -603 -1764 -303 -753 -633 -643 -111 -478 -368 -1066 -789 242 598 77 195 1349 75 292
4442 292 702 1276 340 77 794 11 -735 773 -592 -500 -423 -553 -1401 -1383 -522 -1051 -1937 289 704 -1217
4462 -1217 936 318 -319 66 1657 965 774 364 1765 427 -179 1090 579 -259 550 1027 -947 -179
4480 -179 117 -1837 -635 232 -804 -1414 -771 -216 -969 -636 1057 27 -309 1291 995 -261 583 1451
4498 1451 -48 -2 1559 969 -384 1253 456 -1468 -1481 128 -394 -1011 -295 180 -1864 -879 -441 -1036
4516 -1036 -884 370 341 -629 67 940 -309 346 1114 1479 375 104 69 488 -150 728 -394 523 -10
4535 -10 799 -426 -142 -712 -628 -278 -833 -803 -1229 -143 -670 -886 874 -57 -501 1108 -195 556 326
4554 326 -255 -757 799 430 306 744 630 -693 -74 664 -652 -715 -617 2 -1214 -1029 199 92 -1222
4573 -1222 77 1227 -1094 809 564 -1561 -327 1601 -136 -300 1429 1210 870 1110 1291 -429
4589 -429 -32 938 -344 -588 -271 49 -1471 -983 352 -913 -1523 -344 11 -1030 -390 256 -1060 -1004
4607 -1004 220 803 -777 1015 916 -991 910 1320 36 -425 1694 767 -229 -650 49 -611 -1416 671
4625 671 -1160 -1687 -332 -388 -972 267 41 -558 271 806 493 -624 1773 1140 383 192 59 576 -110
4644 -110 -161 238 -35 -533 149 209 -93 -319 296 -115 -353 -92 -687 -1346 -669 92 -147 -570 728 487
4664 487 -143 533 665 680 -499 65 447 -247 140 625 729 -1009 357 -538 490 150 -47 -60 -1381
4683 -1381 -312 -499 -117 -364 123 -69 -794 -706 507 -751 -24 461 -299 -42 1152 -213 364 430 745
4702 745 -120 1328 763 -161 -206 362 -688 -1149 163 -167 -531 -756 -225 -1639 -983 -327 172 -1665 682
4721 682 573 453 -41 462 -244 -64 1759 1386 346 561 1140 521 -584 -419 276 -921 -1415 -104
4739 -104 -601 -589 -174 -627 -99 127 268 -711 -636 475 455 268 580 356 513 1339 942 476 899 830 1076
4760 1076 832 -160 -223 -557 -226 426 -57 -897 -391 786 -294 -1261 280 -1284 -1194 -952 -139 -404 -1082
4779 -1082 1068 33 916 768 764 956 528 1393 740 -359 -126 433 -922 150 -518 1091 -797 -1045
4797 -1045 -564 -972 -103 8 -716 -421 -746 -109 -423 -1121 497 327 493 -32 926 -96 39 1578 614
4816 614 -716 25 69 -864 -15 152 221 40 -559 -201 -827 -794 -425 -621 -463 -599 406 -915 -1032 912
4836 912 -546 205 538 570 200 444 1023 202 711 495 -449 -128 633 458 -427 -250 -931 -1475 -700 -278
4856 -278 -960 -1642 -859 -601 -1228 -316 1162 3 -386 666 586 -43 467 1691 82 -181 685 1427 648
4875 648 404 1083 -36 454 -736 -77 -824 -897 -872 -471 -560 -59 -1002 336 274 148 -137 -643 -587 263 -14
4896 -14 -309 652 627 678 333 467 197 -168 502 -153 -106 600 52 -426 -1415 -828 -598 30 -110 -648 -21
4917 -21 -338 -756 -8 -395 -31 122 369 32 495 562 1609 922 710 159 190 -87 22 -114 162 -918
4937 -918 12 643 -306 117 -869 489 -449 -826 589 404 -1063 324 218 -424 357 961 -411 605
4955 605 1606 450 -151 421 718 -178 484 1038 -1283 -75 -261 21 -299 471 153 -288 -316 -711 -1124
4974 -1124 -471 -1333 305 74 -983 1302 187 153 724 1237 -50 897 -310 142 -423 -151 -497 -483
4992 -483 648 389 272 -465 263 -203 -726 -482 -1155 -691 -1816 -688 500 399 85 846 471 -255 1264
5011 1264 -196 769 -749 142 628 -36 438 1062 -18 475 965 -547 31 73 299 -1510 -407 -656
5029 -656 -848 -458 66 -95 -617 111 321 383 -131 1149 503 185 750 691 431 401 -226 824 451 -851
5049 -851 418 -498 -327 -548 -1072 -798 -964 -1011 41 752 -552 -556 232 1245 690 -400 385 -114 -274
5068 -274 17 244 902 659 808 390 478 -203 1077 -698 -159 -164 -402 -499 -95 -103 -482 252 714 -272 -752
5089 -752 495 -529 -606 -627 1110 -401 -721 -234 458 336 1425 1116 30 390 385 65 250 -266 -541
5108 -541 -271 -876 -775 234 -531 -154 -3 -1053 -196 103 712 122 -1090 111 569 833 1487 1079 239
5127 239 1182 602 656 -78 -73 -422 -553 223 321 -342 -483 -437 703 -419 396 121 -393 -834 -230 -601 -331
5148 -331 -460 873 -917 -237 1541 314 -41 1257 -66 -174 277 488 402 1040 -722 -546 149 880
5166 880 585 -328 -607 -139 -737 -791 -323 1047 193 417 -52 -6 -182 137 576 643 846 243 1575 209
5186 209 543 894 -142 -197 -69 -202 -72 337 -144 -805 -185 -86 -1016 -128 115 28 -483 336 -194 -67 -449
5207 -449 399 262 -57 607 1 -117 167 923 987 138 -50 353 154 -298 -286 -907 -863 -41 -309 495 -578
5228 -578 -800 -568 -431 228 -208 447 431 461 285 391 891 903 -542 773 153 462 825 399 554 117
5248 117 -71 -482 -85 -105 -807 -485 -291 417 215 -528 -1027 -445 114 -397 856 -260 -322 165 960 402
5268 402 -280 -86 182 653 542 -155 -160 -451 -1022 -688 334 570 398 -1163 -367 -371 -178 -330 -1221 -80
5288 -80 -1085 863 -448 80 322 -389 474 212 -349 656 330 308 533 -353 -84 559 -500 -835 -366
5307 -366 247 28 -167 392 139 -1460 -1000 -331 -854 -396 -536 57 -510 486 188 113 500 1329 996 -394
5327 -394 1611 294 400 759 -370 545 -948 508 -131 -627 95 447 -1420 -678 41 -341 -412 607
5345 607 -100 -1037 587 120 45 -160 806 882 -685 -354 1159 368 -164 945 -306 475 -96 -121 608
5364 608 -22 1168 -719 60 -470 -1451 -257 -388 348 -499 336 -139 132 -466 -667 -39 -296 450 690
5383 690 226 -309 -472 186 302 -742 434 -145 -186 -13 117 621 356 42 -100 -579 -617 -307 -882 -151
5403 -151 -48 196 314 332 84 977 74 -58 599 110 -226 -481 79 313 459 624 -984 48 210 -1128
5423 -1128 534 -47 -370 -380 -432 581 207 -215 -166 1447 -257 -1116 894 -104 890 398 454 356 984 694
5443 694 -102 1026 771 -567 -88 -47 -895 -729 627 -795 -1207 382 -441 -208 -616 291 58 -740 -35
5462 -35 425 55 118 724 744 846 617 1290 548 214 393 917 68 -52 -1271 -81 20 -10 -862 -972 -561
5483 -561 -1139 -33 -781 370 -74 877 -321 464 131 960 195 363 816 -951 726 662 106 -38 426
5502 426 668 -405 -124 150 -1089 -300 -117 562 -141 -245 -444 -7 791 -985 -483 540 731 -21 -18
5521 -18 362 332 -408 11 718 1404 -60 196 423 786 175 -773 -905 -272 277 -858 747 -1097 -384
5540 -384 -1004 -597 -359 -458 -376 791 -445 -383 -49 850 -193 1094 320 -89 122 441 557 -442 188 -11
5560 -11 -874 -144 -343 -776 -822 19 305 -978 -338 -461 -322 -450 -645 -6 41 -284 571 -1 -494 -17 -418
5581 -418 -485 -290 987 58 1091 -273 518 207 374 -680 -25 -101 -716 -830 -735 -135 -274 -1116 -108
5600 -108 -1122 -680 -495 -344 -463 -146 443 221 -135 736 1327 -445 242 179 361 -327 -1064 -167 541 296
5620 296 734 -355 -308 -403 -450 -375 -526 229 76 -199 -1123 37 1106 324 -128 -41 275 -55 165 82 -115
5641 -115 815 266 -227 86 1050 -168 -476 184 220 -16 -308 196 -727 -822 -1086 157 -955 -329 232 -603
5661 -603 -946 -391 -270 -149 457 634 -217 149 1166 754 280 26 397 478 415 -854 -150 -578 -43 -320
5681 -320 -1161 -1020 302 -649 -804 -290 -508 107 243 526 -668 767 405 -623 -123 1501 -636 175
5699 175 810 355 273 296 413 -460 29 547 -1106 -1113 -369 840 -1017 -53 49 -782 -1050 639 -1140 251
5719 251 -334 0 -77 723 267 350 136 1161 1434 -387 558 287 -220 24 162 -1142 -584 -525 -586 -186
5739 -186 605 -135 123 -611 -502 -225 70 -68 -255 195 453 -92 40 652 -5 365 831 1339 -1144 288
5759 288 716 -459 -311 -782 513 -948 -10 309 -757 -101 -76 -475 -132 40 160 -851 -89 750 527
5778 527 258 -204 204 726 200 286 -262 -458 392 -408 -136 225 941 -426 -162 38 -394 -65 -32 -920
5798 -920 46 -676 -560 32 -1346 384 -100 -56 1005 624 -858 -306 -128 -326 118 249 -70 281 284 901
5818 901 -132 -69 221 862 405 193 128 -1341 -558 -1353 -1059 -5 354 -613 268 1419 233 98 86
5837 86 126 -430 -412 243 -134 -176 1003 159 328 1044 58 -391 845 -715 -842 -1411 34 -294 642 -870
5857 -870 -816 -70 -498 587 52 -551 285 -297 -1166 328 382 192 1410 725 -70 836 88 -483 65 326
5877 326 217 -543 -159 -464 -636 13 191 137 -317 104 115 -1116 1086 367 -1070 -123 1177 348 -481
5896 -481 559 950 400 324 295 -986 -388 51 -874 216 469 274 -783 -717 233 -684 -82 -969 428
5915 428 -74 -444 96 123 -628 421 19 -42 750 392 1317 564 -126 691 419 741 -111 -119 39 210 597
5936 597 661 187 -31 -545 91 -592 660 493 -54 -100 -384 -615 -678 -241 -491 289 -225 350 888 209 700
5957 700 -161 -969 488 354 -270 -610 -124 729 -237 -66 565 -1032 -93 -462 -534 236 208 -386 102 -604
5977 -604 382 -741 -210 -102 -437 -1000 392 528 -543 1094 206 114 695 -268 1088 -63 588 -560
5995 -560 -213 -352 -1502 -560 -401 -12 130 45 274 625 447 328 620 356 -634 -36 -359 178 410 1096
6015 1096 58 579 1628 -159 -625 -459 -910 -646 -490 -441 -1215 635 -382 -168 374 612 442 183
6033 183 834 33 -334 409 413 -12 203 650 445 161 1495 913 467 946 76 -371 -6 -579 -523 -218 -223
6054 -223 -303 -1406 -126 -89 -795 -943 -117 -1061 -541 -311 488 -222 1062 940 399 524 -440 270 -470 322
6074 322 373 80 294 -170 -258 -18 -879 -751 -168 222 627 -643 -630 -873 -4 -356 735 -900 -110 -152
6094 -152 1015 360 856 172 256 121 -688 57 -544 589 54 -878 334 955 515 914 622 -1040 -350
6113 -350 136 -989 -877 -750 709 -541 -150 -26 952 -44 799 1049 -161 668 123 -209 18 464 -54
6132 -54 614 -445 475 -676 -344 343 -67 -1212 582 -627 -862 -414 25 -632 -568 505 210 -140 555
6151 555 -173 -94 -25 115 -43 -404 309 488 175 248 186 -12 208 -388 -1036 -1000 -725 -528 -279 -495 515
6172 515 -294 448 834 735 758 630 824 690 -1081 83 137 147 -141 87 615 559 750 198 -136 -318 -799
6193 -799 151 61 -1085 -388 -350 -18 -36 365 277 -277 496 -63 180 130 -1142 377 780 -176 243 108 866
6214 866 912 258 163 -243 -242 -528 686 240 -1283 -132 -110 -768 -427 230 483 -154 -107 36 105 -4 786
6235 786 844 -891 173 64 503 217 834 459 -322 -58 1001 124 519 596 -1297 -324 -418 524 -716
6254 -716 -620 295 -219 -286 -483 -18 -668 -144 -358 -27 352 465 788 827 1064 -1161 508 -166 240 -1001
6274 -1001 -69 -13 -194 -579 -105 -14 128 -10 -676 -657 -484 -536 274 162 179 182 363 707 -182 731 858 198
6296 198 916 975 414 378 484 289 714 475 958 288 567 -323 538 -543 -770 -307 -659 -872 -947 -614 -837
6317 -837 -126 455 151 643 1027 642 -520 432 262 -151 1030 1000 -758 151 743 -682 174 535 -205
6336 -205 -818 313 -167 -757 266 -29 -411 395 178 69 -993 1280 -250 405 -95 -537 -30 223
6354 223 -993 442 819 33 1112 289 -255 -301 -435 -799 -588 -312 -783 158 -53 -978 -77 -110 -146 -388
6374 -388 736 413 -798 -676 -172 -89 -107 -525 625 304 636 782 725 -288 103 -701 -156 -748 -72 151
6394 151 -913 -605 -972 -510 599 -561 -315 297 818 561 -758 328 -21 -730 -478 596 -226 916
6412 916 433 -114 1156 215 -343 -987 -865 -927 -309 112 -86 316 67 131 380 526 417 19 -863 -13
6432 -13 -87 -635 104 397 466 409 -313 939 596 855 457 -675 -1120 576 -1828 -181 -236 871 215 97
6452 97 -425 1028 -90 200 -251 -304 -592 -292 -255 326 206 -459 619 694 -141 -290 337 475 -255 235
6472 235 -337 -830 -622 246 -86 -579 968 342 50 -480 -1103 -738 -411 -352 -207 -520 448 -387 663 1239
6492 1239 457 -63 -109 366 -426 -489 66 342 394 -406 173 -189 319 758 -239 134 -952 24 -372 -786
6512 -786 -126 -16 -460 683 355 1043 1451 1479 85 -43 285 110 -179 -63 20 288 -282 611 154 178
6532 178 -53 56 557 -824 -3 -1404 -882 -752 4 -351 585 -864 148 787 89 -195 299 -855
6550 -855 -613 -62 540 -442 -132 1478 581 -430 1104 546 40 5 -74 -567 -163 -1224 -38 -798 -441
6569 -441 114 156 377 530 -1117 327 -648 -373 -71 -575 100 582 229 592 -283 647 94 -3 503 -588
6589 -588 -1350 -550 -395 456 207 -436 -74 -639 -196 -1030 -135 -136 -1608 -433 -549 50 -236 1143 332 674
6609 674 117 -197 -568 102 493 -345 -193 -848 -912 -351 -60 -246 -61 35 53 -301 -479 385 -93 -529 84
6630 84 -400 -419 -623 -439 -447 612 -223 363 528 893 186 289 212 -490 78 -378 -37 -246 -176 -177 -25 449
6652 449 -1093 14 -287 -854 -647 -425 199 -445 333 -259 378 1440 -132 -319 430 -721 -434 202
6670 202 -865 -93 39 326 -77 -555 198 59 140 -459 -231 -417 -348 47 -1117 64 -1024 -577 -411
6689 -411 96 1176 93 184 1223 -565 -648 -135 -757 470 -86 -529 256 344 -333 302 297 -487 -714 -402
6709 -402 -74 -1131 -902 -886 394 -546 901 680 759 382 756 -165 222 676 -243 -9 -14 61 479 520 785
6730 785 1538 98 -19 42 25 136 -784 -615 311 -239 -58 -630 200 790 -34 -34 -659 274 -602 208 -200
6751 -200 859 317 -240 -171 -267 1004 677 305 110 424 -1752 -484 -795 -1367 243 -261 -353 -78 -514
6770 -514 78 -609 -356 139 21 220 -494 714 568 314 -161 554 370 803 251 -228 -182 -383 -63 441
6790 441 -382 -170 -272 -421 -68 -4 273 -573 -359 253 151 -133 -537 -332 271 210 29 153 12 512 241
6811 241 -385 379 733 400 -201 906 -779 -40 -389 738 157 -79 -229 147 310 -297 -680 -1017 -260
6830 -260 -51 328 -64 380 1367 -378 69 -440 -224 1264 -300 -231 1052 232 -499 147 -69 -60 -63 -826
6850 -826 -332 250 -70 -1234 -715 258 -756 198 -403 242 -683 401 1101 169 231 -444 230 296 -20 -511
6870 -511 -227 -224 -615 265 1180 -10 -850 585 -1228 -625 121 -166 -438 507 -324 373 -1343 -984 239
6889 239 -413 -425 179 32 -352 -310 231 796 -200 -96 261 1141 846 329 -284 170 -1073 128 -219 -249
6909 -249 -758 371 -469 -400 788 118 1228 684 150 252 -197 845 273 -621 620 612 180 -1 1018
6928 1018 1081 49 -862 -142 -212 208 -715 931 -387 -870 -901 -304 -707 870 -659 -316 -272 222 473
6947 473 -1138 -669 -182 778 230 65 -184 -307 215 432 -369 116 -1238 -281 345 138 -91 -204 191
6966 191 -63 -720 -426 -295 -674 436 -382 -55 -1294 -224 -500 -561 592 1136 501 316 1002 356 -312
6985 -312 431 -246 -271 -459 -10 -109 559 -450 1051 -489 -101 -1001 -124 95 -475 561 -295 1164 567
7004 567 -683 -103 -371 -92 1144 -46 633 -351 -202 -536 -726 256 204 -567 -248 545 806 -3 -999
7023 -999 -114 53 -823 -57 -492 -386 628 -65 101 753 664 337 510 -558 -450 131 -3 910 44 629
7043 629 -163 299 272 59 -245 -1065 227 197 -236 -103 -1045 -322 -173 17 158 84 115 -152 468 -436 -824
7064 -824 -110 -592 -309 -433 114 332 404 -381 362 -173 -25 -794 -474 -858 219 -702 -161 97 -434 259
7084 259 942 903 538 -95 -240 -100 182 -641 -111 -131 461 355 32 229 408 -13 -18 125 -46 133 -737
7105 -737 981 225 -526 -248 -110 -1118 14 111 -567 -434 -661 -70 -136 223 -788 722 157 -88 471
7124 471 544 69 96 224 -110 749 -151 -196 -377 372 -239 398 381 -1353 -361 -169 -445 -302 -816 533 236
7145 236 -1107 29 288 -339 -345 552 428 712 -527 515 -424 -54 -284 248 -603 -400 -47 695 215
7164 215 -755 720 -271 -522 436 -269 -295 -433 -546 -88 -948 711 93 620 379 376 646 188 156 -94 33
7185 33 205 489 -563 284 -137 59 -257 -35 1 -1003 114 557 -967 -448 -725 185 -403 142 319
7204 319 -310 -144 156 294 -206 -721 828 -25 562 -359 -40 99 350 -210 -400 42 -285 -82 -691 -259
7224 -259 -602 170 168 -318 527 37 405 217 -165 -515 -358 697 -905 -182 73 -144 782 -201 376 -381
7244 -381 -164 -287 -73 226 -5 -295 594 -978 118 0 -40 -528 178 -281 -166 336 32 409 822 323
7264 323 -256 71 107 -704 403 712 -414 473 322 -109 329 -994 -575 -219 57 -578 -742 482 -285
7283 -285 -369 535 443 91 209 -482 548 189 -785 1155 357 298 686 261 -101 223 -217 -99 413 -764
7303 -764 -90 -551 -59 -525 -284 -172 -701 -283 -688 138 -429 -1365 -134 -138 -525 -779 -166 -197 -254 787 544
7324 544 125 1066 -225 396 129 -760 -143 -9 133 -746 -687 -74 -102 -413 -869 -329 -128 -608 -274 187
7344 187 453 545 682 -68 -109 -299 507 626 230 -167 -203 -651 496 -796 -371 530 323 970 -244 473
7364 473 423 -85 -127 164 -755 55 19 -617 -756 859 -112 -52 -67 -295 263 892 443 697 410 308 245 -129
7386 -129 557 281 -131 136 -81 -201 312 347 -816 14 -366 -188 182 -242 605 -301 485 -4 25 158
7406 158 116 69 -102 -132 -714 95 215 830 480 471 1 541 -176 764 -810 -481 -268 395 -906 -305 -521
7427 -521 79 355 980 228 334 946 -253 440 300 147 340 174 162 780 1606 876 -307 652 -308 -625
7447 -625 -447 -9 -19 327 -182 410 -550 50 452 634 -265 38 -742 -519 345 719 500 -786 -138 119
7467 119 752 -30 258 488 -349 550 182 -237 -210 -548 -247 -311 -182 597 187 -48 1030 -458 -9 134
7487 134 -26 111 475 -75 -137 200 447 682 885 1168 210 -591 416 1283 -397 -31 -591 -558 143 382
7507 382 -511 953 -431 -285 -383 -35 402 -549 -33 -549 137 820 -561 297 827 -834 605 -749
7525 -749 557 919 565 -198 -631 352 -528 953 -10 216 -860 22 630 -583 135 -980 -428 -538
7543 -538 -913 828 -463 -411 521 450 -83 794 647 107 -789 251 -531 160 -109 -587 -25 412 -661
7562 -661 16 -144 122 50 -824 243 40 -332 -753 173 1038 204 -344 519 294 275 383 -521 -321 -439
7582 -439 1363 -948 218 86 -664 27 10 -1013 -310 -292 238 -368 255 -207 -702 165 71 767 879 -533
7602 -533 -403 -279 398 -515 -72 531 -330 -36 314 795 946 97 642 -209 471 -348 825 -735 -128
7621 -128 -393 -416 -388 279 369 -177 390 145 389 249 -935 566 533 -499 1473 331 529 -52 112 601
7641 601 -918 -219 259 176 -899 -436 -980 -269 -130 -1041 27 -112 210 -387 173 -318 -259 -163 393 -721
7661 -721 -111 -96 665 702 61 569 -720 -640 -241 754 589 -227 386 416 614 -596 -204 -44 228 -597 -182
7682 -182 -143 372 -287 404 -397 134 -626 -419 241 60 590 328 -66 589 316 80 530 21 72 427 898
7703 898 -738 -359 99 -234 -964 -582 212 -1045 -242 160 -1270 279 -23 769 766 -38 296 -3 -140
7722 -140 378 -281 479 -50 1259 -126 -869 -200 -985 102 251 -444 -798 251 -806 -205 242 -456
7740 -456 279 853 -612 -26 540 634 223 390 -179 249 -46 117 453 -73 191 -15 -341 960 -1162
7759 -1162 -248 7 -378 -600 -48 -573 -310 -395 -76 -201 -596 362 538 -22 -456 -769 -15 1043 383 103
7779 103 382 296 1002 -903 107 672 555 -307 497 726 -953 -653 367 312 -108 243 485 782 166
7798 166 475 -347 -87 103 77 204 393 623 609 24 144 810 566 -52 -437 357 607 -502 -132 278
7818 278 217 122 -546 -1075 395 -823 430 -581 -100 -945 475 -309 -540 105 -239 37 23 -421 893
7837 893 -61 406 1118 1074 -78 2 -7 436 524 647 285 -863 -536 59 67 -788 177 69 -293 274 -62 56
7859 56 27 706 302 -46 -576 431 584 -424 -97 1282 359 -378 69 267 357 -75 -452 80 407 -125
7879 -125 215 58 -9 -245 255 -66 52 -236 -454 82 -33 -585 -8 -151 111 304 643 647 265 1182 316
7900 316 486 412 -224 -1304 -545 -467 802 -547 -653 -623 136 -163 -1625 514 -172 711 -128 -96 -21 89
7920 89 -133 -272 438 -923 -42 36 -725 751 532 -219 -45 529 -841 79 -523 -54 -941 207 -265
7939 -265 1252 119 -317 241 49 785 -25 146 303 181 386 -206 230 1063 -175 184 557 695 -742
7958 -742 -264 478 -672 150 -266 -148 527 4 98 -278 -392 -625 -332 -168 8 -532 -180 199 68 -947
7978 -947 661 271 460 274 1028 -753 -197 238 73 -1076 -40 354 573 53 74 -233 -777 34 -347
7997 -347 -213 166 139 -28 63 -108 480 -334 -534 19 302 107 -360 142 210 -61 512 434 403 -603 4
8018 4 -98 -424 -294 158 -526 629 -30 -608 184 -415 -702 477 415 -221 -740 370 -767 -523 460 199
8038 199 -150 710 -55 -11 283 354 -154 -281 470 432 282 143 39 444 -219 -787 307 -38 100 -995
8058 -995 49 610 704 -562 -225 -148 -220 0 1116 -291 432 1034 162 73 -757 322 514 604 -327 445
8078 445 -506 367 329 618 255 -137 240 -877 518 -156 -114 337 -462 151 -229 924 603 -997 397
8097 397 -20 -355 -520 -521 -584 9 -847 517 -232 -370 -877 -664 936 340 -543 -155 540 834 1014 1095 191
$$ [...]
##END NTUPLES=NMR FID
##END=
