##TITLE=1H_UK_23_6_1
 CD2Cl2
 108 sc, 
 19.10.2022
##JCAMPDX= 6.0         $$ Bruker NMR JCAMP-DX V2.0
##DATA TYPE= NMR FID
##DATA CLASS= NTUPLES
##ORIGIN= UXNMR, Bruker Analytische Messtechnik GmbH
##OWNER= root
$$ XWIN-NMR		Version 3.5
$$ Wed Oct 19 14:52:05 2022 Russian Standard Time (UT+4h)  she@DPX200
##.OBSERVE FREQUENCY= 200.1313499994
##.OBSERVE NUCLEUS= ^1H
##.DELAY= (6, 6)
##.ACQUISITION MODE= SIMULTANEOUS
##.ACQUISITION SCHEME= undefined
##.AVERAGES= 108
##.DIGITISER RES= 18
##SPECTROMETER/DATA SYSTEM= spect
##.PULSE SEQUENCE= zg30
##.SOLVENT NAME= CD2Cl2
##.SHIFT REFERENCE= (INTERNAL, CD2Cl2, 0, 15.7039)
##AUDIT TRAIL= $$ (NUMBER, WHEN, WHO, WHERE, WHAT)
$$ ##TITLE= Audit trail, XWIN-NMR		Version 3.5
$$ ##JCAMPDX= 5.01
$$ ##ORIGIN= Bruker BioSpin GmbH
$$ ##OWNER= she
$$ F:/spectra/data/she/nmr/H-F/1/audita.txt
$$ ##AUDIT TRAIL=  $$ (NUMBER, WHEN, WHO, WHERE, WHAT)
(   1,<2022-10-19 14:45:56.10 +0400>,<she>,<DPX200>,
      <continue with go, POWCHK disabled, PULCHK disabled
       configuration hash MD5:
       00 E9 B6 7A A2 85 ED C7 34 08 36 98 17 FE 4E 26
       data hash MD5: 16K
       5F 83 02 2E DD 4E 95 7B 0C ED 78 0E BB 83 5F 61>)
$$ ##END=
$$ 
$$ hash MD5
$$ 7D E8 EE 93 AE C6 55 49 A5 35 93 BF 7C 44 23 4E
##$RELAX= 
##$RELAX= 
##$RELAX= 
##$RELAX= 
##$RELAX= 
##$RELAX= 
$$ Bruker specific parameters
$$ --------------------------
##$DU= <F:/spectra>
##$EXPNO= 1
##$NAME= <H-F>
##$PROCNO= 1
##$TYPE= <nmr>
##$USER= <she>
##$AMP= (0..31)
100 100 100 100 100 100 100 100 100 100 100 100 100 100 100 100 100 100 
100 100 100 100 100 100 100 100 100 100 100 100 100 100 
##$AQSEQ= 0
##$AQ_mod= 1
##$AUNM= <au_zg>
##$AUTOPOS= <>
##$BF1= 200.13
##$BF2= 200.13
##$BF3= 200.13
##$BF4= 200.13
##$BF5= 200.13
##$BF6= 200.13
##$BF7= 200.13
##$BF8= 200.13
##$BYTORDA= 1
##$CFDGTYP= 0
##$CFRGTYP= 5
##$CHEMSTR= <none>
##$CNST= (0..31)
1 1 145 1 1 1 1 1 1 1 1 1 1 1 1 1 1 1 1 1 1 1 1 1 1 1 1 1 1 1 1 1 
##$CPDPRG= <>
##$CPDPRG1= <>
##$CPDPRG2= <>
##$CPDPRG3= <>
##$CPDPRG4= <mlev>
##$CPDPRG5= <mlev>
##$CPDPRG6= <mlev>
##$CPDPRG7= <mlev>
##$CPDPRG8= <mlev>
##$CPDPRGB= <>
##$CPDPRGT= <>
##$D= (0..31)
0 1.2 0 0 0 0 0 0 0 0.06 0 0.03 0 0 0 0 0.0002 0 0 0 0 0 0 0 0 0 0 0 0 
0 0 0 
##$DATE= 1666175946
##$DBL= (0..7)
120 120 120 120 120 120 120 120 
##$DBP= (0..7)
150 150 150 150 150 150 150 150 
##$DBP07= 0
##$DBPNAM0= <>
##$DBPNAM1= <>
##$DBPNAM2= <>
##$DBPNAM3= <>
##$DBPNAM4= <>
##$DBPNAM5= <>
##$DBPNAM6= <>
##$DBPNAM7= <>
##$DBPOAL= (0..7)
0.5 0.5 0.5 0.5 0.5 0.5 0.5 0.5 
##$DBPOFFS= (0..7)
0 0 0 0 0 0 0 0 
##$DE= 6
##$DECBNUC= <off>
##$DECIM= 32
##$DECNUC= <off>
##$DECSTAT= 4
##$DIGMOD= 1
##$DIGTYP= 9
##$DL= (0..7)
0 120 120 120 120 120 120 120 
##$DP= (0..7)
150 150 150 150 150 150 150 150 
##$DP07= 0
##$DPNAME0= <>
##$DPNAME1= <>
##$DPNAME2= <>
##$DPNAME3= <>
##$DPNAME4= <>
##$DPNAME5= <>
##$DPNAME6= <>
##$DPNAME7= <>
##$DPOAL= (0..7)
0.5 0.5 0.5 0.5 0.5 0.5 0.5 0.5 
##$DPOFFS= (0..7)
0 0 0 0 0 0 0 0 
##$DQDMODE= 0
##$DR= 18
##$DS= 0
$$ [...]
##$SUBNAM2= <"">
##$SUBNAM3= <"">
##$SUBNAM4= <"">
##$SUBNAM5= <"">
##$SUBNAM6= <"">
##$SUBNAM7= <"">
##$SUBNAM8= <"">
##$SUBNAM9= <"">
##$SW= 18.0517283424941
##$SWIBOX= (0..15)
0 0 2 0 0 0 0 0 0 0 0 0 0 0 0 0 
##$SW_h= 3612.71676300578
##$TD= 16384
##$TD0= 1
##$TE= 0
##$TE2= 300
##$TE3= 300
##$TEG= 300
##$TL= (0..7)
0 120 120 120 120 120 120 120 
##$TP= (0..7)
150 150 150 150 150 150 150 150 
##$TP07= 0
##$TPNAME0= <>
##$TPNAME1= <>
##$TPNAME2= <>
##$TPNAME3= <>
##$TPNAME4= <>
##$TPNAME5= <>
##$TPNAME6= <>
##$TPNAME7= <>
##$TPOAL= (0..7)
0.5 0.5 0.5 0.5 0.5 0.5 0.5 0.5 
##$TPOFFS= (0..7)
0 0 0 0 0 0 0 0 
##$TUNHIN= 0
##$TUNHOUT= 0
##$TUNXOUT= 0
##$USERA1= <user>
##$USERA2= <user>
##$USERA3= <user>
##$USERA4= <user>
##$USERA5= <user>
##$V9= 5
##$VALIST= <valist>
##$VCLIST= <CCCCCCCCCCCCCCC>
##$VD= 0
##$VDLIST= <DDDDDDDDDDDDDDD>
##$VPLIST= <PPPPPPPPPPPPPPP>
##$VTLIST= <TTTTTTTTTTTTTTT>
##$WBST= 1024
##$WBSW= 4
##$XGAIN= (0..3)
0 0 0 0 
##$XL= 0
##$YL= 0
##$YMAX_a= 582456
##$YMIN_a= -768483
##$ZGOPTNS= <>
##$ZL1= 120
##$ZL2= 120
##$ZL3= 120
##$ZL4= 120
##$ABSF1= 10
##$ABSF2= 0
##$ABSG= 5
##$ABSL= 3
##$ALPHA= 0
##$AQORDER= 0
##$ASSFAC= 0
##$ASSFACI= 0
##$ASSFACX= 0
##$ASSWID= 0
##$AUNMP= <proc_1d>
##$AZFE= 0.1
##$AZFW= 0.1
##$BCFW= 1
##$BC_mod= 2
##$BYTORDP= 1
##$COROFFS= 0
##$CY= 11.3945322036743
##$DATMOD= 1
##$DC= 2
##$DFILT= <>
##$DTYPP= 0
##$F1P= 2.36226072786647
##$F2P= -0.459571619588291
##$FCOR= 0.5
##$FTSIZE= 0
##$FT_mod= 4
##$GAMMA= 1
##$GB= 0.15
##$INTBC= 1
##$INTSCL= 1
##$ISEN= 128
##$LB= 0.24
##$LEV0= 0
##$LPBIN= 0
##$MAXI= 10000
##$MC2= 0
##$MEAN= 0
##$ME_mod= 0
##$MI= 1.114404
##$NCOEF= 0
##$NC_proc= 0
##$NLEV= 6
##$NOISF1= 3.799351
##$NOISF2= 2.8
##$NSP= 1
##$NTH_PI= 0
##$NZP= 0
##$OFFSET= 15.70392
##$PC= 1
##$PHC0= -18040.38
##$PHC1= 23.2007
##$PH_mod= 1
##$PKNL= yes
##$PPARMOD= 0
##$PSCAL= 0
##$PSIGN= 0
##$REVERSE= no
##$SF= 200.130013532006
##$SI= 16384
##$SIGF1= 3
##$SIGF2= 2
##$SINO= 400
##$SIOLD= 16384
##$SREGLST= <1H.CDCl3>
##$SSB= 0
##$STSI= 0
##$STSR= 0
##$SW_p= 3612.71676300578
##$SYMM= 0
##$S_DEV= 0
##$TDeff= 0
##$TDoff= 0
##$TI= <>
##$TILT= no
##$TM1= 0
##$TM2= 0
##$TOPLEV= 0
##$USERP1= <user>
##$USERP2= <user>
##$USERP3= <user>
##$USERP4= <user>
##$USERP5= <user>
##$WDW= 1
##$XDIM= 8192
##$YMAX_p= 0
##$YMIN_p= 0
$$ End of Bruker specific parameters
$$ ---------------------------------
##NTUPLES= NMR FID
##VAR_NAME=  TIME,          FID/REAL,        FID/IMAG
##SYMBOL=    X,             R,               I
##VAR_TYPE=  INDEPENDENT,   DEPENDENT,       DEPENDENT
##VAR_FORM=  AFFN,          ASDF,            ASDF
##VAR_DIM=   8192,          8192,            8192
##UNITS=     SECONDS,       ARBITRARY UNITS, ARBITRARY UNITS
##FACTOR=    0.0002768,     1,               1
##FIRST=     0,             0,               0
##LAST=      2.2672688,     0,               0
##MIN=       0,             -768483,         0
##MAX=       2.2672688,     582456,          0
$$ Real data points
##PAGE= N=1
##DATA TABLE= (X++(R..R)), XYDATA
0 0 0 0 0 0 0 0 0 0 0 0 0 0 0 0 0 0 -108 108 -108 108 -108 109 -216 216 -216 324 -324 432 -432 540 -614 669
32 669 -762 869 -985 1118 -1268 1414 -1585 1768 -1972 2192 -2425 2691 -2977 3283 -3630 4004
48 4004 -4412 4855 -5356 5903 -6498 7172 -7922 8765 -9729 10829 -12106 13604 -15406
61 -15406 17604 -20358 23926 -28762 35708 -46681 66506 -114505 582456 -3386 -426089
72 -426089 546956 113289 -390619 67295 165071 -400282 443 313663 -174646 -154237
82 -154237 420097 74918 -331266 73408 203572 -318727 -274812 65732 -138219 -286626
92 -286626 110818 148405 -147770 79663 371086 21904 -93001 264789 86704 -306946
102 -306946 3824 161128 -270681 -173330 243301 -35584 -176586 286935 196414 -219197
112 -219197 87305 249715 -222697 -179799 180772 -129421 -298587 145832 138232 -183733
122 -183733 85992 298552 -32653 -34231 245167 17102 -232137 6978 39341 -244937
132 -244937 -138227 95171 -92592 -159770 149342 139623 -113441 42229 192658 -89384
142 -89384 -131674 138646 -13816 -239395 44157 152327 -117433 20687 280306 30231
152 30231 -58499 244917 120734 -177569 19461 87251 -232659 -156709 101408 -106368 -203754
163 -203754 102397 89450 -122876 59198 172424 -88070 -96252 115075 -25427 -182600
173 -182600 10933 55225 -123255 -7692 185526 37778 -33037 168758 126011 -76235
183 -76235 24754 97322 -131093 -146710 56646 -42457 -162519 45527 98360 -81282 32155
194 32155 187677 -7457 -77773 100890 11235 -157048 -7621 41004 -141132 -61973 119626
205 119626 5178 -47042 126719 86844 -68126 31771 82730 -99709 -112510 20250 -56427
216 -56427 -124245 29797 64026 -52750 30900 153009 39960 -14272 95940 34412 -97717
227 -97717 -9176 41603 -98892 -78163 63572 379 -50839 92581 91050 -50834 10954
238 10954 83315 -58048 -97193 10430 -55389 -137935 -6065 46494 -55592 1676 116267
249 116267 37275 464 101924 55127 -67613 -11059 31771 -75593 -71574 31317 -14524
260 -14524 -53405 61125 86926 -7656 23577 78813 -16798 -56516 14910 -30844 -113639 -39345
272 -39345 17200 -44501 -11750 80170 36168 1248 81163 68867 -30984 -14665 15831 -65912
284 -65912 -77340 -818 -24858 -65027 17557 61415 9502 32234 80066 14846 -27872 23103
296 23103 -1065 -75316 -45122 -4864 -44106 -21554 54964 38172 7678 61130 69238 3816
308 3816 37 14204 -52223 -79209 -28352 -32508 -63400 -13256 28482 8311 31421 76504 40207
321 40207 -1969 19708 9043 -42856 -37023 -17395 -43089 -35982 22011 34381 15612 44692
333 44692 58675 20660 11169 21786 -21396 -64413 -45664 -37406 -57158 -29494 9495 2101 12530
346 12530 57851 57742 22107 22858 18879 -22269 -33569 -16935 -32349 -47120 -9921 16554 13904
359 13904 32026 52630 33115 12376 22051 7618 -33084 -43978 -36733 -46727 -41967 -6688 7918
372 7918 2103 27371 54034 38968 25469 28501 2429 -29705 -23925 -18586 -40644 -37074 -6106
385 -6106 -362 3919 34579 42946 16518 13565 23082 -1801 -28304 -22749 -30768 -47878 -22684 9648
399 9648 2517 8435 42808 44264 27461 37439 32001 -13074 -27810 -10272 -31250 -48656 -20446
412 -20446 -10015 -25523 5623 41066 17608 5615 30423 11745 -23050 -7496 -7284 -46762
424 -46762 -39638 3184 -3613 -7790 36084 44591 16667 36646 54747 9401 -17583 1700 -19826
437 -19826 -51995 -23119 -6508 -35436 -17934 32467 20676 3370 37691 29673 -18773 -6743
449 -6743 13974 -36144 -50097 -5332 -13410 -33389 19590 43531 1959 18786 59176 16464
461 16464 -13338 18395 -7439 -58642 -25130 3992 -38444 -27994 29920 14414 -3343 48006
473 48006 49999 -9140 2337 30298 -20298 -43311 874 -14115 -49613 1537 36185 -5144
485 -5144 2994 53158 17406 -18847 22651 11720 -56540 -37315 2238 -41323 -43216 22757 10742
498 10742 -22426 38938 63532 1960 6671 47447 -7648 -41005 12428 -351 -54949 -10738
510 -10738 32159 -13431 -3285 56264 20603 -21460 27636 27997 -45325 -30557 5434 -44325
522 -44325 -52607 16168 8388 -32585 21126 56713 2777 8926 54177 2586 -41526 9589 6226
535 6226 -55740 -23165 23457 -23165 -20166 54241 31414 -19716 28657 41356 -30616 -20670 23318
548 23318 -34641 -59703 12468 12895 -37219 15963 57028 -884 4603 61900 12785 -39815 7978
561 7978 5460 -60725 -28278 17724 -34324 -38068 38438 24983 -21923 28107 44885 -24511 -17633
574 -17633 31680 -19355 -56023 7006 10744 -37379 11747 57459 1720 -1524 62739 26923
586 26923 -29576 14150 15200 -59176 -38287 19299 -31589 -49644 26658 19712 -27901 26442
598 26442 52395 -21215 -19362 38264 -12464 -52016 9446 8442 -48127 -111 50991 -2233
610 -2233 -5603 56747 25360 -23411 21958 25242 -47599 -35195 14217 -27435 -47398 18088 17303
623 17303 -31180 18367 57368 -4904 -13106 40274 531 -46827 7902 15125 -48719 -17475
635 -17475 41008 -7210 -17004 51083 27274 -29052 20537 37066 -38911 -34232 17085 -31412
647 -31412 -54315 15879 14430 -37607 11673 53461 -1482 -2018 49418 9344 -36219 12232 17360
660 17360 -40874 -20131 27351 -12725 -23574 39124 29418 -22919 11930 37578 -23672 -28778
672 -28778 17662 -22423 -59057 1222 14154 -37486 -1120 48090 -102 -6114 54256 24459
684 24459 -29879 12273 23325 -39705 -21920 25935 -18512 -35074 31207 25636 -21554 17158
696 17158 39178 -19071 -17891 24365 -14840 -50958 -2976 4065 -37633 -5876 37426 -215
708 -215 -6506 45272 31305 -16225 12837 25370 -31827 -28498 17980 -14732 -40512 13186 22356
721 22356 -20269 11720 43747 -8341 -18597 28176 -219 -42696 -2680 6101 -39461 -13516
733 -13516 34287 -782 -11515 39987 28602 -12295 17545 29490 -25103 -26761 11886 -16443
745 -16443 -38869 4732 9375 -23861 4244 38985 1010 -11058 25310 6251 -31100 -1711
757 -1711 10156 -32306 -22346 22728 1334 -13474 32491 29815 -11390 14080 35362 -12258 -24027
770 -24027 11124 -13219 -39635 1190 9290 -27252 -4547 33205 2866 -6248 28898 10778
782 10778 -25078 1691 12702 -26987 -20522 12545 -5600 -15325 23212 24797 -7197 9817 29811
795 29811 -4032 -14937 10454 -8144 -35765 -6681 6822 -22066 -9626 24187 4539 -6635
807 -6635 26464 19520 -15475 67 15324 -17417 -20447 9702 -6694 -23266 12177 21090 -7336
820 -7336 5958 25379 -2387 -10579 12155 -2499 -29608 -9446 1912 -19228 -7942 17459
832 17459 3744 -5427 21198 21500 -5106 3045 12717 -13518 -16711 6340 -3336 -20818 1880
845 1880 14203 -5203 3164 21221 1734 -10997 9428 4016 -21508 -9021 2017 -16916 -11279
858 -11279 14410 4969 -6612 14053 18289 -1754 4796 15824 -7000 -15695 3436 -3063 -18299
871 -18299 -2574 6982 -8226 -643 17922 5223 -5408 7667 4961 -11938 -5096 3121 -12260
884 -12260 -13685 6352 4938 -3052 9449 15539 118 3972 14402 -275 -12361 -2527 -3013 -15371
898 -15371 -7352 2214 -8772 -6237 10851 6830 -1546 6830 7635 -6642 -3824 5494 -5863 -11376
912 -11376 464 2084 -3582 6547 14149 3879 2945 11545 4693 -5617 -1658 -4440 -15054 -10694
926 -10694 -1375 -6507 -7570 4164 6393 1044 6867 10675 -55 -3459 2955 -1854 -8825 -3502
940 -3502 -512 -5043 650 11474 7063 2699 7850 6488 -2417 -1881 -705 -11596 -13806 -3999 -4597
955 -4597 -7810 1145 5476 1906 5308 11948 6073 -448 1759 -85 -6259 -4082 109 -4490 -4739
970 -4739 3561 6989 2328 4971 7587 -639 -3470 666 -4051 -13777 -9596 -4500 -8665 -3463 6791
985 6791 4750 2554 11874 10897 3164 5042 4712 -4801 -7506 1042 -2970 -8880 92 3922 216 3273
1001 3273 9356 1282 -3514 650 -704 -10316 -8581 -4974 -8154 -7602 3909 3674 1296 7732 12685
1016 12685 5040 3810 9058 -1173 -9370 -2973 -880 -9734 -4160 4183 -1976 -248 10950 6090
1030 6090 -2577 3132 4170 -8458 -7203 1067 -7832 -11618 1610 4762 -1718 6382 12950 4105
1044 4105 2457 10703 1868 -8481 -2465 397 -10666 -7453 2987 -3331 -6894 6333 7818 -2530
1058 -2530 2090 7345 -4729 -7571 4170 -2326 -11709 77 5538 -4934 2969 14857 3644
1071 3644 -2715 11888 7145 -7004 -709 2319 -11794 -9339 3734 -4081 -11119 4293 6473 -5217
1085 -5217 3849 11103 -2611 -6800 4885 422 -10335 32 5148 -7438 -1403 11714 4449
1098 4449 -3890 10048 7950 -6178 -124 6705 -8430 -11663 3226 -2380 -11722 2292 8111 -7020
1112 -7020 -435 14182 1177 -7240 7897 3246 -11581 -431 6966 -8880 -7281 9982 1123
1125 1123 -5688 8275 7524 -7308 -1135 8413 -7373 -10352 2743 -3082 -12608 2212 7648 -5488
1139 -5488 -2446 11950 3671 -3468 8696 6082 -9705 -610 9171 -6801 -7120 7386 954 -9442
1153 -9442 6578 8771 -8938 -2269 10007 -5363 -10131 6144 527 -14522 860 9394 -7359
1166 -7359 -3284 12397 1125 -6045 10301 8001 -8705 -1306 7976 -6363 -8449 7989 513
1179 513 -11792 3827 8643 -6397 -2276 10843 -2179 -10292 5026 2867 -11904 -2037 8164
1192 8164 -5445 -3429 12673 3284 -6880 7517 10035 -6892 -1939 8257 -6501 -10284 6297
1205 6297 1456 -11390 1755 7982 -6889 -2820 10918 -1901 -9458 4814 4675 -10926 -145
1218 -145 7650 -6077 -4485 11972 3778 -6104 6627 8685 -5848 -2042 8442 -5022 -10124 3197
1232 3197 1769 -11960 520 8692 -5791 -4168 9622 606 -9021 3449 4143 -9875 -2090 9790
1246 9790 -4526 -6530 8966 5939 -6982 5412 9228 -7414 -3353 7667 -4064 -10593 3582
1259 3582 646 -11047 -166 8598 -5214 -5111 9314 1777 -6985 4401 5986 -9162 -1564 8676
1273 8676 -3244 -6277 7341 5719 -5292 5620 9745 -5021 -5039 6205 -2493 -10414 2335 2596
1287 2596 -10050 -2759 8362 -3510 -5118 8129 1898 -6633 5412 7135 -6948 -3521 6934
1300 6934 -1870 -6042 6786 3136 -5346 2758 9216 -3821 -3494 7430 -2241 -8639 2775 2260
1314 2260 -9240 -2676 5525 -3385 -3472 7560 2955 -6376 4792 7523 -4225 -2879 6615 -2732
1328 -2732 -6852 4984 2597 -7537 557 6034 -3624 -3754 5617 -477 -9359 1692 3630 -7439
1342 -7439 -3130 5679 -2699 -3546 7725 3987 -5606 3071 7667 -3019 -2476 6654 -757 -6533 3572
1357 3572 4132 -6441 614 5719 -3273 -4066 5508 1203 -7827 631 3742 -6765 -3401 3494 -3170
1372 -3170 -6165 3962 3414 -4470 995 5478 -2821 -3241 6536 1005 -6074 1880 3399 -5976 -843
1387 -843 5904 -1968 -3104 5601 1564 -3805 2110 4367 -5083 -2397 4277 -1441 -5366 2218 2382
1402 2382 -4495 1174 4904 -3106 -3337 3737 601 -5264 531 1859 -6136 -2630 3737 -1751 -4156
1417 -4156 3665 1847 -3858 2061 5369 -2647 -2013 5132 303 -3725 2795 3629 -3471 -313 5943
1432 5943 571 -2505 4454 1032 -4321 585 2772 -3996 -3170 2127 -990 -3406 2668 2155 -2586
1447 -2586 372 3774 -1109 -2283 2911 208 -3283 1875 1738 -2733 -886 2652 -345 -1490 2703
1462 2703 1682 -2839 -790 2935 -946 -1969 2587 1765 -2630 2028 3077 -1899 -432 2284 -729
1477 -729 -2030 2565 804 -3601 735 2479 -2552 -2193 1340 -1248 -3286 2109 1174 -2745 -943 1572
1493 1572 -1907 -1171 2673 848 -1066 1394 3926 -2 462 2775 762 -1113 2265 862 -1838
1508 -1838 -757 2314 -957 -1356 2192 154 -3692 -1110 1320 -1829 -1616 1056 -2453 -2001 1576 1973
1524 1973 5 758 2489 1464 -195 1298 106 -2584 16 1614 -1642 -1049 1740 -73 -348 1087
1540 1087 1442 -1714 -414 294 -1420 -2208 1518 21 -432 833 2417 313 -72 3189 521 -1174
1556 -1174 1147 -209 -2294 -1479 408 -1641 -1731 487 950 -2263 143 1588 -926 442 1190 -759
1572 -759 -1202 388 914 -1442 -339 1912 1489 510 2893 2010 -479 674 1116 -128 -1401 -603 -857
1589 -857 -2373 -880 -88 -2531 -1267 957 157 -2260 855 1157 -2083 -641 1783 -1428 -1117 1614
1605 1614 1470 -506 2507 4059 -162 762 1285 -312 -2258 287 -129 -3309 -956 720 -944 -1791
1621 -1791 1030 208 -701 1273 2065 -1028 -1199 882 -623 -1000 938 1198 -2253 1034 2407 366
1637 366 -965 2041 261 -2735 1757 716 -2846 -1027 615 -1937 -1480 2389 1544 -1406 824 3532
1653 3532 -726 -976 2022 190 -1581 1324 933 -1789 -343 2041 -977 -1045 2058 124 -2879 -506
1669 -506 768 -2293 -990 1303 -673 -2006 1832 2050 -1369 1907 2911 -534 -438 3581 1164 -2592
1685 -2592 721 2287 -2201 -1226 2114 -924 -1952 2160 1276 -3066 112 1119 -2182 -2871 2267 -753
1701 -753 -3281 833 1097 -2330 154 2588 -237 -164 2434 1379 -2129 1379 2736 -2155 -1115 1848
1717 1848 -1014 -2429 2127 1436 -2026 210 2235 -1974 -2094 2214 -233 -2594 836 1795 -2545 284
1733 284 3169 -1265 -1946 2309 761 -2919 -611 778 -2845 -1917 1799 -31 -2613 2047 735 -1224
1749 -1224 545 2553 -1469 -1551 2743 1043 -1948 1352 2361 -1060 -597 3572 402 -1467 1855 1253
1765 1253 -3091 -196 1707 -2515 -2225 1853 -149 -3537 1726 1781 -2687 -696 2869 -1869 -2322 1928
1781 1928 36 -2772 51 2832 -1650 -894 3320 380 -59 2852 1554 -2441 -556 2118 -2829
1796 -2829 -2765 1337 25 -3548 1082 1777 -1898 -833 2580 -259 -1713 1302 1388 -2789 302 1786
1812 1786 -1382 -719 3366 153 -1448 1412 2238 -2667 -1544 2179 -1439 -2766 863 -202 -2501
1827 -2501 1874 3917 -1572 121 3522 372 -1514 1830 1794 -1846 145 2079 -1396 -1496 2371 413
1843 413 -2169 1477 2166 -1830 -1749 710 -1891 -1888 820 -1066 -2408 -97 2130 -636 199 3239 1364
1860 1364 -2291 2255 1525 -1168 229 2439 -667 -1500 2264 827 -1227 364 2380 -1491 -1056 1665
1876 1665 -844 -3008 837 -565 -2436 -1023 2192 -380 -400 3245 1384 -977 1990 1653 -1497 1084
1892 1084 1601 -1616 -2348 1284 690 -1880 973 1169 -1649 -497 2646 -486 -1858 1362 991 -2853
1908 -2853 455 1114 -861 -595 2448 701 -962 1510 1006 -1592 413 2021 -680 -1819 336 -429
1924 -429 -2530 -173 2419 -1181 -1057 2552 641 -754 619 390 -1746 -403 2340 -469 -1253 1503
1940 1503 742 -418 1803 2189 -559 -122 1331 -815 -1797 513 -214 -2516 -747 1927 -718 -691 1885
1957 1885 -200 -1220 1257 1269 -1977 492 1585 -1115 -1104 1634 380 -485 1280 1444 -579 -786 1672
1974 1672 -917 -1052 -195 186 -1123 -1402 196 -1411 -574 1319 697 -719 829 1467 187 -517 1303
1991 1303 -919 -2210 134 791 -2318 538 2273 415 43 1137 85 -2375 -517 647 -1512
2006 -1512 -1028 343 -1104 -568 1345 1945 -5 859 1447 -1108 -557 233 -1112 -1386 226 284 -595 -885
2024 -885 857 316 -348 1642 465 -1832 613 1451 -2258 -941 380 -510 -2056 1307 831 -942
2040 -942 1570 1992 -821 -528 1709 476 -1205 -203 88 -1424 -282 1316 -64 165 1254 -31
2056 -31 -901 -169 935 -1955 -1430 1083 -470 -702 1002 1050 140 914 1200 -824 -412 381 -663 -546
2074 -546 151 376 -692 169 2347 -163 542 320 512 -604 -421 212 -455 -824 802 607 -227 259
2092 259 809 51 895 1238 786 -1121 -100 -23 -1355 -345 258 -1087 88 736 568 -528 234 -224
2110 -224 -1034 -388 46 382 -874 -573 697 133 -425 1571 232 -710 897 140 270 55 136 -770 -804
2129 -804 -57 -488 -790 -161 46 -307 226 954 -239 43 672 792 -245 91 -252 -594 -154 261 -593
2148 -593 271 460 199 -196 -156 -560 -1489 -1559 488 -99 -2175 -348 440 223 227 1139 1415 357 373 572
2168 572 -748 -338 413 -878 -384 478 1030 29 317 1156 320 -20 972 -403 -27 -18 -181 -1665 -248
2187 -248 415 54 498 611 1329 278 614 1220 602 10 -533 -359 -1314 -1197 307 -254 388 1421 227
2206 227 -322 99 -726 391 -129 -607 -889 -2108 796 77 -357 1029 509 6 565 1716 -864 217
2224 217 207 267 -566 803 -172 -325 -504 809 -244 94 934 -149 -696 -639 316 -1852 -733 1335 -1405
2243 -1405 -474 -135 793 -338 28 844 390 -87 783 87 -1409 31 437 -372 393 1142 -92 101
2261 101 569 48 -259 141 1150 -596 -141 190 337 -556 -388 808 -318 1059 506 488 -536 649
2279 649 372 -892 -573 -63 -346 -763 1508 677 -32 678 699 -167 -154 336 -771 -1076 660 512 -622
2298 -622 88 630 -7 -908 649 68 219 749 275 -41 -296 70 -406 -1092 914 373 -152 573 1743
2317 1743 989 -530 1650 526 -310 728 231 -248 260 423 -204 -1112 1290 112 -1283 226 725
2334 725 520 182 596 -102 389 -146 599 -137 129 1749 838 -254 1597 726 -795 1553 517 -1004
2352 -1004 -173 222 -1054 370 436 289 -957 33 -32 -266 -338 -398 62 -562 -367 6 -505 879 10 -401
2372 -401 -1191 1891 105 97 273 -436 -937 223 235 -343 -736 540 -129 -392 52 443 -829 448 1037
2391 1037 -572 35 -299 -175 -835 -251 863 -55 -685 1293 -150 -805 360 110 323 681 296 -663
2409 -663 -1161 362 -138 -487 258 1109 490 217 590 -119 -752 374 -59 -939 -577 881 -462 -637 1662
2428 1662 760 -30 116 289 -343 -590 -92 -128 -418 79 185 -411 -15 79 595 907 999 -116 529 64
2448 64 -316 -214 650 289 -796 145 495 700 -866 -965 274 -413 -76 -69 211 -131 719 430 57 -531
2468 -531 432 161 -51 155 -396 -423 562 -497 -453 118 590 -389 -883 732 339 -1192 711 1414 -39
2487 -39 349 1110 429 -537 -437 -55 89 -207 -60 -91 211 1049 550 -188 -433 1036 -627 -923 15 141
2507 141 127 379 538 -217 499 218 -156 -688 459 -94 -1235 212 1078 -417 -58 750 563 -186 1602
2526 1602 426 -473 109 1037 -949 374 774 -519 776 -926 -662 -375 561 235 -194 534 357 11
2544 11 141 149 343 -547 62 691 -894 284 479 -3 446 434 655 69 -382 -946 -15 -551 970 1054 103
2565 103 754 209 410 -523 806 152 -438 809 831 -281 -477 1182 -338 -79 551 235 91 1094
2583 1094 112 -908 -303 439 515 353 -238 -430 70 -394 365 -6 -252 757 -48 -168 296 325 -1294
2602 -1294 350 112 499 -421 -222 214 -323 1240 -699 49 -214 -27 -275 -87 -342 485 -1127 52
2620 52 661 531 -989 -48 515 -1179 281 169 -456 -605 185 558 -248 517 259 -22 -570 -515 -57 594
2640 594 -362 -948 -679 -677 -193 4 -595 -265 569 -514 -70 233 -494 274 -231 -127 533 577 891 -112
2660 -112 -469 -10 11 367 -76 -45 -51 -120 -654 -139 128 591 -92 -305 -175 611 -457 -32 303 472 -788
2681 -788 272 -109 166 368 -192 -171 145 538 -1060 -808 -317 1282 13 584 125 -272 23 110 -727
2700 -727 -29 204 105 -489 -322 -179 289 -100 934 557 -143 -25 6 666 -185 -525 521 -492 4 -469
2720 -469 -806 708 1042 -759 -304 253 -787 322 -270 -145 463 836 -415 126 282 -72 706 -33
2738 -33 306 753 183 -70 425 101 772 -377 -188 32 236 -3 638 6 -410 1128 457 -319 369 16
2758 16 -631 -453 -146 317 552 305 291 -559 386 -364 77 61 -48 -451 99 773 981 370 197 -976 -210
2779 -210 -370 -926 99 -507 -30 789 314 1151 42 -671 -6 759 -207 600 708 -28 -381 812 179
2798 179 -200 -898 -193 467 -688 -315 -239 -424 402 370 1178 -462 1215 303 -511 -990 -609 206 457 -739
2818 -739 -400 -413 40 -71 -1177 -92 695 -88 976 139 20 1254 350 -806 369 487 -121 -177 65
2837 65 1135 -67 -1142 -760 79 -157 -6 -348 -939 -342 267 -50 -260 -368 -969 930 67 103 -993
2856 -993 -248 501 -256 -259 -55 -120 428 -745 462 553 -324 449 283 -224 -671 -743 -74 20 230 274 -597 -441
2878 -441 -199 161 534 704 354 -483 -42 623 417 91 -346 -133 -444 271 -32 1078 947 223 -415 -298
2898 -298 921 -444 135 -445 193 273 -837 89 -222 224 584 -992 -1021 101 -113 -788 504 497 -176
2917 -176 -447 405 -95 436 -108 -604 98 99 240 367 -369 -495 -535 -358 62 1027 -847 -142 770 14 -26
2938 -26 -298 26 -370 -271 60 -271 278 -358 -75 131 -113 700 -187 -177 119 315 -1153 192 310 -321
2958 -321 -259 1025 -184 -1095 483 286 300 -62 816 -1013 -770 590 294 86 -433 -675 -117 -454 515
2977 515 -43 -345 144 -632 -686 -13 709 305 195 504 236 28 -374 816 -1191 12 1230 -491 308
2996 308 -1049 -55 -835 -914 160 -74 -289 593 705 -19 578 -86 523 582 503 -175 192 153 -333 -98 -315
3017 -315 359 -329 432 -276 249 14 1552 515 381 -143 -11 402 574 -301 -670 790 1263 340 89
3036 89 498 -151 288 865 12 -345 184 8 -464 -301 -104 113 -129 -222 -245 -71 509 166 -1118 -200 -353
3057 -353 -598 1153 621 631 975 7 455 297 -13 -72 749 608 -373 -374 -99 182 490 -437 -244 412 760
3078 760 585 26 -788 -335 -1011 20 378 -43 -9 597 -160 272 389 1378 260 -407 785 353 139
3097 139 -843 336 -844 -487 517 -347 -74 591 686 -452 -778 -155 704 -62 -17 699 303 539 699
3116 699 123 204 228 128 74 -912 -948 -631 -519 23 -411 -364 -294 -919 -656 -29 -56 -250 -199 265 903 421 -17
3139 -17 -154 -309 640 -74 -18 -125 132 -138 458 -537 -268 629 358 -224 -438 -13 169 -40 68 665 -32
3160 -32 -452 -26 -92 -475 495 245 319 227 -674 -160 -995 -1104 403 1228 -1441 568 1175 195 -626 556
3180 556 -516 -113 -234 1192 -1051 484 635 -1127 644 501 207 -282 474 297 -449 -209 763 293
3198 293 -332 -499 31 644 962 305 -478 -424 533 -212 182 -192 -321 -701 392 89 566 758 208 83
3218 83 321 216 392 -75 543 -157 -1698 130 -237 259 -456 -360 424 350 -780 307 76 -119 400 436
3238 436 -134 -793 -51 -439 149 788 -201 -994 -566 -630 -337 -390 -185 180 276 361 63 -362 -110 -726 -1178
3259 -1178 -170 981 -214 -111 -456 126 -456 -328 -406 100 177 -20 -154 -54 -23 802 -319 172 -807
3278 -807 336 496 -729 183 305 18 905 -139 -922 734 -190 -167 -475 1007 -774 85 285 -234
3296 -234 408 46 -74 235 39 549 -51 -46 -494 265 -722 -396 1200 -911 624 -1143 528 659 254
3315 254 342 -613 -352 51 105 164 172 174 292 356 -285 426 153 -165 487 638 -420 443 -758 -500 -402 -689
3337 -689 -624 -286 269 -557 235 -307 -192 61 354 174 405 102 676 -205 214 -939 115 -338 -128 -43
3357 -43 621 740 22 -1148 -332 293 343 521 56 385 -178 -200 -685 620 -81 -184 284 -664 -1171 -179
3377 -179 -1125 192 367 159 -120 406 454 -157 -13 -12 -189 -399 378 468 -402 -177 -569 -102 440 766 -204
3398 -204 -288 275 198 260 -674 -412 -370 357 31 326 -102 281 -201 -349 -375 150 372 31 -83 -64 -978 -387
3420 -387 251 -39 3 -312 -75 393 -52 220 -425 -1185 172 -177 -283 -371 401 428 291 74 546 844 -19
3441 -19 258 133 1361 -545 13 63 125 50 355 -279 69 390 507 -612 675 -557 874 252 1
3460 1 567 179 240 354 -40 -76 -482 310 -192 -120 780 104 -960 -362 24 -1374 232 76 -418 599
3480 599 -254 49 -43 -218 -438 648 46 -200 217 -531 639 862 498 357 181 193 -1188 -411 -14 -167
3500 -167 184 -314 11 1213 -412 116 -295 -118 -143 -45 871 -424 -205 699 697 536 -569 -647 315 -350
3520 -350 400 330 785 283 416 102 -138 83 80 -310 475 338 -115 73 -186 -744 -76 -73 362 209 -633 227
3542 227 -490 6 -87 132 -632 636 79 358 510 854 -1044 -741 -66 194 449 -172 -15 -792 219
3561 219 194 -105 90 200 316 131 422 53 -261 -198 98 -191 62 457 -220 -62 -1118 -1046 -544 584
3581 584 119 -324 208 -640 358 -179 44 558 389 1027 570 -208 -88 -60 64 296 -752 -227 62 -343
3601 -343 -594 897 483 -807 892 542 -111 -335 392 316 -41 101 341 -446 -1004 404 651 -398 -416
3620 -416 239 -42 397 182 280 -506 -105 -150 -261 -456 -144 -287 -6 440 1027 -51 1135 964 -705 101
3640 101 632 -229 738 186 -604 -16 -146 -341 483 127 342 -290 842 -423 223 812 -298 438 75
3659 75 338 118 -404 -100 134 756 -93 -94 834 -358 -54 -237 -140 381 406 64 -68 228 50 558 -158
3680 -158 -577 -82 -184 -651 -102 603 1485 286 -289 -323 612 -384 66 -644 586 -193 -147 332 -326 609
3700 609 488 384 93 -806 5 -313 -663 1370 609 -391 -1350 6 675 48 683 -697 -260 172 -29
3719 -29 770 -106 -423 -505 59 -524 187 250 582 434 21 279 -132 -511 -410 -601 -60 -271 162 -115 -327
3740 -327 683 -308 -601 -26 -502 -558 492 51 -1534 844 -649 -183 -579 -295 865 -70 195 -702
3758 -702 148 251 652 -486 119 74 1119 -548 595 -83 1285 780 179 1110 405 254 491 -125 3
3777 3 -487 197 -27 9 914 55 509 -304 -305 348 -387 316 -241 -8 484 390 -762 612 -637 -282 -586
3798 -586 -619 -404 -261 -1506 -386 -258 336 -348 -282 240 788 -89 -505 -890 -296 33 -1573 319 187
3817 187 -472 231 1419 131 247 -38 -122 1111 -26 -12 951 -612 -338 -542 218 222 -334 598 -563
3836 -563 408 -317 -549 -459 43 177 -203 512 -287 178 -482 -79 -145 -133 435 1052 -546 712 59 548
3856 548 544 -7 502 -63 700 92 749 463 -47 491 1266 970 -740 -1061 1038 338 911 501 146 911
3876 911 -499 439 -663 110 -14 -502 578 390 -1093 131 266 225 170 187 -876 -405 -102 151 -497
3895 -497 -13 -89 153 645 275 -73 0 -94 22 -56 69 437 283 316 -147 -786 485 310 -700 -449 1
3916 1 -154 -382 304 -260 -524 -30 875 -433 472 150 -445 161 772 -423 -75 633 -436 1136 372
3935 372 170 81 466 -69 3 -49 164 -186 -556 220 -219 21 -285 167 -679 413 -174 49 -37 -115 47
3956 47 243 -175 -583 -1197 89 -858 436 -292 -557 340 148 -364 -196 588 133 -510 -59 35 858 73
3976 73 507 712 324 411 587 546 329 177 345 -106 -226 -155 187 -683 614 506 -417 -1174 -126 -62 178
3997 178 113 -601 677 -330 229 -83 -908 -475 -496 -25 294 895 598 367 192 1069 186 -615 674 136
4017 136 652 124 595 713 -218 89 -325 357 -633 576 -610 -104 58 -599 484 -129 -109 -476 -100
4036 -100 282 -272 -979 582 75 -205 -226 294 159 54 -590 -56 86 -696 -104 -425 732 -139 182 -250
4056 -250 -864 211 -44 -303 243 -165 298 -275 69 378 -208 -664 -38 -253 514 -165 -526 635 -819
4075 -819 -242 -9 -144 46 664 499 -107 -370 418 -688 -1156 558 -93 -386 110 215 200 -390 380 180
4095 180 -247 -856 1156 -997 594 875 -412 -210 267 15 653 -602 -656 -309 -404 -420 -71 -309 -755
4114 -755 -167 1176 -574 47 -818 -941 405 9 -350 -525 -528 -45 560 -760 -195 634 -773 525 853
4133 853 796 -626 -106 562 -589 630 -526 290 243 95 835 577 792 -601 305 -58 -49 -686 -471 3
4153 3 -468 -447 -115 298 67 -567 19 314 568 715 750 142 7 -454 -723 -134 -810 533 -713 -378 -153
4174 -153 -237 109 -266 -707 -1084 -605 928 -133 -303 141 533 -609 -821 356 -835 -489 25 631 -334
4193 -334 692 -3 -550 -282 616 65 467 -765 -232 -380 -334 40 299 -302 427 -823 19 -773 454
4212 454 -227 -16 -403 39 704 330 684 695 7 460 -900 451 -169 377 -188 658 999 909 -1303 -195
4232 -195 256 872 355 -708 369 -298 -42 224 -546 -371 631 350 -828 1032 676 95 203 -94
4250 -94 466 102 -633 307 803 952 636 -441 -66 -60 -492 -524 262 437 813 12 685 653 372 28 368
4271 368 -752 85 411 -32 -188 170 -682 -323 -723 -152 76 297 622 11 22 -2 748 240 -113 169
4291 169 152 -113 300 -124 -358 -376 -179 -332 522 522 -126 439 -113 -34 -279 -133 -231 -163 177 258 -670 538
4313 538 429 -578 516 -51 -356 833 443 761 -184 427 360 -150 316 38 731 -448 52 1119 87
4332 87 -287 -507 269 -250 -296 -322 -500 -932 602 140 361 -305 713 151 -618 28 424 146 862 71
4352 71 348 1020 256 -224 -400 -490 -596 1023 828 93 168 387 -854 471 1229 17 100 736 743 854 529
4373 529 398 -574 619 -798 22 700 -798 -856 27 245 -992 948 -1029 -129 -366 -67 105 -302
4391 -302 59 -500 397 550 -317 -118 -152 674 -234 -367 238 -68 430 985 -473 241 487 1220 -453 -84
4411 -84 -562 88 -289 833 -254 -410 -418 427 -392 -277 -278 -342 351 915 -235 -481 662 -243 -885 261
4431 261 992 -447 1052 55 -831 802 521 548 -463 241 -407 103 -324 607 -121 -177 139 -330 -17
4450 -17 -1079 306 -293 -65 -294 774 737 373 -33 -21 -487 -327 17 -41 -59 392 -66 111 -415 57 -77
4471 -77 258 405 110 381 -298 84 -202 1171 77 230 942 1095 144 -185 -172 -370 1752 -648 -371
4490 -371 232 439 636 222 509 -443 -22 125 137 -287 18 -628 -71 -256 -447 -799 427 464 54 824
4510 824 357 565 55 880 -3 339 137 -202 1295 238 -353 -670 -823 -170 -384 -9 426 52 196
4529 196 114 -1009 431 304 5 132 258 -792 -399 1210 145 -69 477 642 -705 -894 -809 -230 279
4548 279 555 364 -1191 -114 104 238 -24 568 -625 108 841 538 -23 144 -221 -229 317 -1053 513
4567 513 98 286 410 299 -64 -317 -295 -68 824 -193 -530 1172 -1118 473 -304 -27 -171 -329 752
4586 752 -155 316 -913 324 -635 53 -208 62 451 -89 -170 395 223 -331 600 228 656 -60 -114 61
4606 61 -209 -730 -615 122 -358 -262 469 656 446 -1322 -146 -199 552 -732 -525 -300 -170 -615 -65 79
4626 79 645 517 -490 213 443 518 -348 174 201 -6 -259 402 676 296 91 29 -593 193 -301 -267 757
4647 757 -34 -137 540 702 -570 -221 471 309 -353 445 -192 -762 252 -234 1295 204 -136 -941 -93
4666 -93 385 -549 -990 45 689 -878 849 203 -390 -66 292 524 149 -95 -618 734 -459 235 380
4685 380 -408 -298 356 -475 569 -272 -1067 -126 -289 -21 -339 336 162 671 593 -223 -210 754 75 -435
4705 -435 -44 180 22 -74 229 485 172 191 -535 -482 813 181 -643 -584 891 674 -488 632 601 685 190
4726 190 -761 35 149 -174 287 -797 -129 1203 -163 3 -115 -299 -137 -202 -866 324 306 -598 151
4745 151 -144 290 54 574 213 -162 -39 -283 -641 888 205 1055 110 -204 1068 -141 708 -554 -369
4764 -369 340 22 -306 -335 208 624 500 -740 -151 50 -83 503 -718 -23 -467 884 -579 -158 -284
4783 -284 -326 -227 19 -182 667 18 659 203 -959 1444 7 -268 -696 250 745 -91 -257 -519 607
4802 607 -194 -343 838 570 -1323 -702 1387 -20 -55 -425 -14 -354 -607 -633 516 239 284 307 417 -205
4822 -205 -412 -613 1011 430 409 -253 402 434 465 243 -221 113 178 218 222 -86 986 411 -21 -63 241 288
4844 288 589 -638 -276 -348 -352 543 -100 49 245 -280 600 35 968 108 46 -661 284 228 -799 439 92
4865 92 905 222 -1497 -210 -334 -73 -445 382 50 491 768 280 -262 326 745 286 310 -863 -472 -594
4885 -594 -202 -228 591 143 61 137 2 -235 -754 1167 145 -681 -102 908 409 497 197 105 -792 476
4905 476 -67 275 -340 323 565 262 -121 312 935 -36 -1163 915 228 -698 14 -922 -999 -175 -126 -95
4925 -95 875 -655 738 126 -88 -738 -6 -2123 82 146 -174 -561 264 -381 406 -84 184 -636 173
4944 173 -475 194 -551 -634 418 -203 -1190 -525 556 95 -544 -561 290 -179 267 783 332 950 859 -289
4964 -289 616 -248 925 -728 252 332 430 746 -192 1168 -5 211 7 -200 -189 -490 -785 -428 331 -31
4984 -31 -401 41 80 -18 -154 -503 155 -478 420 474 -468 -1012 42 763 -225 198 -82 163 -68 -2 -69 -1049
5006 -1049 -651 213 -243 173 317 -413 47 -57 288 179 -306 -458 857 120 231 707 -635 46 864
5025 864 -684 -399 -814 303 -660 284 -1151 -246 -153 -531 543 305 404 360 -678 -777 371 335 246 448
5045 448 332 1196 713 4 79 106 417 -192 263 528 296 45 -701 -268 -261 -408 -280 -228 -316 120 -89 -833
5067 -833 837 -128 227 -327 -245 306 -581 -813 -81 -614 -612 -267 990 193 -22 360 71 422 -356 -583
5087 -583 180 -375 202 -105 -1061 257 167 -301 482 603 -56 -967 -623 -12 -182 392 -463 85 284 64
5107 64 365 -398 -787 185 -344 113 -91 88 -322 279 -275 157 596 515 -191 -63 -615 385 -272 -178 -584
5128 -584 -104 167 -244 286 145 745 -474 -336 313 -28 -791 197 -361 -38 530 -669 -862 880 -212
5147 -212 -449 45 -18 -803 173 185 -198 235 645 -514 -198 -482 1267 88 -75 291 128 620 -302 781
5167 781 -579 441 35 781 307 252 -463 354 -916 31 301 -280 630 2 98 -253 203 -854 -199
5186 -199 -391 -127 -434 -472 -187 433 -116 -673 -679 559 -66 -385 -178 -498 267 -446 138 594 -963 -255
5206 -255 344 -179 -681 -284 1022 800 146 23 -215 -287 -695 -117 253 -567 378 70 -119 129 -180 -1022
5226 -1022 854 -74 305 86 383 311 55 241 -499 654 881 -235 -21 -151 819 -57 254 -327 -266
5245 -266 -193 -385 -397 -193 -941 -419 83 767 665 -402 -635 -1063 30 -342 -409 139 -1361 122 904 437
5265 437 229 1323 -259 381 -418 -341 -166 -326 345 674 347 576 504 -889 -147 386 -178 346 -583 -130
5285 -130 318 255 -96 -228 -193 1500 482 -32 -661 -199 -257 -430 -490 120 -297 59 343 -366 351 428 -501
5306 -501 733 934 166 -885 575 257 344 273 -687 25 199 -291 773 -138 -613 -154 -331 892 263
5325 263 0 -261 -922 -365 -78 176 -660 424 263 -546 285 200 -558 47 -123 -581 39 524 225 -131
5345 -131 583 111 -1269 -358 -390 -442 276 -123 426 10 -122 -542 23 -50 115 -166 444 -226 1203 255
5365 255 246 52 -461 490 423 -617 346 143 -29 -32 272 -50 575 476 359 496 137 -740 -438 111 432 428
5387 428 7 177 -1091 36 -440 578 376 -279 425 24 252 -30 43 -484 86 254 -697 -23 295
5406 295 -453 124 -105 1013 1092 62 137 -70 402 192 30 -1020 -227 673 29 419 -577 374 -73 -469
5426 -469 809 111 348 160 -480 -193 -457 -625 -493 -215 227 -192 75 -22 195 741 -1042 201 -162
5445 -162 55 -550 -80 -15 -905 407 -159 437 -485 -74 192 -208 -273 509 840 101 209 410 528 -10
5465 -10 150 -429 -174 -244 -25 65 216 -391 647 380 332 -159 -31 -145 -135 412 -68 -149 -725 -368 -561 -791
5487 -791 118 659 330 -856 -171 409 -878 -724 768 349 -169 -509 40 -1151 -768 371 -471 -509 -924
5506 -924 361 -591 -97 415 645 -176 258 953 -248 435 -1128 -248 -918 103 75 -244 -952 -489 -15
5525 -15 -119 139 93 60 -660 532 324 356 285 366 164 671 -721 216 904 -722 22 100 598 -247 468
5546 468 -162 -481 -440 -206 -158 496 -366 270 208 -444 -514 397 -381 -1341 -582 -651 437 -627 417 646 -175
5567 -175 -396 -327 313 341 -203 1135 19 772 -480 101 -105 -394 873 -435 393 672 495 519 -732
5586 -732 370 110 424 144 410 -590 256 -188 -540 539 1371 -400 -292 -384 -179 -925 -78 -324 392
5605 392 -583 -766 -79 -140 511 113 -926 -316 468 135 301 289 -273 -488 -507 159 -52 525 199 666 471
5626 471 -740 295 111 353 374 159 -230 -126 98 -117 -171 286 -29 -326 -90 752 -48 -537 -214 -149
5646 -149 286 222 -490 569 91 444 -201 -343 -16 402 840 -241 -379 980 -832 586 -691 -352
5664 -352 -89 81 454 -85 -458 879 -79 333 275 608 188 -164 -625 -315 432 425 -297 360 -424 234 309
5685 309 -902 -180 -1282 780 400 -226 -207 -738 -202 166 -200 747 -416 -473 -706 -1306 816 440 117
5704 117 253 -320 -99 269 114 -518 510 671 595 -13 -855 861 -163 -294 -73 821 161 -259 -724
5723 -724 -1341 347 221 421 -53 577 19 218 300 -492 102 -93 -574 105 532 -716 -452 -291 -279 -864
5743 -864 -491 -308 -404 -62 264 227 -1 613 1102 -170 -392 -352 429 -209 -454 1007 466 522 -514 148
5763 148 -796 -27 217 -223 505 288 106 91 -351 -548 328 210 375 -97 268 -985 -63 108 279 275 -188
5784 -188 5 596 -244 97 1382 66 820 40 519 195 63 383 -337 -44 -309 590 516 870 -1036
5803 -1036 -989 62 -343 -313 -13 393 734 432 209 -361 469 246 -300 472 91 98 -991 -289 -738 -89
5823 -89 -683 416 581 443 -246 405 -92 -71 -246 752 -772 -18 -537 -123 116 -200 238 495 278 54
5843 54 409 37 426 -92 -310 -683 -1061 189 -122 991 -455 -703 353 -413 855 -207 -215 -213 -403 -247
5863 -247 211 -216 389 -293 254 -57 -557 44 240 208 -1185 519 -143 349 -200 450 -244 -237 -395 130
5883 130 287 -562 -229 -181 -540 -97 282 -586 120 908 74 -444 -262 -1071 786 436 -628 -287 1056
5902 1056 231 -1462 -590 497 -320 -508 770 -201 -323 -435 735 -329 77 -428 107 381 85 -409
5920 -409 -336 190 745 -19 843 -943 299 -86 960 -233 -391 8 588 4 -287 -468 188 402 8
5939 8 17 94 -643 358 269 787 706 276 -237 -711 -100 405 224 268 308 -564 -227 -268 2 -76 319 36 -37 -440
5963 -440 -238 418 8 589 -865 -96 970 -25 213 50 137 -119 212 -445 618 223 145 464 -558
5982 -558 443 -173 275 -650 144 -155 -95 424 -782 67 -920 58 316 315 718 -299 114 -168 -759 174
6002 174 -161 -179 811 393 277 -274 -44 210 -556 -490 853 520 -14 582 -407 -368 -231 780 -719 -176
6022 -176 230 -35 357 -498 431 -119 247 -708 -375 622 -507 -266 132 111 -165 -742 -597 -444 -33 -218
6042 -218 -629 -435 347 -836 -566 27 222 -323 -207 -292 39 -185 -861 360 1093 668 -73 -29 207 161
6062 161 -398 47 -213 -419 424 -493 180 -763 -439 762 -279 -69 -30 168 391 235 328 284 -419 -162
6082 -162 258 -167 -386 -23 -515 27 128 307 301 -302 -102 -60 163 -247 -440 -386 -528 -1217 -747 -53 -250
6103 -250 -343 -137 372 -240 440 -715 30 -209 -526 516 44 -245 -68 128 420 316 760 85 726 -826
6123 -826 208 -55 -708 -334 163 -315 291 -418 361 314 -248 872 196 484 -274 449 -391 -427 -306 190
6143 190 -420 -217 41 22 -143 354 394 -93 313 497 597 892 453 282 -652 -169 -130 215 -95 262 164
6164 164 1221 -560 -185 199 -12 -546 707 -481 -40 606 -106 388 -597 568 200 -382 -21 -42 -414
6183 -414 -289 -525 -858 468 -337 -132 556 327 86 -590 -1636 -49 535 555 14 -329 642 -573 486
6202 486 794 434 -267 -432 296 -222 418 -482 -476 -874 -214 -202 267 -178 383 -80 361 364 -651 -740 -232 38
6224 38 -82 -111 822 -281 344 174 -1030 402 264 93 -34 -885 151 60 97 -107 -475 -1170 1544 109
6244 109 511 -150 -112 521 926 -698 -461 381 503 663 -572 -43 1789 -14 -760 710 -287 -86 -468
6263 -468 -56 -69 258 -312 467 508 -160 631 -18 -79 66 100 -1080 527 -241 338 44 217 -297 889
6283 889 -172 -264 83 295 350 269 157 53 -206 -410 171 -355 128 -842 -121 -38 -93 117 -663 -376 -612
6304 -612 345 -795 447 -112 332 8 -606 640 55 576 282 287 338 -838 516 696 212 408 -949
6323 -949 84 -164 195 -182 969 351 -616 568 124 -36 569 -677 19 312 -599 -16 -169 241 -154
6342 -154 499 -1011 322 -326 -289 446 428 226 84 -672 1116 -532 562 -199 -21 752 -408 -270 -80
6361 -80 588 558 -313 -452 257 193 576 -54 277 -71 806 20 81 -190 -657 -130 -254 -36 -872 -192 -487
6382 -487 -243 -397 -937 -411 399 -421 -518 251 503 -489 956 -550 17 -129 602 385 76 467 -183 -93
6402 -93 -79 21 -1539 504 -819 18 -7 -448 254 425 -406 -91 -358 983 931 -85 50 87 -490 -6
6422 -6 -49 660 -512 303 -584 -365 224 -520 29 212 416 82 386 325 -17 471 -68 -340 -22 222 -268
6443 -268 507 -454 -543 -638 140 -758 275 -369 17 -554 -190 660 0 39 -802 501 15 -429 333 531
6463 531 -75 -100 -206 366 263 141 496 -632 924 -69 107 -516 -435 338 -111 -398 -64 963 -256
6482 -256 -81 -1001 -862 -123 867 -77 -671 -895 -228 901 -275 1298 -934 231 359 -855 -7 792
6500 792 -185 -560 -107 237 572 -534 -283 238 -120 -594 -686 90 -569 -102 -571 -454 210 -465 132 -521
6520 -521 357 16 -125 -437 -869 16 -178 156 320 145 -836 86 217 -378 423 217 203 -58 -372 -62
6540 -62 649 316 -1054 548 653 -108 660 -7 1195 133 382 -128 531 1073 331 -230 -624 -73 41
6559 41 -267 -118 645 598 540 -547 407 55 -495 447 26 -384 -493 402 -4 10 246 207 42 -125 -504
6580 -504 -420 -149 958 251 -832 536 -190 -942 -490 199 1069 47 -97 504 546 -332 626 290 872
6599 872 -337 -709 -380 -909 -365 -24 691 746 -392 -773 -446 -51 -1153 -40 426 -708 510 -432
6617 -432 377 540 496 -190 -46 -157 -768 -642 -476 105 335 -60 -89 307 593 -124 -406 1021 -693 -198
6637 -198 -193 37 -14 658 274 12 -341 519 572 -439 72 -395 -667 -533 -215 348 54 430 174 415 20
6658 20 -823 458 504 422 -889 440 16 21 853 296 -341 -949 993 99 -855 -726 -550 -629 412 4
6678 4 720 451 445 1127 1678 -374 -206 167 -106 926 20 -406 811 35 -663 -228 -456 -625 389 -407
6698 -407 39 -356 -322 848 75 -69 857 68 -1179 -542 415 -277 -957 547 632 189 657 407 617 402
6718 402 416 -228 354 -1060 204 596 -569 305 -67 71 -31 1043 41 1428 198 -981 396
6735 396 765 -506 -854 -396 487 -9 241 167 281 -192 -984 -396 -467 263 325 462 956 -255 224 -504
6755 -504 -1188 -452 -546 352 -35 -271 277 252 356 -588 508 -62 -649 -947 -478 -571 -473 254 226 546 -1096
6776 -1096 -427 136 -134 855 711 -120 -345 9 326 -52 236 80 64 -228 -164 -239 333 271 -161 -918 1011
6797 1011 188 237 -171 266 -221 -487 270 230 -259 -426 -162 -528 736 112 -487 617 353 -59 928 471
6817 471 600 -488 355 342 248 557 -649 -133 -598 -463 192 38 631 -76 271 -285 676 185 209 -303
6837 -303 -692 -701 92 776 -549 352 344 -503 286 561 111 534 135 -379 -71 -208 62 370 388 -411 224
6858 224 -830 -59 835 -503 -340 -99 768 379 -622 -614 -124 287 290 -178 473 -421 -426 167 -251 -625 -565
6879 -565 624 -298 -466 651 -228 -598 409 -34 -179 -635 494 243 -447 86 -501 -141 1068 -424
6897 -424 -54 505 319 138 -164 734 154 99 -1056 194 494 -16 35 727 -617 -440 310 -27 -447 1
6917 1 -1176 315 -523 276 -80 232 96 818 -591 764 868 44 -7 545 248 -214 467 484 238 113
6937 113 -424 -207 809 -430 -667 327 -4 -72 -7 -315 -623 210 114 371 -108 -341 602 543 759 -363
6957 -363 829 -44 56 57 -343 51 947 657 31 -727 -550 751 724 -29 -117 -746 599 -200 -660 745
6977 745 -500 26 -533 165 696 -425 -329 1079 -113 548 79 -297 483 -719 165 -100 -623 897
6995 897 -380 -68 167 249 -1252 294 -151 1004 405 -355 -621 -551 271 117 -994 70 167 687 -242
7014 -242 -579 -128 306 -393 454 -327 49 659 -666 -302 -190 -893 -139 696 201 -3 676 -257 -370 -356
7034 -356 401 -207 -336 1174 318 732 -182 -260 -795 77 509 -43 21 -8 745 -540 -507 448 683 1172 -600
7055 -600 806 -143 -206 45 233 -629 -262 -634 180 -287 263 -922 -282 3 937 318 -601 326 304 -406
7075 -406 624 530 93 59 214 114 -224 285 -127 16 66 -384 -431 -173 913 81 -295 -222 638 -318 450
7096 450 46 -626 -561 -102 -590 73 -1011 -673 -452 -97 -576 -220 46 -302 311 613 376 -307 148 -758
7116 -758 701 -306 -1379 -489 -260 651 -318 294 -442 -587 -273 -284 93 -634 -56 -550 582 -454 563
7135 563 -192 -460 133 -602 -83 77 610 1027 -247 83 296 -184 313 -438 138 -487 1244 522 141
7154 141 -392 -283 -396 -98 -534 171 -42 749 674 -42 -515 215 1002 502 -205 709 -275 -410 -145 445
7174 445 521 -34 392 532 379 -699 -685 131 460 205 1130 -897 488 342 616 125 168 154 -611 -633 178
7195 178 134 178 342 681 -134 198 -623 377 -921 -533 -539 280 -353 97 715 -355 -137 288 -83 227
7215 227 88 388 374 607 500 597 -516 324 130 749 480 672 -388 -36 -273 149 -17 267 133 -8
7235 -8 581 -71 341 -98 705 705 -1041 -164 751 -277 342 -806 -481 -496 -41 722 383 -1090 278 371
7255 371 -97 825 96 -522 -588 358 -19 77 -33 -565 -680 180 105 -231 657 -291 39 280 -332 602 559
7276 559 -349 -1442 -137 -844 -371 -359 -198 686 -73 -831 -383 -1346 -1009 -574 -480 830 -716 -98 1289
7295 1289 439 -58 695 -323 1627 -537 -700 33 -755 -327 818 -237 94 -302 -501 736 -397
7312 -397 70 -1149 -767 -1066 115 -910 -106 -224 -691 133 261 1125 -114 -461 -697 -887 -344 87 -163
7331 -163 -413 80 1139 -520 -444 407 745 551 530 355 -79 -21 -43 367 -703 274 187 195 78 -605 1094
7352 1094 463 -78 -641 -512 965 419 468 827 -815 -110 176 3 301 366 -642 304 1069 -760 130
7371 130 548 -564 -594 766 422 -238 555 712 733 242 -553 950 29 -367 -142 298 11 137 -263 -220
7391 -220 -435 158 117 -71 -423 237 26 -692 210 -687 7 -261 -791 307 684 -341 1017 353 483
7410 483 624 22 -630 421 118 -428 -30 -388 -162 -320 1106 478 -37 587 156 -143 -558 307 -529
7429 -529 181 -73 -170 667 555 -318 -25 22 -229 925 119 -245 -139 777 123 -414 74 -103 -1 -649
7449 -649 -368 -25 -132 -28 -171 -366 -607 -931 -162 226 -1230 120 14 -938 -567 -529 -31 741 97 147
7469 147 153 297 -348 572 -171 92 15 708 454 534 -1 57 -784 798 347 -262 -289 53 -103 532 192 140
7491 140 -544 -346 -77 -167 508 18 -1201 -129 582 -446 1197 240 355 -637 -1012 125 716 465 32
7510 32 133 764 -149 28 324 -152 257 -373 299 401 -172 585 -859 -171 55 -288 41 -639 565 -36
7530 -36 101 124 -20 -325 1058 591 -600 260 901 -64 -1019 -909 -259 -146 275 500 643 724 132 791
7550 791 636 -578 -26 659 -515 674 -333 -288 267 466 85 -32 -172 -424 -447 -198 848 -50 -701
7569 -701 65 -356 362 346 -596 -103 -387 401 -740 -68 -957 -712 281 -196 -614 -82 825 -142 613 326
7589 326 531 511 750 491 -34 -422 706 303 499 384 299 940 -508 -5 -663 803 718 152 -857 -121
7609 -121 -212 430 -161 -468 847 -559 -157 452 -223 -29 979 310 -150 497 126 -768 302 -576 762
7628 762 107 -540 858 638 485 51 352 -390 835 588 440 -331 258 186 234 53 -109 -506 -360 -188
7648 -188 492 520 58 -789 51 -17 323 -64 229 88 -232 57 -274 251 378 452 107 -146 327 -449 303
7669 303 -418 -550 109 14 -91 -534 583 -529 859 -89 184 -352 745 72 -220 -132 653 667 -925
7688 -925 -888 9 1144 -104 -284 238 -312 140 775 -396 503 72 -373 849 -98 -646 -185 -626 -152
7707 -152 -189 -169 71 -623 380 543 -20 450 100 1385 -442 -88 -353 98 402 -115 -254 -314 759 836
7727 836 -320 -16 339 -62 313 -456 -686 -1336 792 833 -124 -185 200 10 -377 -533 -500 1085 -52 119
7747 119 411 -339 526 922 715 -743 444 -171 282 134 -548 777 695 -675 36 29 953 914 93 -318
7767 -318 76 -536 -149 212 97 899 -292 414 -253 -374 20 193 -183 661 115 225 2 1024 269
7786 269 846 -352 659 339 598 164 949 -632 539 658 -51 59 484 -74 84 -516 -532 116 402
7805 402 -549 -400 -32 757 288 -613 477 -813 403 474 -646 -838 -16 381 165 -838 346 659
7823 659 -168 152 -53 -94 597 -335 -257 -998 -460 -36 502 204 -324 -105 -1160 53 800 521 862 -448
7843 -448 -43 17 294 625 165 109 712 668 -135 283 -252 846 596 -250 327 -399 -451 447 -481 -1546 499
7864 499 455 -17 139 674 618 540 259 -301 165 119 -108 528 -563 -57 -33 -488 234 -229 -249 -589 -1035 -90
7886 -90 52 -563 89 -471 -481 823 -441 534 473 287 -1289 298 -217 -224 180 -1212 511 -229 -1121 -145
7906 -145 126 -111 563 9 518 50 -425 -528 -27 -107 576 -167 -170 61 -275 648 -496 253 491 226 735
7927 735 -361 -637 18 265 418 -774 -421 -15 -152 -38 745 -1513 277 103 -477 346 613 323 -940
7946 -940 249 -123 -620 95 969 -24 -794 -4 834 -1150 -194 253 -175 -101 -545 -843 -27 230 352 -843
7966 -843 -2 495 87 -180 -912 109 -742 367 -751 528 -253 1083 -52 -203 223 -296 -232 -674
7984 -674 -441 -346 420 252 541 -420 432 -190 -370 324 -315 -475 -289 552 606 -919 373 100 -366 469
8004 469 -947 107 106 -277 443 70 354 233 -756 125 -348 -1865 344 -516 -267 -479 599 422 -44
8023 -44 788 31 -24 -165 -356 -654 627 158 379 -656 518 -568 -1072 269 75 268 168 351 -165
8042 -165 1038 459 -380 261 -198 314 14 348 212 -368 -536 -373 853 597 809 -78 1040 -286 -176
8061 -176 73 930 -413 -169 -3 62 145 -164 562 255 218 -1153 540 -197 196 -552 432 334 609 -477
8081 -477 -451 291 -642 -28 508 753 -94 569 391 193 -205 -41 172 -346 -263 -263 -567 515 134 763 -496
8102 -496 122 377 -128 40 349 -318 -53 265 59 -567 202 222 -67 -106 -166 9 331 97 -318 550 -834
8123 -834 341 532 190 109 86 91 475 -328 228 -850 156 -258 -1038 -412 94 9 485 -547 -617 -46 75
8144 75 318 -62 278 79 -494 826 134 -1077 -353 497 1047 -243 114 71 -1 -139 272 21 675 -482
8164 -482 141 -175 -631 622 -36 200 -318 224 -367 37 -14 398 214 -95 217 7 -782 -337 -595 -40
8184 -40 -423 -387 625 734 43 427 315
8191C15
$$ Imaginary data points
##PAGE= N=2
##DATA TABLE= (X++(I..I)), XYDATA
0 0 0 0 0 0 0 0 0 0 0 0 0 0 0 0 0 0 0 0 0 -38 108 -108 108 -108 108 -108 210 -216 216 -230 323 -324 382 -432 475
35 475 -542 620 -671 766 -856 942 -1046 1160 -1284 1419 -1569 1723 -1901 2096 -2310 2546
51 2546 -2799 3096 -3405 3776 -4181 4652 -5188 5831 -6587 7511 -8658 10123 -12076 14821
65 14821 -18940 25755 -39184 75115 -387058 -768483 317644 219877 -443413 26325 395196
76 395196 -149494 55183 501684 36391 -147670 392789 156418 -370474 -11408 248228
86 248228 -251594 -287074 152710 34192 -210556 114004 204961 -151176 -61746 237308 -70777
97 -70777 -288694 71114 48042 -334804 -63681 246971 -116549 -129925 330694 141496 -153201
108 -153201 222343 228269 -260035 -75334 206701 -218665 -285981 157173 -16265 -270320
118 -270320 148819 251654 -135556 22923 298052 -27305 -147571 154499 19165 -260777
128 -260777 -15325 135497 -122124 -68169 212673 68265 -86759 160343 172359 -146899
138 -146899 -91637 94036 -151460 -263941 24854 -18508 -255768 -61 204528 -58325
148 -58325 -25687 261051 56744 -133246 144762 112793 -213028 -48940 145912 -115278
158 -115278 -96583 218858 79276 -101508 164204 192981 -99172 -22832 118321 -137140
168 -137140 -213721 25825 -41258 -221236 -26187 102011 -67521 -11991 191700 57561
178 57561 -84479 86019 86787 -134412 -70404 71850 -94601 -131443 108890 81037 -76918
189 -76918 89952 180328 -31371 -12398 144500 -38112 -172801 12105 -1386 -176086 -37133
200 -37133 92975 -61573 -25679 177878 79558 -44089 96414 85415 -102826 -45709 48172
211 48172 -105011 -138274 32153 12029 -78677 53444 115624 -24428 -1169 115335 157
222 157 -104999 -1067 -11237 -135350 -49673 60184 -41703 -38300 124940 94789 -1348
233 -1348 98623 113370 -51396 -37113 56609 -62578 -128414 1047 -8643 -96568 20009 101106
245 101106 -13507 -9313 100413 20520 -69496 13939 -1812 -123459 -66447 26209 -46738
256 -46738 -48534 74268 61845 -982 82443 111012 -9460 -21755 39601 -38262 -96328 -13465
268 -13465 -13102 -85318 -11179 74586 13450 6995 85974 41994 -32489 22913 24300 -78300 -66034
281 -66034 2031 -42041 -54574 39467 41414 -11734 47205 89734 11576 -9325 30635 -25956
293 -25956 -80899 -24253 -14884 -73210 -36038 33702 9859 9754 75523 55962 -3498 27186 39472
306 39472 -31527 -43857 -7016 -40200 -57939 9654 28943 -8795 23292 61600 23948 9033
318 9033 33863 -6218 -59443 -35051 -20731 -56014 -43032 3565 -3688 -831 52300 59372 20736
331 20736 27435 39007 -2319 -20907 -2528 -25087 -55137 -21068 7825 -6823 8427 41179
343 41179 25922 10325 33532 21606 -27897 -33845 -22565 -44707 -47516 -13267 -7591 -14673 21945
356 21945 50958 35176 31790 41993 16479 -12419 -6842 -11149 -40845 -42227 -16446 -10912 -6633
369 -6633 24386 33294 15964 22044 35351 9350 -19223 -17303 -27368 -46952 -30063 -4444 -11729
382 -11729 -3738 31860 39869 29394 40248 34216 -3624 -17879 -7995 -28871 -50023 -34403 -20553
395 -20553 -24172 1569 36221 26509 15511 35161 29745 -2609 -6362 -4930 -38298 -42856 -5817
408 -5817 -2653 -13132 20934 42146 21233 31996 53226 15373 -20301 -6028 -16985 -53574
420 -53574 -39285 -17553 -39851 -26431 25075 25918 7234 34240 39624 -1588 -3227 15290 -23877
433 -23877 -48328 -14589 -6909 -24500 8717 41648 14882 17137 56297 35440 -7696 6294
445 6294 660 -48607 -41526 -5332 -34130 -44846 12117 24709 -2798 32053 54796 968 -6677
458 -6677 29027 -8571 -49651 -13263 -9211 -49506 -13067 37272 2495 -2911 50286 35488 -7751
471 -7751 19695 22502 -44199 -41879 2969 -28343 -48656 7332 19880 -13652 26641 68170 18828
484 18828 27 40240 10073 -41663 -8079 1349 -55923 -37381 24128 -4010 -20349 39828
496 39828 35774 -17038 16655 40652 -29617 -45615 5367 -26725 -60274 1663 20230 -26632
508 -26632 10284 66923 22816 5954 54822 23187 -38139 -632 15849 -51336 -43764 15080
520 15080 -11592 -29926 36567 40187 -17009 14682 49547 -12137 -32547 14921 -18810 -65687
532 -65687 -8206 17827 -35088 -8534 52903 15591 -5910 55707 37096 -34128 -4636 22659
544 22659 -44749 -47786 13712 -18945 -50491 25430 43359 -16281 14227 60851 226 -21999
556 -21999 34589 1700 -58962 -9726 17206 -37941 -16304 46538 6880 -16766 50824 44037
568 44037 -25766 997 26682 -40482 -49558 8511 -21802 -61427 2956 29565 -21948 7432
580 7432 60098 8185 -18058 41659 22223 -46511 -7640 21460 -41555 -28677 43749 9418
592 9418 -26638 43701 48567 -18986 8911 42760 -32119 -49970 13573 -16290 -66889 -5570
604 -5570 21167 -33887 -1485 61555 12552 -15268 43727 25978 -36241 -443 21367 -42055
616 -42055 -37744 26848 1955 -29185 30227 41210 -15477 8436 49588 -13281 -43080 10789
628 10789 -8153 -60418 -9086 23258 -34518 -13923 55996 20165 -13507 46665 37317 -33130
640 -33130 -360 33209 -36727 -45495 19748 -6365 -40934 23097 38141 -25029 2624 49703
652 49703 -7128 -32865 18054 -5832 -58128 -10891 20506 -30340 -18074 44274 17761 -9382
664 -9382 45182 42656 -19556 -1146 33684 -21809 -40731 12260 -5836 -46952 7819 36741
676 36741 -19318 -6274 46625 1079 -31753 21645 8090 -55468 -16683 20538 -31448 -23389
688 -23389 39271 11173 -18740 40677 46108 -14778 3041 34699 -21150 -35820 14566 -6320
700 -6320 -47436 371 26938 -18507 -4593 41108 5969 -25027 21118 16254 -37822 -15009
712 -15009 15227 -27065 -27455 29737 13940 -23356 25047 43616 -8936 150 36628 -11882 -38759
725 -38759 11741 250 -46842 -7875 21349 -22119 -9881 40958 9546 -20600 24764 21135
737 21135 -29169 -6695 19097 -25210 -28693 22489 8596 -20106 18366 34973 -7463 3300
749 3300 35105 -3993 -30695 5371 -232 -40724 -14530 14263 -20281 -17809 31095 16817 -13987
762 -13987 20418 27036 -20030 -8285 22733 -14919 -32883 12527 7045 -23655 12572 32774
774 32774 -8344 -1631 34819 4175 -22534 8041 -63 -38470 -14166 11445 -20327 -20282 20455
787 20455 11440 -9521 22080 27764 -11771 -5849 18834 -8593 -25432 4019 425 -23777 2295
800 2295 26806 -2620 -3510 27845 10518 -15586 8915 8667 -28589 -17558 8332 -14692 -20658
813 -20658 15846 10991 -11826 17633 30951 -2988 -2663 19485 -5491 -22393 4089 -1695 -26669
826 -26669 -6939 16467 -5390 -3301 22570 9159 -10284 10605 11643 -17432 -15786 2805 -14897
839 -14897 -19233 8858 8974 -8575 10692 27587 5749 2801 18873 330 -18970 -810 327
852 327 -23743 -13550 6188 -7628 -7223 18280 13502 -5657 9026 14765 -8503 -10435 4859
865 4859 -12505 -21422 2268 5969 -8862 6035 20559 6951 5533 19206 5915 -12722 -3746
878 -3746 -623 -19232 -14939 -268 -8419 -9995 10827 14325 989 10305 15485 -328 -4975 5327
892 5327 -4686 -18462 -5022 2266 -6732 1116 15125 6226 1764 14943 11479 -6491 -3207 -1300
906 -1300 -15439 -15367 -1649 -7026 -12685 2983 10279 3004 9605 15595 4560 -1240 5613 975 -10810
921 -10810 -5531 -1185 -7507 -2664 8684 6476 684 9107 10470 -359 -2073 1530 -9526 -14909
935 -14909 -6297 -5106 -10649 -2819 5355 2201 4821 14020 10031 730 4445 4298 -5194 -5605 -1282
950 -1282 -7109 -8880 2828 5010 -693 3700 7406 1958 548 4525 -2429 -10799 -6957 -4289 -7186
965 -7186 -3592 3053 1854 2145 9908 11588 5860 3678 5505 -1127 -5029 -329 -2518 -9602 -5686
980 -5686 1993 -1737 -563 5125 3343 -2894 2449 2333 -6125 -7147 -2187 -6174 -6216 2271 4248 -1151
996 -1151 5979 11783 6472 4650 8843 1746 -5913 -1333 -129 -9004 -7237 -492 -3165 -5623 4988
1011 4988 4933 -1290 132 5444 -1789 -6114 978 -2545 -9424 -432 6249 -1696 1582 9376 5204
1026 5204 1142 8981 5826 -5982 -2073 3029 -7774 -9242 1733 -2825 -9061 3538 8161 -1755
1040 -1755 679 8648 77 -4118 4408 996 -9547 -2502 5142 -3461 -984 10338 4415 -2756
1054 -2756 6721 8848 -4716 -4859 2332 -7230 -12978 -887 -1207 -12140 -1660 7640 -2030 -631
1068 -631 12428 1955 -6800 5621 6226 -8944 -3494 6430 -5787 -5238 10276 5686 -4731 5431
1082 5431 9529 -5144 -2408 5900 -5990 -13550 -635 159 -10604 -2269 6853 -1955 -1291 12615
1096 12615 6093 -6867 4142 6242 -7798 -3827 6390 -4067 -9285 6970 7464 -5247 4320
1109 4320 11330 -4137 -3776 9268 -2417 -13612 -413 1448 -12129 -1123 10215 -4031 -4387
1122 -4387 13460 7729 -5091 5836 8730 -9072 -5181 6975 -4446 -10927 5057 3864 -7349
1135 -7349 3459 11293 -3890 -6126 8781 10 -12435 95 2201 -11904 -4704 9986 -1225
1148 -1225 -5143 11466 9464 -3853 6746 12027 -7237 -7577 8515 -3561 -13082 2943 3638 -11285
1162 -11285 620 12346 -2213 -5518 8631 1072 -11079 2863 5210 -12270 -6179 8732 -1535
1175 -1535 -5547 9922 7635 -6707 4920 12095 -5061 -6598 6398 -2740 -12422 1300 3668
1188 3668 -10762 -4233 10153 -1793 -5598 9480 4253 -10299 850 7196 -8944 -7677 8005
1201 8005 -1424 -8130 7449 9662 -6307 2714 13128 -3562 -6012 8260 -1020 -14011 1331
1214 1331 5116 -9841 -3267 8563 -3272 -5658 10158 6380 -8528 2086 8241 -6077 -5463
1227 -5463 8637 -1371 -8151 5149 7386 -5450 563 11592 -2684 -5804 8663 1375 -11686
1240 -11686 -760 4587 -10126 -6251 8491 -2409 -8411 8569 8481 -6078 2908 10855 -4915
1253 -4915 -6091 9386 557 -10413 3850 7160 -7700 -92 10364 -1871 -6881 7102 3096
1266 3096 -9890 -53 3751 -9404 -6577 7608 -1149 -8409 5417 7057 -3818 3599 10824 -1984
1280 -1984 -4954 8287 2801 -8691 2554 5909 -7341 -2965 9060 -937 -5765 6294 3280
1293 3280 -8362 -85 6566 -8389 -7102 6171 -539 -7918 4094 5418 -6116 2638 10674 -1487
1307 -1487 -4484 7546 1123 -8548 1764 5322 -6507 -3951 6846 -183 -4998 5165 2897 -7774
1321 -7774 758 6763 -4743 -5545 4821 604 -6737 4073 6701 -4838 -208 8567 -361 -4436
1335 -4436 6149 2480 -8284 89 6059 -5814 -4826 5855 -2423 -7501 4946 4052 -7668 -1374
1349 -1374 6098 -3586 -4803 5106 199 -6515 3653 6520 -3639 803 7387 202 -3661 5359
1363 5359 2934 -5789 16 4856 -3848 -4563 4355 -195 -5660 2471 4241 -5166 -2128 5162 -3751
1378 -3751 -6029 3581 1667 -6429 775 4980 -3265 -1440 6107 -118 -5097 4076 2601 -4851 -1372
1393 -1372 3638 -3981 -2925 5120 1375 -4803 2687 4482 -2719 -566 4963 -1784 -4496 3812 1811
1408 1811 -4159 1596 4430 -3460 -1512 4051 377 -4856 636 1222 -4568 -2185 3241 -3580 -4057
1423 -4057 3714 2097 -3838 1709 4141 -2402 -434 5065 -870 -4459 2848 2542 -3336 1192 5071
1438 5071 -1876 -1586 4911 1507 -3648 2202 1672 -4663 -2371 2820 -2021 -4327 1831 1641 -3503 1103
1454 1103 3144 -2473 -2457 3238 -9 -2902 1188 925 -3504 -642 3739 -487 -3245 2620 1325 -2518
1470 -2518 1150 3714 -2609 -2185 2992 -256 -2156 1796 3060 -2394 453 3724 256 -559 2580
1485 2580 83 -3114 1249 1980 -3244 -3281 1488 -1420 -3088 952 1377 -2539 -264 1561 -731 -1479
1501 -1479 974 315 -2072 1723 2675 -1000 651 3243 1586 -157 3248 1325 -689 407 1207 -1006
1517 -1006 -2755 599 -640 -1596 234 1803 -1323 -1129 811 -708 -1139 781 291 -1753 106 1608
1533 1608 179 -860 2267 1285 -755 817 1505 -435 -1072 648 -376 -2603 -228 49 -1943 -1329
1549 -1329 2185 33 -1710 987 1080 -1138 1294 1692 330 -672 1583 -175 -1964 1067 694 -866
1565 -866 117 1211 -949 -1005 -128 -1119 -2541 -1112 -699 -1936 -1893 905 -73 -870 1932 1184 -182 -101
1583 -101 3062 235 -53 1760 1786 -717 312 2986 -1318 -1171 1284 -248 -1772 -141 1085 -3070
1599 -3070 -2022 730 -865 -2613 519 634 -1622 703 1642 -2015 -767 1967 987 -693 1282 1221
1615 1221 -570 840 2259 -377 -2255 930 259 -1590 515 1040 -1817 -1886 980 4 -2265 1172
1631 1172 1270 -1203 144 2729 835 -1664 1433 -60 -2402 220 2103 -1323 -1126 1263 -423 -967
1647 -967 96 1164 -2144 -1628 1386 -1276 -3368 280 750 -1007 2125 1838 -992 352 2910 959
1663 959 -1366 1440 785 -2298 344 1519 -1343 -1473 1269 436 -2067 1352 1567 -2368 -1998 1071
1679 1071 -1155 -2209 589 247 -1879 847 2862 -625 -389 3731 1196 -1181 1902 1290 -3458 -1551
1695 -1551 1438 -1408 -1027 1563 37 -1851 1714 1480 -1426 -1296 1730 -1194 -2667 1408 624 -2617
1711 -2617 -123 1731 -425 -99 3684 1542 -2233 834 2112 -3239 -1445 1339 -1880 -2723 2433
1726 2433 1082 -1507 1411 3244 107 -244 2886 306 -2954 805 498 -3260 159 2212 -200
1741 -200 -1254 3601 1079 -1965 587 2463 -1751 -762 1675 -1088 -2487 1444 1995 -2752 168 2503
1757 2503 -830 -23 3057 1196 -2287 1292 2002 -2968 220 2874 -939 -1839 2650 2074 -1663 1211
1773 1211 2319 -2302 -1652 2056 -1012 -4085 780 -45 -3208 178 2121 -445 -1060 3653 1508 -1227
1789 -1227 2447 1332 -1974 -881 2797 -1169 -1948 1483 1380 -2165 666 3096 -2090 -1033 2253
1804 2253 309 -2277 34 2576 -3183 -539 2751 -73 -1193 2584 1424 -1630 1258 2388 -3187
1819 -3187 -1807 1591 -1069 -3483 1003 299 -2569 196 2231 -1755 -1845 2026 85 -2308 65 861
1835 861 -2668 -779 2361 -39 -983 2923 1493 -1738 1783 3456 -1080 -1495 1191 -773 -3556 970
1851 970 593 -2756 -1213 2186 -1238 -885 2392 1065 -3759 483 1094 -2673 -2073 2747 -358 -2179
1867 -2179 3279 2075 -1034 538 3345 -1901 -915 2133 -1082 -1914 974 1862 -1756 -745 2891 -1379
1883 -1379 -727 1549 866 -2611 122 1629 -1710 -804 1385 -1136 -1994 2404 2837 -711 955 2646
1899 2646 -1215 -1216 1546 960 -2412 -141 728 -2231 -1281 1429 -21 -1365 1583 1154 -685 518 2368
1916 2368 -1997 -1830 2855 -96 -714 2250 1788 -1953 435 2708 -756 -1502 1359 -453 -2850 -841
1932 -841 1285 -2395 -1067 1378 -932 -1414 317 308 -771 769 1689 -673 -1253 1286 561 -1591 1091
1949 1091 2671 -241 502 3321 504 -1372 1325 150 -2412 -449 310 -1333 -1040 1447 -342 -370
1965 -370 2689 519 -1186 627 635 -764 -1842 382 242 -1184 1171 1551 -756 459 2396 365
1981 365 -302 348 78 -2436 -269 966 -2639 -125 1661 -744 -447 1424 2302 -462 1186 2355
1997 2355 -41 -1241 662 -1011 -1674 -93 942 -115 -779 1339 583 -611 1020 395 -573 -988
2013 -988 645 -2411 -1085 998 -630 -1385 1194 1297 -399 101 414 212 -981 1139 -693 -1290 -499
2030 -499 1371 -1498 326 1480 560 335 989 779 -210 118 178 -1301 -2672 41 -34 -1523 183 1602
2048 1602 -136 753 1999 16 -104 239 -197 -2091 -1246 106 -1027 -1140 130 378 259 824 649
2065 649 132 -381 631 -836 -1601 -461 697 -635 313 761 315 444 1798 81 -1142 194 777
2082 777 -1152 -898 -143 -1413 -1355 -221 1065 -160 754 898 -218 852 825 233 -942 198 -553 -715
2100 -715 321 -394 125 -169 1053 992 205 826 436 -1224 -1033 -272 -189 -1428 95 -640 -994 1102 45
2119 45 -146 -1058 1623 38 45 613 -20 -1058 -432 361 865 635 318 179 -567 -56 1462 -1077 -96
2138 -96 -64 -405 -1106 -346 253 -676 -582 394 478 872 1192 709 251 213 -322 -1447 -699 -447 -146 -952 -136
2159 -136 125 76 453 994 23 -624 -873 -507 -1396 -958 810 -983 -250 481 923 -35 1717 319 350
2178 350 -351 1304 -381 -871 -145 137 34 -77 155 153 -115 1019 324 -417 454 -681 -363 -949 1254
2197 1254 457 636 330 -135 -160 289 1922 213 -235 837 924 -849 -367 92 -564 168 -162 -93 -634
2216 -634 543 -264 -877 13 669 230 -1527 42 -131 -380 157 832 211 297 676 -617 -612 -277 -637 -18
2236 -18 406 -268 -306 -1050 26 700 344 591 -522 112 -511 901 -807 -492 266 -26 -831 -120 764
2255 764 -513 18 861 228 -423 205 -337 -640 101 -99 -329 -1447 466 957 -709 255 397 -348 271
2274 271 672 -394 469 -107 320 198 99 1023 -511 -11 169 307 -1130 271 262 -1328 -1646 152 -1014
2293 -1014 -610 776 560 -671 793 1249 221 240 1221 35 -507 782 981 -729 -695 -258 -204 -660
2311 -660 692 -492 838 592 874 -111 -720 692 65 -1241 790 719 196 -201 271 -541 -349 1051
2329 1051 669 52 -913 424 -524 -1048 -321 -208 -954 -12 1095 -828 567 594 -317 -234 376 -264 -1107
2348 -1107 215 -833 -596 176 1271 236 57 759 1425 -597 -798 455 -210 -909 739 -811 -1304
2365 -1304 -1059 225 -867 -195 863 -782 341 16 -232 -1071 -288 613 -1572 -61 56 -51 27 1236
2383 1236 927 -438 14 238 -412 -1653 273 -50 -622 771 651 -47 -465 830 -85 316 -19 -446
2401 -446 -858 -211 510 -1127 -1310 63 413 -858 587 616 -434 205 509 -1318 -611 556 193 -1098
2419 -1098 -14 -547 -1223 202 696 -600 436 -266 926 125 556 576 -1111 -538 527 678 -418
2436 -418 -173 346 -544 -504 1388 174 -182 157 -454 -437 -257 437 -759 5 396 -146 -109 354 -288 -530
2456 -530 351 995 62 -1194 86 295 -1973 579 469 240 671 912 -436 -37 221 705 -609 -1090
2474 -1090 -528 -681 -78 271 -256 -1063 469 658 332 -785 264 -475 -251 1210 527 -486 794 229
2492 229 300 250 172 -227 -153 168 -334 -616 161 357 382 627 778 192 -306 834 270 -322 684 815 552
2513 552 -1303 297 314 -390 -582 546 -190 36 916 252 25 509 621 -186 53 1622 -280 140 390
2532 390 53 -151 856 570 621 267 404 -292 -1104 609 -65 -28 -210 409 317 -139 186 -1276 744 473
2552 473 409 85 206 -156 -613 -78 310 579 102 318 845 493 -422 594 -653 -501 -255 -761 -642 507
2572 507 -568 25 -831 341 317 -867 65 -112 -379 118 1629 -1024 -177 1157 1336 -648 628 74
2590 74 -316 -819 -55 -536 174 -211 727 -567 -781 -127 -364 -539 -198 466 -590 141 364 258 -902
2609 -902 930 729 554 488 378 -545 296 -321 344 -491 -282 -760 -1517 -363 448 -535 559 808 -410
2628 -410 121 515 347 691 538 669 -310 111 448 -569 -1083 463 -462 -470 145 80 910 -351 141 291
2648 291 -243 -280 1380 -901 -499 167 -648 5 -314 -17 148 376 -189 -137 -1174 -51 -386 -715 -188
2667 -188 -639 74 -269 -220 46 -349 225 -368 -931 417 236 -329 -129 -628 178 -350 57 -213 276 187
2687 187 641 -546 105 622 -677 -53 -601 -355 -233 -123 -324 -13 -806 594 -131 63 -70 798 -98
2706 -98 -541 -119 -26 -315 -518 513 435 -98 501 -10 -1071 57 230 -795 314 324 962 -1230 -414
2725 -414 -254 -500 243 50 -1087 -187 108 390 -589 83 -368 -615 58 373 564 -410 -241 -670 635
2744 635 611 -1081 -82 284 -34 947 -97 654 136 -891 284 249 156 -624 701 -420 301 390 360 -47
2764 -47 -561 412 550 385 -219 347 764 7 301 596 -826 599 549 686 -248 29 245 -158 -748 -287
2784 -287 -62 842 292 330 277 428 -319 -511 440 742 -390 -606 -129 -405 -240 369 -558 -8 461 65
2804 65 482 476 324 -335 -206 564 -401 -185 779 -52 -426 -6 180 -512 598 562 -555 1064 -351 -78
2824 -78 816 -544 -115 -97 -1136 518 -25 -847 9 213 108 -1243 -289 -286 -523 544 904 250 -279 1082
2844 1082 -736 219 -255 40 407 -223 420 -321 370 -84 -152 940 507 -113 -299 165 511 413 -40 31
2864 31 607 -404 -681 187 -647 383 -147 -522 -510 620 -273 155 -1060 133 480 -597 -712 -459 -37
2883 -37 285 455 -360 299 -129 -422 222 -55 -202 140 662 -34 454 738 196 -850 129 -521 500 108
2903 108 -221 183 -425 -563 -264 828 505 510 -1013 -309 -158 56 -361 -422 -265 -689 -590 196 -141 1096
2923 1096 78 482 370 -464 101 425 -58 774 853 340 109 426 254 -616 613 116 -412 -855 133
2942 133 208 -351 -470 -343 -622 -453 272 482 374 111 882 -896 -425 -412 291 134 329 -142 137 -254
2962 -254 -317 408 -211 696 -11 -592 -336 348 -780 -183 -549 -294 -322 -490 633 -101 -36 65 956 -153
2982 -153 -702 -937 -1571 -532 -343 85 314 556 249 226 401 -510 -543 47 -185 -719 209 388 -627 482
3002 482 -453 -10 -215 825 137 -53 -131 641 -86 -535 -254 -765 210 570 774 -373 -204 -9 -235 1159
3022 1159 215 487 0 -580 824 -22 -367 316 399 -377 547 351 303 -453 38 -119 936 904 -470 120
3042 120 -130 1276 344 138 204 191 466 -726 -811 -113 -1000 589 -21 17 307 -902 898 -304 -160
3061 -160 305 -464 723 -303 161 -554 -69 -969 -82 -762 314 557 -178 -498 -604 -452 -294 -882 -603
3080 -603 -644 200 1152 292 26 138 347 94 -85 -29 -223 -514 -71 -25 -141 -243 -377 -819 -392 672 69
3101 69 428 -475 177 30 211 -98 -146 606 263 -331 90 286 729 75 -311 -802 565 276 319 736 -581
3122 -581 20 520 -672 -532 440 229 -301 -318 158 -178 -160 -687 -265 -1130 -247 -249 1085 145 -260 51 268
3143 268 -146 977 819 -482 -298 -365 -629 734 28 242 463 -74 -662 534 917 919 -392 632 90
3162 90 -30 1248 421 98 191 195 1459 176 -850 593 -141 708 154 -868 -282 199 -327 130 -77
3181 -77 192 113 93 -920 292 272 -1851 -738 -60 601 -997 121 -216 314 -169 -322 262 -30 -400
3200 -400 -853 28 338 610 143 445 -80 -165 -621 1496 859 945 -612 77 -29 317 1029 800 170 -116
3220 -116 488 -17 281 -270 -1146 873 1120 -422 -77 125 -662 -499 -112 13 -148 108 -600 -590 -128 -116
3240 -116 442 -269 363 -219 66 -587 272 -1081 339 -886 -756 -398 598 196 289 -483 75 -668 276
3259 276 382 222 65 837 49 -755 709 -432 -141 330 1140 -193 -630 218 -1194 50 -627 -118
3277 -118 -132 229 -763 -287 879 332 -297 75 -3 659 -359 -967 194 -766 112 -609 -795 26 -78 -1451
3297 -1451 1045 651 628 -425 380 -316 181 -259 553 353 -886 384 166 435 -88 59 572 -478
3315 -478 -306 -641 -200 366 232 277 -470 377 -259 -321 169 872 -57 -249 137 -601 765 341 -51 62
3335 62 256 -11 -208 327 200 -279 257 -371 -605 -49 -441 538 -391 477 -60 -367 -51 -135 -237 33 168
3356 168 -752 -450 132 492 -694 -869 130 -9 1442 295 -1226 615 -101 -170 345 735 -134 644 -696
3375 -696 357 -471 833 994 -127 210 99 449 123 -673 -218 -239 329 549 308 253 1074 22 100 188
3395 188 24 -494 470 -323 781 546 -861 -688 33 461 484 468 267 -105 -976 -288 -215 12 -721 7
3415 7 -240 -333 617 249 -625 1599 -285 48 53 2 727 564 -98 78 -220 232 -479 -236 -172 141 13 -390
3437 -390 741 191 334 355 -800 97 -828 326 -185 -196 -101 210 603 -94 -343 240 -627 1254 -85
3456 -85 -425 159 393 275 1 -34 -312 -324 -340 963 323 -488 61 -524 -250 102 -858 -74 618 451 -285
3477 -285 335 473 237 -176 271 -824 762 530 123 144 44 -857 655 152 178 -475 310 -257 -635 -248
3497 -248 39 -248 424 -192 528 14 536 -170 -710 -379 96 -359 305 -213 -238 -795 -1131 201 507 -110
3517 -110 -24 1285 -589 -282 115 225 -194 -145 28 175 443 312 -300 -328 395 139 -77 -461 321 42
3537 42 144 -238 -170 -778 312 -771 -24 -16 969 412 622 432 -149 40 -939 -58 -110 607 420 -241 -975
3558 -975 -138 604 -100 -276 341 666 482 124 -894 588 -418 -434 -285 -321 567 -65 156 -223 -78 -351
3578 -351 448 -112 115 -167 825 254 362 -392 -689 37 181 -326 250 34 668 -73 -271 -79 650 363
3598 363 -285 369 144 408 -393 893 -113 -299 -715 -200 -742 293 -587 328 -1047 56 -386 -540
3616 -540 1142 -239 349 310 -312 236 -558 -304 -244 216 440 850 412 -230 -156 66 848 -496 425 229
3636 229 -84 1061 565 -350 -167 327 136 1385 431 385 712 -458 83 -369 -1093 365 -419 46 785
3655 785 748 -271 -286 -882 -66 610 -397 -241 -181 412 113 -273 -23 521 299 -8 1059 563 -45 -519
3675 -519 -219 405 -394 465 596 72 -740 284 434 -608 -277 -39 -348 -243 -358 -522 80 179 722 970
3695 970 -620 756 175 816 599 661 -361 174 545 -36 -241 -591 -474 107 -561 -825 539 -438 831
3714 831 8 455 8 487 -691 -34 -256 -226 -195 -1257 -603 -829 -1241 937 -553 133 -840 42 -180
3733 -180 -178 415 -924 556 854 91 376 -808 699 158 -222 -1004 -690 100 427 829 -714 315 -166
3752 -166 520 363 457 -430 -678 -180 242 -159 253 971 284 333 100 556 -263 609 -93 732 238 229 914
3773 914 346 -141 -380 295 729 651 -237 -85 1045 218 -1255 -22 -438 -119 17 290 412 717 83
3792 83 140 -297 148 340 -239 297 108 702 -133 278 269 -458 119 -454 -241 -1009 55 286 451 -701 158
3813 158 566 -704 397 -424 -731 -303 31 -338 -155 79 125 136 518 148 -427 -113 157 221 163 -199 34
3834 34 54 -228 1 -370 438 -165 -391 192 -510 -570 322 64 217 -768 781 -318 -224 -452 119 -101 -64
3855 -64 -739 -708 278 -670 -146 -553 -411 -392 -227 -625 436 -239 120 -1451 1038 -1154 -373 719 -614
3874 -614 226 457 226 711 -753 -655 832 -289 -565 710 -384 367 -764 -224 -211 1025 -327 -891
3892 -891 405 570 -655 1447 501 948 566 264 -267 -1148 -427 -503 -32 820 -247 -71 -12 462 869
3911 869 -866 -120 -12 -126 -339 -175 -255 -522 -950 305 -347 -178 -959 -409 602 -89 115 3 -444
3930 -444 -537 200 -631 -22 -388 -182 349 986 -841 -51 309 639 26 -15 21 -14 -420 432 261 883 -42
3951 -42 131 66 -448 -178 -476 156 -721 -191 -370 -1259 -93 532 615 734 29 432 -307 -7 18 -1378 -30
3972 -30 129 -598 1191 549 167 162 -421 -9 121 621 -26 845 95 502 -362 179 536 272 -1162 -269
3992 -269 876 60 -147 -211 808 -66 303 55 356 -509 -121 -694 447 -1070 -332 -367 15 -388 -269
4011 -269 584 212 -739 -146 -772 -387 332 124 -334 -30 65 -241 -164 -215 -342 -1176 -724 -613 242 482 591
4032 591 325 -217 1054 58 -21 227 -105 -428 32 484 629 1 525 -541 -208 -741 185 -71 255 -405
4052 -405 -9 -326 665 75 123 468 668 297 -57 -332 -142 0 -457 210 109 560 -608 -542 -99 739
4072 739 -160 1175 -39 300 -181 410 -179 -723 929 926 405 287 -9 162 307 -624 107 107 -632 -84
4092 -84 -684 -2 32 -849 180 -408 511 -181 353 68 -284 -106 -115 -187 -967 349 196 -58 -512 821 261
4113 261 118 -1030 2 234 -225 781 -78 924 321 -82 -185 -1134 264 803 -160 -96 1043 144
4131 144 220 461 46 576 29 -102 -381 -145 941 -53 208 -145 -413 508 -375 -579 -310 -696 249 -388
4151 -388 -113 628 1333 -56 285 -1378 -670 171 -394 1049 -162 -567 -423 -1027 -425 337 768 -952
4169 -952 311 -330 357 962 462 -512 707 103 -338 889 -849 -510 -128 -159 -37 -198 -362 28 -469
4188 -469 120 165 88 280 -190 -552 464 -19 -1140 260 530 249 -350 265 260 -68 194 -1121 -773 -152
4208 -152 588 819 162 -309 -445 719 423 -440 -167 -363 420 -606 -25 1167 -778 437 -217 -428
4226 -428 -290 205 -33 -240 770 651 220 -205 801 406 165 -1135 105 317 120 -206 -538 -472 502
4245 502 513 -716 -573 -656 552 -616 606 219 -172 -190 -517 88 1203 549 -835 8 79 -225 -1022
4264 -1022 691 685 318 821 48 768 -297 -178 134 106 249 -851 -537 -499 577 159 210 39 1039 623
4284 623 876 564 -410 -295 422 252 -501 -111 340 -233 -401 -511 -275 590 274 537 499 29 91 384 -609
4305 -609 -137 -521 -442 977 148 -584 282 351 46 463 305 373 -649 -481 145 -643 507 995 -594 -104
4325 -104 482 -223 15 -570 -465 289 -318 420 555 388 812 239 -159 -44 -984 797 318 -221 178 -294
4345 -294 84 -655 -620 -75 700 -481 -900 -295 484 -1082 -773 -472 826 336 268 679 -692 -99 25
4364 25 -102 445 553 274 -423 -500 -697 400 522 -549 -185 448 428 931 -637 -426 1377 1041 -665
4383 -665 116 845 553 1042 70 -537 -68 -246 156 1439 117 121 -799 261 -68 259 -680 -48 937 -257
4403 -257 -283 254 -410 171 403 73 -440 -340 579 -463 392 655 -72 -32 41 571 14 -1386 103 250
4423 250 325 -2 678 229 253 -41 960 -473 -599 1115 452 212 708 144 112 125 86 -750 -408 -308 -289
4444 -289 -290 -588 691 -190 -956 -365 -142 -365 571 -119 -234 557 239 46 -143 -602 -194 -21 -879 -551
4464 -551 662 -69 318 266 810 -212 0 922 216 -86 671 -399 1431 -606 -211 819 -75 -594
4482 -594 1475 622 -561 -133 -262 68 -100 27 -504 -1204 80 358 -54 315 -222 -49 112 -583 -30
4501 -30 -214 -561 -804 186 -41 -215 220 -632 -774 -98 -188 171 316 478 -1114 -601 245 369 100 416
4521 416 -897 201 -390 -371 26 -273 710 -66 -389 559 220 284 758 714 585 -257 123 -323 72 567
4541 567 295 -821 539 -337 -18 691 850 -157 -670 583 198 628 -147 -872 -341 -428 -252 -269 -315 222
4561 222 -536 364 268 90 -36 -881 304 -129 -149 -56 321 144 -53 1135 422 -37 309 -116 -122 255 -388
4582 -388 688 258 562 41 456 -418 -728 125 424 -232 -1020 -259 -710 -530 -17 599 389 893 -728
4601 -728 -82 414 -399 -643 -293 83 224 -362 174 -485 539 209 -278 683 36 211 -1016 370 628
4620 628 -375 -149 -136 -250 597 -86 54 674 567 -81 204 958 -324 -7 -677 -333 -928 325 1094
4639 1094 14 -287 273 -685 -914 -578 24 -226 757 350 195 -785 95 136 462 527 -271 284 -60 1014
4659 1014 -414 354 -614 -299 -378 -192 375 277 796 153 200 845 -8 231 -128 436 621 -333 -869 -603
4679 -603 -723 -743 -100 -684 -358 264 154 -235 -87 -667 151 -298 -211 -515 677 -142 -480 -522 279 -463 1119
4700 1119 129 77 -634 876 -246 -305 -1161 41 371 -245 857 -1011 -336 -458 -462 -1344 76 1000 -29
4719 -29 276 508 589 -663 -233 -31 627 -181 710 -382 185 168 -337 -115 24 553 -783 -410 -636 -52
4739 -52 -622 194 -871 99 474 -153 54 1072 310 -1208 -387 549 255 -197 -186 -369 -330 -242 557 -404
4759 -404 95 684 964 542 400 17 -135 219 -63 1086 -1064 122 236 264 -861 -15 -782 -138 -11
4778 -11 -407 486 785 399 -404 -627 -482 -578 -81 678 -60 -600 538 606 -328 -246 -853 100 81 157 190 -966
4800 -966 -622 -31 776 -396 434 579 165 382 129 -673 605 -338 1119 -606 347 178 3 -707 246
4819 246 145 451 934 526 20 -854 118 655 531 -103 -701 199 -28 -187 -506 -872 13 -272 40 222
4839 222 386 1442 514 31 -670 1141 -262 -21 138 88 293 -411 6 -359 618 612 -486 -457 191 442
4859 442 1059 -564 -341 366 388 757 353 -369 496 370 -113 902 668 748 359 454 -870 659 -565
4878 -565 -1085 -239 255 -156 165 -471 1052 -564 954 389 123 59 -747 396 -762 557 -72 530
4896 530 696 82 -300 -18 -499 -443 582 362 460 915 403 357 1133 -195 -425 -20 -892 -278 -349 1172
4916 1172 126 -1120 1437 -1061 -657 -34 9 113 -71 681 398 746 291 35 -470 381 -199 1006
4934 1006 -719 411 617 -406 -291 -224 -216 133 182 -353 -974 76 564 344 -836 -347 110 -995 -484
4953 -484 -81 208 520 209 97 -985 -333 -273 -122 -105 91 213 126 -595 -4 327 1198 323 -485 37 -1529
4974 -1529 -1135 -107 -46 157 255 -117 -267 -219 396 -446 290 -142 199 268 -505 -1285 380 -429 -473 -437 1093
4995 1093 106 -279 -237 283 86 -589 802 618 80 123 189 -139 -496 676 -53 31 -176 -167 470 -419 496
5016 496 -94 -586 1096 897 214 677 764 365 -395 -365 872 -136 210 703 -1060 243 -26 -588 112
5035 112 -83 -484 275 -140 -332 33 -454 288 -307 337 216 -951 739 901 347 -344 333 -60 -609
5054 -609 -524 -183 507 -787 113 124 720 -510 858 -360 565 593 794 204 -604 -692 788 -118 -760 184
5074 184 927 -492 -270 -121 -239 -53 189 801 -308 -764 447 -214 715 -261 -169 227 876 304 307 3
5094 3 -7 158 -339 357 377 245 883 -26 777 -1233 -530 -387 570 475 -1053 -327 182 -199 97 -943 -77
5115 -77 412 844 -65 -410 1088 -90 175 -80 561 -533 -1272 -41 -827 -494 -87 -200 197 618 -49
5134 -49 -319 168 419 -619 15 -158 1195 -576 1016 -400 -349 167 -447 119 541 229 -719 231 344
5153 344 286 513 -78 172 29 17 1074 160 -830 -15 965 313 296 -462 1091 -878 328 -79 -113 -67
5173 -67 -45 568 251 150 -16 -46 433 330 -45 32 -839 -451 400 -190 785 394 -386 -1385 441 -121 521
5194 521 -415 543 609 -213 -686 -768 335 -540 341 -1324 260 195 202 -230 433 -77 115 -859 150 11
5214 11 -418 418 440 -911 691 545 -42 -242 136 -396 -303 -54 173 241 310 422 398 69 789 378 -146
5235 -146 -526 327 904 600 803 -880 -608 15 565 66 151 -668 -209 141 -247 -206 329 -650 -309 395
5255 395 -44 -384 -37 -686 375 28 182 -1048 -170 -61 266 -1109 -97 -6 252 192 -413 -8 164
5274 164 -279 225 -326 115 526 712 802 -82 502 485 596 -182 654 123 -787 -587 -399 -526 -180 -24 251
5295 251 878 175 32 118 427 -104 603 -221 -545 1200 343 -7 -328 914 -409 53 -126 326 -110
5314 -110 793 637 -543 -247 927 648 -235 -149 -153 -159 -359 -283 24 369 111 307 615 -371 -961 -87 359
5335 359 -159 -86 -909 95 -213 -201 219 -364 -663 296 -14 -160 -948 936 367 -764 -59 -510 -101 -1196
5355 -1196 232 109 -699 -52 433 -762 1356 18 -253 -717 -287 -328 159 -43 19 448 893 419 402
5374 402 836 981 236 -290 928 568 -272 276 541 283 950 -845 -229 44 -345 -99 967 -175 138
5393 138 -351 181 637 -213 -399 -791 419 438 616 432 186 -71 -372 213 376 878 370 -314 135 321
5413 321 469 -261 288 210 194 -472 719 976 634 -336 253 754 -431 423 417 699 -261 -483 -95 488 -761
5434 -761 215 733 327 -469 -225 -96 166 212 881 394 294 -62 194 937 -586 582 -199 -725 567
5453 567 248 244 -445 -31 329 81 -144 -41 1035 197 340 -200 -193 -530 -556 894 396 588 -105 -283 759
5474 759 550 799 -115 -402 -56 -958 810 -426 453 -631 382 688 -1 -533 233 -145 -233 -350 -531
5493 -531 -1226 814 140 175 796 278 -575 -225 206 194 652 -7 -415 -571 192 528 25 -617 -810 -501
5513 -501 -411 431 601 -888 -180 -77 448 -476 929 -132 855 -245 25 52 -704 62 348 -727 245
5532 245 -509 -327 -541 725 -685 773 549 -901 -667 -26 854 -264 251 352 633 -100 -387 -97
5550 -97 544 -358 23 -99 1266 126 -352 489 109 305 -454 -620 -1198 -347 -99 260 -129 -449 -158 -793
5570 -793 -315 770 -96 -356 251 -655 457 -311 -486 377 1243 -323 -68 -749 -383 -410 338 267 -235 -582
5590 -582 166 -280 309 479 93 -703 601 -159 -213 -101 611 -9 -136 -218 -29 216 -458 948 33 -261
5610 -261 173 0 -159 -17 165 378 -543 108 237 -177 -186 373 -548 -916 -69 376 450 497 -304 563 962
5631 962 523 598 494 467 409 -890 334 -9 -615 27 -324 70 -765 -680 519 1139 40 -731 -653 196
5651 196 24 272 428 497 190 -459 -351 149 871 74 528 513 567 393 300 178 817 -434 513 -205 394
5672 394 464 -783 407 176 782 182 -300 -589 -444 141 349 370 -86 -226 -557 -106 -432 -255 957 533
5692 533 -403 551 362 56 18 -363 -530 344 -459 533 487 142 -36 -195 -544 531 -65 -398 563 -435
5712 -435 41 -351 -345 -647 147 136 1039 -315 -160 9 465 -288 1038 73 23 11 394 -179 -250 -347 -81 -687
5734 -687 242 -31 -56 128 272 760 839 45 371 97 -8 -180 -588 -394 57 512 -1168 656 -115 -287
5754 -287 1002 -520 -415 -582 -151 -1046 131 -36 -420 -10 -356 167 -339 -34 -421 797 -778 520
5772 520 -277 11 -170 -385 -243 -847 -411 511 -77 457 171 -61 -364 589 -185 8 -1208 -115 -552
5791 -552 -668 512 -511 -965 989 474 301 -446 54 -99 -408 281 412 1209 -305 -359 -532 -296 -151
5810 -151 16 21 -257 -538 -133 433 -914 -31 674 -282 -152 -1108 365 -99 267 271 541 19 -102 -617 -302
5831 -302 -642 241 135 121 -474 -358 752 -24 345 717 -5 -489 340 -145 -943 711 -287 257 333 852
5851 852 579 -329 433 -533 -310 -367 763 -200 -89 -1226 -143 -704 -64 -80 -114 -712 -575 577 769 -349
5871 -349 -409 -673 -283 -397 99 -60 -310 -299 125 260 191 38 -145 -73 193 581 -507 -102 220 -782 224
5892 224 -506 -418 782 -60 -718 -307 223 125 -53 394 -210 221 629 14 -754 -395 145 526 -200 -268 308
5913 308 482 751 152 588 -523 158 489 431 489 -142 -473 -363 14 -264 1047 450 -547 -801 186 107
5933 107 -664 17 -210 -2 -131 364 -335 424 209 609 139 437 -972 506 772 506 127 374 267
5952 267 415 -333 207 -465 -74 -316 -253 -789 176 -38 -1035 31 449 669 -30 -949 504 796 140 -254
5972 -254 -72 -137 -624 -1029 430 157 -561 -253 -566 -272 -192 19 -1177 -376 -384 424 -405 629 509 258
5992 258 -255 395 -327 -215 129 -1091 193 -332 -450 -231 303 -389 428 183 -101 976 506 355 -41
6011 -41 565 493 -558 -695 -596 290 161 -533 488 37 769 174 -330 -56 -878 180 1168 342 158 233
6031 233 -360 70 -343 -28 40 393 737 -310 486 331 -754 172 736 340 606 -138 528 -128 -169 321
6051 321 307 -550 662 -86 -622 1122 65 209 319 -296 -6 -117 336 -830 -329 864 -1014 -355
6069 -355 483 -813 308 -27 -303 415 -38 -118 128 278 143 -414 395 -636 -184 -341 186 24 111 697
6089 697 -411 -224 -72 120 -305 839 -324 -1019 371 229 960 64 246 590 73 -2 289 181 1282
6108 1282 2 -186 -493 1047 173 -691 124 -341 448 202 830 -41 379 -64 325 446 -57 -426 -138
6127 -138 -261 -273 -71 -451 -648 -214 -99 423 -288 1155 27 -188 -464 865 76 507 150 289 -488
6146 -488 -253 620 -932 130 617 75 1035 651 166 1210 -667 -278 -295 -859 -290 86 378 -806 -289
6165 -289 -428 399 84 110 71 425 179 -453 -409 -257 139 -166 -119 274 298 184 899 529 99 -300 -455 315
6187 315 81 -191 -294 -873 -761 508 -485 244 -150 -34 67 -76 -41 136 -178 91 169 -253 423 -279
6207 -279 817 -608 -962 -1 56 617 -575 -404 1318 -164 327 -138 -507 57 -971 -45 342 -338
6225 -338 74 -560 -158 -161 -335 8 493 674 -328 -9 -562 -701 -571 10 347 -394 -1150 482 237 -233
6245 -233 209 840 395 -957 200 -278 -587 128 120 883 -21 522 131 238 -625 -474 -513 669 366 -226
6265 -226 -51 -80 -163 -526 -156 75 146 70 222 826 558 273 -134 -379 -361 406 1323 1112 868 274 132 -405
6287 -405 425 -1057 -388 8 -576 427 205 -595 602 -264 -232 -352 136 502 67 1 -1106 -485 -486 204
6307 204 -687 207 167 -211 356 479 -673 285 943 136 34 -289 679 695 183 156 267 319 381 -529 -521 481
6329 481 -1729 119 -503 -106 -93 -703 509 18 -767 136 187 194 -326 -757 -448 -132 -379 -20 350 663
6349 663 -494 -337 152 -98 -397 289 -644 196 521 -446 -84 -232 -504 283 29 -1036 -99 -1061 -544
6368 -544 -216 -233 179 -872 -255 578 141 294 -575 115 -403 514 547 336 -261 5 257 350 -58 -13 -134
6389 -134 -228 33 29 360 -103 169 -394 73 436 853 -735 -141 255 -462 483 -58 -293 -102 -185 489 754
6410 754 917 -903 69 99 509 -657 -583 -15 -286 -276 -290 -238 -649 -817 -594 701 190 -165 -401 -360 309
6431 309 223 293 226 182 1053 -694 148 920 -709 -368 -831 512 314 -95 -807 -237 -77 286 493 -601
6451 -601 -802 -483 737 940 463 602 -457 -134 -217 37 801 2 416 -320 -31 833 -120 -122 265 -196
6471 -196 779 623 928 414 271 386 100 168 -516 -135 242 -403 1045 673 -105 309 -220 -654 316 -379
6491 -379 309 419 -12 -426 -899 -732 473 179 211 -252 -153 667 -499 206 302 468 -299 1555 -50 194
6511 194 159 -347 -54 -180 -1003 -410 -189 83 -278 241 -981 -211 -1356 736 -80 -135 849 -385 348
6530 348 -132 -327 679 162 -16 -212 -1034 -13 -173 423 255 298 663 -109 269 529 -1088 533 -70
6549 -70 966 -23 223 285 -442 -73 141 -621 -53 479 50 571 -272 523 -476 -713 -365 5 -466 929
6569 929 -272 121 -7 -5 -94 -161 -299 -181 312 -418 -495 -246 1310 -587 -849 -626 -130 -280 743 -20
6589 -20 -579 -328 240 391 -454 -189 65 91 4 258 35 144 -590 49 678 -7 275 647 749 -239 -849
6610 -849 405 269 793 -834 -610 -529 90 -143 79 -167 338 221 290 733 -272 339 83 905 229 -153
6630 -153 -350 -165 -295 -153 -574 -207 -328 415 976 -361 -326 243 294 -551 -158 849 -1024 -178 655 -379
6650 -379 -480 -1051 -281 179 -557 993 -403 -419 -545 -11 912 142 276 -872 397 -533 239 248 139 -52
6670 -52 -322 -17 -109 627 -199 476 674 736 -426 233 632 -303 -276 -685 -8 -122 -428 1037 132 -941
6690 -941 -54 124 955 -174 -64 -558 203 -132 -119 -400 -46 53 -202 -671 -219 -671 135 -360 -432 -301 -407
6711 -407 539 208 -315 76 878 -269 149 610 -205 -1070 -247 28 -637 -186 173 -40 -374 -339 334 109
6731 109 59 845 -393 -395 366 -829 -261 -800 257 254 164 678 669 243 14 -773 239 -335 926 127 185
6752 185 91 27 -1290 56 371 -278 -691 506 373 -53 1150 -30 -121 404 -475 169 165 -298 200 -559
6772 -559 -438 -410 475 -136 388 190 -365 43 -234 159 -345 -521 312 -73 -261 123 567 262 377 1075
6792 1075 452 717 388 -579 -280 -274 -263 -204 -898 31 302 456 -43 666 202 -596 -507 911 -217 122 596
6813 596 -352 183 -412 371 373 132 -363 -567 -444 -800 -352 -375 -96 9 -185 -273 520 -84 -199 305 -217
6834 -217 515 -462 42 164 -488 -383 -928 -218 -57 326 346 542 163 435 -64 105 335 750 -638 -162
6854 -162 -223 -633 254 393 -99 -49 -416 -397 -344 298 112 -265 -762 925 -263 91 634 670 -252 112 -829
6875 -829 -124 375 -303 167 -405 672 -1132 541 20 327 -825 -1308 -474 -258 65 -743 -167 120 -397
6894 -397 95 -16 -254 -295 174 46 -158 -399 -530 121 559 36 181 136 -545 880 -733 485 -875
6913 -875 754 -419 71 -705 -163 -243 -673 -271 213 -284 200 597 308 20 575 532 -24 112 177 -109
6933 -109 780 -148 -282 581 -143 96 116 -46 -795 -529 35 123 260 -83 184 -157 -468 476 -808 -613
6953 -613 546 -218 -304 164 -393 -930 -231 -494 711 534 -163 -622 297 369 25 320 185 -346 -509 11
6973 11 -355 -770 -623 -484 305 184 -747 -326 466 334 114 -275 489 381 -772 68 483 252 686 -77
6993 -77 -219 -36 -359 65 -176 -421 850 611 -642 31 118 -32 1097 299 275 1679 594 690 296 213
7013 213 21 -408 -63 -469 137 629 -592 408 -746 -1 -396 876 -515 -630 -88 -637 -1056 -34
7031 -34 14 762 -1251 -849 -194 328 1363 -931 -982 338 -6 366 -962 -947 -345 -778 -264 -227 -19 -848
7051 -848 -407 -683 469 -166 -697 224 40 -90 597 42 278 -82 -436 -551 40 -365 -183 -522 -555 32
7071 32 338 -36 517 152 277 592 -313 376 12 -294 10 204 431 1079 1131 332 699 -363 -310 65 -803
7092 -803 883 11 -531 180 317 -230 -426 -754 -541 -604 122 164 487 438 355 538 896 -706 -577 108 -584
7113 -584 314 -98 -496 -270 -490 -292 -276 173 -428 -258 94 -383 708 688 -608 123 -99 -613 -15 1294
7133 1294 714 -864 285 -756 -18 -710 -800 487 1153 226 355 -15 809 -141 -378 -802 103 -380 -70
7152 -70 -317 240 291 -192 -53 148 -22 81 -961 -653 -87 -1116 500 -176 296 -606 -492 -43 -542 -271
7172 -271 -726 -46 -274 504 475 -311 284 112 362 244 -34 -156 -48 620 371 390 766 -991 -93 -17 434
7193 434 -250 537 -298 -1109 -600 537 179 -71 -321 137 -453 723 502 21 -756 677 -27 -113 350
7212 350 -253 -296 326 -163 -306 -155 239 91 1 148 -345 1 312 -882 -571 -326 523 344 268 -760
7232 -760 561 -210 -73 -483 -380 -79 732 52 -391 -156 662 653 -17 3 148 -282 945 -569 -353 -718
7252 -718 -394 -179 -268 -489 10 -944 -776 -365 -128 -807 454 798 54 -75 576 846 842 -207 140 -877
7272 -877 -206 201 -903 544 -442 -575 -388 -460 181 439 242 -392 -626 -426 -374 184 420 -302 56 -471
7292 -471 273 -165 158 -60 1246 464 112 682 -712 -196 -442 263 577 -991 -379 -651 -824 -482 -300
7311 -300 -761 215 350 -213 -389 -181 -287 -148 61 414 24 -369 843 1038 105 -359 1 -159 633 228
7331 228 -112 830 560 171 -184 345 354 547 246 101 -789 -807 353 -582 191 108 -377 115 553 -94 390
7352 390 324 353 16 880 -971 -45 293 -693 892 935 -49 -84 163 791 -117 176 -307 472 416 -460 189
7373 189 -467 -1303 74 238 -314 905 -463 -338 -812 531 -357 713 1134 284 -12 199 680 -255
7391 -255 593 469 -6 -680 -273 -321 1113 -202 55 42 71 -752 -421 -646 -513 -409 52 -10 81 36 -439
7412 -439 -346 189 60 -975 -211 90 889 617 -490 -327 165 -458 495 253 -304 149 332 -448 272 -202
7432 -202 -532 383 844 167 -267 299 470 -593 -142 -355 -175 -217 -18 550 -172 65 -461 869 -462
7451 -462 -246 -132 12 776 365 441 1043 -413 170 -702 -81 19 -151 210 398 -325 -185 -421 -294 -623
7471 -623 -265 407 -139 59 -738 -930 -272 -130 -666 -255 157 -655 45 244 -685 468 -503 285 -6 1446
7491 1446 -8 -243 518 -194 -387 -679 179 -443 379 -388 447 -405 -480 -96 765 103 -843 497 524 -583
7511 -583 811 -600 180 189 10 151 -329 -165 358 -589 365 -493 595 1011 -194 438 -73 660 989
7530 989 -663 -4 -718 -139 -597 -117 858 -26 -257 687 -76 -530 143 -504 -45 106 273 -9 -203 168
7550 168 183 -180 182 -476 420 -94 -187 -533 -91 -39 944 -152 -406 591 -369 137 344 205 261 205 -154
7571 -154 928 547 -247 127 -445 -105 40 126 16 -808 -531 331 -337 704 149 -698 154 41 -620 766
7591 766 -614 175 43 -62 -450 -329 337 1235 262 -295 -200 196 -128 -857 251 597 732 426 -156 -466
7611 -466 -240 323 -887 -35 57 282 -609 -746 224 -4 -383 419 -469 852 338 516 -115 -267 111 1227
7631 1227 -42 -36 424 20 230 442 -28 296 -635 -472 990 -707 727 93 -147 -780 232 -57 74
7650 74 -74 492 175 145 74 213 -545 346 -50 -228 475 741 335 -313 5 815 1316 398 798 495 349
7671 349 -5 105 -129 369 -363 417 -589 -240 -45 535 555 -386 -97 217 398 562 -299 -8 767 52
7691 52 106 -772 -349 475 701 243 -140 184 -409 -168 389 -619 13 354 -105 -408 599 594 67 557 -202
7712 -202 -568 647 13 -1094 485 406 321 18 22 -960 151 -531 12 -460 -442 399 -5 707 -368 -212
7732 -212 196 -173 92 345 60 409 -372 -917 -368 -368 -38 512 -743 46 636 -1155 -1008 729 -291
7751 -291 -404 -131 105 -439 78 356 -230 -78 -48 -122 -133 -27 40 191 -330 -907 -337 -450 -399 -607 -931 -252
7773 -252 -611 -141 -113 -649 -223 -522 476 -260 -228 412 281 73 72 -274 764 643 300 -246 72 194 -521
7794 -521 175 -263 496 -73 467 390 239 -76 -352 436 124 187 130 564 -87 -34 43 -799 -1207 545 499 -220
7816 -220 973 5 760 -173 -402 -289 510 427 -16 556 33 45 169 431 266 -242 -23 -9 -3 386 -286
7837 -286 -33 -1429 -63 876 287 477 -360 55 197 -860 1035 7 -403 -353 980 -687 -619 205
7855 205 106 -841 -652 109 175 -268 157 271 803 717 155 -159 215 3 1 461 -281 6 894 3 464 -164
7877 -164 152 310 379 469 793 196 29 215 329 -965 -314 -195 397 -464 -348 -214 -15 68 305 -81 -867
7898 -867 350 -450 418 317 -138 895 383 13 -259 -685 -625 119 -125 -498 -257 276 248 718 -635 -329
7918 -329 -1269 732 -386 -55 189 -837 -367 -730 77 430 -548 1204 575 -1177 -909 573 762 -179
7936 -179 -244 -335 372 -315 175 81 -835 1025 402 637 -318 48 -730 348 143 -136 257 -854 -196 97
7956 97 351 -321 279 -857 -478 -60 446 -428 138 -732 184 -69 -466 -15 -443 -351 1052 580 513 330
7976 330 255 118 130 8 514 -311 4 -64 507 89 188 475 285 176 344 789 -599 197 96 319 715
7997 715 -236 -906 -45 411 -191 782 337 -133 -69 1302 564 23 -82 395 -177 -818 -381 -745 298 -136
8017 -136 361 -717 43 776 11 621 -887 755 -909 161 511 202 -702 -183 -585 -47 -128 9 776
8036 776 -181 -590 154 538 -670 618 241 -109 -684 469 -145 428 -291 414 627 -56 -116 443 -50
8055 -50 -564 304 -1281 892 149 -698 -292 -487 139 -296 -216 -956 23 985 43 641 348 -25 330 1042
8075 1042 -152 203 -937 1245 118 703 -433 515 -534 -231 618 -244 -476 32 421 -157 -885 301
8093 301 471 -144 527 362 584 434 785 455 -259 -213 -420 306 -537 477 497 271 -435 452 -10 119
8113 119 416 -748 -643 -34 729 45 -590 -422 -77 -291 -1344 131 -378 594 -29 -10 -101 -633 250 -447
8133 -447 -543 11 -187 361 57 -659 -684 -1082 -280 437 -432 -572 106 -556 188 -269 364 418 295 217 125 -678
8155 -678 36 456 590 -669 623 -140 379 358 128 343 57 921 44 -981 -32 -288 967 1013 543
8174 543 843 -187 786 -919 -41 410 -86 35 155 33 493 61 -11 1090 -318 -624 266
8191B66
##END NTUPLES=NMR FID
##END=
