##TITLE=1H_UK_23_5_8
 CD2Cl2
 108 sc, 
 18.10.2022
##JCAMPDX= 6.0         $$ Bruker NMR JCAMP-DX V2.0
##DATA TYPE= NMR FID
##DATA CLASS= NTUPLES
##ORIGIN= UXNMR, Bruker Analytische Messtechnik GmbH
##OWNER= root
$$ XWIN-NMR		Version 3.5
$$ Tue Oct 18 12:25:07 2022 Russian Standard Time (UT+4h)  she@DPX200
##.OBSERVE FREQUENCY= 200.1313499994
##.OBSERVE NUCLEUS= ^1H
##.DELAY= (6, 6)
##.ACQUISITION MODE= SIMULTANEOUS
##.ACQUISITION SCHEME= undefined
##.AVERAGES= 108
##.DIGITISER RES= 18
##SPECTROMETER/DATA SYSTEM= spect
##.PULSE SEQUENCE= zg30
##.SOLVENT NAME= CD2Cl2
##.SHIFT REFERENCE= (INTERNAL, CD2Cl2, 0, 15.7039)
##AUDIT TRAIL= $$ (NUMBER, WHEN, WHO, WHERE, WHAT)
$$ ##TITLE= Audit trail, XWIN-NMR		Version 3.5
$$ ##JCAMPDX= 5.01
$$ ##ORIGIN= Bruker BioSpin GmbH
$$ ##OWNER= she
$$ F:/spectra/data/she/nmr/H-F/1/audita.txt
$$ ##AUDIT TRAIL=  $$ (NUMBER, WHEN, WHO, WHERE, WHAT)
(   1,<2022-10-18 12:22:36.10 +0400>,<she>,<DPX200>,
      <continue with go, POWCHK disabled, PULCHK disabled
       configuration hash MD5:
       00 E9 B6 7A A2 85 ED C7 34 08 36 98 17 FE 4E 26
       data hash MD5: 16K
       1B 00 F8 98 63 A4 F0 D9 E5 DC C1 43 88 69 06 71>)
$$ ##END=
$$ 
$$ hash MD5
$$ 69 34 15 E3 E7 7D 8B 3C E1 2C 4A CE F5 98 16 A3
##$RELAX= 
##$RELAX= 
##$RELAX= 
##$RELAX= 
##$RELAX= 
##$RELAX= 
$$ Bruker specific parameters
$$ --------------------------
##$DU= <F:/spectra>
##$EXPNO= 1
##$NAME= <H-F>
##$PROCNO= 1
##$TYPE= <nmr>
##$USER= <she>
##$AMP= (0..31)
100 100 100 100 100 100 100 100 100 100 100 100 100 100 100 100 100 100 
100 100 100 100 100 100 100 100 100 100 100 100 100 100 
##$AQSEQ= 0
##$AQ_mod= 1
##$AUNM= <au_zg>
##$AUTOPOS= <>
##$BF1= 200.13
##$BF2= 200.13
##$BF3= 200.13
##$BF4= 200.13
##$BF5= 200.13
##$BF6= 200.13
##$BF7= 200.13
##$BF8= 200.13
##$BYTORDA= 1
##$CFDGTYP= 0
##$CFRGTYP= 5
##$CHEMSTR= <none>
##$CNST= (0..31)
1 1 145 1 1 1 1 1 1 1 1 1 1 1 1 1 1 1 1 1 1 1 1 1 1 1 1 1 1 1 1 1 
##$CPDPRG= <>
##$CPDPRG1= <>
##$CPDPRG2= <>
##$CPDPRG3= <>
##$CPDPRG4= <mlev>
##$CPDPRG5= <mlev>
##$CPDPRG6= <mlev>
##$CPDPRG7= <mlev>
##$CPDPRG8= <mlev>
##$CPDPRGB= <>
##$CPDPRGT= <>
##$D= (0..31)
0 1.2 0 0 0 0 0 0 0 0.06 0 0.03 0 0 0 0 0.0002 0 0 0 0 0 0 0 0 0 0 0 0 
0 0 0 
##$DATE= 1666080956
##$DBL= (0..7)
120 120 120 120 120 120 120 120 
##$DBP= (0..7)
150 150 150 150 150 150 150 150 
##$DBP07= 0
##$DBPNAM0= <>
##$DBPNAM1= <>
##$DBPNAM2= <>
##$DBPNAM3= <>
##$DBPNAM4= <>
##$DBPNAM5= <>
##$DBPNAM6= <>
##$DBPNAM7= <>
##$DBPOAL= (0..7)
0.5 0.5 0.5 0.5 0.5 0.5 0.5 0.5 
##$DBPOFFS= (0..7)
0 0 0 0 0 0 0 0 
##$DE= 6
##$DECBNUC= <off>
##$DECIM= 32
##$DECNUC= <off>
##$DECSTAT= 4
##$DIGMOD= 1
##$DIGTYP= 9
##$DL= (0..7)
0 120 120 120 120 120 120 120 
##$DP= (0..7)
150 150 150 150 150 150 150 150 
##$DP07= 0
##$DPNAME0= <>
##$DPNAME1= <>
##$DPNAME2= <>
##$DPNAME3= <>
##$DPNAME4= <>
##$DPNAME5= <>
##$DPNAME6= <>
##$DPNAME7= <>
##$DPOAL= (0..7)
0.5 0.5 0.5 0.5 0.5 0.5 0.5 0.5 
##$DPOFFS= (0..7)
0 0 0 0 0 0 0 0 
##$DQDMODE= 0
##$DR= 18
##$DS= 0
$$ [...]
##$SUBNAM2= <"">
##$SUBNAM3= <"">
##$SUBNAM4= <"">
##$SUBNAM5= <"">
##$SUBNAM6= <"">
##$SUBNAM7= <"">
##$SUBNAM8= <"">
##$SUBNAM9= <"">
##$SW= 18.0517283424941
##$SWIBOX= (0..15)
0 0 2 0 0 0 0 0 0 0 0 0 0 0 0 0 
##$SW_h= 3612.71676300578
##$TD= 16384
##$TD0= 1
##$TE= 0
##$TE2= 300
##$TE3= 300
##$TEG= 300
##$TL= (0..7)
0 120 120 120 120 120 120 120 
##$TP= (0..7)
150 150 150 150 150 150 150 150 
##$TP07= 0
##$TPNAME0= <>
##$TPNAME1= <>
##$TPNAME2= <>
##$TPNAME3= <>
##$TPNAME4= <>
##$TPNAME5= <>
##$TPNAME6= <>
##$TPNAME7= <>
##$TPOAL= (0..7)
0.5 0.5 0.5 0.5 0.5 0.5 0.5 0.5 
##$TPOFFS= (0..7)
0 0 0 0 0 0 0 0 
##$TUNHIN= 0
##$TUNHOUT= 0
##$TUNXOUT= 0
##$USERA1= <user>
##$USERA2= <user>
##$USERA3= <user>
##$USERA4= <user>
##$USERA5= <user>
##$V9= 5
##$VALIST= <valist>
##$VCLIST= <CCCCCCCCCCCCCCC>
##$VD= 0
##$VDLIST= <DDDDDDDDDDDDDDD>
##$VPLIST= <PPPPPPPPPPPPPPP>
##$VTLIST= <TTTTTTTTTTTTTTT>
##$WBST= 1024
##$WBSW= 4
##$XGAIN= (0..3)
0 0 0 0 
##$XL= 0
##$YL= 0
##$YMAX_a= 1984460
##$YMIN_a= -1461334
##$ZGOPTNS= <>
##$ZL1= 120
##$ZL2= 120
##$ZL3= 120
##$ZL4= 120
##$ABSF1= 10
##$ABSF2= 0
##$ABSG= 5
##$ABSL= 3
##$ALPHA= 0
##$AQORDER= 0
##$ASSFAC= 0
##$ASSFACI= 0
##$ASSFACX= 0
##$ASSWID= 0
##$AUNMP= <proc_1d>
##$AZFE= 0.1
##$AZFW= 0.1
##$BCFW= 1
##$BC_mod= 2
##$BYTORDP= 1
##$COROFFS= 0
##$CY= 11.3945322036743
##$DATMOD= 1
##$DC= 2
##$DFILT= <>
##$DTYPP= 0
##$F1P= 2.36226072786647
##$F2P= -0.459571619588291
##$FCOR= 0.5
##$FTSIZE= 0
##$FT_mod= 4
##$GAMMA= 1
##$GB= 0.15
##$INTBC= 1
##$INTSCL= 1
##$ISEN= 128
##$LB= 0.24
##$LEV0= 0
##$LPBIN= 0
##$MAXI= 10000
##$MC2= 0
##$MEAN= 0
##$ME_mod= 0
##$MI= 1.114404
##$NCOEF= 0
##$NC_proc= 0
##$NLEV= 6
##$NOISF1= 3.799351
##$NOISF2= 2.8
##$NSP= 1
##$NTH_PI= 0
##$NZP= 0
##$OFFSET= 15.70392
##$PC= 1
##$PHC0= -18035.75
##$PHC1= 11.8007
##$PH_mod= 1
##$PKNL= yes
##$PPARMOD= 0
##$PSCAL= 0
##$PSIGN= 0
##$REVERSE= no
##$SF= 200.130013532006
##$SI= 16384
##$SIGF1= 3
##$SIGF2= 2
##$SINO= 400
##$SIOLD= 16384
##$SREGLST= <1H.CDCl3>
##$SSB= 0
##$STSI= 0
##$STSR= 0
##$SW_p= 3612.71676300578
##$SYMM= 0
##$S_DEV= 0
##$TDeff= 0
##$TDoff= 0
##$TI= <>
##$TILT= no
##$TM1= 0
##$TM2= 0
##$TOPLEV= 0
##$USERP1= <user>
##$USERP2= <user>
##$USERP3= <user>
##$USERP4= <user>
##$USERP5= <user>
##$WDW= 1
##$XDIM= 8192
##$YMAX_p= 0
##$YMIN_p= 0
$$ End of Bruker specific parameters
$$ ---------------------------------
##NTUPLES= NMR FID
##VAR_NAME=  TIME,          FID/REAL,        FID/IMAG
##SYMBOL=    X,             R,               I
##VAR_TYPE=  INDEPENDENT,   DEPENDENT,       DEPENDENT
##VAR_FORM=  AFFN,          ASDF,            ASDF
##VAR_DIM=   8192,          8192,            8192
##UNITS=     SECONDS,       ARBITRARY UNITS, ARBITRARY UNITS
##FACTOR=    0.0002768,     1,               1
##FIRST=     0,             0,               0
##LAST=      2.2672688,     0,               0
##MIN=       0,             -1461334,        0
##MAX=       2.2672688,     1984460,         0
$$ Real data points
##PAGE= N=1
##DATA TABLE= (X++(R..R)), XYDATA
$$ [...]
2652A32J63o02K171J533k456N03M72j395j906J818j978o84P22J947j063P54K630
2669B761j399r51P35R6k516n64J665j485p83L192l81K47O90J178k359K66J554
2686A946l017k11j51q24K50K753N91l11L69J461j103k006P26q69r10j419J457
2703a268l48J116J352n06K92L53J692k055o09k55j729q65J525P0l27J713l20J755
2721A586J93L39q71L0j096j473o77P52o15j87K387L00o2R38Q11j334N15n81j024
2740f9j708j08Q19o20P22J862j052J556J370j902J49n96J7k012n00K059k98j511
2758a822J262L41N39J386J307k779j81R64j684k291K023N52J51J6J716p68K86
2775A018K164k512j417N59k09r56p38J139p61J174R02J579j428J420k0j926j097
$$ y = [132, 295, -307, 1864, 3397, 941, 1444, 1916, 521, -1385, 433, -1545, -2229, -1507, 440, -623, 131, 2761, 1362, 411, 1146, 1242, -1274, -1838, -173, -1658, -2441, 751, 370, 617, 1307, 2485, 126, 392, 1946, -1071, -1282, -1433, -2257, -2007, 746, 1337, 1026, 1395, 2856, 1753, -253, 473, -396, -1306, -2725, -1268, -1616, -500, 852, 346, 638, 991, 2683, 628, 19, -236, -1965, -2830, -1305, -1235, -1562, 151, -169, 1586, 1779, 2118, 1247, 1277, 181, -1292, -1969, -1217, -1832, -2019, 368, 668, 606, 1544, 2355, 1021, 1536, 955, -69, -1777, -1885, -1066, -1686, -964, 898, -154, 1402, 2772, 870, 1019, 423, 440, -1572, -2072, -13, -311, -1822, -560, -219, 320, 1706, 3013, 234, 53, 1017, -667, -2958, -935, -383, -232, -216, 1500, 732, 1018, 3182, 670, -747, -188, -397, -1353, -2091, -952, -1713, -539, 363, 1942, 514, 1934, 1914, -12, -1109]
2792a109J268j048j885K667mp38R79J088J78o12J884j193k016J86l80r73k20J287
2810f41k49Q81J670P07j980L83j92n04j297N38o92l49P52O40q95K109J075n60
2828A396k01N67k527r65O49N42k340P36K096J25l40J696o99L42m73p7k70p22l99
2847h64l23N8j76J904j072K126j211J747r46N84j485j804J069o59j570J760J087
2864B25J34J05J098N45j455k09r64j602J553o73p53Q74J111n59P22K108L17k329
2882B48K66l9k221J41J301j236m23K438N08j290J994L91j357L5j50o90k078R71
2900a191n49r11K440J049m56L80O66K75j218Q75j181j283l34N30j104j3L243m73
2918G45o56J068J640j665r41P8m68j897J58P07P54N57K093p63n38J399o78j533
$$ y = [-1109, 159, -889, -2774, -107, -111, -849, 130, 1218, 1396, 784, 2668, 1475, -541, -355, -735, -1708, -1928, -641, -890, -9, 1661, 2368, 388, 771, 579, 75, -1222, -684, -1376, -1725, -973, -333, -1228, 881, 1956, 1396, 1195, 1762, -765, -1730, -1081, -539, -2879, -2143, -47, 78, -262, 1434, 735, 1077, 604, 527, 257, -465, -864, -1187, -1129, -1305, 599, -473, 1653, 442, 2189, 1243, 1827, 342, -1462, -393, -1052, -2622, -862, 225, 359, 464, 1562, 2107, 652, 443, -521, -2123, -570, -1243, -1996, -1122, -11, -570, 152, 2260, 2577, 248, 514, 475, -1746, -1605, -304, -1540, -1963, 475, 983, -307, 1687, 2078, 721, 756, 606, -84, -2162, -1191, -1740, -2651, -211, 838, 382, 762, 1428, 1703, 485, 1360, 179, -1104, -1438, -908, -2012, -2025, 1218, 745, 89, 1157, 2797, 1132, 191, 269, -199, -2096, -1938, -1231, -477, 80, 2173, 1410, 872, 2271, 1593, 60]
2936F0J035j260j018m08M26R0L50J360j440K563k37p4j83n34j3k007O77n91j92
2955a396Q8J147J202p01J181J57o40k66l13k398L17M87n27J519J40J006Q76K27
2973B106k32j335j112m56J004k295Q43M70j75J415l54J572j77K05p93j431N80
2990a65j26m28k85L86k18L53O77J016j150J095Q54j753r67M88q22r60P74K84l7
3009i84N84K548j92m85O74j541j766J047p84j276R77k03P50K54J030J673k124
3026A82J015P9q43j286j47p65L88L77P28k98L28K564j550P7P82j199j121M93k44
3045d40j701L30L99J642J74J351K15r85l6o65j079lL64o05p37O58J537r02J792
3064A309M23j034L03N28j215k510J252M24j370J65K207l30K11J082l24K34m06
$$ y = [60, 1095, -165, -1183, -1591, -1165, -1075, -725, 635, -805, 1758, 1521, 1447, 1264, 730, 717, -1290, -613, -1204, -1396, -1308, -161, 1041, 340, 1521, 1678, 1038, 772, 459, -1939, -1622, -1135, -1662, -143, -3, 1003, 1879, 2106, 1874, 539, -573, -1029, -25, -2320, -1477, -1007, -1182, 233, -121, 1451, 1274, 1479, 686, -745, -165, -291, -719, -1004, -618, -836, -483, 194, 1210, 60, 1155, 2009, 256, -711, -223, -1045, -2005, -1231, -947, -984, -400, 2148, 1956, 1471, 2145, 604, -1162, -115, -899, -2175, -1198, -1401, -651, -397, 633, 2306, 182, 1197, 1276, 433, -853, -1000, -1765, -1377, -1000, -272, -570, -242, 2322, 772, 849, 1631, 432, -689, -196, -440, -2141, -1811, -1412, 230, 404, 1755, 1970, 985, 949, 284, -795, -798, -434, -1039, -1776, -1118, 419, -483, 1309, 1732, 698, 1001, 1529, 314, -2196, -944, -520, -1890, -1725, 482, 152, 363, 1445, 1121, 1355, 949]
3081I49k10k134m93J498j647N29L75J572k9J143P72p49j468J836k681p78O37r76
3099a854N49J022J192L28p35J052o81k19l18p04j882J692m63q25J029J298j01
3116C80P71Q30l3k337L6J76r26O87j37j448L93J883J388j402J211K5m70j203K77
3135A01o16j105L87J65L88l04J952l71J065j60j94j960J891j877j206l27P62k61
3153a670J77K353j46k47J219k80j080N87k12q22j323j54j96M39J803O39j54K02
3171A135R74j661n44P3P3k517L60J548K55O85L41J018j148J585j360p25k05oj392
3190a511o62J056N28j106J566K442k200J023p81n09l88L0j021J42J87j06K96Q16
3208a98J049j86q1J153p21o16j475J73n59N56j09M57J096Q20j97j141J212o40
$$ y = [949, 739, -1395, -1888, -390, -2037, -1508, -1133, 439, 410, 1553, 2325, 1576, 108, 1944, -737, -1515, -878, -1854, -1305, -283, 909, 1237, 502, 1554, 873, 654, 336, -368, -2250, -558, -1021, -1846, -817, 481, 380, 1151, 1981, 1948, -389, -353, -177, -1103, -416, -553, -2001, -1608, 275, 1663, 261, 1472, 1497, 1027, -176, 101, -515, -1620, -1233, -1068, -680, -984, 968, 597, 1662, 1502, 1308, -652, 1239, -638, -1844, -2171, -1409, -1670, -1493, 860, 714, 467, 1686, 1406, 326, 913, 701, -121, -1444, -1598, -1794, -1355, 448, 1087, 933, 1135, 2109, 448, -96, -23, 50, -2467, -2107, -559, -304, 381, 722, 1740, 592, 2177, 817, 92, -113, -119, -1511, -2173, -1117, -589, -1695, -129, 2313, 113, 1136, 355, -154, -542, -512, -1533, -1391, -1204, -1310, -1014, -198, 851, 665, 584, 1737, 1016, 400, -1075, -902, -1461, -905, -1014, -557, 539, 1359, 1162, 21, 1233, 593]
3226E93o96n02L87j349j016K471Q31j290J644J179j712N42L00j608j025R27K35
3243h9j196j37P77N29J416j083Q22l80J82L74j688q65J270j105m9O63N25J002
3261I68N34O14j268L59O4j214l05j57l5j358J360N47r54J423M30j195J283o66
3279D30p24n17M67P61k160J659L09l04N28J384L07j238j008O94j185M15o33j268
3297b083K91J774Q91q01J652l45k49M54q16j916M58M1k02l19J423K47n21O15J090
3316A684m07k94K55j443n68mk14K13L46M55O04K31n1K74j442K10l42j278M03M47
3336i21Q6K12J09R70L49N85l10k60p05P07j287j379P07P65p36J406Q8M87K05l9
3356A039O66j82j382m04j41q53K63l80J487m65J310j409K966j024j155P64j701
$$ y = [593, -103, -605, -218, -1567, -2583, -112, 719, -571, 1073, 2252, 540, 1082, 1382, -226, -1251, -324, -89, -1285, -1422, -645, -116, 1300, 217, 1039, 659, 841, 1215, -473, -1338, -68, -1173, -1222, -559, -34, 968, 1502, 2116, 848, 1207, 1271, 57, -248, -405, -440, -1798, -438, 109, -845, 578, 1008, -187, 1096, 430, -294, -811, -344, 417, -1743, -84, 225, -79, 449, 1833, 2140, 902, -106, 588, -597, -182, -815, -2083, -1792, -18, 873, 72, 1724, 1379, 1130, 1584, 768, -1148, -690, -649, -851, -1170, 253, 500, -21, 594, 1684, 1277, 983, 1238, -205, -773, -777, -991, -778, -432, 23, 627, 858, 807, 1081, -361, -151, -493, -1771, -1368, -921, -835, -623, -514, 456, 805, 1390, 1080, 820, 115, 822, -465, -1844, -1137, -372, -1108, 298, 386, 873, 1078, 1039, 1705, 1523, 141, -263, -404, -1257, -994, -1374, 113, -352, 958, -451, 2515, 1491, 336, 1100, -601]
3373f01l67j61J65j76P47J251Q17j482R95m96m90J27k16n07j151j66J200l38j37
3392i86J717J50j00q45J125j641R2o5j258J016j68q8P73J308m90K89q79J308l15
3411I43R7j298l23l71M39j80r8O62K94P10o49P78o61m12l29J64o48j006K109k62
3431d1m76J664J88m77j66L78j975P04n66q87l58R77P47K57J042L10p67N76M8j454
3451b76L90n38n81j70p79J953o74L82J736j72m22M97L69k141R66j421o85J74J263
3470a29j78N3M88N24n08K90K42j433o9J09O94n12M80N23o15k8J107j459J024j13
3490D90j185k89J382n65M26j412R73M05Q04p99k0O62n28rm73j55m35p06R05J473
3510I44m45j460J317J46N64o12K38j164j11J90N05p53k18J538m58P44p62Q76q84
$$ y = [-601, -968, -1129, -964, -1140, -393, 858, 1675, 193, 1188, 692, 202, 329, 113, -394, -1545, -1711, -511, -849, -986, 731, 881, 781, -64, 1061, -580, -488, -553, -1811, -795, -963, -1051, -278, 1030, 540, 829, -50, 1258, 943, 1040, -258, -581, -952, -513, -693, -791, -129, 165, 875, 226, 1004, 343, -69, -398, -234, -882, -1888, 221, -41, -517, 1147, 1335, 858, 692, 1070, -905, -201, -767, -1654, -2012, -1035, -288, -31, 1011, 1321, 554, 1130, 1178, -276, 114, -424, -1005, -1175, -1954, -1, -675, -293, 1443, 1271, 849, 1346, 1715, -426, 540, -881, -1566, -1392, -129, -307, -254, 234, 758, 250, 540, 782, -651, -720, -611, 83, -429, 51, 574, -41, -69, 1038, -421, 603, 490, -695, -984, 398, -167, 259, -1153, -180, 225, 1029, 230, 210, 872, 344, 335, -138, -293, -728, -1434, -529, 944, 499, -961, 356, 502, 1066, 454, 692, -472, -583, -393, 112, -641, -859, 679, 221, 965, 203, 1079, 195]
3529A95N31j085j94KK36q39K43J446n2q6J557n29j166L44m87n45p27L50l84R01
3549b89J05k4J31R20k47O7r54M89j357M96m44J073n09l97J303k54J15k86N36L4
3569E08o29m98J9j23M20n24q0O23O52j94J167o05o49l54j91k30N1J007q14n3l95
3590h92L99J309r5M14j376J93k37j05k41K37m6m34M31N16K03K29N33m85j036R95
3610E12l37n57j51k8K49k15P77j10K14O65j158O46j083k14R92p2J23o36J002n69
3630E0J092p56N0l85o1j171J037K51O6q37n68R89k11P12L00K16m37J122j778j43
3650d62N59j344J188k30L09p60P94J8M03k64R62j400P48j179j22M58K24j150J237
3669a1l51J038m85O84j58j971J266m95M83j268J325N0J46n50J148n81n69J110
$$ y = [195, 726, -359, -553, -551, -315, -1154, -911, 535, 483, 397, 1954, 1425, 259, 603, 116, -429, -1156, -806, -1190, -289, -184, -208, -77, 843, 596, 663, -291, 198, -1159, -663, -1107, -34, -543, -940, 363, 109, 224, -62, 474, 508, -121, -619, -600, -723, -303, -827, -907, -284, 368, 174, 1341, 736, 87, -267, -458, -688, -637, 370, -444, -497, -892, -493, 816, 721, 1135, -241, -48, -285, -390, -631, -394, -440, -874, -443, 73, 276, 505, 1038, 553, -483, 512, 175, -382, -533, -561, -312, -527, 250, 140, 354, 1019, -139, 507, -576, -790, 202, 130, 253, -383, 619, 50, 1142, 386, 436, 51, -10, -1181, -144, 107, 173, -664, -1232, -243, -454, 258, 558, 774, 337, 1459, -319, -462, 97, -1247, -59, -289, 20, -740, 54, 72, 475, 211, 1173, -227, 521, -658, -780, -322, -98, -1248, -11, -362, 676, 191, 875, 717, -1254, 12, -483, 0, -1268, 57, 107, 253, -297, 851, 270, -299, 811]
3687H11j117K57j04K13k74o09P22L28p08J747o28L54j735K021m42k216M15M86
3705d79K48o79J095m05K25J122n33p85M77P65j974N49l84j054J666m10N43j60
3723a73Q13k37O9l79q6O10p65j3j427Q83J151o50P20J18K82j94r21J20j24j84
3743c87K00K65K72p25J360j092N27K53J03r67J98J58j192J132m79m6r8N67j76
3762a27n77K029l01j344L84k9l34j111J338j11J2O62m12p2K96l99J95r7k22j82
3782d02J02p97M11N7O34Q4J69O95K83j191j12J75j12N50q99R67j130O30L95M42
3802I51r97R47p8M3q38P09j401M8N01p45M88P47N2j060J007L86l99j15K47m93
3822@K02j377k3J306k81L38P49l01JK67r06q77L94N61j080J64J36O05k16O66j31
$$ y = [811, -306, -49, -153, 60, -214, -823, -101, 227, -481, 1266, 638, 992, -743, 1278, 836, -1380, -965, -479, -231, -910, 185, -220, 5, 1127, 594, -191, 286, 1051, -923, -374, -758, -1812, -146, -556, -13, -173, 640, 403, 472, 93, 7, 617, -148, -161, -1588, -705, 446, -204, 516, 634, 916, 722, -199, -79, -203, -387, -187, 78, 350, -375, 985, -107, 420, 673, 776, -191, 7, 165, -1027, 105, -374, -420, -518, 49, -127, -704, 1325, 1024, -320, 64, 35, -299, -1410, -72, -183, -171, 491, 79, 7, 303, -96, 99, 2, -220, -402, -300, -1097, -686, -629, 5, 89, 258, 953, 1236, 45, -67, 108, -4, 546, -353, 614, -516, 114, 509, 951, -46, 901, 823, 866, 28, 737, -664, -616, -115, -860, -372, 375, 427, -633, 374, 760, 361, 246, 493, 0, 202, -1175, -1198, 108, -173, 165, 914, 613, 614, 881, -25, -902, -508, 53, -1027, -863, -727, -122, -338, 328, 197]
3843A97N6Qj38j15R85j185q65J554q57j60J64O39J02M37k92n4j168J164k30j471
3863a229Q41M99o66J47O25m4L55n77m02J9j266J795J58p13M51M66k316K413p26
3882a70N24l51N48o40q3q2K73m16K06N0P30n53l02N02L5N18m51j185j94J176r56
3903h21N20l11P76j90O03n17L15l2l29m97O22l70j58J59J06Q97p73l46J026k76
3923D04q05N50K66q33j21L19N57n16j09k13N25K03n9k33j55J024j035l10L54p97
3943i84J020N98o35L81n05K7l73J272q72J89o71j99l54J091M89J99l16k56L87
3962D88j64p2p2k44q52Q56N98j068J143q83N28n67k14R34m83K32m05j035J033
3981b47J78m3N49m47o18R28k8m45P64l23j87pj205P88M60R9K26k1K51j120N64
$$ y = [197, 253, 261, 123, 8, 993, -192, -1057, 497, -360, -520, -356, 283, 385, 822, 530, 476, -692, 472, 242, -1229, -388, 111, -555, -408, 217, 173, 528, -49, -451, -432, -1698, 97, 255, -458, -7, 459, -1857, 556, -170, 354, 3, 551, -89, -172, -254, 19, -397, -191, -141, 589, 36, -266, 236, 271, 789, 338, -847, -1041, 135, -821, -301, -612, 164, -26, 577, 60, 375, 343, 14, -483, 139, -231, -389, -230, -124, 773, 0, -346, 680, 404, -401, 149, 415, -418, -539, -220, 337, -179, -288, -501, 24, 227, 168, -65, -220, 804, -231, -541, -187, -984, 36, 634, -1, 380, -125, -98, -471, 801, -71, 118, -553, -752, -1106, -15, 474, 673, 357, 101, 488, 324, 252, 180, -64, -916, -60, 538, -530, 613, -270, 258, -309, -523, 411, -72, 160, -245, -1280, -247, -69, -112, 437, -10, -628, 300, 272, -173, 591, 268, 81, 74, -1131, -343, 117, 216, 442, 421, 672, -448, 116]
4002A16L49q16K10N35p76P68j465N62J315m74k27k5m07J584q47k10L23r57J59
4021b83K31O14k34n32J073q82N39n50JO88o95J129k879K382k96p52R68m40k4K13
4041B71O01q06q59J147r0j11K36K57n99L83n7r72P34r2n14k21R53j058P29q91
4061i59J111n03K15J53J45l29J46J53N52j81r80J311j064K49K12q85J174k68J03
4080C55r99M37p3n94j75N75Q56r0k66K0q12nP84n05Q04p0n96L70p75O49L29m86
4102b67N13k57J70m48m67J403J32j626K2J962q62k86M39o70m52J048q45L27j09
4121b73l30Q72n43J96N3l33K4J739j433j02O48l95J07k6K95k24N85r92J28K00
4141A96J19P1K14M4j662Q19o71J286q62Q11j502N23Q78l99J36J14R99j14o28M11
$$ y = [116, 465, -351, -141, 394, -382, 386, -1079, -517, 798, 324, 97, 72, -335, 1249, 402, 192, 515, -442, -283, -52, 562, 328, -204, 869, -13, 526, -24, -23, 665, -30, 1099, -1780, 602, 306, -446, 522, 82, 58, 271, 872, 66, -793, 354, 264, 153, 389, 646, 47, 430, 373, -599, 135, 43, -471, -692, 261, -797, -68, -959, 152, -351, -136, 17, 162, -167, -21, 132, 684, 503, -477, 834, -230, 19, 231, -654, 520, 252, 355, -644, -207, -280, -874, -1049, -474, 382, 292, 26, 46, -766, -771, 13, -492, 312, 242, -354, 16, -759, -110, 219, -267, 246, -11, 159, -289, -756, 647, 779, -847, -825, 1137, 275, -11, 428, -242, -694, 354, -491, -164, -273, -603, 269, -274, -78, -25, -358, -334, 1405, -28, -130, 518, 123, 230, 204, 499, 275, 860, -132, -4, 196, 315, 386, 600, 644, -1018, -199, -870, 416, -446, 365, -1137, -614, 264, -135, 1, 115, 1114, 1000, 372, 783]
4161G83r37J42K90k017J987n69j74P91l95o25K57J287j304J181p68N93r41P39
4179C20o11J89j09P51J6r12l81R13n46J35L60o97P94n95M9N12L36j1o51O88Jk80
4201B71n20K42M4o2K03k97K14j0P99j102Q21Q17k111R4J035j087L8K36P13k22
4221A16K8j37J0m04M40J98m81J236k75o43p98J242k11m64n88O93l24J56J080j466
4241e92R09k07mm3M26j90o80m55J030j32K3M41m37k32j14N20o75J25J76J39m32
4262d04L87m64N96o5k75M29j454M37k77Q55n43O29l7M9M95o08J366k029J592o20
4282E9P05j125P40m23K85l87k05J06q61J248L52q02P8O11p59j53J08N6Q86o62
4302a43M15J59l24l85J72J81m07P11j30O54q53k15J88j26j65L10o85Q8K15J000
$$ y = [783, -154, -12, 278, -1739, 248, -321, -495, 296, -99, -724, -467, 820, -484, 697, -71, 522, -419, 320, -291, -102, -211, 540, 556, -356, -737, 176, -370, -235, 125, -572, 222, -373, -324, 188, 524, 513, -138, 550, 551, 271, -249, -7, 37, -25, 178, -119, 95, 85, 884, -218, 603, 1420, -691, -597, 438, -649, -611, -375, 338, 116, 144, 7, 17, -387, 53, 251, -230, 1006, 731, 88, -710, 532, 321, -143, -731, -38, -362, -206, 874, -592, 317, 110, 106, 63, 489, 299, -381, -836, 194, 62, 85, 526, 89, -143, -257, 263, -412, -287, -111, 28, -404, -17, -481, 115, 50, -225, 204, -1250, -813, -1090, -235, -778, -149, -186, -137, 358, -250, 1116, -913, 679, 59, 764, -361, 379, -44, 241, -146, -351, -245, -1106, 142, 494, -308, -230, 381, -378, -531, -423, -367, 519, -143, 272, 431, 107, -278, -106, 75, -332, 379, 249, 903, 50, -165, 23, -103, -268, 42, -643, -555, -340, 660]
4322F60o02k04L71Q3q76J96L68j96Q93m65L75L1p65J26J69Lq54j29J394m40k70
4343a32k47J027j335O43m14J13O48N9k9j026Q97K9l43J06M34m69O8M33J40q9n42
4364b9Q04r33L78L62n93K46M37k59l15p83R44q00k99p5j65L56J151J451j076j88
4384F14m19j306J770k96r88O11K76k86j2L07O60j395Q07n29L36p89J137n39k09
4403b50M41n27J230j018K82q55M04J461j053L1J92n92O95j019N98p53P43N42j019
4422d67R55m65R77n59k64K4q0L68p43R33J52r83N97k07p34k96O54L85m00Q96j439
4443f96R96j100P74l83J65P14n65N70m12Q1o59L68n5P59n02K67l21o54R55l61
4463e9n52L13l40M50N01n46L52l28J14L46O3K75n09j48K16l23K86l90O9J57K94
$$ y = [660, 58, -146, 225, 308, -568, -372, -4, -200, 693, 228, 603, 634, -131, -5, 164, 167, -687, -816, 578, 138, -132, -379, 648, -687, -44, -458, -345, 303, 362, 333, -693, 204, 233, -110, -4, 430, -39, 29, 462, 602, 513, -29, 775, -158, 220, 582, -11, 235, 672, 413, 98, -685, 259, -541, -840, -915, -1080, -724, 427, 1878, 802, 614, 195, -1111, 659, 363, -625, -14, 262, -24, -36, 271, 931, -464, 343, -186, 150, -639, 498, -41, -250, 191, -336, 894, -124, 158, -697, -293, 1168, 115, 146, 338, -254, 441, -578, 20, -733, 10, 552, -467, 488, 23, 1000, 441, 177, 201, 121, 489, -254, 679, 831, -152, 445, 238, -496, -792, -138, 247, -153, 743, -696, 300, -800, -26, -409, -244, 470, -95, 475, 63, 144, -515, -147, -202, 557, 55, 322, 1, -653, 302, -59, -611, -298, -638, -188, 313, -233, 119, -209, -95, 251, 314, 589, 80, -68, 148, -175, 111, -279, -210, -53, 241]
4484B41Q4q69L55j4O27k03l99k48O59o60m84J049p75P95k47K17K85K29m55N14
4504G01j019O65j441R25p37kQ51K78n05R7L82o98Q07P93j251J09J57M55o76k4
4524a33M10j206L50L09j50O12j047J637j28m54O73q23k79n6O9L30M98j68n92J42
4544fM92r87K5Q58k97R31j097k3M0R65k55m5l54P3k09m1R51j870J79P37j292J377
4566A52j017J049l41N72j131R83k00m44N73k1o28L2j38k9L84j41J227j248J146
4585G80p11J15p62J386j298J298q02L57k7l08j39J53K30l20p8j17J12J09Q22j011
4605b11K0j48M33m48j91M18L27m92Q26m71J2K16j430Q05K80Q18j067Q20j486J179
4625B10Q6j18n50l28L42o62R97l7N62p95R35m09j00N33o31k43Q88m51n75k27n83
$$ y = [241, 325, -544, -189, -203, 424, 221, -178, -426, 233, -427, -911, 138, -637, 158, -89, 128, 413, 642, 187, 701, -318, 347, -1094, -169, -906, -908, -57, 221, -284, -187, 195, -503, 304, 1097, -154, -45, 112, 567, -109, -133, 277, -929, -579, -270, -420, 192, -855, 782, 654, 200, 873, 50, -229, -285, -216, 114, 612, 444, -148, -6, 486, -501, -476, 382, 85, 1016, -81, -104, -64, 901, 646, 601, 247, 320, 111, 70, 1021, -849, -670, 67, -1225, 152, -865, 184, -157, 415, -716, 267, 67, -377, 196, 175, -453, -421, -559, -588, -204, -345, 882, -366, 780, 69, 184, -578, 808, -490, 808, 6, 363, 336, 28, -111, 42, 272, -48, -126, -243, -131, -22, 800, -211, -191, -339, 94, -354, -545, -127, 200, -292, 534, 63, 75, 291, -1139, -334, -54, 764, -303, 517, -969, 210, 296, 178, -372, -700, -358, -1020, -23, -60, 502, -293, 642, 233, 133, 666, 35, -208, 680, 229, -346, -573, -1156]
4646a156J210m54Q21pk38n68N37M09q38m87K70J116n17k54N14J091j886Q18j024
4665f43P43L83j259L08L41k04M92Q06n81J42j144R13L31M41j771Q06L49l17L02
4684D38Rk10k42P35p63N09j741J095r0M68J74k36j83n6l11M31l05O75K28K26o05
4705B46N03j054J082p41q43P39K5J82q27O28q28J691j206L08l42k1O91q19J49
4724d37J10M45O41q00Q56o84k72m53J681o10r47j77J64Q25N86j172m61J424m18
4743C01M89q37j79j24K42M37l85m81K84Q06q38L80K99q5M47r89J17j28m04Q93
4763B45N20o43j482J732L11j129l09J905j507P2L11q95N93M61m88N31o75N50k28
4782a25n53P80R58l96q72n99O28M03n12N29r76L78J87Q15p60J39J13j27J80m04
$$ y = [-1156, 54, -400, 421, 414, 176, -392, 145, 554, -284, -771, -501, 615, 98, -156, 358, 1449, -437, 381, -643, 100, 483, -776, -468, -127, -331, 161, 967, 386, 528, -616, 297, 628, 1069, -702, 104, 453, 136, 438, 447, 237, -5, 730, -33, 476, -1265, -170, -260, 208, 382, 146, -37, -93, -404, 27, -278, 397, 625, 851, 246, 749, -305, 777, 36, -807, -68, -43, 139, -688, -60, -888, 803, -403, -95, -437, -458, 233, -586, -437, -327, 118, 759, -41, 815, 131, -141, -594, 1087, 477, -470, -647, -483, 342, 928, -244, -705, 719, 301, 790, -47, -226, -350, -108, 329, -56, -537, -253, 553, -285, 95, 394, 309, 756, -233, -116, -244, -648, 245, 765, 122, -1360, 372, 683, -446, -755, 1150, -357, -285, 26, -869, -276, 185, -303, 228, -447, 103, -125, -678, 102, 1060, 664, -208, -807, -179, 224, -288, 241, -735, -357, -170, 645, -115, 24, 137, 10, 190, -214]
4802b14M69j238K40O23K28L12K34k14j031M53j72J86p56Q55m00l75R6R19J94j481
4822a072J163R35j713k36J647j033j99M61m87P88L60r59J070m67j47J433j189
4839C55k07q91J09R66o90l33j56J049O6j28J57M45j147J125j146P96r21J033m09
4858G3L89L40p91K75k61r59J502j565J519j261J073L03K5j75j723J443m02n04
4876f99J335n35R0j3k09o68J014O42j872L81K07P7M09O76j209J35n83M00M27P44
4896G49j606P87O34o20M76L41q09N76j623J962p07%j045J176j65P9l07R3Q2o75
4916f02J242J76L9q86K10M70j140o33M78J165k43P24Q2j028j44O81M76q70L58
4935E55p39O26l90K12j46Q79j671J122L79o97M09n08K10j8r26P79l53J322m66
$$ y = [-214, 255, -983, -743, -120, 108, 420, 654, 440, -591, -138, -310, -124, -880, -25, -425, -800, -704, 215, 409, -1072, 91, 1026, -687, -923, 724, -309, -508, -47, -534, 254, 614, -345, 725, 258, 111, 1544, 355, 148, -743, -634, 332, -358, -691, -847, 202, 268, 140, 297, 742, -405, 720, -426, 370, -551, 482, 73, 462, 802, 11, 286, 25, -934, 568, -997, 522, -739, 334, 637, 662, 487, -1236, 207, -195, -699, 636, 101, 191, 178, -31, -699, 315, 957, -915, -534, -327, -250, 159, 835, -374, -239, -822, -422, 5, 749, -857, -70, 564, -56, 420, 761, -48, 528, -1095, 867, 160, 160, -885, 291, 126, 205, -102, -9, 73, -602, 640, 816, 855, -31, 179, 649, -491, -1124, -646, 519, 276, 1000, 1082, 54, -90, 591, 1067, 197, 555, -184, 442, 52, 264, 118, 997, -674, 448, 827, 130, 539, 31, 241, 223, -703, 76, -277, 1045, 579]
4954E79L87L4k34q30j29J79l77j80J067j163m2N08R59o44J170p85p58Q66j064
4973d57N07j02J07J8n1k5K4N02O0k27p05N57m87K83P38p21N2K61m04N48p70K77
4995a5M07j240J000q18O35J183j420J28l58k11R57L93m68q77N44J449j106m75
5013b92p03N65L09k16K23K25J72p0k24J59r86J080j74l48P94k91j25O6q05r8L32
5034d07p15J000L61Jj57l11M91p0k24j99J81m16P74P88k03l82n13M13p30j93o3
5055e74m06J817j240L03P36L30n84n33L09P68m88j043M4J3L66J85j131Q54N37
5074B63l22P09j013j25P79l82l66j43P66j08J46o51P68l57M51o57M03m6r31Q76
5094F0k21m0p2K64P5Q3K62m81l2K49M49j051L40k04n49J193M2q64J92P33j155
$$ y = [579, 966, 1000, 766, -64, -193, -14, -391, -571, 496, -667, -709, -201, 758, 114, 1284, 499, -259, 607, -457, 50, -52, 55, 73, 22, -3, 21, 523, 583, 356, -349, 208, -279, 4, 742, 21, 73, 334, -70, 478, -292, -15, 392, -848, 152, -666, -31, 1152, -268, -140, -498, -709, 248, 641, 173, -704, -160, 1289, 183, -292, -995, -430, -121, -337, -114, 111, 283, 213, -11, 148, -838, 242, 68, -280, 514, 223, 98, 164, -641, -739, -407, -1122, -122, 239, 240, 83, -228, 263, 193, -31, -230, -49, -465, 309, 1097, 894, 512, -1, 412, -318, -511, -574, -980, 837, -403, -100, 636, 966, 382, -151, 158, 926, 438, -605, -561, -548, -182, 3, -1128, -274, 263, -59, 650, -363, -488, 291, -91, -457, -600, 166, 58, 204, -447, 321, -36, 415, -242, 161, 115, -816, 60, -161, -201, -273, -9, 66, 149, 411, -70, -102, 147, 596, -455, -115, -319, -868, 325, 367, -497, -305, 428, -727]
5115g27K89Q20l90J05j82M61p71K52R68j38q40O42Q9p71P95j481N66O58K04q07
5135b58M80k02j51L39lp75p5J265r75j92N52M44r88L48o04Q61Q12J24l13q50l38
5156d99J781p49q35M81j6R12j710Q82k93o24R05M10j257k79Q71j076L22K23J108
5175E57j194J514j015O68K88p1p80k45J421j050J65k21m9j137J200n05Q59q86
5193d81J233p63j97J090o05r88O69q2j0n4K17m50Q62k3n08j12q45P30k60K16N25
5214A64j030R06O42l37r27J74M21k52O46l34M93m90m5M75J42p73j31L09O33p7
5234F09q27L74O10p38M31K40j37q95M22o07Q92n58N13l16k16N24j395Q86j08K14
5254h2K42n91M19o7k45Q5l6J51M02M6k8q27N95m45J217l47k26O6M01o84L79m99
$$ y = [-727, -438, 382, -8, 97, -85, 376, -395, -143, 825, 687, -153, 489, 578, -193, 602, -879, -313, 345, 549, -258, 222, 20, -131, 208, 205, -570, -645, 620, -355, -547, 5, 449, -539, -191, -795, 66, 878, 1002, 689, -161, -499, 1282, 533, -302, 179, 163, 1075, -635, 247, -46, -670, 235, 645, -612, -891, -20, -1096, -774, -551, 557, -637, 877, -138, 530, 818, 747, -33, -278, 1143, 93, 258, 37, -12, -1149, 51, -454, 405, -481, 752, -11, -208, 882, 277, -711, -42, -124, -134, -188, 29, -421, 441, 418, -90, -202, -1047, -317, -577, -361, 164, -866, 40, 682, 345, -582, -408, 13, -239, 407, 73, 566, 76, 31, 506, 648, -125, -256, 53, 686, 609, -218, 156, 766, 28, 459, 699, 562, -333, 89, -518, 374, -184, 329, 13, -203, 321, -1074, -188, -296, -82, 160, -431, -12, -79, -324, -239, -275, -124, 278, 324, 296, -531, 64, -381, 836, 489, 263, 329, 730, 46, 425, -74]
5276g4Q1q34R28%l02O20m30K50p51J1O43K34l09j036J580j272R41q18J339r65
5296a64J112q76p15N60l17R35j526J073l30M68J49n95q8M47k35J00o16P82o56
5315d92R00n54k77K74N06k34qk43j60M03n9P4K01M36r41J176j490Q9L21Qn28N18
5337h0K6J15M89q5J61O9j207J15R42o96j30N88j077R70J24n33o22N94j30L28P4
5358C5K91m81L38p1O47p10o00J254k97j420P94N13M08R9r40k53J19L81n54L43
5378a04N11j187J348l09o64K7k49K89L1Q42J89j370J022L05q21L26m45M4N8N43
5398C86j79q61L71M68K65m14l1J54l8K21n96k4L31m1PN14J2l4o61NN50j228R84
5421A61k70j14J04j61m79J626q73N98p91P01m39o62L77P40l53M94r56M9L87N81
$$ y = [-74, 7, -827, 101, 101, -201, 419, -11, 239, -512, -501, 142, 376, 67, -969, 611, -661, 280, -538, 801, -164, 948, 72, -643, -83, -400, 535, -991, 82, -248, 220, 369, -226, -314, 133, -102, -2, -618, 164, -492, 408, -146, -423, -149, 357, 123, 115, -128, -288, 115, 56, 130, 331, 767, -174, 1002, -488, -399, -78, -70, -598, -80, -54, 61, 550, 465, 626, 695, -512, -397, 545, -151, -281, 307, -770, 200, 324, -209, -831, -237, -367, -39, 35, 326, -155, 183, 112, 759, 49, -551, 703, 406, -1014, -220, 293, 701, 800, -140, -393, -274, 107, -447, -104, 407, -780, 568, 259, -405, -378, -627, -338, -307, 535, 724, -646, 376, 681, -140, 186, -259, -215, -157, 386, 207, -654, -283, 185, 450, 36, 5, 159, 121, 342, -254, -278, 53, 12, 19, 533, 545, 511, -150, -145, 405, -823, 161, -109, -223, -119, -280, -759, 867, -6, 592, -199, 502, 63, -599, -222, 518, 165, 659, -297, -248, 139, 720]
5441G20j548R17o19Q97l66l33o6j61j7J474j138M29p2k70R48j197J361j183O40
5460D16o80J06k2K78N7l32l45J526r62r11K81O66O72n05o30O55j059R06J59k33
5480D3k12j78J203m90j40l47m20P48l21n12L37Q22j98n24q23Q79O70o74k4M36
5500B75L77o83M25p93R13n6j40o66O72k12j94k47K75P86j013P2L61ML39j178M67
5521b16L45k20K48n8l65L23n00J028j135K88n11P47k60P6J82k38P85p03l03L70
5541a17O4j013J460k09K12q5p90Q08L29r4r71j10j03N55n37J51J40N84M9n58Q11
5562E76p95m00l09O2R48p29J38O28m36K98kO86m47J41l46o7J46n49J056j51q62
5583d14K87k47J48L90o14R77N38j555O72o03O20L93l14p09O92M29q52k86K35l54
$$ y = [720, -828, 89, -530, 367, 1, -332, -398, -559, -576, 898, -240, 189, 117, -153, 795, -402, 959, -224, 416, -264, -158, -180, 98, 155, -177, -522, 1004, 42, -869, -588, 78, 750, 245, -385, 270, -789, 117, 276, 43, -169, -347, 856, 366, 226, -121, -541, 207, -114, -626, -289, 533, 335, -189, -1012, -133, 537, -137, -161, 275, 652, -31, 394, -399, 514, 458, 318, -348, 324, 112, -82, -329, -54, 732, -281, -209, 152, 156, 495, -683, -216, 129, -91, 157, 99, -266, 57, -443, 585, -550, -262, -773, -26, -286, -210, -28, -266, 519, -184, -487, -117, -53, -1066, 394, 185, 397, 312, -478, 330, 659, 565, -406, -516, -619, -64, -601, -450, -310, 274, 323, -235, 576, -219, -619, -928, -866, 82, -647, -509, 119, -317, -19, -21, 665, 218, 359, 13, -54, 92, -457, 599, 448, -414, -127, -374, -226, 164, -450, 527, 1065, -490, 182, -421, 199, 592, 278, -431, 261, 690, -162, -448, -213, -567]
5603e67J071p03J6K14L14l36K75Q29j196P56m50k75k41K47m67N12K9j130J504
5622D02K62j419L78L20J141j356k62J041l33n6n73P91j97l60L35m10p5k83L61
5641b93L44M26j305N55P37j004K75R91j34j018Q99j56j56K91N73r82q8j53O1N42
5661D05j25j69j68n78Q45k79l79M35J38j413P97J66J076p23Jm33J35J223j382
5680d28l39k19K44K44R44m75K92J122j600n39R12p53J048Q55q01P79q83q23N54
5699A34j45l18O6J337j125L76l31n8o52J356r79K76n90Q73m69k26J83K8N31Q1
5719C48K70j382L43j244K267n23O14l20O92j518J276j152K5l16L31k39K00m9K07
5738a70o48N24L78N1Q33j981J375j08o52k29m20J167j94L71q88R88l31k20Q9L61
$$ y = [-567, 504, -199, -183, 31, 345, 9, 284, 1113, -83, 673, 223, -52, -293, -46, -513, -1, 28, -1102, 402, 664, -755, -377, -57, 1084, -272, -534, 507, 174, 118, -455, 336, 139, -221, 114, -296, -371, -654, -293, 51, 477, -828, -273, 464, -540, -265, 726, 592, -426, 473, 317, 161, 452, 1025, 43, -45, -198, -137, 405, 280, 111, -57, -635, 210, -69, -448, -13, 125, -1288, -491, -325, 751, 28, 29, -404, -269, 954, -428, -767, -986, -742, -498, 446, -29, 263, 1385, -215, -754, 158, -595, 453, 1308, 507, 1286, 403, -420, 134, -11, -329, -263, 1074, -51, 325, -6, -64, -716, 640, -339, -63, -653, 220, -249, -475, -292, -264, 267, 348, 618, -764, -421, -1665, 602, 79, 693, 373, 1065, -453, 823, -329, -304, -620, -289, -528, -328, -377, -170, -818, -294, 84, 135, 968, -1013, 362, 254, -398, -627, -1047, 120, -74, 297, -591, 397, 66, -154, -65, 296]
5758B96l17O03p46j23K6o98Q05L07N7p01Q61l09O31j357J411j155M51J71n24K76
5778c5O01j149K70O67o66K28N38p34K55J32K57j13l57L60J29k86k76l94R2Q29
5798C48j128P49K57p75Q67M72n83J50q67P89l85J83o5j11K00j7o59O29q4kj010
5819a042J808n53N6n20j79P54q69K76p07J893j062q3Q96j204J254j051l21J210
5837E56K34o85N15kl97k96l23K02n0J116j726K15l86N27q2Q2L54Q09j007j38R9
5858c83L28k69N77p26o36L59R36P5q55N26N27L43p16J06o72j6P40j30j87m20j2
5879e05N63j31m59M62J313k010J659R2j356K23r0q61R38Q8l0R5P37r88k44N88
5899H4p7N81n87K73j07l24N35j322r8M61J074k47j31N12l40r85J359n12r5j023
$$ y = [296, -21, 582, -164, -287, -261, -959, -154, 153, 210, -491, 370, 61, 692, -665, 746, -409, 42, 213, -311, -35, 566, -583, -313, 354, -312, -84, 454, -280, -25, 107, 364, 251, -106, 254, 383, 97, -179, -573, -481, 348, -780, -31, 226, -549, 318, 790, 207, 357, -510, 279, -106, 77, 12, -99, 101, 84, -575, 54, -30, -32, -1042, 766, 213, 269, -251, -430, 324, -545, -269, -976, 917, -145, -228, 668, -536, 718, -333, -654, 556, 790, 105, 620, 618, 221, -75, -398, -196, -246, 870, -856, -641, -1027, -500, -582, -500, -146, 663, -344, -482, -383, -55, -324, 253, -473, -1109, -750, 186, 261, -594, -68, 459, 802, 86, 192, -480, -496, 244, 114, -73, -493, -505, 58, -73, -532, -70, 1243, -767, 892, 984, -372, -149, -239, -1100, -162, -74, -104, -9, 728, -260, -504, 84, 7, 588, 1, 274, 167, -157, 378, -944, -1042, -581, 493, 246, 115, 627, 287, -698, 661, 149, 54, -969]
5919i69J087K61j008R25K42j047K03O01r49N18l16L39o05K87N71m53O36r10J046
5938D59p60O53j171P34R07r22Q3p24J83K14M62l02N30j138M98J058j107MJ023
5957F84n00p11J156n17k52R00r42n6Q87m95J41j419Q08j24L43o59J107l84k05
5976b38R19m38K0j07J85k30n95O58j11k10k68N97J43M62q80L94m45Q0m77J048
5996E07j061N67L44n5r03O6O62O60n29L90n24L57r06LL47k27m76k38J058J33l07
6017a32K85K45K05N92j630P32q51N76l33P45m60l6O75L07n74m46k42M97k62J92
6037H5j158L5J589k25M6j228J503p41K58k89J63m15R15q42o51L81O96k34J67l7
6057A8M33K34o54o19L74N15r8j57j121J044M55r74R50j99J57p66M20J157j450
$$ y = [-969, 118, 379, -629, 296, 538, -509, -306, 295, -654, -136, -452, -113, -718, -431, 140, -313, 323, -587, 459, -301, 352, -819, -85, 822, -100, -17, -741, -558, -344, 118, -184, 346, -792, -294, 764, -343, -339, 684, 184, -527, 629, 112, -140, 760, -182, -238, 649, 154, 295, -1124, -316, -440, -97, -756, 351, -33, -238, 681, 243, 263, 156, 341, 111, -484, 174, 63, -147, -415, 182, 325, 787, -93, 301, -144, -64, -541, 507, -554, 13, 357, 302, -601, -535, 127, 787, 258, 648, 124, 481, -425, -422, -75, -302, -778, -1016, 42, 175, -132, 153, 398, 603, 1195, -435, 297, -554, 22, -311, 434, -26, -62, 613, 920, 346, -100, -342, 155, -107, 85, -1073, -1038, 551, 326, 372, -856, 647, -94, 164, -125, 38, -377, 538, -304, -955, -574, 122, -112, 55, 18, 451, 685, 31, -588, -214, 301, 203, 46, -1075, -31, 424, -550, 400, 201, 358, -408, 12, 1169, -281]
6076b81k09N63q37L72M52o69J247J20p93K66l96R48j515J031K66j551J463j002
6094e25O47q41L95R45k16o6o08N85j032k14J316j144J645q70J047m73l65j083
6112h57R43o4l28J231j451O37j49m56K44l86J028k71M48l05P7j005l6K25M17k57
6132c15K00k40O52k54n43J162j517J444j120L69j82N41o94O33l07k81O88m50O65
6151D51J75l85k57n89n23J148L34k77m2j65Q45k38o40k08o0K52p92J572j050K54
6171a95m43Q84o18O40M59j42Pk12L18j145N53J95m73K74r35Q52M83m94k50N28
6191B86K28j370L65j567K606j812O77J117L91q55j005J254J42k80K15m74L63o61
6209c80N31k05n41M57K08M48j10J0p60Q64n26J62l33J90n03N25o47J057l85J065
$$ y = [-281, -490, 73, -764, -392, 60, -609, 638, 758, -35, 231, -165, 783, -732, 299, 565, -986, 477, -525, 122, -719, -324, 621, 405, 339, -269, 316, -716, -930, 386, -758, 887, 17, 1064, 591, 226, -857, 86, 22, -306, 925, -526, 111, -38, -494, -250, -636, 392, 121, 569, 264, 341, -664, -700, -475, -58, -315, -115, -355, 297, 43, -500, 662, -855, 589, -531, -162, -344, 197, -497, 136, -171, -452, 236, -214, 451, 626, 241, -16, -605, -1128, 20, 354, 77, 35, -130, 715, 477, -163, -371, -431, -179, -971, 601, -449, -195, -638, 246, -372, 268, 727, 585, 592, 380, 698, -447, 106, 301, -172, 102, -833, 19, 502, 8, -242, 286, 514, -856, -491, -2058, 548, -1264, -587, 530, 921, 66, -939, 315, 457, 177, 392, -82, 281, -380, 151, -54, -595, -138, 70, 518, 408, 418, -342, 522, -4, 158, -175, 15, -488, 37, -610, 447, 62, 1127]
6229A127n39o78P87p21J87l80k42K8Q07J061j192J28j47j23L93J65n8j800P6N61
6249e60N10O27M58j687J139O21j018o0J057r12o08N55l48N25r91Q95k88M93R1
6268D99m26j89j93N11j054M30N47l48J3l63J154j73m37Q12j71j074J09k16J67
6287d02P48J35j082L92N01n98Q99j06j163Q03J031j174M57j274R44L59j71j272
6305i73J159O98q25J132j629P14j42o47J14j39n4K99N97m8k80R05j04k124J881
6324E34j54n27L8K38J66j103M31j5Q60R24j165J99o88J14j64p43J418r36K32K65
6344g6l59Q39o21J51L0O72L9j055J01j06R43n37q18J200l92J70j3J50J19p64J79
6365a48O10j713P28j74M70p32P60L69K95P5j628J287o48L25p18j57Q47n3j157
$$ y = [1127, 588, -90, 697, -24, 163, -217, -459, -431, 376, 1437, 245, 373, 226, 103, 496, 661, 603, -1197, -1121, -560, -50, 577, 1035, -652, 487, 1108, 90, 30, 1087, 175, -433, 122, -226, 299, -692, 203, -85, 408, 499, 73, -116, -309, 202, -852, -422, 125, -223, -210, -573, 581, 408, -29, 783, 612, -462, -353, -569, -402, 346, 481, -601, -209, 292, -306, 593, 487, -676, 127, 1158, -16, 441, -833, 111, 470, 299, -973, 186, 884, 59, 1191, -438, 276, 134, -513, -399, -538, -592, -293, 304, 256, -24, 881, 777, -1347, 534, 380, -147, -109, 129, 295, -808, -377, -392, 468, 1392, 227, 426, -262, -148, -312, -1055, 363, -573, -341, -76, -435, 404, -217, -66, -36, 636, 675, -380, -279, -385, 558, 21, -797, 403, 11, 181, 168, 318, 437, -327, -148, 462, -1251, -523, -697, -227, -959, -199, 170, 465, 540, -1088, 199, -449, -124, -842, -999, -152, -205, -1362]
6384a362J814L8j69p83N79L02o27m52Q08j318L33Q87J38J39n50P04k08k59O73
6403F87q51m2L60k78j32K93L41k86J73K52p00L77L06m70q7n63k45J59K76L78L96
6424C44n28K44Q50j573R34o7K31j85j104Q86q5q57n10J033P3R66m28J242m21n38
6444E07q64J58J59M66j135q8J151o09N03k47N93K97o35l06lk48k70l39O32m6m23
6465g47J779k070M66J109j119R22r94M4J3P7L47Q66o21J33L5Q20j289K82o38J151
6485E66o19p96M41PP85p49M90p07J081l87R9m17N80n78P14j111M04J040q81O73
6505F35j71m19L57j017N94L27j293J432m56j61M79j5P32r64k87J96o48M65J373
6524A159j463n76J309m56J31j57Q26J69Q68j711P28r01K67R2o85N12q51O26J89
$$ y = [-1362, 452, 490, 321, -462, 117, 419, -208, -660, 148, -1170, -837, 50, 188, 327, -223, 481, 273, 14, 687, -164, -206, 154, -124, -256, 37, 378, 92, 265, 517, -183, 194, 500, 30, -57, -620, -865, -706, -430, -52, 344, -184, 60, 910, -663, 271, 204, 435, 250, -854, 32, -53, -910, -1420, -387, -314, 652, 224, 1466, 1045, 507, -357, -199, -40, 426, -709, -797, 354, -255, 248, 1, 594, 891, 256, -50, -53, -301, -571, -910, -278, -324, -747, 1032, -1038, -572, 537, -582, 340, -654, -610, -597, -520, -173, 693, 72, 205, 240, 1060, -229, 53, -585, 566, -53, -849, -408, -401, 384, -365, 125, -582, 499, 112, 211, -206, 374, -204, 510, -601, -197, 843, -38, 635, 464, 45, 402, -615, -21, 306, -987, 445, -11, -172, 307, 292, 1024, 60, -227, -31, -679, -214, 1159, -304, -880, 429, -27, 104, -53, 773, 942, 1810, 99, 827, -74, 193, 285, -400, 112, -739, -113, 76]
6543G6K09K15k11k52K74p29Q46j044P84j013R06k93L09k16P29n95L88N29o09Q28
6563A131o49j072J17J189j123k67O21N83m01L65n45q12O43n85O80m32K06N16Q57
6582A022j107M4M01l06N29j375O47n17L63j20J7M84O44o28M44M7J5J03k50n13
6602e6q67J066m47J9l14K07L82Q81p10l19j56L71K1k6j9n89P49q04L51l93J081
6623D28J5o62L81N66m82n39kk43m67N09K94K4M00p3N64Kp53l38R55o88n05p3P39
6646E2K37m92P46L28m24k34J83l51N84n8o14R38j268J284j232J092N14r69l63
6665d7J17j2r45O56L52L07j427P78K57J10r8m04J165l12K67j029K21k46l80J49
6685e21L98l27Q67k58m79N92j44O13m35k01m60P6l96M82L28n57N34m11J692j239
$$ y = [76, 285, 500, 289, 37, 311, -418, 428, -616, 168, -845, 61, -232, 77, -139, 590, -5, 383, 912, 303, 1131, 482, -590, -473, 716, -407, -674, -53, 530, 129, 494, -51, -863, -220, -805, -125, -557, -351, 165, 1022, -85, -41, 360, 54, 583, -792, -145, -662, -299, -419, -402, 82, 726, 98, 542, 589, 604, 707, 457, -56, -923, 143, -304, -285, -599, -392, -10, 871, 161, -158, -314, 57, 78, 52, 33, -556, 193, -611, -260, -653, 428, 443, -219, 162, 728, 246, -293, -295, -538, -1005, -496, -202, -178, 222, 149, 713, 715, -38, -376, 579, -109, -614, -687, 52, 289, -203, 543, 871, 447, 213, 396, 45, 629, 571, -43, 895, -373, 911, -321, 771, 1285, 316, -47, 70, 58, -887, -231, 121, 428, -999, -221, 36, 146, 48, -356, 809, 497, 764, -265, -44, -290, -670, -521, -123, -450, 417, 159, -320, 272, 128, 741, 306, 105, -355, -279, -675, -193, 135, -422, 112, -299, 1393, 154]
6705A54q54J192j179j86J302r37p35J333K01L5K59q02K98j72j78Q39j428J440
6723E82q50o11J086k86n6P15m86M61K74J35q03l16O64j162n9J81K88Q71n28l32
6743b32p8J96Q56J66j655N94o13J031q36K045j755Q07l8m32k38M98r65J128k95
6762A84j101Q46l1l6k22O0Q48M67r36N63m17L38m23n07l31O51l5k92P4P48l8k22
6784A88J457r47n66j74n98L48q17P57j000R96J223k233J818j31m24K26j144J133
6802A12J29n8j496J405p84J684o24p56Q64j33l69J158n75j079R76q0l92O2p78
6821g34J407j12m80j26q42J127m52P46r28J402m78l60M48Q0r12O90p80J018n35
6840A79p88R37j481J315O92p35j159J415M76m6j232N25J75m00n38K00L0j57N49
$$ y = [154, -700, 492, -687, -873, 429, -508, -1243, 90, 291, 326, 585, -217, 81, -91, -269, 570, -858, 582, -268, -879, 207, -79, -135, 580, 94, 555, 829, 964, 161, -155, 509, -653, -712, -531, -243, 628, 100, -232, -310, -114, 742, 908, -747, -153, -766, 265, -571, 1474, -281, 526, 488, 56, -182, 316, -649, 479, 184, -917, -71, -102, -138, -360, -300, 548, 1015, 79, 642, 225, 563, 140, -367, -698, -47, -82, -374, -300, 448, 410, 188, 1645, 698, 132, -42, -640, -292, -1109, -352, -1352, -356, 867, -1366, 452, 321, -103, 123, -1021, 112, 241, 183, -1313, 92, -692, 992, 368, -388, 476, 343, -26, 1132, 557, -522, 454, 374, -18, 44, -734, 673, 561, 81, -45, -887, 240, -212, 534, -394, 1008, 530, 170, 618, 698, -214, 476, -304, 714, 179, -609, 328, -1153, 162, 854, 119, -1040, 375, 851, 805, -427, 98, 273, -127, -665, -465, -435, -592, -43]
6859d3L86q20Q69J190j857N86p85j159K054m63o83M18Q55k66n08P17K27k86p14
6878b82J141k256J051M30q63J35K1J004R29j067Q57n59K57j136k82l59R70Kq21
6897h28K42n8M16J57N03J164j536L88l77n70r64N81O79p75J536n75J146j507l78
6916g56L64j30M58P34K52q16j97J76q0q44R09p45J277q07Q54K80j679N85j43J56
6936a52P0K14P5q1N02J01o46l04L25l67J70l84L3p01Q09O79j072J974n59L69q05
6957B50l48j738J312K41n28J85R79p36r2J567n86m35J57k81Q53o73j781J592n87
6976f49M46O21j69K94n67o2k90O40q4m18M84j183L81o8J347n48J80K56K61j76
6996F96l35K4n77q89N82k30k10J580k63L12p68J479r49r2N02j548P89l99O78n38
$$ y = [-43, 343, -477, 392, 1582, -275, 311, -474, -1633, 421, -42, -725, -307, 548, 282, -226, 491, 718, 432, -282, 859, -1397, -346, 84, -779, -644, -623, 381, 1310, 243, 1100, 541, 798, -338, -620, -979, -9, -7, -828, -586, -644, -228, -71, 432, 1596, 60, 448, 71, -499, -1463, -882, -203, -978, 558, -17, 1129, -378, -756, -392, -522, -64, 670, 922, 106, -91, 85, 5, -839, 70, -675, 602, -205, 649, 929, -750, -165, -308, -152, -82, 132, 207, 126, 628, 729, 83, -221, 104, -263, -93, -477, -444, -1145, -336, 343, -729, 1245, 686, 1055, 250, -98, -1836, -524, -283, -811, -626, 353, -383, -475, 1092, 506, 71, 228, -53, 800, 127, -1654, -62, -649, -203, 418, 249, 543, -24, -86, -376, 264, 180, -238, 246, -937, -556, -624, 723, 175, 355, 611, 872, 696, 361, 385, -192, -1081, -499, -729, -939, 641, 378, 690, -78, 1401, 452, 360, 862, -686, 103, -296, 382, -156]
7016a56k0K34m93L59P13r13J04n36K6j40O58l30K53Q88j051R45j16o43l4J191
7036I39r59L7nl23N10p6n58K74J35p61M34l60R9j29P33Q02n91j177O51K89O32
7057E96l84L0P88j001M33n8j456R37j131Q56N48k95n18P15J09M58n17N20j047
7076d17L08k91O49m4o22K58k25M75m84O64p37L17m28J136K75r78k3o5on49M00
7097c87J84n36J098q2n66N36p67P29j98l9j17k65L81R7q12Q14P01m56r7j14L33
7118D37n98n6M74m8J71r6r6Rj81Q6r81J184j130M58K03j066J639j565J046M95
7138C85o45L58N04l52k63j0J26r45k77J018p5L05n6k85J223l56j269J347j097
7157c64L90k75M47Rl87K68k16J022j267Q13L2o36l9K3r60M07k76J012K89L12q17
$$ y = [-156, -176, 58, -435, -76, 637, -276, -172, -708, -682, -822, -164, -494, -241, 647, -404, 541, 425, -218, -252, 939, -20, 17, 12, -311, 199, 123, -435, -161, -26, -787, -353, -713, -614, -743, -10, 792, 201, -976, -325, -36, 596, 212, 242, 1030, 29, 462, 404, -1052, -115, -1246, -390, 158, -137, -655, 60, 169, 627, 110, 630, -417, -109, -400, 249, 205, -417, -159, -384, 91, -393, 271, -466, -149, -577, 559, 834, -144, -167, -232, -238, -787, -387, -203, -739, 359, 277, -289, 247, -520, 209, 11, -28, -145, -410, -29, 68, -744, 70, 771, 315, 218, 104, 437, -161, -217, 257, 209, 380, 284, 188, 197, 16, 102, -879, 305, -825, -367, -164, -1230, 409, -1156, -110, 385, -260, 98, 602, 250, -13, -23, 103, -842, -1119, -101, -176, 129, 73, -212, 1011, 655, -614, 733, -364, 26, -249, 198, 207, -180, 88, -128, 894, -373, 440, 472, -164, -203, -180, -1140, -733, -1009, 3, 292, 604, -213]
7178b13J034o93M71k78J58q45k63M35L02r08J140q5Q73m84j10m75j66K70J04l4
7198B33j23L38j890J732O6M59o57N5P69p42J36m35p9l78P01j10p7j66J04P72n70
7219A38Q04j409R86j58q94J760j171K20j068P82k99Q88j81j477J525j145J184
7236D85j330N02l57Q71n07P15J6o32J552o90r46k87Q67m98m00Q20m14N7J35Q86
7256H45K37m48n12J025k053Q40%m42Q15m22L87l04K48q1n4K49j007J132m5j38
7276B72m02n98N47N04j46l81L38n40P44n39Q1M72j078J74K8J034q15O37k43N74
7296F63q82O17k46L71k28K0Q95j121r5L30L9j00N8m41l33N13n77L57J9j80K00
7317a21L02m76M5P37k28M29o04p55O94J34k5o3k6m38R55l29l95q1Q84j226R41
$$ y = [-213, 821, 128, 599, 321, 479, -366, -629, -194, 108, -800, 340, 255, 1128, 644, 534, 59, -107, 163, 267, 233, 110, 448, -1442, 290, 356, 815, 158, 213, 982, 240, 376, -59, -138, -516, 185, 75, -2, -168, -64, 708, 138, 942, -467, 519, 361, -533, 1227, 56, 276, -792, -10, -309, 579, 398, -1079, 446, -699, 485, -845, -343, -700, 171, -336, 379, 395, -237, 1315, 625, -321, -608, 259, -239, -639, 181, -233, -176, -41, 845, 1082, 634, 122, 1147, -906, -66, -66, -508, 307, -115, 272, -32, 216, 135, 81, 330, -677, 455, 410, 272, -130, -728, -181, 323, 177, -204, 134, -406, 338, -201, -120, 352, -726, -552, -524, 510, -305, 332, 89, 663, -219, 398, 152, 523, 295, 315, 1210, 89, -6, 324, 363, 263, 321, -120, -453, 60, -517, -160, -141, -321, -121, 181, -295, -250, 487, 259, 688, 84, -671, 23, 157, 132, 69, 43, -395, 560, 231, -164, -245, 639, -587, 354]
7338C54J40r83m39J260r48O41K16L6l28k76J207q68R87n01m83j2j059J653j819
7357a222J762r37M42M58R2j835J260O82J75j265O38r86Q85m0k47R41j134J170
7375H39l43K45j57j24n07k50P96m11N46m43K4l41l10O09r38J071q0l74R37m30
7395C59k29J52L98j250l35L61R49q34M04K59m48m70O86M11j005N71L42r6n19J192
7415H98k50l44L55j180M33N4q03K38L86K3Q59k74m85K41L67L10o55k96L71J27
7435C75l30J53n72K5N40k45Q0l20m90J091m54R1N50j05L1N6m28j082J723o03l58
7456b72L58J77J28J59q76k6O45L01r87J020J69L1k20m06r13Q91j89J057J80j163
7476F4o93J005q62N16J105q63J88J2j140P13M51r67L08M9K57j87J83j51p64J285
$$ y = [354, 494, -489, -928, 332, -616, 25, 241, 277, -51, -327, 880, 12, 999, 498, 15, 3, -1056, 597, -1222, 540, -397, 45, 503, 595, -1240, 20, 702, 877, -388, 250, -736, 149, 109, -138, 803, -331, 839, 496, 741, 584, 460, -47, -297, 499, 88, 634, 191, 215, -126, -436, 173, -765, 306, 226, -148, 789, 359, 130, 282, 680, -570, -905, -544, 405, -429, -25, 234, -214, -684, 2, 413, -592, -21, 321, 225, -294, 898, 648, 304, 659, -521, -88, -34, -837, -599, -213, -190, 669, 395, -90, 151, 518, 828, 173, -123, 248, 375, 45, 198, -374, -349, 191, -54, 26, -294, -784, 307, -147, -56, 494, 389, 420, 476, 48, -1034, 689, 86, -272, 86, 263, 391, 550, -326, -352, 293, 594, -393, 627, 796, 827, 607, 201, -712, 179, -10, 1047, 1227, 64, -629, 376, -486, 30, 1135, 272, 460, 472, -668, 45, 496, -471, -163, -114, 143, -44, 139, -12, -776, 509]
7496E09P9j068K264j931k7j81O33l50J140L78n78j097O03j08j103J204k82l50
7514b65N70P02k086R47N52n53M1R19j192K84J244p54k45M97q76J59o82O15K40
7533A17r67Q88M33m52J116j066J84o37N78n06Q96l4o30k59O64K93q57m27O32q32
7553h66J037k58Q14r55j15J013j044k31k06R02q91J238r65N78l55M84n21j26l52
7572h19L90Q14j34j23n30L85M07m74l26O12q12N36o9N03M22p73m83o1N93p17N12
7593a47O53j082O68K86q01R40j630J421n67j48p8N54n78m19J396p61m2N82l38
7612i1J345j678M90N91j797J511l12n4k61L95j95L26m51N26J47p81j20K22K92
7631A05l98n0o17O10M9L26K68k97R8J87o84K18Q93p63K9p4J55q97L40M88K67n65
$$ y = [509, 588, -480, 1784, -147, -174, -355, 278, -72, 1068, 1446, 868, -229, 374, 266, -837, 367, 85, -265, 305, 1007, -1079, -132, 420, -133, -92, 827, -365, -81, 1163, 409, 164, 661, -215, -56, -738, -123, 117, -850, 38, 471, 19, 1135, 69, 253, -384, 194, -312, 584, 550, -80, -339, 325, 618, -239, -666, -34, -866, 171, -87, 727, -228, -343, 670, -374, -605, -811, 91, -800, 438, -527, 51, -304, 180, -341, -467, -819, -429, 385, 251, 128, -402, -17, 390, -84, -410, 202, -610, -74, -143, 360, 782, 9, -474, -535, 58, -659, -147, 506, -576, 92, 378, -423, 517, -1113, 308, -259, -407, -485, 69, -509, -928, 468, -293, -335, 247, -91, 1254, -424, 66, 657, -1140, 371, 59, 5, -256, 139, -56, 270, -181, 345, 492, -289, -409, -187, 105, -293, -343, -960, -350, -301, 25, 293, -4, 94, 281, -403, -185, 708, -55, -26, -100, 55, -842, -502, -14, 253, -312]
7653c12O53r10L81N3J051p65l06p8M10J278m77j021q5O75l24Q1j268J436K18n95
7673I5m95J34K52n95N24o08N07N1r8N87n79K78k16l90K2N52P53j119P83m76M86
7694D48j042J708j387J001J9j047j147K101R2r99k51Q02l20j04O73M21j401J835
7712A402j518K67L93p73r79J764j49j22K44L9l82n9j19k97k21L02J548j468k32
7731c60M78j76J45l87K29k51R16n35n69P59J27j86O1l37l0m06N97Q40j980J298
7751B33o12J62p38J521p66L95K12r10K24O56j74m84J36jM85l83Q77m14k54J45
7771C10l38R13q94L57j85q25m88O11P74k71n99K20J26L34l54L51O01o6j61L02
7791G18n56K71o78m51N2K07k97J06M36nj87J007m73L12n61J2O21l8q04j78k65
$$ y = [-312, 341, -569, -188, -135, 916, 151, -155, -233, 177, 1455, 978, -43, -128, 547, 223, 304, -964, 472, 690, 95, -400, -266, -14, -609, -85, -693, -186, -135, -233, 354, -225, 53, -163, -553, -531, 21, 774, -345, 438, -38, 448, -594, 1114, -273, 728, 747, -300, -1447, 654, 746, -253, -504, 298, -22, -126, 547, 968, -433, 1402, -116, 151, 544, -229, -1208, 556, 407, 285, 529, 568, 186, 127, 8, -289, -510, -208, 1340, -128, -360, 118, -58, 87, -300, -71, -322, 594, 59, -510, 249, 376, 190, 251, -86, -116, -522, 75, 915, -1065, 233, -379, -217, -955, 566, -200, 195, 407, -503, -279, 377, 203, -281, -145, -146, 339, -44, 833, 419, 165, 310, -28, 885, -9, 348, 163, -662, -1150, -539, 235, -36, -635, -415, -289, 45, -309, 42, 643, 577, 416, 718, 162, 433, -245, -696, -644, -437, -734, -628, -192, -197, -384, 623, 150, 462, -99, -87, 534, 496, -308, -486, -751]
7812g51O72k52L79j81Q54n50j31o5M33J09o65p6j6Q53m89J15q15N52m59J112m37
7833A92J3k54p36J029N62o47o01p8J080k08o52K89J95m02M74n06Q30q25M91j205
7853i59O52K44O33o48J203j31j921J353j22K80L69p19p70l26J256J09n54N19r95
7872e27Q4O21L13n39m61J037l08K8L32o42K25q22Q27n1q66L81L65l26J91P40q56
7893b54O70n1K47m40o89Q67o35N4P21n33M43l9%L7p17M76j10j41r6N81p81j16
7915e06M73N9n8M19j551J261K57P58n04j304Q7K68N34k93k65J9J030j123J42k00
7935d97j09N55j55l90R28j122Q55j184J672p75K00j217L39N86K97o85Q88k62m75
7954e51L36J78N10m87K57l09N75j29j17L15m31n98M59n49Q30m68M91q53N06N7
$$ y = [-751, -79, -331, 48, -133, 721, 171, 40, -25, 408, 517, -148, -224, -240, 613, 124, 239, -576, -24, -483, 629, 192, 205, -49, -785, 244, 806, 159, -442, -520, 560, 352, -300, -11, 184, -218, 256, -250, 580, -245, 246, -959, -307, -63, 570, -78, 1125, 994, -927, 426, 304, 584, 953, 234, -536, -862, 394, 503, -51, 468, -527, -443, 178, 491, -48, -509, 528, 220, 248, 580, -62, 163, -659, 168, 117, -749, -368, -3, -329, -138, 602, -254, 416, 365, 612, 172, -517, 350, -285, -231, 490, -43, 400, 361, 361, 398, -319, 157, 47, -94, -190, 391, -390, -506, -33, 26, -32, 387, -1164, 97, 354, 1112, 608, -696, -609, -341, 193, -100, -365, -346, 684, -439, -297, -497, -606, -51, -206, -596, 332, -790, 65, -1119, 553, -222, -22, -1239, -900, -314, -17, -702, 186, -76, -551, -215, -37, 473, -14, 243, -66, 509, 380, 263, 578, 147, -451, 8, -541, 289, -179, 312, -541, -35, 22]
7974B2q28J385j90P26j057L4K38j012L92M60j63N30r48K79L89p0K63j072J23M36
7994f3J060p24j198J568m74N09l25q92Q77q14J192q89k10Q00k27n01k30K4J140
8013F23m6m53J035q06J83P1j308M48n60J412r07M58q25Q41m63K91Qm12Ml53J119
8034C60k00p21J009n71MP76l9m4j231J050o79O67l55k14M61k59l29k92J068K97
8054G58j423J642j45j139L95N62o16K93q15P30l54m39J239j087P13n51O04j93
8072A74J77n17O46j539P45j82M91J27k83l45M51K95l1o0P37j252R19l48O14m77
8092C42o66mK39k7J14j86j25O86n92l31M98M02p73Q35J01K22j558J452j018P5
8112c14L26l5p33J344j374O82M91j02p93l12O92P27o56j80N99J14p86L17j08J148
$$ y = [22, -806, 579, 389, 1115, 58, 92, 330, -682, -290, 170, 7, 537, -411, -132, 257, 187, 450, -622, -499, -63, 997, 273, -925, 643, 169, 678, 353, -539, 338, -476, 716, -173, -383, 417, 190, -311, -541, -517, 623, 577, 124, 1159, 353, 536, 607, -701, -253, -813, 599, -308, 150, -675, 166, -297, -6, 2, -410, -406, -759, 360, 160, -561, 448, -123, -119, 657, 618, 574, -657, 393, -286, 381, 26, -188, 273, 14, -315, -607, 461, 758, -665, 977, 832, -307, 88, 650, 34, 327, -488, 242, -112, -551, 688, -399, 314, -237, 367, 174, 351, -166, 480, -1059, -314, -496, -5, 122, -161, -506, -55, 240, 209, 149, 886, -366, 553, 205, 819, 342, -324, -328, -89, -116, -2, -188, -313, 373, -219, -550, -52, 350, -423, 412, 513, 735, -823, 629, -389, -314, 12, -23, -756, 588, -786, -104, 387, 285, -508, -820, -128, 599, -57, -237, 362, 476, -310, 7, -101, 1047]
8132A047j613j97Q62M69q81l9L74n80O55M16q74j22J159j201k79K99Q69J28o69
8151a77m85J206n52R17j971J694p09q56J223Q2J83r42J124j413M56Q3P27q22O36
8170D04l99o06J453j086J28n73Q97p41J191j592J298r99N30k39p7J018M59j286
8188b20j142J642k97
$$ y = [1047, -566, -763, 99, 568, -313, -352, 22, -558, 97, 513, -361, -483, 676, -525, -804, -505, 364, 492, -177, -662, 544, -8, 909, -1062, 632, -77, -933, 290, 372, 555, -387, 737, -676, -220, -137, 590, -232, 404, 5, -601, 852, -234, -106, -679, 218, -523, 668, -924, 374, -625, -95, -334, -411, 607, 1066, -220, -1362, 280, -17]
8191a7
$$ Imaginary data points
##PAGE= N=2
##DATA TABLE= (X++(I..I)), XYDATA
0@%%%%%%%%%%%%%%%q0J88k16K16k16K16l10M18m32M73n81O59p67Q91r99J188j370
32g22J526j713J942k191K460k754L071l428L821m244M700n203N751o351P016p731
48d050Q518r387J0338j1395J2560j3856J5319j6968J8834k0989K3514k6485L0049
61A6002l4430L9976m7242N7186p1678R4822j37367K39643r00981p17265K625082
72A163748m90559j678618J630023J099505j967349J86427J751464j140743j321541
81g67643J475865J33231j788454M18954J273242j209881p17731J479382O3018
90C59983j351855P45333J079773j127280m23252J374298k31770j167307Q36849
99I4772P42285j138115r5593J141642m72576q61313Q13404L27543j006429M7140
$$ y = [0, 0, 0, 0, 0, 0, 0, 0, 0, 0, 0, 0, 0, 0, 0, 0, -80, 108, -108, 108, -108, 108, -202, 216, -216, 257, -324, 335, -432, 459, -540, 648, -722, 804, -909, 1033, -1158, 1302, -1452, 1619, -1809, 2012, -2232, 2468, -2735, 3016, -3335, 3681, -4050, 4468, -4919, 5419, -5976, 6584, -7272, 8047, -8921, 9913, -11076, 12438, -14047, 16002, -18428, 21548, -25694, 31492, -40186, 54636, -82731, 156912, -744069, -1461334, 1163748, 673189, -1005429, 624594, 1724099, -243250, -56823, 1694641, 553898, -767643, 708222, 841453, -947001, -528047, 745195, -464686, -1182417, 296965, 359983, -991872, -246539, 833234, -294046, -717298, 657000, 425230, -742077, 94772, 837057, -301058, -396651, 744991, 272415, -588898, 224506, 552049, -454380, -407240]
109d07240P90353m89897n76858O86809L08690o74209R8201P46931k74465n57926
119c49611N45635L35658p48923q0003P41253l40351o64365O50041L73279q21806
129c59193P6078Q55852m66794o34131P58969K19725r30211J70959Q09310n67972
139f7408n14948Q72836J63680q95350L28672P90190p26303m83605R26943m8964
149C45743j019779M90489P42336q99996k59466J112287k44921r16843Q02340N35416
159F87606j090890J4119J040279o07045p49493R76035K40020j057080L52196R07196
169G12943p61963m66335R93047o2172r91688M89829O55748q72398k49243R65719
179D13487k24013p93800O78544M96957q72620j7895Q65797m45342o63949P24631
$$ y = [-407240, 383113, -106784, -683642, 3167, 311857, -362352, -264151, 482780, 208315, -349611, 196024, 531682, -217241, -297244, 444009, 103658, -560707, 89334, 462613, -359193, -283115, 572737, 105943, -528188, 230781, 450506, -479705, -308746, 500564, -67408, -582356, 290480, 454160, -441190, -112518, 677672, -48631, -532236, 394707, 345743, -674036, -183547, 558789, -341207, -600673, 511614, 266693, -650150, 152190, 687606, -403284, -389165, 651114, 44069, -705424, 270611, 510631, -546449, -194253, 712943, -49020, -515355, 477692, 415520, -576168, -86339, 569409, -302989, -552232, 413487, 189474, -604326, 74218, 571175, -301445, -319340, 546457, 101115, -562834, 161797]
189A61797K34449q56233J89723P44566n16637m09441P55310P0823p23788K83185
199f6246N34243n64883k96602O23152m9364n92323L27696M47181m83970j59571
209b80687N93522q3294n33338L22339L45109n31375j47617N49979j40795m84335
219c90492L94525L37711m99783m7401N61106j98041m71260L88861K36941n55609
229b43442k0967N29877k46644m01861M74624K24683n38298Q1973N34640l45391
239D9194l97794N02345J03396o09920J63146N22534m12123k83576O09692L3603
249B80497n80389K84410M43595n27925k16887N81887j26857n53149L85790L59212
259C30184n36196m3773O05989k18064m68505M55816K20742o00532K9409N33583
$$ y = [161797, 396246, -459987, -270264, 474302, -42335, -451776, 303534, 374357, -349431, -66246, 467997, -96886, -393488, 229664, 180300, -412023, -84327, 362854, -121116, -280687, 312835, 229541, -303797, 18542, 363651, -167724, -315341, 234638, 93843, -390492, 4033, 341744, -158039, -205440, 355666, 157625, -313635, 75226, 312167, -243442, -264409, 265468, 18824, -383037, 91587, 316270, -222028, -140055, 394585, 49194, -348600, 153745, 257141, -352779, -189633, 332901, -79222, -362798, 246894, 280497, -299892, -15482, 428113, -99812, -316699, 265188, 138331, -414818, -29028, 330184, -206012, -249785, 356204, 138140, -330365, 125451, 346193, -254339, -224930, 308653]
269C08653l32630l80781N25282J45362n49244J80432M98719l96215k88538N20183
279B31223n420n56334K36896L95330m50648j64257N50821p2472m67719L44253
289D1673L24149m90366r2036N03961j95741m47651L74114K35679m90884K2897
299b14205N06863k29176l47891M32266J49466n03190P6447M23027l26147k97886
309c30426M43570O5478m61140J91538M05706l46811j95298M63389l0702m62551
319b57247K23388L07602m13593j32424M58411r5012l85066L21267K63252m08701
329a18123l2469M27624j92307l53812L26843J44993m30359N1744L98583k32633
339i916k43547L90555R1523m00346J18976L33279l02356k16500L59205K385l78092
$$ y = [308653, -23977, -404758, 120524, 265886, -283358, -102926, 395793, -422, -288960, 231223, 225803, -330531, -93635, 301695, -148953, -313210, 237611, 165139, -302580, 41673, 365822, -124544, -216580, 287381, 91640, -356011, 18103, 253782, -237102, -214205, 292658, 63482, -284409, 147857, 297323, -205867, -129420, 293607, -32540, -330426, 113144, 178622, -282518, -90980, 314726, -32085, -227383, 236006, 205304, -257247, -33859, 273743, -139850, -272274, 186137, 91125, -293941, 27326, 290578, -118123, -150592, 277032, 84725, -269087, 57756, 202749, -227610, -175866, 222717, -9916, -253463, 137092, 228615, -171731, -52755, 280524, -21832, -238332, 120873, 123258, -254834]
350b54834J75425K97490k85994j13336L77263l9513l35536J96941K11967l31520
360a01647q9890L30495r6450k88285K43148J98494k96550j6809L34034j22296
370I4244k75769K32057J33884l31176j2574L09951j42544k33630K81018J34483
380A89944l10486M5455L08100j94132k33189K81728N8545l49967Q6648L01951
390A84597k32577j68882L56694L2604l46309J58770K76770l10983j50495L55901
400A56090o1743l55310K30050K43853l39351m3277M01088j31388l15887L00717
410H4842J51401m04379K2313L58469k36735k53775L66362P6898l80859J51461
420f4002L32604k93569j66428L74144m1088l70839J97198K33262l31297o3818
$$ y = [-254834, -79409, 218081, -67913, -181249, 196014, 156501, -179035, 17906, 229873, -101647, -191537, 138958, 42508, -245777, -2629, 195865, -100685, -117494, 216540, 94244, -181525, 50532, 184416, -146760, -159334, 150617, 8073, -225557, 55461, 189944, -120542, -75087, 233013, 38881, -194308, 87420, 145965, -204002, -117354, 184597, -47980, -216862, 139832, 172436, -173873, -15103, 261667, -49316, -199811, 156090, 94347, -260963, -30913, 212940, -126411, -169688, 231400, 100012, -215875, 84842, 236243, -168136, -145823, 212646, -24089, -277864, 88498, 165396, -215463, -64002, 268602, -24967, -191395, 182749, 141661, -229178, -31980, 201282, -130015, -193833]
430a93833L67275j02640k74542K74416J55719l31849J5426L02107j92200k30247
440b10368K69867O1254l06142R2941K63750j92990j27723K76967P322k61881J10425
451a6578J73500k17746r2529K27982l0422k00831J38182J54085j71151m2155K04575
462A26912m2637j83386J03955J07822j83129n2976J87920l3425j63345J28570
472c719J39381j60597m8971J92616m5343j91695J08046J15245j90041m2045K14863
483H7740m9661j75319J66262J33123k13559k0352K29722j09302k09396J86541
493B5799R2935k60642L1210K62691j48305j68468K63790N8011k91648R0490K33444
504A89307k35238j39517K87192k9762k81358J88408K03513k70002l2695L16616
$$ y = [-193833, 173442, 70802, -203740, 70676, 226395, -105454, -90028, 212079, 19879, -210368, 59499, 120753, -185389, -92448, 171302, -21688, -149411, 127556, 134878, -127003, -16578, 156922, -60824, -153353, 74629, 44207, -156624, -18442, 135643, -35508, -77663, 126912, 84275, -99111, 4844, 112666, -70463, -123439, 64481, 31056, -132289, -3719, 135662, -24935, -73906, 118710, 73367, -118328, -10282, 104963, -85078, -127123, 87740, 38079, -137240, 29022, 162145, -51414, -71766, 157956, 48654, -160742, 25799, 118734, -141908, -110698, 151993, 3688, -164780, 99010, 157021, -134627, -44137, 189307, -45931, -185448, 101744, 71982, -209376, -20968, 182545, -87457, -120152, 196464]
514A96464j14957k55842K38308J10286l21036L1345K84420j86920j80030K92282
524I4320M6019k91125J25149K35329k40748j12980K78457n6533k69946J70439
534b1619J60717k52291j5116K74039r9400j88653K10379Q3168k45553L1673K00614
545A37958j51436j36765J98395K7633j96552Q1847J66141j30600p5436J70910
555I2095r891j66570O3364J02030j32228n4378J45646p797j22784P9459J09632
566I8578j05251m7355J27933j3103j34478N4254Q9195j12535n1429J38371M052
577D8232j22076P5517J12285j14106o0371J35289k1158j52617P4970J04191j41243
588f1087m0224J76142k9605j49497J27190J09228j80775k5651J86269r0086j68851
$$ y = [196464, 81507, -174335, 63973, 174259, -146777, -115432, 168988, -17932, -197962, 94320, 140339, -150786, -25637, 209692, -31056, -144036, 134421, 77888, -192058, -21619, 139098, -113193, -128309, 145730, 46330, -142323, 68056, 151224, -94329, -62656, 137958, -13478, -150243, 48152, 75785, -120767, -38920, 127221, -3379, -78815, 92095, 82204, -84366, -21002, 81028, -51200, -105578, 40068, 32271, -90513, -11054, 98578, -6673, -54028, 73905, 60802, -73676, -19422, 69773, -42762, -94191, 44180, 48232, -73844, 1673, 113958, -148, -60519, 74770, 53612, -99005, -24035, 80156, -61087, -101311, 74831, 45226, -104271, 22919, 132147, -48628, -74279, 111990, 21904, -146947]
599a46947J60000P8160k00613L8265K04433j24425j19244K01766J8363k15651
609a05893Q1449J56288j83698q0305K14441l5374j90804J47963J35145j95590
619e6378j8572K11168r1721j76038J64256P1263k16000K9693J97065j25806j16592
630a27662K00816K7993j94258Q3894J47674j66480p2136J81555m2113j72028J20487
641a2258J08352j57489j2196J74676n7919j29817J18451O2293j55664k29J34027
652G2227p5717j02560J20745M9275j27024K9516J29223p6770q1435J12427J6180
663F6087j32025L0082J02614q9500o0188J18250J5198j09247M8855R7526q4725
674B927n6303J01546l436j16979L9579Q6443q5293m4371J18536N412j08147O2048
$$ y = [-146947, 13053, 91213, -109400, -71135, 133298, 8873, -110371, 91395, 109758, -105893, -24444, 131844, -51854, -132159, 82282, 46908, -143896, 4067, 139212, -56378, -74950, 136218, 44497, -131541, 32715, 103978, -112022, -82329, 114736, -11070, -127662, 73154, 101147, -93111, -9217, 138457, -28023, -100159, 81396, 39283, -132745, -12258, 96094, -61395, -73591, 101085, 43166, -86651, 31800, 94093, -61571, -61800, 72227, -3490, -106050, 14695, 63970, -63054, -33538, 95685, 18915, -62520, 49907, 66087, -65938, -35856, 66758, -22742, -82930, 35320, 50518, -58729, -9874, 87652, 2927, -53376, 48170, 44734, -72245, -32666, 53777, -31516, -75887, 42649, 48061, -60086, 1962]
686A962Q8200j08815m2626J20531l2740j21702Q4741P8557j22331p305J41052
697G9524m6510j03127J06216N2308j38500L797J18500p7220r0009J17868L5329
708E8176j26802M0941J20250q9560o9071J24621K468j40433N6718R8666j18179
719d2205m6830J44245j6797j21059R2474Q6362j25685j9499J26810n5609j09856
730h7649R6595M9434j24154J4457J21662o2751p6997J12928K9332j22520K7813
741b1850J01899q9553p2907J13915J0449j20252N2820J04398r2596m6537J23074
752F2860j1557j16289O4962P3885j14229k7087J19636l8161r6517R3505N8556
763F9564j09261O345J10654n8889q5214R1628L1036j17339J8189J01862o6521
$$ y = [1962, 90162, -18653, -61279, 59252, 26512, -95190, -10449, 68108, -54223, -61528, 79524, 33014, -70113, 36103, 88411, -50089, -46292, 72208, -5012, -95021, 22847, 58176, -68626, -27685, 92565, 3005, -66066, 58555, 61023, -79410, -22692, 75974, -42205, -89035, 55210, 38413, -82646, 9828, 96190, -29495, -48994, 77816, 22207, -87649, 8946, 58380, -65774, -51317, 70345, 7594, -69403, 43525, 72857, -49663, -21850, 80049, -9504, -82411, 31504, 41953, -78299, -25479, 78919, -13677, -60214, 62860, 51303, -64986, -24, 73861, -40368, -67455, 52181, 14020, -82497, 11008, 69564, -39697, -33352, 77302, 18413, -66801, 24827, 55863, -61476, -43287, 58575, -7946]
774g946o3467J05353K1919j04635L7631Q7434q3057n0988J00302j2429j01724
785g1607N8561P0088q8607j7600J05485k5849q2993O9252M5211r6241p626Q6770
797D4844m2302o9744P2612L8442p9970J0154Q2330m1744n6242O7110J7321q5227
809d2416J4338O8469n1156m4904P7438J6341p5152L0049O6099n6141m1719P0643
821C1889j165q0110K8992O2012n8392l0942P8785M504p1917L4630N8317o5895
833i292l2012P5277j4099p9769M8821N7572p7351j4927R5089k3572p8018O7506
845A5225M6070r6405l298R1425m9404p4424Q7094L1414r7272K4662R3198o5725
857B560n4491R6109J582j02341M4790P3459r0121l1566J07721k2046r0560P4306
$$ y = [-7946, -71413, 33940, 55859, -48776, -11145, 76289, -6768, -57756, 42546, 30117, -71607, -13046, 57042, -31565, -49165, 56320, 30471, -52522, 16730, 61941, -34300, -41926, 44844, 2542, -67202, 5410, 43852, -36118, -25964, 56366, 14622, -41620, 25490, 42811, -42416, -28078, 40391, -10765, -55669, 21769, 38110, -37042, -6993, 59106, 2965, -38754, 31889, 30724, -49386, -20394, 41618, -16774, -47716, 31069, 35573, -36344, -1714, 56603, -9292, -41304, 33973, 19874, -59895, -11074, 46498, -30853, -45780, 49309, 25737, -52281, 15225, 61295, -35110, -38408, 53017, 3613, -70811, 16283, 47697, -49575, -24913, 68285, 2560, -51931, 44178, 45760, -56581, -11791, 61668, -28453, -60019, 47702, 25656, -64904, 9402]
869I402N9115j00793n005J00955n1000p9762Q5235K7930j02940K4808Q9160o5693
881h588m6913R4155J351q9395M5121O2950q1051k4304Q5354k3623p1570N8301
893A788M4695p1679o72P4194l2293n5206N5818K1116o6841M658N6726l3636l7450
906c8782N0731J4547m8732J4869M4224l4422l0433M2600M484m9719J1705M1541
918B2613k7455k4444M3193J2970m4180R050L8983k7046l3696L8095J1273m7710
930b8354P605M7809k6857l1912N1870J2833n6692J6235M8434m5877l4750O0348
942B0692J597o6530L3437N5409n6656k2922P5087j2763o8722M7169M1541p5503
954b8164q597P4275l1922n8847O6408K9474p7857J5989P2627n4098m7249P8300
$$ y = [9402, 68517, -32276, -37281, 63674, 12674, -67088, 18147, 46077, -56863, -32055, 57105, -8588, -55501, 38654, 40005, -49390, -4269, 58681, -22370, -46674, 38680, 15057, -56513, 1788, 46483, -25196, -25868, 48326, 16033, -39173, 16645, 37761, -29080, -24422, 32304, -1332, -38782, 11949, 26496, -22236, -7367, 36857, 2435, -27998, 14602, 19086, -30633, -18928, 22613, -4842, -29286, 13907, 26877, -17303, -8253, 30730, 3684, -30012, 8083, 19356, -28354, -20749, 27060, 203, -31709, 20161, 32994, -23698, -7463, 40971, -4906, -39656, 20692, 22289, -44241, -10804, 44605, -12051, -34973, 40114, 27351, -41371, 5798, 47339, -28164, -36761, 37514, 5592, -53255, 13153, 42627, -35230, -19241, 53386, -712, -47961, 30339]
966C0339K230q3971L7432O2006o9155k5402Q6488j7209p0459N7769M2818p9092
978b6206k734P6827m1637n7239O7854J9825p4764K1729O2061n1628l1955O9993
990C2126n038o6144L3925M6050n9098j8504O2323j2978n3160M1222L4073n1306
1002a6509m207N1650k3101m0738L9104J8269m7351M402M2664k3595k6496L7754
1014A1846J0690l7547R046L3745k5030k6097L0040R390l5981N693L5613j7249
1026D159k3528K9781J0835l5266L927L2833k1259k6355L2157P910l8564J0886
1038a2484L7447k5901k1746M1476L756m6076J4831L6790l7667k1925M6200J057
1050A5758m4310K4602L6921m1607j3657N0815j2902m6453L3683K6977n1584k993
$$ y = [30339, 32569, -51402, -13970, 48036, -21119, -46521, 39967, 22758, -47701, 10068, 52886, -26206, -28940, 47887, 6250, -50989, 16865, 36690, -38074, -16345, 45716, -5912, -37867, 32126, 27088, -39056, -5131, 40919, -18179, -36683, 25640, 12662, -40498, 724, 34797, -16509, -20716, 30934, 7833, -32905, 6199, 24468, -22883, -18481, 24183, 588, -25908, 11846, 22536, -15011, -5965, 27780, 2750, -23347, 6693, 16083, -19898, -14205, 21408, 4159, -19369, 10412, 21247, -14019, -10092, 22741, 1482, -24873, 7284, 15194, -23370, -12484, 24963, -938, -22684, 18792, 22548, -23528, -8697, 28093, -9574, -31499, 14701, 15758, -28552, -3950, 32971, -8636, -22293, 28522, 15620, -30833, 2850, 29827, -21757, -24750]
1062b4750N3656k4021l8294M9239J6664n7164J3110M8922m0266l2120N4174L132
1074B2282n4744K2976M1764m3773j7027N2653p506m7934L3648K8410m8371n921
1086b3543M8912j9078m0511M1642K1281n1802O337M9170l1281l3217M8111Q401
1098B4422n0156J6263L9570l6707k0800M5561j227m1892K4595K9876l9624j0650
1110b0769M1263j0425l7062K8299K2329l7851m149L9269j5575l1530L2834J6225
1122B2858l9381J425L8215k0867k8538L2747J0851l6073J0490L0807k2774j8588
1134a8828L1743K103l4329J4187K6135k6733j3647L2073l339k9121J8167K3201
1146B1612k6501r633L0234m516l1269J6476K0008k5864o728L1590p529k5201K0512
$$ y = [-24750, 28906, 4885, -33409, 15830, 32494, -24670, -11560, 37362, -2904, -35024, 19150, 22282, -32462, -9486, 32278, -11495, -28522, 24131, 16625, -31309, 2339, 30749, -17622, -23543, 25369, 6291, -34220, 7422, 28703, -23099, -16762, 32408, 1127, -32090, 16021, 24422, -25734, -9471, 30099, -6608, -27408, 18153, 16926, -24966, -371, 29505, -10119, -20769, 20494, 10069, -26993, 1306, 23635, -14216, -18365, 20904, 5329, -26201, 6633, 22858, -16523, -15098, 23117, 2250, -26288, 6459, 17310, -18763, -8273, 22534, -240, -18828, 12915, 15018, -19311, -5124, 21011, -5722, -19369, 12704, 9365, -19756, -1589, 21612, -4889, -14522, 15712, 11196, -20073, -3597, 16411, -9453, -16181, 15409, 7880, -17321, 3191]
1159C191J5029k7031l280K9716j2780k4106K3092J0272k8384K169K9011j2994
1171C905k1099K4464J1001l0197J357K9130j5356k3628K6452J1924l2773N690
1183i130L0338k1402j9602L2581M220l6940J4364K8306l0282j4648L9083m822
1195A2066l6522K4832K3421l7114n993L9556j3574l3713L1875J8403l9393J898
1207a4258L8698k2896k7239L8004P624m2724J5054L6248l5319j5976M3493n564
1219A5145m0328K6397K6626m0979o931M2249j7595l1416L2659J4764l8536O944
1231a1001L3337k4529k0319L4497J017l3374J6103K3890k7316r663L2258n513
1243I387k8030J8812J8399k7317l862K6509r811j9976K0512R565k3128J484J9261
$$ y = [3191, 18220, -8811, -12091, 17625, 4845, -19261, 3831, 14103, -14281, -12112, 16899, 3905, -17194, 7270, 18271, -11926, -10569, 18561, 3205, -20423, 6029, 17953, -14820, -9130, 21208, -194, -19796, 12785, 17005, -19935, -5571, 22735, -7547, -22195, 16888, 12066, -24456, 376, 23797, -13317, -19310, 20246, 6672, -27041, 4834, 23237, -16156, -14258, 24440, 1544, -25695, 12309, 19933, -22791, -7737, 28511, -6808, -22784, 20709, 15145, -25183, 1214, 27840, -13139, -20070, 22179, 4584, -26832, 5827, 20591, -17945, -11001, 22336, -2193, -22512, 11985, 13002, -20372, -4269, 19621, -7695, -17358, 14900, 9387, -18643, 169, 18568, -8749, -12611, 13898, 4087, -15889, 4623, 14188, -8940, -7456, 11805]
1256A1805j1408j2389J4908M708j5029K536J5176j0023q631J3138K889j2319m57
1269e096J3712m211j2731P166J0945j2854m456J4753j029j7370R557J2344j5984
1282e254o096K0602m267k0148J5288J3251k2713j971K4631j1770j9935K2264J1611
1295A5493k8942N945K8576j9276j9399L0314M008l4036J1881K7923k8899j3669
1307b0081L6648o001l2202K4919J9832l6006l15L5929k2479k6526L3874Q763m0227
1320b3872J3847L3211k7779j5735L8857m050l4752K2254K0879l4764n703L7001
1332A9394j4702k7628K9813J1571l3130P718K8808k2907j7824L1547j951l1856
1344b1147J6891K1575k7309o108K9202p223k2033K1504Q759k1743J262J8954j2490
$$ y = [11805, 397, -11992, 2916, 7624, -7405, -4869, 10307, 284, -8347, 4791, 7680, -4639, -5096, 8616, 4405, -8326, -1160, 9785, -3069, -7525, 7228, 6199, -11171, -1614, 10730, -5254, -11350, 9252, 4985, -15163, 125, 13376, -9337, -11308, 13323, 1553, -18382, 3882, 15493, -13449, -7504, 21072, 1796, -17603, 12711, 16719, -17317, -5436, 22487, -6412, -20081, 16567, 10566, -21636, 3283, 23115, -12891, -13206, 22723, 244, -26282, 7592, 16355, -23872, -10025, 23186, -4593, -20328, 18529, 14479, -20273, 1981, 22860, -11904, -17607, 19394, 4692, -22936, 6877, 18448, -14682, -6964, 21844, -1063, -18887, 12660, 10709, -21147, -4256, 17319, -9990, -16098, 13104, 5881, -16152, 5352, 14111, -7632, -6370, 12584, 94]
1357I4j0926J7197J744j5957O406J1742r637o284J2539p45j2337M612O520q057
1371c089m991P364K971o404j492P829n40o318L094O104n393n361Q437J724j0072
1386f137L588J1234r180m860J3975j455j5264R610J1120j7436n253J8901n406
1399C437j8818J4994J2974k1588J090K2265j1424j7389K1011M417k7007R173K1269
1412A4404j9455j0974K9250k787k4775J8344J6476k8161l411K8494j3816k4475
1424b0886K4278R193k9486P180K7216j7685j5048K8572p75k9688J5826J6966k7079
1437a1416n181K9673q983k2051K2634J2915k6424L379K6732j9915j5648K4071
1449I786J69k5680J0792J7020j6192n745K2213m758j9050J4419Q278k0045p04
$$ y = [94, -10832, 6365, 8109, -7848, -1442, 10300, 663, -5621, 6918, 6173, -6164, -1552, 4968, -3089, -8080, -716, 2255, -4149, -5641, 2188, 1648, -4670, -1576, 4528, -865, -6226, 2211, 3935, -6137, -2549, 8685, -495, -5355, 8620, 7165, -8099, 1511, 12631, -4805, -10058, 8843, 3437, -15381, -387, 12587, -9001, -7911, 14354, 2930, -14459, 6552, 10969, -16038, -6865, 14404, -5051, -16025, 13225, 10438, -14337, 4007, 20483, -7678, -11089, 17405, 3589, -20886, 3392, 12585, -16901, -9721, 17495, -190, -15238, 13334, 12559, -17129, -1303, 15663, -11416, -16597, 13076, 4093, -17958, 4676, 17591, -8833, -5454, 21278, 1363, -14285, 9786, 9955, -15725, -4933, 12087, -4105, -9850, 12363, 7605, -11445, 2974, 11252, -8793, -9497]
1462i497J7054r061j2958J6093N399j5503M096J5844j0823p182J2971M01j3378
1475f544L198Q372p746l549R481n4n490M155L420n353j009M417n21p001J685K711
1491A72j537m974M319N393m719k60P367j333r296M099O143r645k867J0480r45
1506B397r387O752Q000r282q49J1797n796j2143J0809L190j6012L003J5704j0138
1520a955q508J8126L331j9301P775J6216j8482q344J9623m119k0667J5107J1598
1533A0400j8810K377K1251j0981j4276J9720K273k5412P377J7758j8000q548K2930
1546H059j641k0677J6019J4389k1007k363K0923r739j9172J7458N885k1753N854
1559g765K0090j4214p767K2025j365k1105J0593J3262k0747l495J8931o823j5049
$$ y = [-9497, 7557, -1504, -14462, 1631, 7030, -8473, -4377, 11467, 644, -6538, 6433, 6834, -6544, -3346, 5026, -2720, -6269, 3212, 3158, -2332, 1823, 5243, -110, -1119, 3298, 2777, -4224, -2539, 172, -1365, -6339, -2020, 3373, -1346, -1606, 5761, 4428, -4868, -769, 5374, -4271, -7138, 3342, 2397, -6990, -238, 7762, -1520, -2369, 9428, 3632, -8511, 2298, 5488, -10524, -7521, 8183, -1955, -10463, 7663, 10994, -8307, -532, 15684, -2798, -11142, 8481, 4362, -16305, -1198, 10400, -8410, -6033, 15218, 4237, -10039, 9681, 11954, -13458, -6081, 11677, -6323, -14871, 8059, 6418, -14259, 1760, 16149, -4858, -7221, 13702, 3963, -15209, 2249, 8134, -13619, -7765, 12325, -1889, -9656, 12369, 11004, -10101, 492, 13754, -6993, -10488, 8443, 1620, -13429]
1572a3429J5855O039j4924L729J5851j0754r359J2556j849j3571N442R164r294
1585d544j951J2240l510p611Q843M470r356j308P409m811n058M452K094n286L194
1600g33M511k303Q16J259j360k327l44j921J712p91k982K888K265k506J393O262
1616E839l955m194O619m41j0858L322O836q778k763J3142j814q563R949O803j3728
1631b584o41J3501r711j1343J3234J514j5129P910J3293j3078k347J7663m445
1644G837j7818J2850O626j9629r70J9373j0471j1781K1038K734j8441J0131J4033
1657A5512j7236o728J8284q033j7559J5054Q935k0128N698K0177j3347r851J9539
1670A0317L01k0815Q001J3107j8095m462J8936n956j3519J5632Q557j6562M062
$$ y = [-13429, 2426, 8465, -6459, -2730, 13121, 2367, -6992, 5564, 3715, -9856, -4414, 4750, -4544, -6495, 5745, 2235, -5376, 3467, 7937, -1419, -2727, 4682, -129, -5187, -735, 1359, -3927, -733, 3778, 1475, 2291, 3550, 2190, -137, -481, -2402, -690, -1481, -4463, -1575, 690, -1816, -423, 5839, 1884, -2310, 4309, 3868, -6990, -3668, 3168, -5610, -8373, 4769, 2955, -5608, 4341, 11144, -2584, -3225, 10276, 565, -10778, 2456, 3970, -11159, -3249, 10044, -3034, -5381, 12282, 7837, -9981, 2869, 9495, -10134, -11104, 8269, -2202, -13983, 7055, 9789, -8652, 1479, 15512, -1724, -8452, 9832, 1799, -15760, -706, 8229, -11899, -6201, 13976, 629, -9222, 10317, 10618, -10197, -2196, 10911, -7184, -11646, 7290, 1334, -12185, 3447, 12004, -4558, -496]
1683d96J3834j2192r172J3103j909j3358P752R246j1928p29J3239m041r127R648
1697C870J473j0344J736O286p235k473P645j609k523O736J041l448J788J478l664
1712G57j263K057k176k204L424r64L1K925J43j304K682n93n779J754J820p941
1728f631j231R294l663m768R146K774p785L992P416j0665l308J0101m968r754
1742a0050J0263N007j3340N132J4687j0548p523J6402k158j6775Q169Q640j6707
1755h801p51J7157p058j0422J5624N065j6952O582J2394j4211p543J5661m469
1768B276j6246J3439R674j7017K050J9576j0409j2133J4552K415j7584M882J1408
1781F883j4690m257J7132l337j2996J4462O865j5793K199J3721j2490p648J4869
$$ y = [-496, 13338, 1146, -8026, 5077, 3168, -10190, -2438, 6808, -5120, -5849, 7390, 3349, -5778, 3870, 5343, -5001, -3265, 3021, -4214, -6687, 958, -651, -3174, 3562, 4603, 1155, 2943, 4421, 757, -506, 1551, -625, -2829, 595, -369, -338, 2587, 2730, 1426, 4108, 3515, -2264, -510, 1310, -6631, -7862, 1432, -2231, -6999, 2147, 4921, -2864, 1128, 8544, -2121, -5429, 4672, -296, -10050, 213, 5220, -8120, -2988, 11699, 1151, -6372, 10030, 7872, -8903, -734, 7906, -8801, -9552, 7605, 547, -9875, 5749, 10814, -6138, 444, 12838, -1373, -8916, 6745, 2276, -13970, -531, 9143, -7874, -5824, 13752, 3343, -8790, 5762, 8177, -9407, -4525, 6883, -7807, -12064, 5068, 1731, -11265, 3197, 10062, -5731, -3532, 10189, -2301, -9949, 4920]
1794D920l30j3651Q590R725j0551n42J1808m738q033Q362q5j0101K889O134q170
1809c773j910P868j033n612N787L083o210K32L232m134k937M658j715j597L164
1824h97J569j392L594J569m584L668M59n466j86K697k388k224M886M12l299M123
1840B541L548o897N55O223o867l843P111k426q203O697P095q533K52J1444n053
1855C644p745Q943J031j2649L010R158j0509j905J1978k407j0835J2072N289j2689
1869c614J022J1423j0436r598J3377J08j3454Q914J1749j2457j500J4796n565
1882D765j1075J0214L138j3801K533J1414r959m942J3520p08j0749R213N636j1472
1896b273j946J1073p812q802R232L383j1396N791J0619q267l074Q567j909r104
$$ y = [4920, 4590, -9061, -471, 9254, -1297, -1839, 9969, 5231, -2802, 5560, 5475, -4626, -1737, 4397, -3773, -5683, 2185, 1152, -4460, 1327, 4410, -1800, -1568, 1664, -2470, -5407, -749, -2464, -4061, -897, 672, -720, 2874, 4443, -141, 3527, 3986, -1480, -1666, 1031, -1357, -3581, 1305, 1717, -1582, 2541, 6089, -808, -253, 5970, -897, -4740, 2371, -55, -8258, -1561, 5534, -2999, -2747, 8697, 3644, -4101, 4842, 5873, -6776, -3766, 5392, -5117, -7022, 4956, 2549, -8286, 3786, 9075, -3614, -2592, 8831, -1605, -11203, 2174, 2282, -11172, -2258, 9491, -2966, -4466, 10330, 4765, -6310, 3904, 7042, -6759, -4226, 7188, -2771, -7713, 5807, 5099, -5650, 3563, 9199, -2273, -4219, 6854, -958, -9760, -528, 2855, -8541, -2750, 7869, -398, -3472, 5095, 3186, -5918]
1910e918P097K251r447J343Q643m600m962R258J558p981M187M319o674j515N612
1925C171m252l152M606J233l765K697K825l746R44L061k763k620L179j404l719
1940c705K794Q46k724L127L065m587K432K774k888j397L267k933m553M701M44
1955F63m183Q34P621m466j974O118j862o320M700K504q145M20P710n634l507R956
1971D435q36p727O163N150r368k412J0900o354q105Q364L221q569L581R250q252
1986e59l564R535j635j0790P261M628j1015O09J1671o763p610J2266K443j1065
2000d588M178P617r072m604J0299l485q735R668M602j0051J957R444p563m530
2014d863J0073k160r593O652M497q866J39Q296k935n714P119J379p380K867M554
$$ y = [-5918, 1179, 3430, -6017, -4674, 3969, -631, -5593, 3665, 5223, -2758, 1429, 5748, -926, -2441, 3171, -1081, -4233, 373, 1606, -2159, 538, 3363, -383, 561, 3622, 859, -1761, 1418, 14, -3705, -911, -65, -2789, 338, 3403, -1184, 1248, 4022, 1134, -263, 3004, 71, -4482, 219, 663, -3520, -2686, 4935, 469, -1505, 4613, 2751, -3569, 1131, 3635, -4510, -4090, 3620, -2014, -5521, 4435, 3599, -4128, 2035, 7185, -2183, -4595, 6305, -49, -8154, 210, 3431, -5138, -1557, 7693, -559, -4123, 5412, 3777, -7013, 248, 4876, -6139, -5530, 6141, -622, -8232, 4034, 6477, -4588, -410, 7207, -1865, -6469, 3830, 345, -8390, 1278, 5880, -4171, -2214, 7230, -333, -4863, 5210, 3050, -6543, 109, 4606, -4260, -4121, 4175, 1240, -4474, 2645, 4024, -3356, -489, 4065]
2029D065n629l355P608l594k501L527K793n402K437L502k937j673L922k592k915
2044b744J772K177l781K426L472n018K017K582l011j300K843j042k881K289Q10
2059F11m305J753L356k964k3N137k919k446L841L38o503K786M055n917M09O053
2075C262k311n721O720K860q220J877O627n615m470P668l104o714P401M033q030
2090c737J932P696n625n243P868J18r832O070O055p598k371R747l148o363P154
2105B723L386q890P59P671p004m386R885k647o911O221M316r214J083R536m680
2120A848o963Q940o94p816K263P051o453k040Q535l250m895O143J612p765K708
2135g76M893n861j557O967k693n026N399R19m382J084L807l085k347M245j145
$$ y = [4065, -1564, -4919, 2689, -905, -3406, 121, 2914, -2488, -51, 3451, 514, -1159, 2763, 171, -2744, -972, 1205, -2576, -150, 3322, -1696, 321, 2903, -108, -1408, 1435, 393, -2488, -199, 611, -3694, -1941, 1415, -1549, -1572, 3565, 646, -1800, 2041, 2379, -4124, -1338, 2717, -3200, -2791, 3262, 951, -4770, 1950, 4810, -3410, -1533, 5094, -521, -4991, 2677, -427, -7141, 260, 4293, -3737, -1805, 5891, 266, -4977, 2891, 3009, -6823, -753, 5302, -2296, -4667, 5080, 1932, -4431, 2723, 6109, -2781, -2022, 5649, -1355, -5741, 4144, 1497, -5414, 807, 5123, -4091, -3008, 6528, 1848, -5115, 3825, 3131, -4685, -2422, 4629, -1824, -3864, 4671, 1421, -3474, 2669, 4281, -3484, -776, 4117, -1744, -3301, 3666, 973, -4053, 1346, 2265, -2117, -1033, 2774, -311, -2658, 1587, 442]
2150D42l598L650J496l507J091M206l853j538M335j846l395L659R05m764J452
2165a265J904j980p9L664k620j568L920l12m065L247P11n187J485M745l093k575
2181c068N193M23n681L386K992m532K28M355k616m796O087p96m941L410N150o619
2197a825m98N994k702n313O747J101p273K048O198n731l360P582j536n442M681
2212F71M667q459O64O843o006l179P348Jp253L726N921p915r37P477k310n090
2228c831N659J820p457K973M126m682j708O186j561m764M642K414n096M68M664
2243C853l453l403N493o63m140K145K466l910l26L794k687j713K935P70l534K244
2259a29K324l984l44L959r72l304K715J098j817L87K137j936l36K135l120M22
$$ y = [442, -3156, 494, 1990, -1517, -426, 3780, -73, -1611, 2724, 878, -2517, 1142, 2047, -2717, -1265, 639, -1341, -1420, 2244, -376, -1944, 1976, 1664, -2401, 846, 1557, -3630, -2145, 2600, -493, -3068, 2125, 2548, -3133, 253, 3245, -1287, -1059, 3296, 680, -4116, 1971, 1175, -3766, -356, 4794, -1825, -2323, 3671, 969, -4344, 2403, 3504, -3769, -1721, 4477, -1254, -4614, 2968, 1432, -4010, 671, 5338, -3121, -2457, 4386, -1620, -4799, 2549, 2550, -4703, -977, 4944, -2971, -3908, 3569, 1259, -3831, 1828, 3648, -3809, -836, 3290, -1392, -3100, 3086, 1525, -3239, 1403, 3817, -1279, -811, 3853, 400, -3003, 2490, 1827, -2313, -168, 2298, -1612, -1938, 1856, -831, -2544, 391, 1161, -2373, -129, 2195, -1789, -2133, 1826, 854, -2450, 265, 1363, -454, -67, 2070, 134, -202, 1933, -1187, -765]
2275g65R27j54j453J238J576k605R64J924k436r38K948p34k310K071J048k541
2291a240R13K161l683M60M296k052l668L532J662n601O11N253l331k338N360k007
2307C28l621M109K227m631L62M080k801k555L637K54n234M050L487n863j74O010
2323C665k594l968L890K254n575R60M213l967k478N867n54m109L314K477n154
2338a759m05M998l605k349M380N4m805K541L657l773p01M619j819l413M051P00
2354B371m965J699K690l280p66L530j116j734J696K238l525P70K389k073k656
2369b732K697L28k446R36L675k330J36O63r09j816K460Q1k265J859Q51j832K79
2386c65K033j149j128K455M6l253K376Q1k566J074R90k341J381J783j836l66K725
$$ y = [-765, 162, 8, -1445, -207, 1369, -1236, -272, 1652, -784, -1722, 1226, 492, -1818, 253, 1301, -1240, -327, 1834, -1849, -1389, 2907, 855, -2813, 719, 2381, -3220, -2609, 2644, -687, -3025, 2335, 328, -3293, 816, 3043, -1588, -1226, 2854, 53, -2502, 1135, 1389, -3845, 205, 3692, -2171, -2345, 3665, 1071, -2897, 993, 3247, -2328, -1368, 2845, -1122, -3600, 2267, 1713, -2396, 918, 3395, -1759, -2164, 2834, -771, -3120, 1260, 1314, -3491, -950, 2707, -1066, -1767, 2852, 1033, -2380, 1671, 2371, -2594, -895, 1795, -1485, -2251, 1279, 163, -1571, 125, 2363, -1162, -392, 1997, -76, -2732, -35, 293, -2153, -1217, 2458, 128, 264, 927, 18, -1798, 662, 743, -1522, 337, 1188, -644, -365, 1668, 519, -609, 1846, 1892, -1361, 1015, 1096, -1470, -396, 594, -1747, -366, 1417, -419, -785, 1940]
2403A940j571k473K636J236l485J70J870p76r26K569p56r78J269K341k440k493
2419a867L458j906j657K305J569l881J684L673k185k225K804J45m255K008J906
2434A576l359j46K246o36j901M209N08l675J034K571l721J81K491j999l464M613
2450E28J462l089M61L451j887j603L413j545l256J428J989m406J206K684Pk899
2466b056L646J100m333K168K303m732n27L084p72k671J953J438q74N10K056k316
2482b3j090K650j320j439J308Q9k124Q03K324j398j67L012l24k185P92r5k209
2499a396P57O94r17L23J562o33j447L232j535n64O09o61j182j148J515l00q28
2516a919K159p6r03K212J107k800J90J597k232k017L139l98k398J747K106k304
$$ y = [1940, 369, -2104, 532, 1768, -1717, -1547, 323, -453, -1379, 1190, 434, -544, 725, 3066, 626, -1867, 1591, -315, -1972, 333, 1902, -1979, -295, 3378, 1193, -1032, 1772, 1917, -2338, -330, 1576, -1783, -1929, 317, -319, -2220, 1989, 2497, -1178, -144, 2427, -1294, -1113, 1378, -621, -4085, 528, 1990, -1099, -638, 2813, 926, -677, 2736, 1191, -2065, -637, 1352, -3054, -1848, 836, 843, -2056, 1590, 2690, -1643, 525, 2828, -1904, -2431, 653, -119, -2790, -837, 601, -273, 237, 2293, -23, -1113, 1537, 217, -1222, 86, 175, -1949, -1146, 1178, -220, -387, 2625, 2301, 116, 908, 813, -1396, -639, 55, -862, -539, 1023, 390, -1057, 2175, 640, 76, 685, 24, -1158, -2306, -791, -1091, -1919, 240, 164, -739, 1473, 2580, -220, -30, 1567, -665, -2682, 457, 59, -2339, -592, 1514, -790]
2532g90M07L362j164k611J676O64m177J508J393k377o25N177j905k582L106J850
2548B912l604q5K890l209p34J691l30k649K606K693l017O24L457j624k573J729
2564G77j065k882J675K739k667M13J873O5j612K495M02k599O70J504l114q22K377
2581B29o94p55K263J046k045O83J537j681k593K356n13j101j98Q77j015Q30J391
2598F17j78r67K239j584n28O29n86j105P6N23O7J086Q85M99j299J555M98k718
2616b91k26L07o87p60N5J487m82K045P95j847N31R22j670j49O25j136j956K006
2634d31Q88j117k97K973k116N60J143pk655N80m6k624J115L188k851N50K696L18
2652A867k170P33J888k922l10J291j432r20Q23J588k205J804L318k424j17J967
$$ y = [-790, -383, 2979, 1815, -796, 880, 1544, -2633, -1125, 268, -2109, -2734, 2443, 538, -2044, 1062, 2912, -692, -777, 2113, -1096, -1830, -139, -469, -3118, -512, 2181, -836, -212, 3245, 1621, -952, 777, -288, -3170, -1495, 1244, -1423, -1010, 863, 928, -684, 1811, 2213, -386, 284, 1788, -1326, -2148, 229, -465, -1220, 1043, 2089, 44, 727, 2264, 583, -2010, 346, -167, -1268, -1466, -589, -1604, -774, 617, 439, -528, 1711, 127, -401, 228, -358, -1463, -1387, -864, -797, 289, 1174, 1673, 374, 1929, 2427, -291, -517, -210, -897, -1657, -1602, -115, -597, 1448, 2243, 396, 927, 1849, 179, 30, 655, -481, -2437, -431, 457, -660, -957, 2016, -100, 460, 1603, 1596, -1059, -479, -525, -3149, -2034, 1154, -1697, -1147, 1549, 1867, -303, 430, 2318, -604, -914, 377, -1055, -1975, -1152, 436, -1769, 35, 3353, 929, 812, 2779]
2668B779k146j477O83n2j985J18K645r73q11J364J253j382Q39O56k178j20O52
2685a35j706p30K425L21j45P7K735k172j72J265j088j855J02L58p50N14J151o79
2703d84J796L93k63O8l93k24j839r76m6l28Q70J063M54nJ149Q49j697N10q20N93
2723F70j333j313J9P8J894N50k61J820l95r49k1j22j553J98l8j605M12M34J619
2742A04k90P61J829o45o48J038j490k399R81j95l90O79Q27m78K27J346J478j111
2760A624j094l51j036j31r28J170n68R64L68J17J114K132k617j163J520l43k943
2777b165n6J991j528Q00J120J135n88J492n28r92m00k88j136j063J607r68n27
2794b094K191J480p68K46J734j260k225Q44N37k905O20J047k89j26K330P28j24
$$ y = [2779, 633, -844, -161, -213, -2198, -2080, 565, -408, -1219, 145, 1398, 16, 855, 1511, -667, -787, -135, -1841, -2571, -146, 175, 30, 107, 2842, 670, 498, 1763, 675, -1180, -1078, -720, -1470, -956, 195, -484, 1312, 1705, 1442, 1510, 1117, 893, -946, -1922, -1968, -2296, -1426, -363, 91, 86, 1235, 2084, 387, 897, 77, 670, -663, -1976, -1957, -1879, 15, 565, 304, 2124, 1729, 780, 759, 637, -916, -718, -756, -2361, -1949, -1515, 104, -186, 575, 2404, 1759, 1111, 2149, 659, -1740, -759, -954, -1344, -665, 162, -316, -89, 1257, 2735, 1624, 530, 179, -857, -988, -1916, -746, -1314, -350, 18, 135, 1249, 3381, 764, -399, 1121, 778, -2165, -2221, -230, -1758, -958, 162, 1297, 709, 2201, 1673, 681, 281, -7, -1143, -2206, -599, -1567, -2094, 97, 1577, 809, 1055, 2789, 1529, -696, 148, 685, -2220, -1600, -553, -842, -968, 1362, 2090, 1966]
2811A966R03j233j631L24j44k250p89K436O95r49J770l98J153j445P25j740P57
2828A50p6o43j694R72L09M06J030J238Q1o22J23j01j884R10j335j499J645j148
2846b138P39J361J580L30j20M97o55j942r56O08j890M82J181k4q6J239J600m16
2864A390l28K25j047p19l00q21o37K16K332m59N18J908R4j415P81k55l100R83
2882f34l66j136L8J542LM63J451l93j77Q88N5k015L45l30l34k068J708K59K28
2901d73J173J210n25k71L65j953o99j40J182j371l88J214P33P56O52O12j430L42
2919I89j44k274L21Q94j065m97J514P04m55Q72J204q94k18q66q82m21J30K35j557
2938b410J494J563l44J011N99l95p74J96j10k085q2M07j851J838Q83l94M93K152
$$ y = [1966, 2869, 1636, 5, 329, 185, -2065, -2854, -418, 277, -672, 1098, 700, 1853, 408, 1133, -607, 150, 74, -569, -2263, -1291, -982, -576, 454, 1692, 1773, 1151, 1274, 1173, -711, 199, -1136, -2635, -990, -2138, -1399, -38, 1542, 1872, 1752, 2249, 1594, -348, -1304, -696, -2586, -2104, -923, -947, -1033, 206, 1806, 1390, 1062, 1287, 240, -479, -779, -1600, -2237, -2021, 311, -148, 370, 2278, 2372, 957, 1738, 1483, -1617, -634, -1000, -2136, -2098, -556, -553, -90, 1361, 968, 791, 1679, 1734, -281, 64, -266, -600, -2668, -960, -701, -473, 700, 1910, 1385, 1114, 1479, -474, -1173, -1313, -131, -1502, -1890, -676, 57, 813, 1465, 2077, 647, 989, 845, -1429, -1108, -214, -1279, -1776, -262, 442, -13, 859, 2063, 1169, 951, 85, -797, -1218, -1088, -853, -2410, -916, 647, 303, 1314, 1913, 1518, 744, 940, 830, -1255, -1337, -930, -2781, -943, -60, -454, 39, 2191]
2956B191j98j210k07R75k762o41R83o19k89J391O14J373L98m15o08o53L86j049
2974c40j451Q38o63l42R58J255J230l28J067n21q19l85L49j916l77m18O6l94J905
2993b86L97Q23R08J03k540J428R97k839p35O39N85j602J989J903p39J1J424j254
3011A212o58n24p86j263M67J070j08j008K444J048j443O01J240k529L26o83k19
3028h13j603J581L99k90J151R35o5n83M68l2q82J83j300n80j020R75q2K055M58
3047I55R09m15M59q35j301Rq96j06o69J021P4J52J112R42j225Q22M28q77l98j378
3067a217j43l74l85J433N79Q23J168n44l1N38j386n3l76j650J85o17J627o92J089
3086b6J040J208j493R46q30j317l72P17j431N59M99K67J37J054N62j47j49R09
$$ y = [2191, 1993, 783, 576, 1551, -1211, -1852, -869, -1488, -1777, -386, 228, 1601, 1999, 1584, 976, 323, 709, -340, -1791, -953, -1616, -1958, -1000, 255, 1485, 1157, 2224, 1703, 884, 499, 848, -1068, -1445, -1863, -1797, -2191, -286, 111, 934, 1842, 1945, -595, 833, 1830, -1009, -1744, -1105, -520, -2122, -133, 1770, 1031, 1042, 2466, 1212, 554, 30, -756, -2019, -1552, -482, -590, -1598, 846, 1894, 451, 1052, 2292, -237, 89, -594, -813, -2416, -835, -436, -726, 425, 1360, 1295, 712, 1180, 1148, 266, 449, -851, -1431, -2451, -1476, -1558, 497, 955, 1864, 1449, 1908, 1073, -228, -219, -1115, -1221, -1890, -869, -795, -643, 469, 1411, 186, 1008, 1436, 559, 161, -1217, -1360, -1734, -2119, -686, -107, 716, 1884, 1340, 1309, 1847, 461, 408, 32, -1618, -1433, -2050, -423, -1115, -26, 1014, 2222, 729, 1675, 845, -472, -844, -127, -1558, -999, -500, -233, -96, 958, 1520, 1373, 1224, 2133]
3104B133k138j693L54k1r33J114N78P22k32J298J38o75P98q6k530k74R26j109
3122a630j8J354N43p7J67J726j087j48R45k325m19l64q87P32R04M61N8P37P90
3141A462P3j350l8K09j240n37K81n03M31Q06N89N21J435M98k052n15J59q94j16
3160g81Q40j572p7J682P84j054J608j55K11j417N67j056q14N75r63Q34P09n3J09
3179b3R91R47o60j200l23J203j703j857K244o60O0J283P32n65P24M52j124q8l55
3198G8j125p37N74L80J69O56J533k42R18k94l11j683R06p61j251J53K65l81O44
3217e09J847j241J946n96Q32k163o86J170k781J711k8J49M08j46O14m40J244M19
3235A750r43p54l56j50p78M20P67k295J085K238K36p57J844j542r56m51K76r1
$$ y = [2133, -5, -1698, -1344, -1365, -2298, -1184, -606, 116, -116, 1182, 1320, 645, 1443, 1357, -1173, -1447, -521, -1630, -1648, -294, 249, 172, 339, 2065, 978, 830, 1775, -550, -969, -1333, -2220, -1488, -584, -123, -65, 672, 1462, 1535, 185, 147, 356, -884, -1421, -1140, -1643, -1212, -406, 183, 704, 2139, 2637, 585, 70, 229, -665, -781, 59, -1513, -1590, 92, 876, -178, 1430, 1275, 1486, 69, 636, -420, -1234, -659, -1622, -788, -79, -132, -23, 968, 1915, 1255, 55, -268, 935, -768, -2625, -381, -1041, -981, 302, 1034, 469, 1193, 1645, 521, 433, 78, -1047, -1784, -1210, -830, -661, -5, 1528, 1286, 2204, 1910, 1599, -84, 822, 61, -1190, -1037, -772, -1153, -509, 1338, 97, 2043, 1447, 2279, 116, -570, 600, -2181, -470, -498, -349, 59, -87, 527, 87, 1331, 1750, 807, 53, -303, -453, -1231, -811, -44, -2339, -1254, 984, 1220, 463, 2307, 765, -191, -642, -366, -457]
3253d57j750J620l10O40P19P94N85n11M41j614k114R71J74k14k42J026j58N00
3271A00J820j162nJ418k761Q16j99j06j934J203Q93n17q8J566O22r50P36j101
3289C51n88m58K36m40L26O24Q15j809J805O05m78o89O16J42j709n91M90r01K022
3308C69N67r34N35J360k029P01M56r87q38k85R69o07j60J06L14J730M84l70j418
3327c7P85p75j118M34L13q17n09J562o39O20J539L6j374P62K13j662n32J224j164
3346a139K46L05k81N15P03J417K3j047r02N34k75j361R51k07r11K441k73K94k80
3365G53L1K08p98j32j095l55J66N15n57J253N75r94P50J356r50K91n00n00r10
3384h93j19ML80O36K09M34j36N01L33j263N31l71j619k35P48k01m9J911l72O08
$$ y = [-457, -2207, -587, -897, -257, 462, 1256, 1841, 1330, 1771, 157, -1957, -986, -812, -1026, -1268, -242, -400, 100, 1920, 758, 753, 2171, -590, 226, 27, -79, -2013, -810, 83, -434, -522, 1044, 1666, 716, 1452, 351, -237, -695, -459, -899, -573, 51, 866, -943, 862, 1467, 989, 300, 916, 1058, -651, -1242, -752, -1653, 369, 936, 2, 537, 1897, -132, 569, 1025, 38, -800, -1085, -116, -723, -883, -777, -463, 1267, 1751, 1381, -37, 748, -27, -1145, -711, -398, -1215, -1724, -162, -801, -181, 1358, 1394, 20, 782, 995, -667, -1199, 25, -1139, -893, -588, -869, -354, 349, 1766, 1789, 742, -160, 374, 99, -1262, -311, -518, -1429, 1012, 739, 1033, 753, 784, 992, 194, 62, -1033, -1388, -1222, -707, -1264, -11, 564, -430, 320, 1676, 726, 1017, 517, 17, -893, -1012, -1008, -628, 8, 217, 651, 515, 1016, 1349, 86, 617, 246, -1373, -1608, -860, -1061, -1110, 801, 429, 1037]
3404A037J4p33L95p86j71K2p88R92o43m82R26J234o8p57Q21l04k82N3o47m05k82
3425h54k52J32N98Q95k1L69J172l48k204O73n97p42j34K40P83n18J138Q64q96
3444B98K77P0k47j46jK20k104J629o27k38N28J283o90O12O04r62j037M43q18L03
3464f03l79Q00p12N96J693j039n63R03J036j599m89J52M2j81N3o13m20J386M01
3483D64l52O10P13k082M47K05r86m02N85J92K40K17J233j39l12J262j239j060
3501d04l39l78M03L42R55j272L01P11Q82o56L20l37j312J79N54q19M18p37J212
3520B3O80q4M72p66n60J268p38m36j26l98j3N46q9m56N91J401o70n39PJ26m79
3541b40k66n07J069m13O28n46K58P90J293j882L80k11j77p20R48j352O37n3N57
$$ y = [1037, 1051, 318, 713, -73, -244, -222, -1010, -18, -661, -1143, -217, 1017, 949, 192, 1013, 709, 427, 480, -167, -572, -854, -1106, -974, -376, 519, 498, 867, 2039, 1691, -513, 160, -437, -1179, -1313, -1073, -290, -808, 330, 1194, 298, 575, 645, 398, 252, 251, 471, -1633, -4, -631, -869, -341, 942, 252, 864, 1468, 506, -531, -88, -906, -603, -982, -182, -894, -298, 1395, 356, -207, 696, 1732, 133, -356, -204, -162, -343, -290, -903, -1323, 63, 464, 112, 722, 1435, -647, -200, 5, -981, -1383, -798, -606, -366, -149, 1084, 945, 633, 1895, 656, -404, -743, -1121, -718, -376, 579, -693, -392, 319, 1201, 545, 865, 528, -784, -605, -51, -870, -452, -1189, 23, 703, 619, 1091, 325, -235, 1033, 295, -141, -267, -665, -678, -132, -221, -677, -86, 1315, 645, 106, 113, 239, -240, -506, -1013, 56, -357, 271, -275, -17, 773, 2066, 184, 564, 353, 176, -544, 404, -948, -311, -364, 193]
3560A93J112k29m55o5k53Q14l04p31o04j60p02M54J002N77m24P50l38j48q58Q82
3580E13j305M40j78R9K69p05J462j529J562l13k11M13J13p45n57O48p12j326J618
3599d44J606j027L24L78l50n15J95M44j658J254j274K86L96K71N10Q53j68k0o42
3618D19M63l75j466M07M57l57n03P48M75n25K38J471n51j300O36n39q66K29N92
3637c47P2r23K918j574R18N25j170m15k03O52o87o05P36j028P65J140r31J303
3655A146j61M89j203k05o91O72m49L14m59m59J656o57O40k34R75r77k36N02j636
3674i73J182r60O60l86M26L59Q87p74n0Q48l88j467J215j119O90m14m36N43O83
3693E26L22p3m79R04l95j362R6j037J303j161P61l10J041J335j101k67Q88l35
$$ y = [193, 1305, 1076, 621, 556, 303, 1117, 813, 82, -522, -682, -1384, -930, 72, 649, 225, 975, 637, 489, -369, 513, -792, -352, -530, -431, -162, -867, 595, -934, 628, 315, 104, 517, 630, -115, -672, -24, -736, -2062, -444, 1162, 135, 459, 837, 487, -28, 167, 611, -1047, 207, -1067, -781, -385, -114, 396, 1249, 1081, 1061, 419, 882, 507, -959, -552, -95, -452, -955, -207, 268, -257, -19, 1452, 901, -399, 237, -302, -1168, -939, -347, -275, -1198, 1720, 146, 1064, 1589, 419, 4, -199, 453, -234, -839, -103, -1131, -366, 774, -157, 1146, 985, 1474, 271, 66, -625, 47, -402, -88, -547, -1006, 650, -7, 633, 399, 1374, 397, 161, 663, -973, 209, -751, -91, -477, -51, 308, 1195, 421, 371, 1219, 831, -636, 579, -540, 150, -264, -700, -157, 526, 848, 775, 296, 1200, 805, -557, -461, -1498, -195, -1356, -595, -905, 136, 1471, 370, 103, 991, 656]
3711F56k97l82k27m31q4R80l41l79K99R91j593J017K19q22N50o58Q80r32j98Q75
3731A23n23O02L11J08P24o58l50q18M40J043j874N52O74j73N27l84K85k9j83n10
3751a13j458J260m85O66j19N6q07O43J218q57m23J064j43K68j006j46K72Q7L28
3770C05q66J136p21O04K91p66l44M60j685Q72J22k07L79J2O31r51J145L97j136
3789c22K33K5j709J113J74k56L91R57o30Q45Q22j575n79J514j258j06o9J17J78
3808a35j146J746N72j96j13j33o48J26n58O90k134J403R7M43o37L05k98J59P73
3827C16m65N9j11j81j81lP06q84M92m67Q85l17j24J41M37L32j522m0J70J090p34
3848d01O44M69j327L00J49P06m73J44O97m27j148N44p6lj37O9N0o66J461J01p6
$$ y = [656, 359, -23, -250, -681, -765, 215, -126, -505, -206, 785, -808, 209, 428, -394, 156, -502, 378, -554, -752, 123, -400, 202, 513, 621, 1345, 687, 337, -481, -41, 1002, -872, -320, 354, 181, 708, 324, 609, 580, 397, -113, -1571, -311, -796, -130, -249, -193, -1000, -357, 861, 4, -419, 645, 502, 770, -236, -382, -110, -23, 305, -561, 575, -146, 458, 749, -17, -361, 99, -1586, -714, -592, -799, -420, -408, 223, -728, 417, 814, -322, -89, -64, -1773, -660, -486, -742, -351, 606, -24, 821, 1643, 68, -511, 1003, -255, -361, -430, -313, -135, -1281, 465, 1037, 841, 728, 595, -53, 73, -485, 205, -1929, -526, -429, 14, -623, -318, -616, -457, 316, -149, -90, -201, -382, -563, -566, 140, -744, -252, -719, 166, -151, -275, -134, 303, 635, -887, -927, -757, 333, -401, 243, 712, -615, -315, -166, 540, 67, 211, 908, 481, -667, -123, -199, -202, -339, -270, -220, -886, 575, 676, 600]
3869F00n53L21j120L8P39j53m20L89n2J04j2Q22j250J052r75PL03r75R30L05L99
3890D99k75k19O24m42r1l34K24j24r9p48Q88j2q1P46p4n12l39J215k39p49k30
3911c72K51p53O01k00L5N34P99j032Q71K47q56j111N85P64j003J819j693Q01p0
3930B17m4o61p57K381j08n08k67p07M69m14N82r44j1O7J382p26J38M35o27j12
3950b15r5N81m13L37j514J003Q28P46j466J68P37j90j207J361j300P79l35J57
3968c8k17J443j084j208K49J011O18q10k43L68r85Q03L99j391J192L89N85q00
3986B81M74j049k0q57J171J13j93k31K36m28O67o82J043j306Q18o91J55L95N86
4005D82j005kQ62j031Q02l55m77l26Q32m63N96Lj74k06j37M64m5P67m17j66K81
$$ y = [600, 47, 368, -752, -714, 25, -128, -548, -159, -211, -107, -119, 703, -547, 505, -470, -463, -160, -1135, -205, 100, 499, 224, 5, 629, 187, 96, -238, -14, -138, -237, -985, -97, -109, -190, 556, 482, -30, -369, 846, 607, -142, -372, -121, -874, -273, -473, -438, 96, 895, -137, 734, 981, 125, -986, -401, 363, -640, 1179, -514, 287, 217, 173, -488, -1245, 1136, 1028, 520, 253, -454, 15, -399, 183, -761, -772, -705, 677, -49, 89, 524, -103, -215, -310, 271, -142, 195, -1319, -316, 512, 1258, -208, -40, 697, 507, -700, 661, -639, 140, -195, -38, -255, 1188, 104, -1104, -855, 156, 774, -36, -279, 89, -896, -93, 306, -1085, 107, 496, 1081, 281, 755, -294, -314, -1171, 0, 113, -80, -311, -75, -503, 164, -518, 525, -781, 37, -654, -499, -104, 482, -523, -525, 337, -694, 108, -247, -724, -1050, -218, -681, -85, -82, -256, -462, -599, -135, -180, 587, 170, 4, 285]
4026B85l05K87j227K57J038j02m91L97n90L08O7N18L97q26J92L65p49N04q87O53
4046I1M86l46o1k27m48O86k00K94j02J82J72j049j60M24J68N57p96k95O66n74
4066e32K10M78k33J63M60k98o47R37L86j36j34o0K22o87m47k69J85k50J414o09
4086A53Q7L10j071M82N48l70j28J98j704J373n15O68j421O10J295p66N36n58J032
4105G59j89j042K79J33N93o64n11J036o18o98Q95J233q55J25j262K43N50M2r9
4124e0l41j11L05N49j4m96k22O04n20l64P16q05k99K99L85L79M04J18n19p1L80
4145C27k88L4K67r80L6M3J242r78R68o41q53O67O57p26P42j237J241j354M56K16
4165a61O98p36P49J77p51j122J002L11n09j20N01L57j110N89N91n70K68q41pJ4
$$ y = [285, -20, 267, -960, -703, 335, 233, -258, 139, -451, -143, -76, 442, 839, 13, 205, 570, -179, 325, -562, 91, 577, 231, 170, -57, -505, 181, -19, 275, 173, 355, 527, -522, -682, -258, -90, 467, -329, -624, 42, -532, -322, 156, -77, 86, 546, 248, -399, 538, 924, 788, 654, 594, 816, 129, -318, -587, -402, -652, 762, 153, 240, 550, -521, -39, 509, 139, 11, 209, -1495, -122, -637, 31, -1390, -780, 515, -251, 285, -273, 759, 570, -472, -193, -60, 533, -131, -642, 394, -224, -922, -27, 1206, 351, 476, -786, -543, 7, 49, -50, -391, -502, -197, 352, 338, -158, -380, 224, -296, -660, 56, -749, -1048, -749, -364, 15, 419, 537, 18, -53, 327, 39, 73, 340, -640, -604, -561, 681, -297, 671, 30, -823, -156, 501, -225, 517, -720, 521, -833, -377, -161, 537, -199, 550, 727, -24, -1146, -144, 167, -342, -462, 39, 396, -714, -125, 466, -104, 164, -677, -684, -670]
4185f70P84k89K54m70K89k2M41o06L14p60O16J81J49j126P99L76r59J35O2L28
4205a74LM64r06O42j41O2l14p9j07j35O78M56Q10p81k29Lj60J63M81p88m14O21
4227A55p96N95j040R18L85j339J185L47p82J151l28q00n86L38L74m7L01l08L91
4246A14J05l12j88j59K82M47n95R6l21J78M36L64L75j704J322n01n64J008m75
4265i2J02m70l05R91j20N01J98q55k73M80k88J97M16k42r8k01q80R40o00M72L39
4286B12R3q73j50J835j430N02m21P46o79j35Q52l26L23l89N44l72L37o87O09K09
4306H00l98q10K90O00j290N37M74j34l20k25J062L00k44p89N61n23n39N74j358
4325a432J575m90M39j08o08J18J031M18j625N06O25l72l33N64j059N31N67l78
$$ y = [-670, 114, -175, 79, -391, -102, -124, 317, -289, 25, -735, -119, 62, 211, -915, -116, 260, -699, -564, -502, -174, -171, 293, -613, 29, -112, -50, -364, -443, -550, -685, -7, 449, 1259, 478, 249, 252, 92, 255, 736, -52, -466, 155, -641, -46, -1086, -168, 217, -1122, 63, 410, -372, 779, 451, -349, -935, -597, -223, -270, 31, -277, 114, 219, -93, -281, -440, -158, 289, -306, -210, -531, -353, 83, 447, 822, -882, 440, -61, -625, 383, -92, 10, -460, -765, 226, 106, 607, 805, -50, -323, 157, -131, 66, 482, 240, 142, -59, -939, 1, -599, -127, 212, 305, -568, -718, 1117, -313, 189, -232, 514, -165, -300, 552, 226, 549, 160, 704, 332, 669, -18, 591, 800, 402, -408, -118, 482, -808, -271, 203, 69, -251, -476, 586, 886, 642, -147, 414, -109, -648, -74, -1432, 143, -347, 92, -16, -624, -506, 525, 943, -682, -176, 449, 77, -256, 308, -751, -220, 347, -31]
4343c1k91K19Q80k75o53k63K30L29k65j67J459j226N02j36p48M71Q12m2j08j067
4363c70L91P5K33r50L50L78R12j065L16p4j86O46q05r62J558k80p75J69j82N84
$$ y = [-31, -322, -103, 777, 502, -151, -414, -184, 145, -120, -287, 1172, -54, 448, 312, -436, 35, 847, 805, 697, -370, 21, 96, 329, -621, -271, 107, 1019, -46, 270, 196, 10, 656, -149, -1111, 447, 167, -608, -439, -621, -37]
$$ [...]
8191B09
##END NTUPLES=NMR FID
##END=
