##TITLE=1H_UK-23_5_7
 CD2Cl2
 108 sc, 
 17.10.2022
##JCAMPDX= 6.0         $$ Bruker NMR JCAMP-DX V2.0
##DATA TYPE= NMR FID
##DATA CLASS= NTUPLES
##ORIGIN= UXNMR, Bruker Analytische Messtechnik GmbH
##OWNER= root
$$ XWIN-NMR		Version 3.5
$$ Mon Oct 17 14:26:30 2022 Russian Standard Time (UT+4h)  she@DPX200
##.OBSERVE FREQUENCY= 200.1313499994
##.OBSERVE NUCLEUS= ^1H
##.DELAY= (6, 6)
##.ACQUISITION MODE= SIMULTANEOUS
##.ACQUISITION SCHEME= undefined
##.AVERAGES= 108
##.DIGITISER RES= 18
##SPECTROMETER/DATA SYSTEM= spect
##.PULSE SEQUENCE= zg30
##.SOLVENT NAME= CD2Cl2
##.SHIFT REFERENCE= (INTERNAL, CD2Cl2, 0, 15.7039)
##AUDIT TRAIL= $$ (NUMBER, WHEN, WHO, WHERE, WHAT)
$$ ##TITLE= Audit trail, XWIN-NMR		Version 3.5
$$ ##JCAMPDX= 5.01
$$ ##ORIGIN= Bruker BioSpin GmbH
$$ ##OWNER= she
$$ F:/spectra/data/she/nmr/H-F/1/audita.txt
$$ ##AUDIT TRAIL=  $$ (NUMBER, WHEN, WHO, WHERE, WHAT)
(   1,<2022-10-17 14:23:36.51 +0400>,<she>,<DPX200>,
      <continue with go, POWCHK disabled, PULCHK disabled
       configuration hash MD5:
       00 E9 B6 7A A2 85 ED C7 34 08 36 98 17 FE 4E 26
       data hash MD5: 16K
       73 74 08 F5 C3 CC 95 DD 85 1A 82 6A 91 E0 DC D1>)
$$ ##END=
$$ 
$$ hash MD5
$$ C5 92 49 E9 0A 2E 46 56 50 28 FA 4C D6 23 44 18
##$RELAX= 
##$RELAX= 
##$RELAX= 
##$RELAX= 
##$RELAX= 
##$RELAX= 
$$ Bruker specific parameters
$$ --------------------------
##$DU= <F:/spectra>
##$EXPNO= 1
##$NAME= <H-F>
##$PROCNO= 1
##$TYPE= <nmr>
##$USER= <she>
##$AMP= (0..31)
100 100 100 100 100 100 100 100 100 100 100 100 100 100 100 100 100 100 
100 100 100 100 100 100 100 100 100 100 100 100 100 100 
##$AQSEQ= 0
##$AQ_mod= 1
##$AUNM= <au_zg>
##$AUTOPOS= <>
##$BF1= 200.13
##$BF2= 200.13
##$BF3= 200.13
##$BF4= 200.13
##$BF5= 200.13
##$BF6= 200.13
##$BF7= 200.13
##$BF8= 200.13
##$BYTORDA= 1
##$CFDGTYP= 0
##$CFRGTYP= 5
##$CHEMSTR= <none>
##$CNST= (0..31)
1 1 145 1 1 1 1 1 1 1 1 1 1 1 1 1 1 1 1 1 1 1 1 1 1 1 1 1 1 1 1 1 
##$CPDPRG= <>
##$CPDPRG1= <>
##$CPDPRG2= <>
##$CPDPRG3= <>
##$CPDPRG4= <mlev>
##$CPDPRG5= <mlev>
##$CPDPRG6= <mlev>
##$CPDPRG7= <mlev>
##$CPDPRG8= <mlev>
##$CPDPRGB= <>
##$CPDPRGT= <>
##$D= (0..31)
0 1.2 0 0 0 0 0 0 0 0.06 0 0.03 0 0 0 0 0.0002 0 0 0 0 0 0 0 0 0 0 0 0 
0 0 0 
##$DATE= 1666001816
##$DBL= (0..7)
120 120 120 120 120 120 120 120 
##$DBP= (0..7)
150 150 150 150 150 150 150 150 
##$DBP07= 0
##$DBPNAM0= <>
##$DBPNAM1= <>
##$DBPNAM2= <>
##$DBPNAM3= <>
##$DBPNAM4= <>
##$DBPNAM5= <>
##$DBPNAM6= <>
##$DBPNAM7= <>
##$DBPOAL= (0..7)
0.5 0.5 0.5 0.5 0.5 0.5 0.5 0.5 
##$DBPOFFS= (0..7)
0 0 0 0 0 0 0 0 
##$DE= 6
##$DECBNUC= <off>
##$DECIM= 32
##$DECNUC= <off>
##$DECSTAT= 4
##$DIGMOD= 1
##$DIGTYP= 9
##$DL= (0..7)
0 120 120 120 120 120 120 120 
##$DP= (0..7)
150 150 150 150 150 150 150 150 
##$DP07= 0
##$DPNAME0= <>
##$DPNAME1= <>
##$DPNAME2= <>
##$DPNAME3= <>
##$DPNAME4= <>
##$DPNAME5= <>
##$DPNAME6= <>
##$DPNAME7= <>
##$DPOAL= (0..7)
0.5 0.5 0.5 0.5 0.5 0.5 0.5 0.5 
##$DPOFFS= (0..7)
0 0 0 0 0 0 0 0 
##$DQDMODE= 0
##$DR= 18
##$DS= 0
$$ [...]
##$SUBNAM2= <"">
##$SUBNAM3= <"">
##$SUBNAM4= <"">
##$SUBNAM5= <"">
##$SUBNAM6= <"">
##$SUBNAM7= <"">
##$SUBNAM8= <"">
##$SUBNAM9= <"">
##$SW= 18.0517283424941
##$SWIBOX= (0..15)
0 0 2 0 0 0 0 0 0 0 0 0 0 0 0 0 
##$SW_h= 3612.71676300578
##$TD= 16384
##$TD0= 1
##$TE= 0
##$TE2= 300
##$TE3= 300
##$TEG= 300
##$TL= (0..7)
0 120 120 120 120 120 120 120 
##$TP= (0..7)
150 150 150 150 150 150 150 150 
##$TP07= 0
##$TPNAME0= <>
##$TPNAME1= <>
##$TPNAME2= <>
##$TPNAME3= <>
##$TPNAME4= <>
##$TPNAME5= <>
##$TPNAME6= <>
##$TPNAME7= <>
##$TPOAL= (0..7)
0.5 0.5 0.5 0.5 0.5 0.5 0.5 0.5 
##$TPOFFS= (0..7)
0 0 0 0 0 0 0 0 
##$TUNHIN= 0
##$TUNHOUT= 0
##$TUNXOUT= 0
##$USERA1= <user>
##$USERA2= <user>
##$USERA3= <user>
##$USERA4= <user>
##$USERA5= <user>
##$V9= 5
##$VALIST= <valist>
##$VCLIST= <CCCCCCCCCCCCCCC>
##$VD= 0
##$VDLIST= <DDDDDDDDDDDDDDD>
##$VPLIST= <PPPPPPPPPPPPPPP>
##$VTLIST= <TTTTTTTTTTTTTTT>
##$WBST= 1024
##$WBSW= 4
##$XGAIN= (0..3)
0 0 0 0 
##$XL= 0
##$YL= 0
##$YMAX_a= 1962595
##$YMIN_a= -1456368
##$ZGOPTNS= <>
##$ZL1= 120
##$ZL2= 120
##$ZL3= 120
##$ZL4= 120
##$ABSF1= 10
##$ABSF2= 0
##$ABSG= 5
##$ABSL= 3
##$ALPHA= 0
##$AQORDER= 0
##$ASSFAC= 0
##$ASSFACI= 0
##$ASSFACX= 0
##$ASSWID= 0
##$AUNMP= <proc_1d>
##$AZFE= 0.1
##$AZFW= 0.1
##$BCFW= 1
##$BC_mod= 2
##$BYTORDP= 1
##$COROFFS= 0
##$CY= 11.3945322036743
##$DATMOD= 1
##$DC= 2
##$DFILT= <>
##$DTYPP= 0
##$F1P= 2.36226072786647
##$F2P= -0.459571619588291
##$FCOR= 0.5
##$FTSIZE= 0
##$FT_mod= 4
##$GAMMA= 1
##$GB= 0.15
##$INTBC= 1
##$INTSCL= 1
##$ISEN= 128
##$LB= 0.24
##$LEV0= 0
##$LPBIN= 0
##$MAXI= 10000
##$MC2= 0
##$MEAN= 0
##$ME_mod= 0
##$MI= 1.114404
##$NCOEF= 0
##$NC_proc= 0
##$NLEV= 6
##$NOISF1= 3.799351
##$NOISF2= 2.8
##$NSP= 1
##$NTH_PI= 0
##$NZP= 0
##$OFFSET= 15.70392
##$PC= 1
##$PHC0= -18040.42
##$PHC1= 19.20069
##$PH_mod= 1
##$PKNL= yes
##$PPARMOD= 0
##$PSCAL= 0
##$PSIGN= 0
##$REVERSE= no
##$SF= 200.130013532006
##$SI= 16384
##$SIGF1= 3
##$SIGF2= 2
##$SINO= 400
##$SIOLD= 16384
##$SREGLST= <1H.CDCl3>
##$SSB= 0
##$STSI= 0
##$STSR= 0
##$SW_p= 3612.71676300578
##$SYMM= 0
##$S_DEV= 0
##$TDeff= 0
##$TDoff= 0
##$TI= <>
##$TILT= no
##$TM1= 0
##$TM2= 0
##$TOPLEV= 0
##$USERP1= <user>
##$USERP2= <user>
##$USERP3= <user>
##$USERP4= <user>
##$USERP5= <user>
##$WDW= 1
##$XDIM= 8192
##$YMAX_p= 0
##$YMIN_p= 0
$$ End of Bruker specific parameters
$$ ---------------------------------
##NTUPLES= NMR FID
##VAR_NAME=  TIME,          FID/REAL,        FID/IMAG
##SYMBOL=    X,             R,               I
##VAR_TYPE=  INDEPENDENT,   DEPENDENT,       DEPENDENT
##VAR_FORM=  AFFN,          ASDF,            ASDF
##VAR_DIM=   8192,          8192,            8192
##UNITS=     SECONDS,       ARBITRARY UNITS, ARBITRARY UNITS
##FACTOR=    0.0002768,     1,               1
##FIRST=     0,             0,               0
##LAST=      2.2672688,     0,               0
##MIN=       0,             -1456368,        0
##MAX=       2.2672688,     1962595,         0
$$ Real data points
##PAGE= N=1
##DATA TABLE= (X++(R..R)), XYDATA
$$ [...]
2666A432j248m29L151j258j978J101O23k288r15Q34L5q37K532P77j890J287J225
2683B154j685J97O2j670j328K004p78j468L030J233q99L36Q81p71j276l42L53
2700C3k425P78N70k74R11J196O85p51Q03J274k289l04k56j955p77J355J422j917
2718a921K086J366L66O51r95p24q05L23j596k043J225J817j697K960M83k58K27
2735A465J045j851M4o30j260n24p01J173m18J253J842R6n10J878q19k242L21j35
2753B7j297j175J098O28p17J541J267j015J986j048p93j340j29m70q33L29J501
2770d40j410J458J800R79j328J44J93j448m80k37j908l2J653P22r4J382O80r03
2788G31P01L21j720k130J603r72o98Q95J161o90O60J820m87j45K99p01j580j90
$$ plain form
2666 1432 184 -245 2906 1648 -330 771 1394 -894 -1809 -975 -940 -1777 755 1532 -358 929 2154
2683 2154 469 666 728 -942 -2270 -266 -1044 -2512 518 1751 852 1188 2069 1298 22 -320 33
2700 33 -2392 -1614 -1044 -1318 -407 789 1474 723 1526 2800 511 207 -49 -2004 -2781 -1426 -4 -1921
2718 -1921 165 1531 1897 2548 1553 829 24 347 -1249 -3292 -2067 -250 -1947 1013 1496 1238 1465
2735 1465 2510 659 703 73 -1187 -1711 -2412 -1239 -1657 -404 1438 1534 1024 2902 2083 -159 162 27
2753 27 -1270 -2445 -1347 -719 -1436 105 1372 357 2343 1295 502 -838 -967 -1437 -2270 -1941 -440
2770 -440 -1850 -392 1408 2387 1059 1203 1396 -52 -532 -769 -2677 -2709 -1056 -334 -428 954 1634 731
2788 731 1432 1753 33 -2097 -494 -1466 -2164 -1269 -108 -798 -138 1682 1195 1050 1349 648 -932 -1122
2806a122R01k292J223P00N08N77L65J238o99L88l94k429j86n58M02N4j16N23R08
2825iJ697J90o86P34o14k645j081M83K1k93R62Q65R9J846MK18p61N96j001r96
2845c71o36k54r98R44J524k61M93J323O24k020j7M84j174p17r15O65n20J134O68
2864b4N21J35J067l23r9K11j368k215J371r31j065J495R95K79O80N38K8o41o81
2883b7o33o69m91J783j764l31J732Q91m72J960M38j521j112R82k225j276K564
2900a71j916R63J46K431r03P51J588j764j519J118j236j126o68J495j560J546
2916h25R63J207r42J921O0j857l68O29j737r24j31O70N16N04J903l77Q05J80j124
2935A073n01Q24j532k326P60N96J24L61O60J167M97o41m21j46j422N47j741J004
$$ plain form
2806 -1122 -221 -2513 -1290 -590 -82 495 860 2098 1399 1787 1393 -1036 -1222 -1780 -1378 -1324 -1440 -917 -9
2825 -9 1688 1878 1192 1926 1312 -1333 -2414 -1931 -1910 -2203 -1241 -376 -277 1569 1573 1791 1030 1626 625 -371
2845 -371 -1007 -1261 -2259 -1315 209 -52 441 1764 2388 368 351 835 -339 -1056 -1971 -1306 -1826 -692 -24
2864 -24 497 632 1699 1376 1277 1488 120 -2095 -724 -1655 -2720 -1225 -230 49 729 1267 1295 654 -27
2883 -27 -660 -1329 -1820 -37 -1801 -2132 -400 491 19 1979 2417 896 -216 766 -1459 -2735 -171
2900 -171 -2087 -1124 -978 1453 550 1301 2889 1125 -394 724 -512 -1638 -2306 -811 -2371 -825
2916 -825 138 1345 403 2324 2384 527 159 788 -949 -1873 -2004 -1334 -818 -314 1589 1212 2017 2197 1073
2935 1073 572 1396 -136 -2462 -1702 -1106 -982 -621 39 1206 1703 1062 641 495 -927 -380 -2121 -1117
2953a117m98R13K62M97J061J50N47j38l98n34j581r53J01M68J81M49J014J066
2971A490l34L02J000k688L53q67j87k041J806Q05j32n7J596R13l18O14j220m63
2989E72r24m34j894J393j34J053l11J661N63J7j298J54n76j506l75J084k450K577
3007h28n56P00J533J074l3p55J277j556k020O24q47m23L68J493r8o70K795P84
3025B862j509Q7K63j684p87j061K51o27J416O96j47J722O18J03r28L00j651o58
3043g34j011R29q52LJ017O63J259P81j52n49r7j819J4p76j73p58K69J766K93n00
3063d27K328J19r31J0p88o43j501j33K04K5K83R43J574L53L05K17j437n13M5p92
3083g59j52j401P87K08J434R45L44o2J173j661q1j152j024m05R21j836J513J012
$$ plain form
2953 -1117 -1615 -702 -440 57 1118 1268 1815 1677 1279 745 -836 -1789 -1688 -1220 -1039 -590 424 1490
2971 1490 1156 1458 2458 -230 123 -744 -931 -2972 -1166 -361 -493 -550 1046 1959 1641 2255 1035 572
2989 572 -352 -786 -2680 -1287 -1421 -368 -679 982 1545 1562 264 418 -158 -1664 -2039 -955 -3405 -828
3007 -828 -1384 -684 849 1923 1890 1135 2412 856 -1164 -540 -1387 -1810 -1442 51 -47 -717 2078 2862
3025 2862 1353 1440 1703 19 -768 -1829 -1578 -2205 -789 -93 -240 1482 2100 2203 1275 1575 -76 -734
3043 -734 -1745 -816 -1668 -1665 -648 15 1274 2055 1903 1354 1257 -562 -548 -1324 -1497 -2255 -1986 -220 73 -427
3063 -427 1901 2020 1089 1099 311 -332 -1833 -1966 -1762 -1737 -1454 -511 1063 1416 1721 1938 501 -12 33 -759
3083 -759 -911 -2312 -1525 -1317 117 1062 1406 1344 2517 856 775 -377 -1401 -1806 -885 -2721 -1208 -196
3101a96J252k6o8J084p49j457N41l14k121P64J15r38R65J712l16J549J12j21j362
3120D26p78J92j273m96P27l81j07K743L04j70M36Q3n61j261M47j349j374N90N02
3139a300k06J134K165r78p2R89n61j577p34J130j210q78L24J44O25J906O67q16
3157G52J295k38k220P6n8j384n24R94J462q69O56J183n70K38N71n91j734J145
3175A84n89j783J808K96j148P77J900J25n72Q34l06j538m29p6p82j011J827N02
3193A9n05J805Q06p45L1j76j845j324J687k242L47J601l13L7J966J401j461n85
3211E04R75j019j664J19O90j213K80M91M90J069J329n55r19P24j050j484K96P1
3229h66r53l05K422k90k52J079J129q54l63R48k257n26R47j429p59J268J922j112
$$ plain form
3101 -196 1056 1030 962 2046 1297 -160 381 67 -2054 -1290 -1175 -2113 -1148 564 248 1797 1909 1788 426
3120 426 -352 -160 -1433 -1929 -1202 -1583 -1690 1053 1357 1187 1623 1706 1145 -116 331 -1018 -2392 -1802 -1300
3139 -1300 -1506 -372 1793 815 743 1732 1171 -406 -1140 -10 -1220 -2098 -1774 -1630 -1005 901 1568 752
3157 752 2047 1809 -411 -335 -393 -1777 -2301 -1307 155 -714 -58 1125 555 793 1364 773 -961 184
3175 184 -405 -2188 -380 -84 -1232 -455 1445 1570 998 1832 1526 -12 -441 -517 -1299 -2310 -483 19
3193 19 -486 1319 2125 1380 1411 1235 -610 -1934 -247 -2489 -2142 -541 -854 -817 1149 2550 1089 504
3211 504 1479 460 -1204 -1085 -395 -1608 -1328 -837 -347 722 2051 1496 577 1301 251 -1233 -937 -866
3229 -866 -1819 -2124 298 8 -244 835 1964 1110 747 1695 -562 -1088 -141 -1570 -2329 -1061 861 -251
3247b51J642O20j143l49J64l16j243j148N51o11Q89J161m49Q17J233J41o12o07
3265D89N19j293j696R66J75k29k70J792L39L95P4R49k085K07m70j126O4K73j839
3284b766K180N42J560L4N35K42j575O09m31j686j119j4R09p34J486R42K04O32
3302A550J95j123o93L07r33j381J267l60O7P50M99M31J044m18k54o88j49m32j700
3321b021N08L55k74j75K342O2k71R34n24p02k29n3j609o86J614r92J28K108J100
3340A615j525K696j113p26j473N28n58j637K353o99q26Q82K347j580l24K017o15
3357A362o31n22l51j331l86J109k94N20J649M10o66l24J201j214m62L01k208j43
3375a980J155q95K03J934N27j17Q13o6q12j275L37j011j114J404j11K34N63J140
$$ plain form
3247 -251 1391 2011 868 519 683 367 -876 -2024 -1473 -2084 -1195 -34 -483 334 1567 1708 1096 489
3265 489 1008 -285 -1981 -1015 -840 -1069 -1339 453 792 1187 1261 2210 125 332 -138 -1264 -1200 -927 -2766
3284 -2766 -586 -44 1516 1550 2085 2327 752 1361 930 -756 -1875 -1889 -980 -1714 -228 714 918 1550
3302 1550 1745 622 -71 236 -697 -2078 -811 -1171 -1104 -354 145 576 1620 1202 948 260 111 -321 -2021
3321 -2021 -1513 -1158 -1432 -1607 735 797 526 1460 936 234 5 -48 -1657 -2343 -729 -1721 -1593 515 1615
3340 1615 90 2786 1673 947 -526 2 -556 -2193 160 -539 -1365 -483 1864 284 -40 1977 1362
3357 1362 731 209 -142 -1473 -1859 -750 -1044 -524 1125 1535 869 545 1746 532 70 371 -1837 -1980
3375 -1980 -825 -1720 -1517 417 944 827 1640 1574 762 -513 -176 -1187 -2301 -897 -1008 -774 -211 929
3393I29K84l10J62N97j663O16q18k058K15J794l98J440m69Q86j78q5j58p18m5
3412B3q85j470N51Q96Oj63K721K63r66%O90j435j393Q47p03m07l3J660j107R83
3432G8J087N23m87J42q5k042l58Q3r17R37L50J915j556J867L60j757J028l11j042
3451a85j75P55k637K55J448N26J64O47R22n00r23Q37n48o83p9o47l84K74O19R34
3471F20o74J143L26j32k43o73j305p77J049l41N23R69L01k78Q53j15o60j32R22
3490A376j019k161P47O98r92R55J478k00p88J484O30j637M94J7k843J045K74p3
3508e15l26J413l23P33N86j191k09m05j06j364Q14K63m44k85K10K235q20P68O81
3527A715o21j838O52j454o23N06M47k22P24J847j312O54J037p76j527J386r88
$$ plain form
3393 929 1213 903 1065 1662 -1 615 -203 -2261 -2046 -252 -650 790 321 1207 1029 944 786 68 23
3412 23 -862 -2332 -1781 -885 -879 -1042 1679 1942 976 976 1666 231 -1162 -315 -1018 -1425 -1458 202 -905 78
3432 78 1165 1688 1201 1343 1258 -784 -1142 -1059 -1976 -1039 -689 1226 -330 1537 1897 140 1168 857 -185
3451 -185 -360 395 -2242 -1987 -539 -13 151 798 1720 1220 297 1134 586 -97 -176 -823 -1207 -933 -314 620
3471 620 -54 1089 1415 1283 1040 367 -938 -1715 -666 -1007 -484 485 786 508 1361 1246 586 454 1376
3490 1376 357 -1804 -1057 -359 -1351 -396 1082 882 94 1578 2208 571 1065 1082 -1761 -716 -442 -515
3508 -515 -841 572 249 982 1568 377 168 -237 -343 -1707 -893 -630 -1074 -1359 -1149 1086 266 1034 1715
3527 1715 1094 -744 -92 -1546 -2169 -1663 -1216 -1438 -714 1133 -179 475 1512 736 -791 595 -393
3544c93j050NP43o28J168J031r2K78O04n02m27m04r3j428l16K89M38J59N25P47
3564F54k02k08PM16j503J918j818l53J85P76m36J090Q12j54n67K69M09q17q33
3583c55n6q66j42M53O83j302L317n48L9j23M26j564j38K72j156l99R51N73j097
3602a032N35J853J17o71R82j250q92j19J044j931P37N94n54q1K007J3o27K73l19
3621F79j606N46j33n9m67Q56M2r79K414L7j033K23Q12r85j221J38K1k10J22J002
3641A99l26j5Q24O77j009O04K92j648n71Q10p32m83Q68N43j62J332L56n95l38
3660F26N0l85j150P62j690M55R25M64k40J431m17k66L51m24p93j084J017l47M02
3679c13k22p1K50P58Q56p91J25J4n54q5n84m30M66q39Q01O11J9O52M57j134J57
$$ plain form
3544 -393 -1443 -1438 -695 -1323 -155 876 784 1062 1666 1164 737 333 240 -1188 -1504 -1215 -777 -618 -93 654
3564 654 452 244 251 667 -836 1082 -736 -1089 -904 -128 -564 526 1338 1184 617 886 1295 478 -355
3583 -355 -411 -1277 -1419 -966 -283 -1585 1732 1184 1223 1100 1526 -38 -176 96 -1060 -1459 -508 65 -1032
3602 -1032 -497 1356 1473 802 1784 534 -358 -477 567 -1364 -627 -33 -587 -668 1339 1352 725 998 679
3621 679 -927 -381 -514 -573 -1040 -184 -142 -1121 1293 1330 297 520 1332 347 -874 -736 -715 -925 -803 199
3641 199 -127 -142 682 1359 350 954 1246 -402 -973 -163 -895 -1378 -510 33 -129 1203 1559 964 626
3660 626 676 291 -859 -97 -1787 -1332 -407 57 -183 1248 831 565 916 492 -301 -1385 -368 -715 -313
3679 -313 -535 -606 -356 402 1258 467 592 606 52 -33 -617 -1047 -581 -1420 -619 -8 11 663 1120 -14 143
3700A43L01p51l09k34K91n28M94O61o55J340J00k96k33L74o01r53J74P07j41o8
3720a84J37K48P43l53J5k20m62n53m02O36j17p92O44R20L71o54N88P94j92j041
3740A26N00m84j750Q20M18l41N75L90n65J533K20k06j010l43K08j573K86Q25j065
3759a436J469J130p51m42K20R01l91q85m71p79n1k27J905r12J410n36L14k44Q16
3778A040j57q78L17o72o30M78q14P60K29L99R24m71L68K05o65n62m82n38M13r6
3798h32l62J015K89J50K58j24O95j120M67m22L27n80L52j75r56R17J252n42J35
3817G44J536l151J269R57j955n46M63k9M67l24K555j533p09J915p77r01k91l96
3835g06L50j11K56K26K0O87K37k51q28L42n08j314J713o82j29N97j16J07k8Q51
$$ plain form
3700 143 444 -307 -616 -850 -559 -1087 -593 68 -587 753 853 557 324 698 97 -856 -682 25 -116 -184
3720 -184 -47 201 944 591 606 386 -76 -629 -1031 -395 -512 -1304 -660 260 631 -23 565 1359 1167 126
3740 126 626 142 -1608 -788 -370 -711 -136 254 -311 1222 1442 1236 226 -117 91 -1482 -1196 -371 -1436
3759 -1436 33 1163 412 -30 190 1091 700 -185 -656 -1435 -1486 -1713 192 -720 690 154 468 224 1040
3778 1040 883 5 322 -350 -980 -502 -1316 -556 -327 72 996 525 893 1098 433 -129 -611 -1149 -736 -832
3798 -832 -1194 -179 110 260 518 394 1089 -31 436 14 341 -239 113 -62 -1018 -101 1151 609 744
3817 744 2280 -871 398 1355 -600 -1146 -683 -712 -245 -569 1986 453 -256 1659 882 -19 -310 -706
3835 -706 -356 -467 -211 15 35 722 959 708 -120 222 -286 -1600 113 -569 -698 -101 -217 -110 -138 713
3855G13J76m02J05j02j352j99M57j25o23J179J25k98J406o73L7Rl18n26M34m70
3875d47j186N25o00J206k81J282J634j402j209P72j45n62m98L37N48n05N87L68
3893D24p08K256j932J034l68k71j116J39P40j020L78M65n92J543J78p51J076j10
3911A365j374m74N85m90j89k7J6J595j688N63J07M55l0k20J64j183L57J166j648
3930i50N08O74n0R39k49k68J25m12l24j9j292N52N49k41R96r2j053J641n66q44
3950c76O59Q1p28M65l93O0o9J67J679j267k64J255j502N62k73k13m44L8p10M39
3970h34Q70Q47j032M70p4k27l44L42K80l55R7j36m90Q71N26n79n48R69N21j369
3990a95j002J166J90m04j093J038j66O25J158q72OP94j034J11k77m24M58j006
$$ plain form
3855 713 889 487 592 490 -862 -1061 -604 -729 -1352 -173 -48 -346 1060 387 424 433 115 -411 23 -447
3875 -447 -1633 -1108 -1708 -502 -783 499 2133 731 -478 294 149 -413 -911 -574 -26 -531 56 424
3893 424 -284 1972 40 1074 706 435 -681 -542 198 -822 -444 21 -571 972 1150 399 1475 1365
3911 1365 -9 -483 102 -388 -577 -604 -588 1007 -681 -118 -11 444 414 194 358 -825 -468 698 -950
3930 -950 -442 232 182 1121 872 604 729 317 -7 -26 -1318 -766 -217 -458 538 446 -607 1034 468 -376
3950 -376 283 364 -364 101 -292 -232 -301 -134 1545 278 14 1269 -233 329 56 -157 -601 -563 -1273 -834
3970 -834 36 883 -149 321 247 20 -324 18 298 -57 40 -96 -586 285 811 232 -316 653 1174 -195
3990 -195 -1197 -31 159 -245 -1338 -300 -466 159 1317 445 451 1245 211 322 45 -379 79 -927
4008i27K12L21O02q5N82m76K80J3j027O33L08k46M03j441J55O50o3J417j090O12
4028H33n54J61n42P37j001o58O85M05o10J431r89q38J171J500r43j545J041l67
4046h3m04Q38J67o63PK97O52r35R15m07p55p5K1L4q18R17m40J004p32J423n13
4067D50n95P38o30Q3j109N29J07j49R53p05P18j37L88q04L62q63R4O98l17K83
4087I4r23J193p78N98OJ5r7N77o59r89M96n42l83O31J340j26K07n01J37M76j45
4108F27P38j035j349J58L05N63n44J269k92m56J416m35q44R59l64r83j44n6Q01
4127C34l30Q60j231l2k88M44K47L36L96p85j305Q45q36M53l86R82M60n53K564
4146B175k916J084Q23l34j234M98j5j38r2k52nN18J068j646R10m59j00k03n53
$$ plain form
4008 -927 -715 -394 208 123 705 229 509 522 -505 128 436 190 593 -848 -693 -43 -106 1311 221 833
4028 833 279 440 -102 635 -366 -1024 -339 66 -544 887 -102 -940 231 1731 788 -757 284 -83
4046 -83 -487 351 518 -145 -138 159 811 -124 791 384 -371 -446 -425 -391 -1209 -292 -732 272 -460 963 450
4067 450 -145 593 -37 46 -1063 -534 -427 -576 377 -328 390 253 641 -163 199 -664 -570 128 -189 94
4087 94 -829 364 -414 184 190 205 108 685 26 -963 -467 -1009 -1392 -761 579 453 660 159 296 772 627
4108 627 1365 330 -1019 -861 -556 7 -537 732 440 -16 1400 965 121 1080 716 -267 -411 -467 334
4127 334 4 864 -367 -399 -687 -243 4 340 736 -49 -1354 -509 -1345 -892 -1278 -296 164 -389 2175
4146 2175 -741 343 1166 832 -402 96 81 -57 -149 -401 -406 112 1180 -466 444 -15 -115 -318 -871
4165h71J155k17j40l02N63J27j46K66j94M99p17P40j233J95n50J96N76P51j55
4184E43m2O20r89l0J07J195k296R78p29m5l10J345M33J50m81k49j48r80R97n61
4204d92n90O88M37m41M30J42O53j84n91J18J63j015N53l84O2L63k30j99P77n30
4224b70R54K39j689J254p50J025j712L23R33M0pM40j003k73J212N5j058P73m66
4243B0k90O72N0q08M16jO56n27O62j337O63l70K76K4n0m22J62p4P72Q44p11k12
4265D15j89k27r0M45j260J172m99N9k48J70N05q1k72J137o29n72j91L18o16J421
4285G68j217P10m29k88Q74k13j5P22l06j027j6QJ17j45P88k11J95j61m73Q51j75
4306C57k47j544J377m04k53J505j138K93L48k05P85p94k35R23j68j114m73N14
$$ plain form
4165 -871 284 67 -73 -375 188 315 169 435 241 740 23 763 -470 -275 -825 -629 -53 698 543
4184 543 501 1121 132 102 209 1404 -892 86 -643 -688 -998 347 780 930 449 200 52 -928 69 -492
4204 -492 -1082 -394 43 -398 32 174 827 643 52 170 333 -682 -129 -513 -451 -88 -318 -517 260 -270
4224 -270 684 923 -766 488 -262 763 -949 -626 307 347 340 780 -223 -496 716 771 -287 486 20
4243 20 -270 402 452 -356 60 59 715 188 850 -487 176 -194 82 106 56 -366 -204 -278 494 1338 627 415
4265 415 226 -1 -91 354 -906 266 -233 -174 -422 -252 253 172 -100 1037 408 -164 -355 -37 -653 768
4285 768 -449 261 -168 -456 418 205 190 912 606 -421 -437 -429 -312 -457 331 120 315 154 -319 532 357
4306 357 110 -1434 -57 -461 -714 791 -347 -54 294 89 874 80 -155 768 600 -514 -987 -473
4324d73p8l17O66MJ036j679L44R02J43L37k98l03n24K21o43J012j83q87R04j34
4344E0j42k04j245J423l34m73J083N4o07Q27r35Q62L82o63j66P35j296R45p96
4363e00L22j16L74q2J37K00P5K36o98L60k28O31j521M59P3m00Q40p95J535m24
4383D78kk02n89K9J311j030o1K88j271J526m59M0L20K58p62J66m8J65k66Q84k000
4404a225J412O50L98j269N94j240Q39J46q27P81m32M20p2j157N13O43j030N04
4422c52L97M18m69l09J368j008P74K9j104R2N34r3n70p84J433m09N95p96N99P83
4442A128o46l98k54j2P36m13j60o77L23N70m76K76o8J077j035m39J443j136J457
4461A296r88J4n45P63l59L41r44N49J6M73q16L85j154J775r14K24N2P94l16q28
$$ plain form
4324 -473 -551 -868 -202 -198 838 -841 -497 405 548 885 587 284 -240 -19 -662 350 167 -720 184 50
4344 50 -92 -296 -1541 -118 -452 -925 158 212 -395 432 -503 359 741 78 -88 647 -649 296 -500
4363 -500 -178 -294 80 -2 135 335 410 646 -52 308 80 711 -810 -351 -278 -678 162 -633 902 478
4383 478 476 274 -315 -286 1025 -5 -66 222 -1049 477 18 58 378 636 -126 40 -8 157 -109 775 -1225
4404 -1225 187 837 1235 -34 560 -680 159 305 -522 259 -173 247 175 -982 -469 174 -856 -352
4422 -352 45 463 -6 -315 1053 45 819 848 -256 -164 370 277 -293 -1077 356 -53 542 -254 345 1128
4442 1128 482 84 -170 -182 554 141 -19 -696 -373 197 -279 -3 -71 1006 -29 -468 975 -161 1296
4461 1296 308 322 -223 540 181 522 -422 127 143 616 -200 185 -969 806 -108 116 168 962 646 -182
4481a82N50p43l6K86J81m72K47k03Q6P10j808J059q26K215k140R59j36k86J49
4500c90q4L11Q6n09J41j10K19O07m74j01M57j64o51J54l86J532m19m61K53K2p40
4521g07l49J559J06q34J02L2N97J00j552J271l12k45K52L93k15l68J272q45M51
4540G08j062o39J335k22k8l81o3O22K7j40n4L19j61l10K9M82k19O96r43P42l19
4561D19r20K74Q78k36p21J84L90k50l45J046j669J531N33n91j452J050J24q23
4579e78J235p73P26j081P65M69o08M78o71n9j87R05q05l57o4R53N03p72J59K94
4599E32l35L18m35N1P1L99Q0j607J188r42J433o90k64L92m78j8M93r93J57L68
4619b80LP32l63k26k27K87o27J257r98J133m97l5K31o00m5Q34m23l83m59p5Q83
$$ plain form
4481 -182 368 -375 -411 -125 56 -416 -169 -372 -286 424 -1384 -325 -1151 1064 -1076 -117 -253 -539 -390
4500 -390 -474 -163 -77 -586 -445 -555 -336 271 -203 -304 153 -11 -662 -508 -894 638 219 -242 11 33 -707
4521 -707 -1056 503 609 -225 -123 -91 506 606 -946 325 13 -232 20 413 198 -170 1102 257 708
4540 708 -354 -993 342 120 92 -289 -352 270 297 157 103 422 261 -49 -20 462 243 939 -4 738 419
4561 419 -501 -227 651 415 -306 -122 268 18 -327 719 -950 581 1114 523 -929 121 245 -578
4579 -578 657 -116 610 -471 294 763 155 633 -38 -97 -284 621 -184 -541 -605 348 851 79 238 532
4599 532 197 515 80 131 202 601 681 -926 262 -680 753 63 -201 191 -287 -305 188 -805 -648 -280
4619 -280 -277 455 92 -134 -361 -74 -701 556 -442 691 194 159 390 -210 -255 579 156 -227 -686 -761 122
4640A22m5O80j566Q78Q05n61k43o54J89J90O66J12q09Q05m29N10n19o58N85o23
4660e65J76J040o62l57R00j038J00J96R0j30R96j147N27j70l84k35N70p00J630
4679H37j284j35Q24M79j121R74j176M4N65m25p73J078j30N4j87R23k4j132M20
4698a89q83K64J499j007o04R13O87k17j332J577K3o67K69P83j659q0J319k42r58
4717e04O90m31M60m67L56P61q29L11p72J48L31M44Kk26k71q07Q27M77p14J020
4737H06j567Q05l71L38R22m95l00Q71p80m78J159l16l12k9r80N11n90J177L62
4756G33n29M87n37J21n10J194j074Q88j178Q77o72R07r54k13K21l17R2M78Q63
4775H77m48o75K13R03j076J58K12j73L1M47l56p76N87m90j42J670j062N3P42q2
$$ plain form
4640 122 77 757 -809 69 874 313 70 -584 -395 -205 461 573 -236 569 140 650 131 -527 58 -565
4660 -565 -389 651 -11 -368 532 -506 -406 -210 -120 -250 746 -401 126 -44 -428 -663 -93 -793 837
4679 837 -447 -582 242 721 -400 574 -602 -558 7 -418 -1191 -113 -243 -189 -376 547 523 -609 -189
4698 -189 -1072 -808 691 -316 -920 -7 680 463 -869 708 731 64 333 1116 -543 -623 696 454 -504
4717 -504 186 -245 215 -252 104 865 36 347 -425 -277 54 498 500 274 3 -804 23 500 -214 806
4737 806 -761 44 -327 11 933 438 138 1009 229 -249 910 594 282 253 -727 -216 -806 371 733
4756 733 204 691 154 275 -235 959 -115 773 -405 472 -200 707 -247 -460 -239 -556 -464 14 877
4775 877 429 -246 -33 870 -206 -48 164 -9 22 469 113 -663 -76 -566 -708 962 -100 -47 695 613
4795F13o62L06q4L4o96N06K1m86n60J058j22m52r3K22O8M20N85o19l9j80m53J759
4817A146j396J75m85J019r84k7K8J417j34p18p46Q05P37q25l64J82k43l75O81
4836a07j28J41N41P06k275M05J052o66o7P70j370P67J73Q26j286J123j18l88j9
4855H0M26K60o79k26%M66k69m47R15q80p24Q52j86K42k74O49m43N96P1K8j129
4876f72K35J22J344j087k46K92o11J443q50J07n87R4Q58P2k83L31p75P4N35p88
4896c92L47j002J506m18K45m27J69N42q28M35L69j177L78m25O8P63l12J07M36
4915C84K6n86p73J041M10o38m29O04q6K34j34P00r48O28L28m5q75j08m71J456
4935G18j149q93O48J25J5l27J449o58M88o28R86n0k68K10N81j138O5m68n5O26
$$ plain form
4795 613 -49 257 173 207 -489 17 38 -448 -1008 50 -72 -524 -617 -395 -327 93 678 59 20 -160 -613 1146
4817 1146 -250 -75 -560 459 -525 -552 -524 893 759 41 -705 100 837 12 -352 -170 -413 -788 -107
4836 -107 -235 -94 447 1153 -1122 -717 335 -331 -398 372 -998 -231 -58 768 -518 605 487 99 80
4855 80 506 766 87 -139 -139 327 58 -389 526 -354 -1078 -226 -412 -170 -444 205 -238 358 429 457 -672
4876 -672 -437 -315 1029 -58 -304 -12 -623 820 -30 77 -510 -416 442 514 231 562 -213 -139 396 -392
4896 -392 -45 -1047 459 41 286 -141 28 570 -258 177 546 -631 -253 -678 -610 153 -159 -52 384
4915 384 410 -176 -949 92 502 -136 -565 39 -47 187 53 753 -195 433 761 716 -159 -267 -738 718
4935 718 -431 -1324 -676 -551 -536 -863 586 -72 416 -212 774 724 456 666 1247 109 174 -294 -349 277
4955B77J07N36o99k01l25Q24n86l27m0M56p4Q46j055Nm32J160q03J389m36M7r18
4976b49K27L05M49j36r64K65K28m37o58Q64L46j33k63P8q3l14Q43l50L54r06R06
4997C72K76r56P4K08k72l12J062j016N46L32k24q97J237o88O56o9k35P5j085P11
5017b05N74m08Q09r53O37j169O92L22j020Q12j05j11q54O70M0L14j059K99J134
5036D19j103J164l54L77r72O2L59M7K54l2N78p70K84K46q89L33R55k65o28m29
5056c64j64J252m27N69%j532K34M78o41N65J20M80j440J315l31M50j355J033N53
5075G95p8k01k74o68L49K53n34j22o4Q53O16j806J006K2K52l76J154j557Q47j9
5095D48q39K18K96j318R20P2J380j143Q07K24j634P09o64L72n04L30M91R43j103
$$ plain form
4955 277 384 920 221 20 -305 519 -67 -394 -434 22 -52 794 -261 -256 -688 472 -331 1058 622 669 -249
4976 -249 -22 283 732 596 -368 -103 125 -312 -970 -106 240 107 -156 -78 -161 -475 368 18 372 -534 372
4997 372 648 -308 -234 -26 -298 -610 452 -564 -18 314 90 -807 430 -258 398 329 94 169 -916 -205
5017 -205 369 -39 770 -183 454 -715 -23 299 -721 91 -14 -125 -979 -309 -269 45 -1014 -715 419
5036 419 -684 480 126 503 -469 -407 -48 -1 253 221 799 29 313 559 -330 3 958 693 65 -364
5056 -364 -528 724 297 866 866 -666 -432 46 -595 -30 90 570 -870 445 114 564 -791 242 795
5075 795 717 516 242 -426 -77 176 -358 -480 -544 309 925 -881 125 147 399 23 1177 -380 467 448
5095 448 -391 -173 123 -1195 -275 -203 1177 34 841 1065 -569 140 -524 -152 -656 -326 165 1108 5
5114ENJ58P64M75j537N52k45j22j56L86nn72J451l32n67k39l96K84j47k6N7n9
5136b66m0n25R04J87n08J149j199R41m72N93j311Q8m45R74J54J42N74j007J36
5155F9J07r43J083j92j40L62m35k57J75K21l46p63J790n84L26j203Q5K29m19P04
5175a31k42J63M84j5n25j70Q46o82p5N52l98N4j03j39J160o46J37L18J96m89j49
5196A46M48n13K50j049N96J50J63p29M17M0K20j08O61j723K056l20l27n97k16
5215d35r2J446p21K04K16l98m74O1L05Q7l77N02L91o23o46K12L18N49p54Q7n29
5236f71P38M34l08n75Q44p6o66Q03j034J051q52R7L84N73m26j405J267k8l49K31
5256C2p10O30P49J64j135O50J40P65l08q32P23k92L6q82k59R37K90o96n63M30
$$ plain form
5114 5 10 168 932 1407 -130 422 177 55 -101 285 280 -292 1159 827 260 21 -375 -91 -238 -264 -207 -266
5136 -266 -306 -831 73 260 -248 901 -298 643 171 764 -547 -459 -904 70 224 366 940 -67 69
5155 69 176 -767 316 124 -16 346 -89 -346 -171 50 -296 -1059 731 147 473 -730 -645 -416 -835 -131
5175 -131 -373 -210 274 259 -266 -436 410 -272 -347 205 -193 -139 -242 -381 779 133 270 588 784 295 146
5196 146 594 81 331 -718 -122 28 191 -538 -121 -81 139 31 692 -1031 1025 705 378 -219 -435
5215 -435 -527 919 198 402 618 220 -254 -193 112 199 -178 324 715 92 -554 -342 -24 525 -229 -142 -671
5236 -671 67 501 193 -382 462 386 -280 523 -511 540 -312 -215 169 742 316 -1089 178 150 -199 32
5256 32 -678 -48 701 865 -270 380 520 1285 977 145 868 576 612 -270 -529 408 698 2 -561 -131
5276a31K39n27l42O65L57l01j65l57N56j89L77L57J94j028K18m26o22R68l84J118
5296E77m31q7O29j355k1Q08Q4J2N32j180k52l57J008j04K61M40j105J382m80r63
5316f02J397j424J352m34l0p72J46N73K97j69l81J060j345K21N2o21J125o46M94
5335B93o96J071j501k27J785J84o51l86l17N30j41P06p15M22p58M89j82K48n01
5354c47J172q6j323J371j305R94n38P56k89j075R97j51j005P47K64P50j171k83
5372e22Q37k4k92j210R93J74L2n06R64m16n68P33n72K7J168r04L86l67m26R15
5392D22l57p1p0M74K8j159Q2J362r88M94q6M33r59P19n50L03m99R41l4K5o75j90
5414c55N79QJ30m49L05l44L66l16L78q04K00k70p3J063j110O47q4J23N33o81k52
$$ plain form
5276 -131 108 -419 -761 -96 261 -40 -205 -562 -6 -195 182 539 733 -295 -77 -503 -1125 -157 -541 577
5296 577 146 59 688 -667 -688 120 204 216 748 -432 -684 -1041 -33 -137 124 564 -541 841 361 -602
5316 -602 795 -629 723 289 259 -513 -367 206 503 334 -47 1013 -332 -111 -59 -680 445 -201 293
5335 293 -403 668 -833 -1060 725 909 258 -128 -445 85 -56 650 -65 357 -401 88 -94 154 -347
5354 -347 825 739 -584 787 -518 476 -62 694 405 -670 327 176 -829 -82 182 932 -239 -522
5372 -522 315 291 -1 -1211 -218 -44 -12 -518 446 30 -538 195 -377 -350 818 -86 300 -67 -493 422
5392 422 65 -6 -76 398 426 -733 -651 711 -277 217 131 564 -395 324 -226 77 -422 519 485 510 -165 -355
5414 -355 224 232 362 -87 218 -126 240 -76 302 -502 -302 -572 -645 418 -692 -45 -129 -6 527 -154 -406
5435d06O95l34q36R01K80p20P03J50k18j70l06o42R33L14nr13J491j269O24N62
5455H34j208J683j017j93j63m16O04P6J32L11j046M62N12o30P9r25M67K55R15
5474G32j123M69M03l72j16o7j343R71L78L97p04Q64K00l13O93j063o85M55Q52
5493F28o70O85j50K51n92o70Q06j304K209j182p76r5K98J26j93J123k68K98j096
5512e72O72L86r55J207k78o18O38n74j26J214j214Q72j637R06k14k6O18M32r96
5531b65O81k18j110J004o12L31N24m29k06J002k347K331n25l13j98o11M33J692
5549A164l13q99L2q55M77m97O31M38K33K80p39l73L59p94O07l75K00L35L98p74
5569d65N88J40k92J209j643k71J843j648J057K54r74L46Q47j447K57o88J018k50
$$ plain form
5435 -406 289 -45 -881 20 300 -420 283 433 215 45 -261 -903 30 344 339 -574 917 -352 272 834
5455 834 -374 1309 292 99 -64 -480 124 200 332 643 -403 59 571 -59 20 -905 -438 -183 732
5474 732 -391 78 481 109 -7 -74 -1417 -446 -68 329 -375 489 689 376 1069 6 -679 -224 628
5493 628 -42 643 493 744 152 -518 288 -1016 1193 11 -765 -860 -562 -436 -629 494 226 524 -572
5512 -572 100 486 -469 738 460 -158 480 -94 -220 994 -220 652 -985 -79 -293 -319 299 731 -265
5531 -265 416 198 -912 92 -520 -189 335 -94 -300 702 -1645 686 161 -152 -350 -961 -528 1164
5549 1164 851 -48 -16 -871 -394 -891 -260 178 411 691 -48 -421 -62 -856 -249 -624 -424 -89 309 -465
5569 -465 123 263 -29 1180 -463 -734 1109 -539 518 772 -202 144 991 -456 -199 -887 131 -119
5587a19m77M70Q46j085L54n74Q12L49o61Q33o05q01J681p23q02K80o99J246j47
5606A78J40K86m95m93P25r33J573o91m65m32M93m78J08J126k72m10l05K70l85
5625d60j65R13m42l83R83j07p4o22l24J409k93Q11j322k90P09P55j164j93R04
5644F45q31M11Q28o52k23K21m75M57O25k72j269J370j371O47o76J280q68j86N
5663c34J72j96N41j55P37n01n09L63m36q05J432N2L59m61mp20N86m82J70k58Q63
5684D14K20o73O81l63L6L41n85o73K12p72K017j47q37m03L66m00Q08J71l54J44
5704B03P80j103J66k14l65J323n76n39P29J8j014M22m19O18l23R80r14k04K66
5723a66p95J501k76j10m00M58l39M88n40k95n47Q43J19Q77n39p05M30m87K24Q53
$$ plain form
5587 -119 -596 -126 720 -365 -11 -585 227 576 -85 748 143 -658 1023 300 -502 -222 -921 325 178
5606 178 318 604 109 -384 341 -592 981 290 -175 -607 -114 -592 -484 642 370 -40 -345 -75 -460
5625 -460 -625 288 -154 -537 446 339 265 -357 -681 728 435 1246 -76 -366 343 1098 -66 -259 645
5644 645 -186 225 1053 401 178 399 -76 381 1006 734 -535 835 -536 111 -565 715 -153 -339 -334
5663 -334 -162 -358 183 28 765 264 -245 118 -318 -1123 309 361 720 259 255 -465 121 -361 -191 -449 414
5684 414 634 -39 642 279 315 656 71 -602 -390 -1162 855 708 -129 -532 -166 -566 242 413 59 203
5704 203 983 -120 46 -168 -533 790 214 -325 404 422 -592 -170 -589 29 -294 686 -228 -432 -166
5723 -166 -961 540 264 154 -246 212 -127 361 -179 -474 -1021 -178 -59 818 279 -426 4 -483 -259 594
5743E94p54J12n63O56k52N06j80p01L34K88p05O70O83n7j436N55O54J36q81M9
5763b92K60L59l62o72J810n27j098K3P63l10kK19o46L52K46M66p31P86K18n23
5783C39k05k85q62J041M8k76K18j17K27q54O82L87m69J53N52J38j526O74o12o18
5803a365J355j51O11r50J188p20o79Q22J65o68R96j012N34J74K05p68K83J123
5821A143m97n02K48j07K64K61q2j159m09L52j12N67J00n87K75J66n58Kk16l57
5841a208J044l37R23j021J192p1j697n6J285m3m29J068j193J345j275Q25m75m08
5859e31l0J469j103Q6L42J51n41J381j943M56Q5l82J106j043O97n43J192r17m27
5878d95J8K67O75q97k59O12J53o57O92R06j87j229J373j929K46L61l06K8J010
$$ plain form
5743 594 -160 -48 -611 45 -207 299 119 -582 -248 40 -665 5 688 631 -805 -250 404 540 -341 -292
5763 -292 -32 327 -35 -707 1103 576 -522 -499 264 -46 -48 171 -475 -123 123 589 -142 644 862 339
5783 339 134 -151 -1013 28 76 -200 18 -99 128 -726 -44 343 -126 27 579 717 -809 -135 -747 -1365
5803 -1365 -10 -161 450 -500 688 -32 -711 111 276 -392 604 -408 126 300 505 -263 20 1143
5821 1143 646 144 392 285 549 810 728 -431 -840 -488 -600 -33 67 -520 -245 -79 -637 -635 -851 -1208
5841 -1208 -164 -501 422 -599 593 522 -1175 -1231 54 11 -418 650 -543 802 -473 352 -123 -531
5859 -531 -561 908 -195 -109 233 384 -157 1224 -719 -263 -178 -560 546 -497 200 -343 849 -68 -495
5878 -495 -477 -210 465 -432 -691 -79 74 -583 109 1015 828 -401 972 -957 -711 -350 -656 -628 382
5897C82N01j756K039m18o93N65j017M38K45j48p81R43j27J6R87l59j57r5Pq9j162
5918f79J512r15m95M94J44O6j58L37J98k4m61M30J76p45n70J645l92j047J330
5937H46j004N21q65J085l61r67J310j108J042m86J032j741O96J92O35j90m79L55
5955E13l84k28n43R7K47K69R55j437J048r8k13J33K02k68k35N06m99m48k76L74
5975b85J46J48O88m04p66P21p6j691J948m73J63k03r7p67J733n36J60Q0j38m02
5995e1Q09o69oM30J80m26J97mp05P68p80m21K32J008l69Q2K99j334M53q0M43m06
6017c50J312r34j07p5O17n26o9J74j145O14N91p16R09O51K7j903J649p98j29l63
6037e71M66o98J42J112n6L66m39J009j118l67n42Q85P7n34L64j27m97P9Q05p8
$$ plain form
5897 382 883 -873 1166 748 55 620 -397 41 286 138 -643 300 173 189 1176 817 660 565 572 483 -679
5918 -679 833 -82 -577 -83 61 127 -31 306 504 480 19 449 625 -120 -690 955 563 -484 846
5937 846 -158 363 -502 583 222 -745 565 -543 499 13 1045 -696 0 192 827 637 158 513
5955 513 129 -99 -642 -545 -298 -29 926 -511 537 439 226 359 561 293 58 564 65 -383 -659 -285
5975 -285 -139 9 697 293 -473 248 172 -1519 429 -44 119 -84 -181 -948 785 249 409 489 351 -51
5995 -51 758 89 83 513 693 267 464 460 -245 523 -257 -678 -446 562 193 275 574 -760 -307 -387 56 -350
6017 -350 962 28 -79 -154 463 -63 -132 42 -1103 -489 102 -614 295 946 973 -930 719 -79 -208 -571
6037 -571 -105 -803 -661 451 395 761 322 1331 213 -154 -696 189 266 -268 96 -31 -528 -449 356 278
6057B78j70L56J45J49q73o11R77m20K85p37M06K46p45J507r42L32n25K60R14o89
6077A43r67o87P27O43J029n57k79M40k2k33J051j589L21J68j30n73Q98j33L38
6096E88m57M38m23n3L54o41j34J82r41J486o19k35Q28n91J119o71j34J56k61K07
6116A98p16N16r85J433K81j559N50L80m8K08o8q00P51j54j304R03Q36J43l95l01
6136a31K65L64j46j98K32Pq10K59l36p1K33j73J023j99M66j79j199J084q94M04
6156AK75j111O00j82l25K71Q61p0n66P29k27J95j44r71O41o71N21o35O39j09j65
6177d43J738j139p56M10k07j76j2K14M31L59r69O91L91K3m05J38j96l17J99k57
6197b83m15J199j552J338k57k43l5P10k03l54k02j50m6J63N72P37n01J86q18J27
$$ plain form
6057 278 108 464 609 758 -115 -726 251 -169 116 -621 -215 31 -714 793 -149 183 -342 -82 832 143
6077 143 -824 -1511 -784 -141 888 331 52 492 470 237 1288 -301 20 188 58 -515 383 250 588
6096 588 131 569 146 93 447 -194 -328 -146 -1087 399 -220 -455 373 -218 901 230 96 252 -9 198
6116 198 -518 -2 -987 446 727 -832 -282 98 50 258 190 -610 141 -13 -1317 -414 422 565 170 -131
6136 -131 134 498 352 154 386 393 -417 -158 -494 -565 -332 -505 518 319 785 606 -593 491 -403 1
6156 1 276 -835 -235 -417 -742 -471 390 320 -246 483 256 451 307 -664 -23 -694 -173 -808 -169 -278 -443
6177 -443 1295 156 -600 -190 -397 -573 -585 -371 60 419 -550 141 532 555 150 288 92 -225 -26 -283
6197 -283 -698 501 -1051 287 30 -213 -248 462 259 -95 -297 -447 -493 -330 242 979 478 664 -154 -27
6217b7J087j552N22p46J85M79K02N44r43K29l56Q03L39j334P27n51M28r4k59p98
6237a115O11K07L21J11r7O29r94J170l40k34r6m70k50K26m72J017o70J00J389
6256A043p11O26k71o61N7M66j566J253l55N44M29n32K9R9N46j167k77N19o84P23
6276A10N4r23Q03J57M67n84M53n02j54L76j23m10l88M0m77L49P05R28r21m37J013
6297E36n98o43Q50n18j94P57j139J56J807p08Q91j866M27J139j92j093K33k54
6315d09rP89l82L7J23l80M44J201j245J03q27K07o96J104l09p85R32Pl23N77M36
6336E95m53j93K94k0L84j558P1P99p63Q12K36N92m4L85k18o25M41p23j09p67J76
6357f88O95P8Q69m38J11l84k53N05J95k90m22L48m17m13R62K57n02K7M82K43o72
$$ plain form
6217 -27 1060 -492 30 -716 -531 -52 150 694 -249 -20 -376 427 766 -568 159 -392 36 -58 -317 -1115
6237 -1115 -504 -297 24 135 38 667 -327 843 503 269 173 -297 -547 -321 -793 224 -446 -346 1043
6256 1043 332 958 687 26 83 549 -1017 236 -119 425 854 322 351 450 996 -171 -448 71 -613 110
6276 110 164 -759 44 201 668 84 537 35 -119 257 134 -276 -664 -624 -1101 -752 -47 881 -40 -477 536
6297 536 -62 -705 145 -373 -567 190 -949 -793 1014 306 1197 -669 -242 897 705 -388 -155 -409
6315 -409 -418 371 -11 26 149 -231 213 1414 169 272 -555 -348 -1044 60 -249 -1034 -102 -95 -418 159 595
6336 595 142 -51 243 223 607 -951 -880 -81 -844 -32 204 796 752 1137 919 294 735 12 -97 -864 -688
6357 -688 7 85 954 516 627 243 -10 495 690 400 -22 326 -91 -504 458 715 213 240 722 965 293
6378B93N16p49m67O20p78J70K56J097j387R17N55j010o84L90L45k72j57J52j29
6397c22L08J56M67M47j88q68P10j361k50N00p92Q84n84P97K66K28j71K29j3O83
6417A126j488J020j444o6O18N46q10J093j87J78l64n1o06N33J13j464LR32J52
6436a66n2l83N32j54J466r45r61R00p91j90L39K99k59Q55P02j27p30K76l64J0
6456B57k25J333j879J09j12K33J08n6N66R9K43k45l01O8j64o3l23R11r63k45R05
6477B56q07K29J076K38o14k9n63M87q08j27M42Q87j049k3M4R49j91K92j211Q88
6497C66K58m01o25J95j172J722O46j258O44K69n86N64K6m20n4m45Mo49P03J72
6517d1O2J47O29r89J065j593O7K78J63k57J20M36j277J158k21J227j440Q18m20
$$ plain form
6378 293 809 60 -407 213 -565 -395 -139 958 -429 488 1043 33 -651 -261 84 -188 -345 -193 -322
6397 -322 -14 142 609 1056 868 0 710 -651 -901 -401 -1193 -309 -893 -96 170 398 227 456 443 1126
6417 1126 -362 658 -786 -852 -234 312 -498 595 408 586 222 171 -435 98 211 -1253 -1250 -318 -166
6436 -166 -218 -601 -69 -223 1243 298 -663 237 -554 -744 -405 -106 -365 490 1192 1065 335 611 247 257
6456 257 32 1365 -514 -405 -517 -284 -176 -232 334 433 676 431 130 198 34 -29 -352 559 -404 -649 256
6477 256 -551 -322 754 992 378 349 -214 273 -535 -662 -220 667 -382 -405 -361 588 397 689 -522 366
6497 366 624 223 -402 -207 -1379 343 989 -269 375 644 58 622 648 228 174 -271 -267 -916 -213 -41
6517 -41 21 168 797 -192 873 -720 -653 -375 -212 -469 -349 87 -1190 -32 -253 974 -466 352 -68
6536f8l0n53L48K33k54J06N16M21m28J79K6J92j85j42j00Q5p05q9P86o86P16n95
6558b27P15j92J57R82j688n13P97q68O02q7N03m76k12k15J102n78O07K20O16j394
6578a49j54n41K79j58R82M90j269J167k37p87Q58j9j30m00j73L1O1O03k31l60
6598a37N15J65J38q89J502j674n70k95J733p55l03M12J88O46j061J086K82r39
6616D4j21K20Q03j349P07l10m74J018k2j190J007j54Q67r90l75L98M57j171J557
6635I22j149J438o27Lj103J73M34l39j34p51l3L35J691j919K181j106Q7N54j328
6654f71Q18l12K0K8KL30k60k76J227j003R23J5J98n29J0q24j150J114j46K62K82
6675E8P11J9p42o58J199o58R28p20m76j211J633l2o10Q99j206R18O41j041P76
$$ plain form
6536 -68 -98 -651 -303 -70 -324 -218 298 719 291 470 496 688 503 361 261 346 -359 -448 338 -348 368 -227
6558 -227 488 296 453 1435 -253 -766 31 -837 -235 -322 181 -295 -507 -722 380 -198 409 629 1245 -149
6578 -149 -303 -844 -565 -723 259 749 -520 647 410 -377 481 462 332 -68 -241 -210 -149 454 223 -137
6598 -137 378 543 681 -208 1294 -380 -950 -1245 488 -267 -570 -158 30 676 -385 701 983 44
6616 44 -77 143 946 -403 304 -6 -480 538 516 -674 333 179 1046 56 -319 79 536 -635 922
6635 922 -227 1211 584 587 -516 -343 91 -248 -382 -1133 -1166 -831 860 -1059 1122 16 103 657 -671
6654 -671 147 -165 -145 -117 -115 215 -45 -321 906 -97 826 841 1039 510 520 -304 -1454 -340 -486 -224 58
6675 58 769 788 46 -612 587 -71 857 137 -339 -1550 83 51 -559 340 -866 52 693 -348 428
6694D28o92o4o44J714j021n75J049j22L68R8l98k13J08l03J34K58l66L13p71J663
6714I64j334Q5L00N43J54j431J33K49n31K3J305j152Q43n76Q99j01m52N31N0Q1
6734E83k01j478R30n37R27K16m47lM5m55R99n6k7o82p0N62m01q80R56m43P83l03
6756A8l3J049n67R72j363m9j9p78P13L15K3n03P85J069j877J168n69j9p47m40
6776h52J026L41o18J82m23Q52J233j655R58l68m20n63K19j7Rk76k47K69R68n16
6796A02N54l50N84j71k93P7n09n82J21J78L16j73n61J193j043P53O11q21m88Q62
6816C60m24Q6n1n56J229p47L24m46L32L20m04q54P75L05j579R93Q8k71J041J38
6836F59p93O77P27j249k67M01l72j220J095N72k40Q29o33N40j009L98M38j789
$$ plain form
6694 428 -264 -328 -972 742 -279 -854 195 73 441 539 141 -72 36 -267 -133 125 -241 72 -699 964
6714 964 -370 -285 15 558 712 -719 -586 -337 -868 -845 460 -692 151 -425 474 373 -79 452 502 583
6734 583 382 -1096 -166 -703 224 440 -7 -10 35 -420 579 523 496 -186 -256 306 -95 -975 -19 -462 321 18
6756 18 -15 1034 467 1439 76 27 8 -770 -57 258 281 -222 563 1632 -245 923 354 335 -412 -852
6776 -852 174 515 -103 79 -344 508 1741 86 1044 676 256 -307 -88 -105 -96 -372 -619 -350 618 102
6796 102 656 306 890 719 426 503 -6 -588 -467 -289 27 -146 -707 486 -557 196 807 -14 -502 360
6816 360 -64 22 -29 -585 644 -103 221 -225 107 427 23 -831 -56 249 -1330 -337 -249 -520 521 659
6836 659 -134 543 1270 21 -246 155 -217 -1437 -342 230 -10 819 186 726 -283 115 553 -1236
6854a236K027j044O8k43L23O98l85l07m28O53J05l26P06j579J243R4n86J059q11
6873C1p8J96M82L65m30r67j06P06l87P24j128M3J020q08M63P53o4j036N35m46
6893a32O79q18J72l93m57M38J662r77j2J078r37L71K72n65p31n73J91L11pL86
6913d2L77l14N65l05Q6Q0p43M37r62Q31n49M70l66J087L23j210M62L56M89j594
6933e22L02m39q42K062K36j314L27R29r29K381j947p01J23OL45j160Q36p69J186
6952A10j50P42q79L11J012r49M71k3o47p18K90N04o79O45j44N28k69m28J053n33
6972B47q22J32N72o04j9J116K12r51O48J37J75l69l19O00p00ko72O87k85o25J287
6993D45m1l59K18r28Q96j63p61L03K77O6k37j83o56J706L39r25P58k12m79o38
$$ plain form
6854 -1236 791 -253 -185 -428 -105 593 208 -99 -527 126 231 -95 611 -968 275 369 -217 842 31
6873 31 -47 149 631 996 566 -401 -507 199 -188 536 -592 -549 471 -337 126 879 815 -221 314 -132
6893 -132 547 -271 -99 -492 -949 -511 1151 174 162 1240 303 674 946 381 -350 -923 -732 -421 -428 -42
6913 -42 335 21 586 281 367 447 -296 141 -821 10 -539 -69 -435 652 975 -235 227 583 1072 -522
6933 -522 -220 -659 -1501 561 797 -517 -190 739 -190 2191 244 -457 -334 -328 17 -1143 -307 -1076 110
6952 110 -40 702 -177 134 1146 197 668 645 -2 -720 -430 74 -605 40 -104 424 155 -273 780 247
6972 247 -575 -443 129 -475 -494 622 834 -117 531 668 843 474 155 755 55 53 -619 68 -217 -842 445
6993 445 404 45 263 -665 231 68 -693 -390 -113 -47 -284 -467 -1123 583 922 -3 755 543 64 -574
7013e74L03l62Q02j68J47L89p9o57L26p3O19J05j354J075l71m43L26o02K88R15
7033F12p88J05k9J375k181N69M08Q3l90j7J34L0L19N96o94K78n93O10r43M26J73
7054H3J22k79N15P07j074p5J79N03N81j188L49j17j497P22N98l98j49P6q4P48
7074C22m63P48m65O34j333R03m79K07l93J149j467J427K1j030J590j371Q10j226
7092d16J336j124o90k23M51M19J710j620J79M07q12K70L45L4n10Ll57J10R83l93
7112A02K01J88q6L18o44O29j170l5m39N90N60k93r1P32j167J110j028K50N86j040
7132g27Q60j348J959j102M38m04L65j12N04j254Q90l09L96r7k09j301J639k42
7150e4p8N34p55L3R35o65m72N53m35m89R37K22k69l73J054k26p32r1L06Q00q57
$$ plain form
7013 -574 -271 -633 169 1 148 537 458 -199 127 54 673 778 -576 499 128 -315 11 -591 -303 612
7033 612 -176 -71 -100 1275 -906 -337 71 154 -236 -253 -119 -89 230 826 132 410 -183 427 -516 -90 83
7054 83 205 -74 441 1148 74 -1 178 681 1262 74 423 306 -1191 -469 129 -269 -418 -342 -426 322
7074 322 -141 607 142 776 -557 346 -133 74 -319 830 -637 790 811 -219 1371 0 810 -416
7092 -416 920 -204 -894 -1117 -666 -247 1463 -157 22 429 -383 -113 232 266 -244 -241 -598 -488 495 102
7112 102 303 491 405 723 79 708 -462 -497 -936 -346 214 -79 -170 562 -605 505 -523 -273 313 -727
7132 -727 133 -1215 744 -358 80 -324 41 -71 433 -821 69 -240 156 59 -150 -1451 188 -54
7150 -54 -132 402 -353 -320 615 -50 -522 31 -404 -893 44 266 -3 -376 678 452 -280 -371 -65 735 -122
7171a22L33j112Q74J84k44k15J93q4K97J39k45L88m84K56q13N70j094J224o64
7190f19R46R2j51m56J520j300K1j18K78Q5l54N07j001Q26m01R71O2m98k74Q09
7210I45j464K14K27M05l29j77L63O9N34k51n46M83j126O3R93n47k55N28K21m9
7230C01l1K8J86q67kM45K83m78K6k27j65N55k28k76J363p90o25N80o49Q99m16
7251h8N7Q00j399J65R34o23m83J362q06j37M72q33J324j617P43pr0M84L72l03
7271C27o16O22j156P04j02L2l76m15K58M96O14n74l42O38j57k57J280j505K74
7290b55L70k64o96p4J084N3P0k86k03P73m41N67j1j702O56o66Q31m93k67J587
7310F33q3j91j47R00j033M2q79J27N47J307j520K90Q35r74r9M12K55o96j2O75
$$ plain form
7171 -122 211 -901 -27 157 -87 -302 -109 -193 104 243 -2 386 -98 158 -655 -85 -1179 45 -619
7190 -619 327 419 268 -188 1332 32 53 -65 213 298 -56 451 -550 276 -125 846 908 410 136 945
7210 945 -519 -305 -78 327 -2 -179 184 253 787 536 -10 473 -653 -590 403 -144 -399 129 350 301
7230 301 270 298 484 -383 -385 60 343 -135 -109 -336 -501 54 -174 -450 913 123 -502 78 -571 328 -88
7251 -88 -31 769 -630 -465 469 -154 -637 725 -81 -218 254 -579 745 -872 -129 -136 -226 258 630 327
7271 327 -289 333 -823 -119 -221 -189 -565 -980 -722 -226 388 -186 -528 110 -47 -304 976 -529 -255
7290 -255 115 -149 -845 -919 165 218 288 2 -201 572 131 698 687 -1015 -359 -1025 -194 -687 -954 633
7310 633 550 359 212 1112 79 121 -758 -631 -84 1223 -297 -7 828 -146 -245 167 422 -274 -286 389
7330C89K29l91m02K73n37N18N39m06p50p1M60kN37l94K75m90n52k76J365p7n86
7351c49R11Q49j637K84j81K86j068Q11L40n86L45O38k24j070J072o82K99l83R57
7370F12j89n44M96Mj234J104J33O1p54j65N81j3l36k71N26N11j435J165K81r86
7390d53J425j333J246q72k7m87k02j33M26K92q98M00N45J093j391O83K77j154
7408e63L69O36o09M77K81n83O20J3o30p23J198k46p88J119N76j877L13J568o96
7427D55q65R61p08R49q78O23n43j13k85J39l66N46K45r52P25n6M91n68P47l78
7447A69M35r09J227K70n16q31jK7m89N26j39R4J001j097L26K15n75m17P45o04
7467e43J013o40o78J18J059p90J99P07o88N2M32K08n39J22j08N29p8k21m63J36
$$ plain form
7330 389 618 227 -175 98 -439 79 618 212 -538 -609 -149 -151 386 -8 267 -223 -775 -1051 314 237 -349
7351 -349 562 1411 -226 58 -123 163 -905 -94 246 -340 5 643 419 -651 421 -261 38 -345 612
7370 612 423 -121 375 379 -855 249 382 443 -311 -476 105 92 -244 -515 11 522 -913 252 533 -453
7390 -453 972 -361 885 13 -14 -501 -703 -836 -410 -118 -1016 -616 -71 1022 -369 314 591 -563
7408 -563 -194 442 -167 310 591 8 628 641 11 -712 486 240 -548 571 1147 -730 -417 1151 455
7427 455 -410 551 -157 792 -86 537 -6 -119 -404 -265 -631 -85 160 -792 -67 -123 368 -200 547 169
7447 169 604 -305 922 1192 676 -155 -156 -129 -618 -92 -231 -137 864 -233 93 308 -267 -684 61 -543
7467 -543 470 -170 -848 -730 329 -461 -262 445 -243 -191 241 449 -90 32 -76 453 375 154 -309 -173
7487a73K00K45n32M8o17K81m35R95P5n5j84J2J09l91N01K73r22j17J310r78o1
7508d16m7K67Q2O75j280k80L10O17k74o44J359P08m96n04L64O7K87j430L59J327
7528A051j932O23O49l63m8J170j584N07p9l97J028K6j184L75n76Q84n11R04j34
7547D09P72p59m21q28J011q67P38k33k49L85M33o42J31N25o71l29J692p9j254
7566b36Q23p19K33n92J079r47j00N38N73J7m70j63k66M84k0o23R22k23m19O36
7586E27r69jL7L97L22o86Q7j45J34R05L18m98J04l85j629M54J322l76m08M04L88
7607C02q05M53N91J54J32r38O82n07N24p52n34J193q53k72K03R6L58J12J18m89
7627b32p71J464j7q89J425j611J197p09l22N26K93k5l30M91o63P5K03n52N35J09
$$ plain form
7487 -173 27 272 -260 -212 -829 -548 -983 12 87 32 -152 -140 -31 -422 79 352 -570 -687 623 -355 -416
7508 -416 -463 -196 -114 561 -719 -999 -689 -72 -346 -990 369 1077 581 77 441 508 795 -635 -276 1051
7528 1051 -881 -258 391 28 -20 1150 -434 73 -6 -403 625 651 -533 -158 -734 150 -361 543 409
7547 409 1181 422 1 -827 184 -683 55 -178 -427 -42 391 -251 -120 405 -266 -595 1097 1018 -236
7566 -236 587 -132 101 -491 588 -359 -459 79 652 669 199 36 -230 254 234 -389 533 310 -109 527
7586 527 -442 -443 -406 -9 313 -373 -286 -431 -297 608 926 428 532 147 -1482 -1028 294 -82 -490 -86 302
7607 302 -503 -50 541 695 827 -111 571 64 588 -164 -698 495 -358 -630 -427 -331 27 139 257 -232
7627 -232 -1003 461 444 -445 980 -631 566 -143 -465 61 354 329 -1 490 -173 -98 105 -447 88 197
7647A97p94J908r24r18O60j10Q9k77k87O25n28J051o38j57L56L99o90k95P01j313
7667i45R85n25P88n69K00p47L37O58L31p64p10R54Q91r24L81J74j242R07K81q81
7687d20L36n39j01N38O2O4R5q24J003j17l12l39J01j27O73l55N51n27j85M4P78
7708C99o74M9M1q96K091p54l2k42l15J27M47J404j680L67o48Q4K22K92p91O67
7728A58l22q87J444m51M58k54n89M69K96p75J165r33L80Q58l31m7m47J42L87p03
7748A8J04l65J893r33j021L33j3N24j015K22Q29n95l32J237N4j466O46N97j162
7767d45O4L97K87j074P12J702k223J180m31r9l35l78J142q78P05J2k36o80P49
7786A71ln92K47N73o91N63j359M59J032p97M31K61r2O86j298R32n97L45Q6P33
$$ plain form
7647 197 -597 1311 387 -531 129 19 108 -169 -456 169 -359 692 54 -103 253 652 -38 -333 368 -945
7667 -945 40 -485 303 -266 -66 -813 -476 182 513 -251 -961 -7 884 -40 341 515 -727 180 461 -420
7687 -420 -84 -623 -724 -186 -124 -60 35 -789 214 97 -215 -554 -453 -580 93 -262 289 -238 -423 -379 399
7708 399 -275 -226 -185 -1081 1010 256 224 -18 -333 -206 241 1645 -35 332 -316 -232 -10 282 -509 158
7728 158 -164 -1051 393 -58 400 146 -443 26 322 -453 712 -221 159 1017 686 639 192 334 721 18
7748 18 122 -243 1650 717 -304 29 16 540 -475 -253 576 -19 -351 886 940 -526 120 717 -445
7767 -445 -381 16 303 -771 -59 1643 -580 600 169 70 -265 -643 499 -379 326 338 102 -578 171
7786 171 168 -424 -177 396 -295 268 -1091 -632 400 -397 34 295 203 889 -409 523 -74 271 357 1090
7806A090j319J565j290j5N44n84N25l34J63Q09j195L98L33o19k48M12j96K93p91
7825d59J73j25J47M66k09J05K40j130N52m38O90k12j12M01l60M41p28M66N68q78
7845d02K72k60m39J569q27j42j98J281n09j131M53M74k51L75J51o71J77J59L7
7864A18m1Q86o61P37p12n7j456J819j60n48L60j293J552j345J538l22j23O90j304
7883c22O7l96O65k8l56k09J084o34P6k34m29L70L77j56P05o10L65j266J469q31
7903b93m68J312O3n47P64r07K41k05N05J5m58P87q00O79j095J140j234L31K74
7922A04K84k67M15o66K53l23l45n1K89N94l13n82N76rK36P8j377P71O62J76l38
7943A67k37J71O22K10o29Q23j076J18o81M68j06M03j023R98q60P27O64o92j96
$$ plain form
7806 1090 -229 1336 46 31 575 -9 516 182 345 1154 -41 357 690 71 -177 235 39 332 -459
7825 -459 -286 -411 -264 202 -7 98 338 -792 -240 -678 12 -200 -312 89 -271 170 -558 -92 476 -402
7845 -402 -130 -390 -829 740 -87 -229 -427 854 345 -786 -333 141 -110 265 416 -255 -78 81 118
7864 118 77 963 302 1039 327 270 -1186 633 473 -75 285 -1008 544 -801 737 415 292 982 -322
7883 -322 -255 -651 14 -14 -370 -579 505 -129 -53 -287 -716 -346 31 -125 580 -30 335 -931 538 -293
7903 -293 -761 551 614 67 831 -76 165 -40 465 480 22 809 9 688 -407 733 -501 -170 104
7922 104 388 121 536 -130 123 -200 -545 -596 -307 287 -26 -608 -32 -41 195 273 -1104 -333 329 505 167
7943 167 -70 101 723 933 304 1127 51 169 -512 -44 -150 253 -770 228 -632 95 759 67 -129
7962a29N37r8m60n21J795j109J46l00m71P93l51m59l60J334L06J20j382J138K69
7981G98r04J87k15K15N9K76K8J3l38R82j706J012k92n86L16l8j092J047j20J28
8001b30N27M34o25o32L77L89o36J76l55N59J223r53R85j118k7n4K88j237K08o2
8021g63R58o22P56p95R54p69J89K96l90j26J69P7m32R74Rp31Q46n26K82k12J40
8042B84R8M36k039J633q01L93MN94j48q64J82k23P47j085R53r3L85j105N08q9
8062b30N35m23O5L24m83k52R21o1j032M15M08n37L55L39m66J7K70j124P74J052
8082H67n36o45L09K68K5o32M92L68j374J298j219J58J033j272J161M55m54k97
8100Ek69K17K37%M47l50j041N40m59R17p7k51j56O04K93j313N14r0K40K28o22
$$ plain form
7962 -129 408 310 -150 -671 1124 15 161 -139 -610 183 -168 -627 -987 347 653 773 -609 529 798
7981 798 -106 81 -134 81 140 416 444 457 119 1101 -605 407 115 -471 -155 -193 -1285 -238 -358 -230
8001 -230 297 731 106 -526 -149 240 -396 -220 -575 -16 1207 254 1239 121 94 40 328 -909 -701 -763
8021 -763 195 -427 329 -466 488 -281 -92 204 -186 -312 -143 -66 -498 476 485 -246 600 74 356 144 284
8042 284 382 818 -1221 412 -389 4 8 602 454 -410 -228 -451 296 -789 164 71 456 -649 -141 -230
8062 -230 305 -118 -53 271 -212 -464 457 396 -636 -221 187 -350 5 344 -122 -105 165 -959 -185 867
8082 867 331 -314 -5 263 288 -344 148 516 -858 440 -779 -621 412 -860 301 756 302 5
8100 5 -264 -47 190 190 637 287 -754 -214 -673 244 167 -84 -240 364 657 -656 -142 -232 8 236 -386
8121c86M80J87k16L05j55r3p99K0K309r56j040K0J218j035K45J36l97L22j21J30
8141A74L37k68j120J035l09L5q7M3L48j44M59R3M4m47j196J447r41L7R05l68q6
8162ij109J290L08j346J55J590j659J646p18K58o48l42p45J654K64r57N04j70
8180c4N23P03j895M83L13j170Q8J916n48j030N40
$$ plain form
8121 -386 94 281 65 370 215 122 -677 -657 1652 696 -344 -324 894 -141 104 240 -157 165 44 174
8141 174 511 243 -877 158 -151 -116 -203 -160 188 44 503 596 640 193 -1003 444 -497 -460 445 77 -9
8162 -9 -1118 172 480 -866 -711 879 -780 866 148 406 -242 -584 -1329 325 589 -368 136 -34
8180 -34 489 1192 -703 -220 93 -1077 -989 927 379 -651 -111
8191a11
$$ Imaginary data points
##PAGE= N=2
##DATA TABLE= (X++(I..I)), XYDATA
0@%%%%%%%%%%%%%%%l7J45k16K16k16K16k69L77m32M41n49O48p55Q69r78J171j316
32f85J453j643J870k122K392k673K980l327L707m117M558n047N590o179O817p514
48c940Q275r116J0046j1060J2199j3468J4883j6490J8310k0406K2854k5745K9220
61A5562l3497L8903m5984N5697o9861R2526j34260K34842q90887p19409K646381
72A190013m52106j728219J613660J131665k007389J14035J763868j142779j383448
81i00700J478726J84211j800954M15631J348630j160678p20061J529513J32462
90E06780j365971P29975J117243j148748m95137J358901k45454j249857P88240
99d028P56638j172330j39354J179833m34320q75501Q47802M06294r93384N0815
$$ plain form
0 0 0 0 0 0 0 0 0 0 0 0 0 0 0 0 0 -37 108 -108 108 -108 108 -161 216 -216 225 -324 324 -431 438 -540 631 -685
32 -685 768 -875 995 -1127 1265 -1408 1572 -1755 1952 -2165 2393 -2654 2936 -3243 3574 -3940
48 -3940 4335 -4781 5265 -5795 6404 -7064 7819 -8671 9639 -10767 12087 -13658 15562
61 15562 -17935 20968 -25016 30681 -39180 53346 -80914 153928 -736959 -1456368 1190013
72 1190013 737907 -990312 623348 1755013 -252376 -138341 1625527 482748 -900700
81 -900700 578026 762237 -1038717 -623086 725544 -435134 -1155195 374318 506780
90 506780 -859191 -129216 988027 -160721 -655858 703043 457589 -792268 -4028
99 -4028 752610 -419720 -559074 620759 186439 -689062 158740 565034 -428350 -377535
109c77535Q53961m60739o09660O91286L32475p16007M7973P53540k95212o22703
119d02621N32273L50572p81353j02102P81736l21759o83697O84793M28089q27946
129c42015P5727R07938m57890o70072P70388K41194r75103J38705Q27800n86237
139f9565n61811Q80816J85931r28030L19193Q33385p20748n09776R60086j3969
149C75512j043798M88019P84312r08765k94958J138191k29077r62751P94681N71476
159G12842j114619k4857J070898n94263p92590R82462K80987j077400L31723R49068
169G24251p51450n03124J009436k7004j021043M70541O90960q74954k91818R83089
179D08884j99328q27568O66047N35297q78733n2206Q92893m21593o97813P18456
$$ plain form
109 -377535 476426 15687 -593973 97313 429788 -286219 -238246 515294 220082 -402621
119 -402621 129652 480224 -301129 -403231 378505 56746 -626951 57842 485931 -342015
129 -342015 -266288 641650 183760 -486312 284076 525270 -449833 -311128 516672 -69565
139 -69565 -631376 249440 435371 -492659 -173466 659919 -60829 -570605 389481 375512
149 375512 -668286 -180267 604045 -304720 -599678 538513 309436 -653315 141366 712842
159 712842 -401777 -426634 644264 50001 -742589 239873 520860 -556540 -224817 724251
169 724251 -27199 -530323 479113 452109 -568934 -98393 592567 -282387 -574205 408884
179 408884 209556 -618012 48035 583332 -295401 -347607 545286 123693 -574120 144336
189A44336K74537q70820J58462P74479n01055m44285P56255J06748p43115K58319
199h6139N63009n54958l30995O27599k0736o13887L08692M77043m76271j93331
209b99974O06316n3988n57849L06717L76978n30269j83440N64237j15437n11886
219c98595L80988L72838n01753p7505N79798j76203m99914L81320K67887n64157
229b35296n1026N51544k28867m33386M74735K55308n50294N7714N60864l30834
239G0462m32242N04193J34540o27164J40278N50416m02688l16092O15856O3108
249C00667o00816K66319M71810n22265k49629N93395j01814n77132L71348L89348
259C41231n36824p3720O22673j95212m93162M44481K51733o04708J120N50230
$$ plain form
189 144336 418873 -451947 -293485 480994 -20061 -464346 291909 398657 -344458 -86139
199 -86139 476870 -78088 -409083 218516 197780 -416107 -107415 369628 -106643 -299974
209 -299974 306342 252354 -305495 1222 378200 -152069 -335509 228728 113291 -398595
219 -398595 -17607 355231 -146522 -224027 355771 179568 -320346 60974 328861 -235296
229 -235296 -286322 265222 36355 -397031 77704 333012 -217282 -159568 401296 70462
239 70462 -361780 142413 276953 -350211 -209933 340483 -62205 -378297 237559 300667
249 300667 -300149 -33830 437980 -84285 -333914 259481 157667 -419465 -48117 341231
259 341231 -195593 -269313 353360 158148 -335014 109467 361200 -243508 -242388 307842
269C07842l11823m08671N18770J73571n56194J53584N19582l79405l15597N17990
279B19649K4719n68342K12337M18327m38279j95765N52855m2932m83986L23661
289B2244L51845m82215j23395N11070j66911m69310L55576K64967m88607p941
299b32677N18623k04658l70264M19606J80452n05391M7664M41145l08195l24436
309c38131M35341R6884m70085J64566M27608l30333k25292M63415J541m76400
319b50886J98202L32805m04530j63765M63731o7830m02739L02447K93039m04868
329a04394o1516M38971j68668l76657L13204J72974m32548K3463M14436k09812
339I453k71005L84885J21726m07478R3677L50855k86362k43982L56712K6855l86638
$$ plain form
269 307842 -3981 -412652 106118 279689 -276505 -122921 396661 17256 -298341 219649
279 219649 244368 -323974 -111637 306690 -131589 -327354 225501 182569 -301417 22244
289 22244 374089 -108126 -231521 279549 112638 -356672 -1096 263871 -224736 -232677
299 -232677 285946 81288 -288976 130630 311082 -194309 -146645 294500 -13695 -338131
309 -338131 97210 194094 -275991 -111425 316183 -14150 -239442 223973 225514 -250886
319 -250886 -52684 280121 -124409 -288174 175557 107727 -295012 7435 300474 -104394
329 -104394 -165910 273061 104393 -272264 40940 213914 -218634 -195171 219265 9453
339 9453 -261552 123333 245059 -162419 -68742 282113 -4249 -248231 108481 135336 -251302
350b51302J53762L20035k76307j38943L79887j4668l48605J78940K33087l25610
360h9724j15722L36348p3017l05096K29052K21981k93707m0117L42484j01804
370A10678k93124K18120J56094l28122l5779L19798j25446k52290K71312J58030
380A99271l11442K2541L20981j77371k53606K74966Q3617l56351O4086L19330
390A86022k18605j94208L53590O0778l55502J35226K98664k97334j77843L56426
400A47214l5870l71025K11365K66316l31964p1333M07888j05869l34374K84548
410F6896J82256m03883p430L72148k17352k77480L57357J04934l85890J25965
420h2479L52704k76266j92343L68889j2361l81040J74609K53610l21110r0734
$$ plain form
350 -251302 -97540 222495 -53812 -192755 187132 172464 -176141 2799 235886 -89724
360 -89724 -205446 130902 57885 -247211 -18159 203822 -89885 -130002 212482 110678
370 110678 -182446 35674 191768 -136354 -172133 147665 22219 -230071 41241 199271
380 199271 -112171 -89630 231351 53980 -199626 75340 158957 -197394 -133308 186022
390 186022 -32583 -226791 126799 187577 -167925 -32699 265965 -31369 -209212 147214
400 147214 111344 -259681 -48316 218000 -113964 -185297 222591 116722 -217652 66896
410 66896 249152 -154731 -162161 209987 -7365 -284845 72512 177446 -208444 -82479
420 -82479 270225 -6041 -198384 170505 158144 -222896 -48287 205323 -115787 -206521
430b06521L68701p6111k90351K59170J81714l27523j0788L08397j70827k49370
440b13509K56884Q5103l06028O8998K77472j75592j46838K69643L0933k65114
450a18048Q9951J85727k04451j13572K22358q494k06774J21801J69381j59199
460b1320o1518K02673k2656j94066Q8578J22764j73912p3006J87076j2450j71582
471a29419J11401J55575j50477o6724J91958k6316k02422R2157J33555j84182
481g4894o2897K20324k9716j89462J52766J51933k09664m2302K37169r0000k24991
492a61734J75685J13435k61174Q334K73824j29054j89891K57074Q1415k94321
502a26407O7064K49684k20935j61728K84422o271k90013J66844K24574k62664
$$ plain form
430 -206521 162180 86069 -204282 54888 236602 -90921 -101709 206688 35861 -213509
440 -213509 43375 128478 -177550 -108552 168920 -6672 -153510 116133 147066 -118048
450 -118048 -28097 157630 -46821 -160393 61965 53471 -153303 -31502 137879 -21320
460 -21320 -82838 119835 97179 -96887 -8309 114455 -59457 -132463 54613 42163 -129419
471 -129419 -18018 137557 -12920 -79644 112314 85998 -116424 -24267 109288 -74894
481 -74894 -137791 82533 52817 -136645 16121 168054 -41610 -83912 153257 63257 -161734
492 -161734 13951 127386 -133788 -125454 148370 19316 -170575 86499 167914 -126407
502 -126407 -59343 190341 -30594 -192322 92100 85829 -204184 -37340 187234 -75430
512g5430n6809L21021r0255k70639K21114J34220l15849L440K91589j64964k00084
523b02646K80135P1541k90625R9333K50205k23258j34885K72604l1063k77249
533a85908J49136J76944k39497l9703K73847p3761j97857J91535J03725k38938
543h0477Q443K03223j30576j52565J84730M9084j92245N8704J73976j13213q9000
554g9916J59978J0294j67578M6021J10649j19184p1917J39172J3954j25537O3034
565b1030J19049r1000o4195J23381K345j38985L8147J02873j03325o9001J37231
576C5490K2207j27806O0689J24610j04158p6977J33697m900j58760N9159J18293
587H1544j32950n8716J79067j1129j62393J14158J28467j75577m6116J89546p1548
$$ plain form
512 -75430 -132239 188782 98527 -172112 49002 183222 -132627 -129187 162402 -2562 -202646
523 -202646 77489 149030 -141595 -42262 207943 -15315 -150200 122404 91341 -185908
533 -185908 -36772 140172 -99325 -139028 134819 61058 -136799 54736 158461 -80477
543 -80477 -72034 131189 613 -151952 32778 81862 -110383 -51679 122297 9084 -79916
554 -79916 80062 90356 -77222 -31201 79448 -39736 -111653 27519 41473 -84064 -21030
565 -21030 98019 7019 -57176 66205 68550 -70435 -32288 70585 -32740 -101741 35490
576 35490 57697 -70109 -9420 115190 11032 -65945 67752 62852 -95908 -36749 81544
587 81544 -51406 -110122 68945 57816 -104577 9581 138048 -37529 -83645 105901 34353
598C4353j80765J47779R6462j99414J9521K12535j07750j37750J93759M0009k19382
609a00643O2498J69162j68197r9985K10368j3781j98293J28497J51345j85506
619d4535l9512K11636o9041j86563J47403Q9645k09440Q110K00760j06296j29950
630a27783J88810M7808j94770O4416J58414j51380q9962J75394k2228j75234R8300
641b8215J23233j45297l1049J72269l6270j36240J03319P5153j46608j8669J33472
652F5098n7770j11430J06628O4930j21299J2521J31492n7901r2320J00765L2461
663G3175j32246J3029J07435p3690p4295J10803L3349j07799L2392J04764p3326
674A3591o9547R4443J2184j17882K4439R5133p4807n8921J16184K1546j10844
$$ plain form
598 34353 -146412 1367 97829 -101585 -82064 130471 22721 -115029 78730 118739 -100643
609 -100643 -38145 131017 -37180 -137165 73203 59422 -138871 -10374 140971 -44535
619 -44535 -84047 127589 58548 -128015 19388 109033 -100407 -92297 108463 2167 -127783
630 -127783 61027 108835 -85935 -21519 136895 -14485 -104447 70947 48719 -126515 -28215
641 -28215 95018 -50279 -81328 90941 54671 -81569 21750 96903 -49705 -68374 65098
652 65098 7328 -104102 2526 67456 -53843 -41322 90170 32269 -60051 40714 73175
663 73175 -59071 -46042 61393 -12297 -86592 24211 57560 -50239 -17847 86917 13591
674 13591 -55956 38487 50671 -67211 -42772 52361 -22446 -81367 34817 56363 -54481
685e4481M8466R8252j00493n8457J19140j6495j28876P2283R1009j13537k5475
696f8664J42293l0653j11786R4470O6183j33470j0831J21513o5145j00146J09047
707A2811M9220j24168K4945J27466p6541q2266J18681J7482j39913L8035J08453
718G4205j04156o1924J37253L96j23086P5436R5795j13011l4673J24853l8936
729C2152j15815Q4628O0974j18333k196J21739m6118q6230J00953M5032j17631
740d0845J1099J05898p4211q3457J02229K7853j19137L4182J10007p7240o0124
751f3746J18178O217j20239N1102Q1173j04045m0740J15378k1103j02668P9052
762a441P2987j01322j0535J14328m4529r2584P9833M3241j12873L32J06700n2991
$$ plain form
685 -54481 -6015 92237 -8256 -66713 52427 35932 -92944 -20661 70348 -43189 -68664
696 -68664 73629 42976 -68810 25660 91843 -41627 -52458 69055 3910 -96236 12811
707 12811 62031 -62137 -37192 90274 13733 -68533 50148 67630 -72283 -34248 74205
718 74205 -29951 -91875 45378 45774 -77312 -1876 93919 -19092 -53765 71088 32152
729 32152 -83663 965 61939 -56394 -58590 63149 17031 -69199 31754 76786 -40845
740 -40845 -29746 76152 1941 -81516 20713 48566 -70571 -36389 73618 -3622 -63746
751 -63746 54432 60649 -59590 -8488 72685 -31360 -72100 43278 22175 -80493 -1441
762 -1441 71546 -29776 -40311 74017 29488 -63096 16737 59978 -52895 -52563 54137 1146
774A146p3677R7998L6452j03498K4246R3328p2250o3275R4325R85j03586M4325
786b3481P9777q0173k9044J03343j2256q6377N7098N4232q8800k0192Q4615k8954
798I788p4758O1960M7826p4192l20Q2621l2238o2476N9526K7631q1483P13P2583
811C7181l9691n2937P0082K5732p0425J4911P1411m7316n0128O6305J1514p9411
823d2772J5909O6281m6896m2580P1829J7649p3443K5153O3609n6847m3942P4406
835B8356j007q4268L7285O6501o8952k7669R1502q696q3503N6151N7819r0310
847b6791j7505R3666l6823q2412P6910M4879r5623J1509R6541n3479o4030R0784
859C7626J4483j02259L0518Q1620q1979m4667J03718q228r3655O2408O8572r2732
$$ plain form
774 1146 -72531 25467 61919 -41579 -17333 75995 3745 -59530 34795 35780 -67806 -23481
786 -23481 56296 -23877 -52921 50422 38166 -48211 8887 63119 -25681 -45873 38742 9788
798 9788 -64970 -3010 44816 -29376 -29696 52925 20687 -41789 17737 45368 -36115 -35402 37181
811 37181 -2510 -55447 14635 40367 -30058 -15147 56264 8948 -41180 25125 36639 -42772
823 -42772 -26863 39418 -7478 -50058 21771 39420 -34023 -8870 54739 -2108 -46050 28356
835 28356 27349 -56919 -19634 46867 -22085 -49754 41748 33052 -50451 5700 63519 -26791
847 -26791 -44296 49370 12547 -69865 7045 51924 -43699 -32190 64351 10872 -53158 37626
859 37626 52109 -50150 -19632 61988 -19991 -64658 39060 30832 -62823 -415 68157 -24575
871b4575j7192J01315l8704q5844P3734L9278r7981R997R2061n3283n4652Q7931
883C2085J3058q8125L3173O7635p0635l6350P9315q773p4264M6550N1927o3594
895a7998j1683P3006k0350n9046M6331K8902o2670o354N5281k2191l9985M4379
907G622K1799m6487N987M5750k6945l6352L6702J3019m7010L018M2639j8351l0557
920b9166L6576K2139m2319J51M0750k0003l8347L2212K2190m7906j569N1354k0491
933E571l7777M6088K2713n7303P151N3482l8180m3657N7151J2944o6955K1830
945a6942O1902m9944l2621P1083k793o9912L5872N1207o8568j9694P4598k1582
957A2606o5550N8516L8234p5606O537P5476m4704n4659P1675J5088q2677K4535
$$ plain form
871 -24575 -41767 59548 20844 -65000 8734 48012 -49969 -39972 52089 -1194 -55846 32085
883 32085 45143 -42982 -9809 57826 -12809 -49159 30156 21383 -52881 -6331 45596 -17998
895 -17998 -29681 43325 22975 -36071 10260 39162 -23508 -29862 25419 3228 -36757 7622
907 7622 29421 -17066 -11079 34671 7726 -28626 8076 21095 -25915 -22897 19742 1391 -29166
920 -29166 7410 29549 -12770 -12619 28131 8128 -30219 1993 24183 -23723 -25292 26062 5571
933 5571 -32206 13882 36595 -20708 -13557 39925 1745 -41912 15239 28183 -38772 -16942
945 -16942 44960 -4984 -37605 33478 30685 -39227 -3355 47852 -20716 -40410 34188 12606
957 12606 -52944 5572 43806 -31800 -25263 50213 5509 -49150 22525 37613 -45064 -20529
969b0529O7108o0895l3648Q1039m865p4297M8933N1184p2037j3654P4664k9417
981A3586o2310N7395K7791o8972J2296O3340m2120l9330O3253O717o6080K3556
993a0878M9051m9161k7309N6855l855n0395L0391L8232m3706j0612M9473j4493
1005A3593m3103L0336K3083m1658l096M0580j4580k9452L2430J6104l5387J095
1017a0055L3978j6351k9480K2625J7276l1622m236L5525q187k8118K5126J8046
1029B4527l4318n451L5692j5214l1801K9397J6909l9174K293M1012j9976k9312
1041b5416L7987J2104m6476P988L9055k9483k8568M4529Q649m6389J8424M0419
1053C2823l7430k1372M9092m162m8361K7240L3660m6884j1549N3665j7225m3161
$$ plain form
969 -20529 46579 -14316 -47964 33075 28210 -46087 2846 54030 -18007 -31661 43003 13586
981 13586 -48724 8671 36462 -32510 -20214 43126 1006 -38324 24929 31646 -34434 -10878
993 -10878 38173 -10988 -38297 18558 14703 -35692 -5301 32931 -10775 -21387 28086 13593
1005 13593 -29510 826 23909 -17749 -20845 19735 5155 -24297 8133 24237 -11150 -10055
1017 -10055 23923 7572 -21908 717 17993 -13629 -17865 17660 9473 -18645 6481 24527
1029 24527 -9791 -15242 20450 5236 -26565 2832 19741 -19433 -17140 23872 3896 -25416
1041 -25416 12571 24675 -21801 -13813 25242 -4241 -32809 11720 20369 -26020 -7596 32823
1053 32823 -4607 -25979 23113 18951 -29410 -2170 31490 -15394 -26943 26722 9497 -33664
1065c3664M2527K5857n4428J940N2854l1375l8891M7648J2160n3378J5369M4577
1077C1196l6771k4619M9141j42m7183K5749L5235m3393j5926M8406j1327m3534
1089c3168L4521K7519m6249k625M9419k1593l7930M0415J7299m8054N965M2355
1101B7874k8658k7381M0442O386m2270J7114L5218l2221j8280L9244l728l8937
1113b5197K0418K7682l3476r805L8581p322l5122K3973K4309l5367n918L6661
1125A9417j1576l1822K6431J5551l2403K939L3785j8787k2390K8500P698l3548
1137a6205P162K7755k0321j7646K7933N049k9179R851K4929j9989j5022K7277
1149A1594J425l0411J0130K2773k0977j1077K8553q27k6021J4598J9247k6736
$$ plain form
1065 -33664 8863 34720 -19708 -17768 35086 3711 -35180 12468 24628 -28750 -13381 31196
1077 31196 -5575 -30194 18947 18805 -28378 -2629 32606 -10787 -26713 21693 10366 -33168
1089 -33168 1353 28872 -17377 -20002 29417 7824 -30106 10309 27608 -20446 -14481 27874
1101 27874 -784 -28165 12277 18663 -23607 -6493 28725 -3496 -21776 17468 13740 -25197
1113 -25197 -4779 22903 -10573 -20378 18203 10881 -24241 -268 24041 -11326 -17244 19417
1125 19417 7841 -23981 2450 18001 -14402 -11463 22322 3535 -18855 9645 17343 -16205
1137 -16205 -9043 18712 -1609 -19255 8678 13727 -15452 -5601 19328 -661 -15683 11594
1149 11594 13019 -17392 -7262 15511 -5466 -16543 12010 11183 -14838 -240 19007 -7729
1161g729q169K9022m537k7771J8509J7362k5129n438K8490o327k5567J8609J7466
1174A8791k6701o109L0218j0183k5428K1583J6616l0471o52L1505j6597k4381
1186b1809L0843R192l5454P574L3780k5734k1079L5629J423l6725J6805L0011
1198B4456l2774j3903L9053o334l5640K6023K3984l7226m160L8279j6657l0602
1210b5501L2599J5540m1257P588L8116k7360k4169L9620L597m1889J9467K9846
1222B6197l4671j2223L9049q831l3599K5769J9108l4981k59L3870j7911k2492
1234b0974K9107Q316l2923R539K7262k3398j4719K8186R94k7102J3746J8223k0720
1247d463q022K3862l811k0293J3193J1752j8480l166J6766o058j3223J3238O422
$$ plain form
1161 -7729 -15898 13124 8587 -19184 -675 16687 -8442 -13880 14610 8283 -17284 1325 18791
1174 18791 -7910 -14019 16199 6016 -19412 2171 18787 -11684 -12336 19169 2572 -21809
1186 -21809 9034 18226 -17228 -9654 24126 -1608 -22687 12942 14365 -22360 -5555 24456
1198 24456 -8318 -22221 16832 10498 -25142 881 24865 -12361 -16521 21758 5101 -25501
1210 -25501 7098 22638 -18619 -11031 27085 -275 -24444 15176 18773 -23116 -3649 26197
1222 26197 -8474 -20697 18352 9521 -24078 1691 20799 -14182 -14441 19429 1518 -20974
1234 -20974 8133 16449 -16474 -6935 20327 -3071 -17790 10396 11390 -15712 -1966 16257 -4463
1247 -4463 -12485 11377 7566 -12727 466 12218 -6262 -9428 7338 1280 -11943 1295 7717
1260G717j3087P23J2418m119j1662Q140P247j0063l927J1385Q92j1066L452J3039
1274A1089j0213r636J5616J440j7870M132J6020j3278j1183K0864M09k0265R233
1287c642J8127k0160r214K7029o955k5439K0859J6816k7040k563L1209j2760k4148
1300a7881K6897J0246l4065O172L0407k4314j8611L4262L94l4435J9858K4521
1312B3451l4038o986L6944j3568l2240K9238J6220l7267N240L4913k1831k0677
1324b0601L4996J774l4876J5772K5404k9819r840L3695r704k7684K3781J5002
1336A7900k9961L399K8776j9260j9716K7030M108k9939J0161K3037k1104j0937
1348a6506K5570k396k0896J3687J3648j8380j156J7452q682j2183J3339L909j2882
$$ plain form
1260 7717 -5370 -4647 7771 3652 -8010 130 7377 -2686 -6613 4772 5664 -5402 -1950 11089
1274 11089 876 -8760 6856 8296 -9574 -5442 10578 -2700 -13883 6981 7390 -12875 -3642
1287 -3642 14485 -5675 -14889 12140 5185 -20254 605 17421 -9619 -12182 19027 6267 -17881
1300 -17881 9016 19262 -14803 -8631 21776 -2538 -21149 13113 13507 -20928 -1070 23451
1312 23451 -10587 -17573 19371 5803 -26437 2801 19021 -18246 -13006 21907 76 -20601
1324 -20601 14395 16169 -18707 -2935 22469 -7350 -17190 16505 6801 -20883 2898 17900
1336 17900 -12061 -8662 20114 854 -18862 8168 12276 -17663 -7502 15535 -5569 -16506
1348 -16506 9064 6668 -14228 -541 13107 -5273 -6429 11023 2341 -9842 3497 7406 -5476
1361e476K517J0758o377o285Q133L649r689j251P119k443p088K362N606m986l107
1376f558O607L407n986J45P936m421p568P650L064r653N84J1927o384p348J3589
1391F991L723j7476O541J3587j5360j0591J8532j35k1267J1929J6850j9999l806
1404a0481K4288q505j9909J8363R166k6135L325K3923j6276j4070K7000J848k6031
1417a3494J4436J8907k4476r144K6742o460k6842K0086J4682k6546N68K7547j4401
1430A605j7386K4583L541k7577R846K0800k2665r256K6509k285k3489J8460J5141
1443A7827k5060L52K4482j1591j9901J9908N221k3316N089J8651j5142q245K0494
1456H769j170j6578R618J0419j6027m935J6018n388j3596J2296O699j3279K140
$$ plain form
1361 -5476 -2959 7799 1422 -4863 3270 6919 -2770 -4021 3098 655 -6433 -4071 1535 -3451 -6558
1376 -6558 49 3456 -2530 -2385 5551 1130 -6438 1212 4276 -5377 -4793 7134 750 -6598 6991
1391 6991 10714 -6762 -221 13366 -1994 -12585 5947 5812 -15455 -3526 13324 -6675 -10481
1404 -10481 13807 5302 -14607 3756 12922 -13213 -9888 14035 -2241 -16311 10689 12537 -13494
1417 -13494 942 19849 -4627 -13771 12971 6511 -20331 -245 14437 -12109 -11541 16006 1605
1430 1605 -15781 8802 12343 -15234 -5388 15412 -7253 -16509 10000 7715 -15774 2686 17827
1443 17827 -7233 -6881 17601 6010 -13891 6017 11238 -12078 -6989 11662 -3480 -11725 8769
1456 8769 7599 -8979 639 11058 -4969 -9904 6114 726 -12870 -574 6125 -7154 -5014
1469e014J3360n630q326R981L187j1005L31P516o206m298O549K274m847K531M353
1484D756k637k861K149R51m308k082L828O8o009L848N789k550l959Q860J024j0217
1500c350J090P501q254o219J0349K173j0835O438J0580j0446l040J2089l021j3405
1514h350Q708O694j6246j409J7738o832j0682J6206P246j9717M038J6359j4057
1527c04j3408J7563K159j9708J0854J3951j6615l266K3438q443j6260J5887P561
1540A3409k4443J685K0751j5126j3185K2753L735k0298R472J6330j7659p171K0932
1553A1185n587j8974J4138P601j9507J624K0974j0866j1049J9426L521k0336O915
1566i35J3457j6477p119J7737m388j4136J2247R203j4653J468J5272q207q760
$$ plain form
1469 -5014 8346 2716 -5610 4371 7558 -3447 -3116 4400 -1806 -6104 445 2719 -2128 403 4756
1484 4756 2119 -742 1407 2358 -1950 -4032 -204 -136 -6145 -2297 3492 942 -3017 5843 6867 -3350
1500 -3350 -2260 5241 -3013 -9232 1117 3290 -7545 -1107 9473 -973 -4013 8076 5055 -8350
1514 -8350 358 7052 -9194 -10603 7135 303 -10379 5827 13073 -6644 -2606 13753 -304
1527 -304 -13712 3851 6010 -13698 -2844 11107 -5508 -8774 14664 6221 -10039 5848 13409
1540 13409 -11034 -9349 11402 -3724 -16909 5844 9579 -10719 -1247 15083 -2576 -9747 11185
1553 11185 5598 -13376 762 8363 -11144 -9520 11454 588 -10461 8965 12486 -7850 -935
1566 -935 12522 -3955 -11074 6663 2275 -11861 386 9589 -5064 -3596 11676 3469 -5291
1579e291J0173o72j2551L789Q010q150l252J2615o02p563O514M578p102k392M774
1594B878k114n883M562P28k777M18L425N34J419m33n73N29l428k532R61P6k270
1611d480K662M931l826k23P014l201n373N744J729j0985J098R663r391m076J3741
1626E027J230j1525Q639Q518j2627m802J3413p117j3217J2436N257j5966O315
1639d419J5657j2781p058J9177j687j8604R108J0320j9661k199J8966o712j2891
1652a2784J6982O679j8956N427J7116j6046q593J9216l928j9382J1943J1313j9133
1665a0146J885K0580q188j3881J7637L768k0107N268J2355j3584p558J7534k507
1678C056j3039J1335Q721j3801J784J3579q674j0447J1921j723j3176N301J0160
$$ plain form
1579 -5291 4882 4210 -8341 -4552 3458 -4692 -7944 4671 4069 -3494 3020 7598 496 -1896 2878
1594 2878 764 -5119 -557 171 -2606 -2188 1237 1771 3190 2757 2184 2713 -715 -3247 -2286 -2210 -4480
1611 -4480 -1818 3113 -713 -936 6078 2877 -2496 3248 4977 -6008 -4910 4753 -4638 -8714 5027
1626 5027 6257 -5268 3371 11889 -738 -5540 7873 756 -12461 -25 5232 -10734 -4419
1639 -4419 11238 -1543 -8601 10576 8889 -9715 -607 9713 -9948 -12147 6819 107 -12784
1652 -12784 4198 10877 -8079 -2652 14464 -1582 -10175 9041 5113 -14269 -2326 8987 -10146
1665 -10146 -8261 12319 4131 -9750 7887 11655 -8452 -3184 9171 -4413 -11971 5563 3056
1678 3056 -9983 1352 10073 -3728 -1944 11635 2961 -7486 4435 2712 -10464 -5163 4997
1691D997r979j889J3342l060p738O546L063r326J825L093m909j978O682j043j902
1706b276N156J797k475J555J464n371O12J360l358K0R64q18O89N231j707l761
1722i18N575q76o827J099M100q360j960R073j995o306Q791M281r205M810P664
1737H946j0439o094J0935k518j1926J0567P392j3086J524J6579q225j0201J5147
1750H601M48j7507N556J0703j4472l330J6346m049j1950J3891P929j7445L066
1763b213J5308j2963j0505J5837k654j5505J0275J1206j4182k501J8827n739j3540
1776h349J2483M386j7442L791J1374j2405n233J6619j673j2752J1320Q760j4748
1789c869J005J2398r014r774J1732J816j1519N510R379p702j805J0428k574q061
$$ plain form
1691 4997 -4982 -6871 6471 3411 -4327 2219 5282 -4044 -2219 874 -4035 -6013 669 -374 -2276
1706 -2276 2880 4677 2202 3757 5221 -150 462 1822 -1536 -1516 -552 -1370 -681 4550 2843 -918
1722 -918 4657 3781 -3046 -1947 2153 -6207 -8167 906 -1089 -7395 1396 5677 -3528 1282 8946
1737 8946 -1493 -7587 3348 830 -11096 -529 6863 -6223 -4699 11880 3655 -6546 8601
1750 8601 9049 -8458 -2902 7801 -6671 -10001 6345 2296 -9654 4237 12166 -5279 -2213
1763 -2213 13095 132 -10373 5464 2810 -12695 -2420 8786 -5396 -7897 10930 5191 -8349
1776 -8349 4134 8520 -8922 -5131 6243 -6162 -11395 5224 3551 -9201 2119 10879 -3869
1789 -3869 -2864 9534 520 -9254 2478 4294 -7225 -1715 7664 -38 -1843 8585 6011 -2050
1803b050O364J551j0805K147N484n907l166P974q97m838O341K108n684O52J984
1818A258m551j617L809k666Q8M156M03k305N089N13l470K552P78o198n95M049
1834A293k798j730N324K87m857N691M295q206p89P698o813o305P676k14q773O136
1850b085Q363q531k21J1104l996r245P826J628j1791L119Q246q630m014J3135
1864D908j388r567P882P315j2807j077J2189q097j0644J2013K529j2590P333J0594
1878H593j0440l081J2930k912j0613Q058M171j3273J834J1573q654o147J2939
1891D978L89j0524O683O428r773k889R914m873r631Q277M729r239K167R522o555
1906c97l454Q806k732p962P564K560r356O62P080k703m847P779K079n751J956
$$ plain form
1803 -2050 4314 5865 -4940 -2793 2691 -3216 -6382 1592 695 -4143 2198 4306 -1378 -726 1258
1818 1258 -3293 -4910 -1101 -3767 -3679 477 880 -1425 3664 4177 707 3259 4037 -2161 -2756 1293
1834 1293 -1505 -3235 2089 2376 -2481 3210 7505 -701 -1490 6208 -605 -6910 766 552 -8221 -2085
1850 -2085 6278 -2253 -2474 8630 4634 -4611 3215 4843 -6948 -3829 4417 -4213 -8227 4908
1864 4908 3520 -6047 1835 9150 -3657 -4734 7455 -642 -11286 727 3256 -9334 -2001 8593
1878 8593 -1847 -4928 8002 5090 -5523 2535 6706 -6567 -4733 6840 -1814 -7961 4978
1891 4978 5367 -5157 1526 7954 -1819 -4708 5206 333 -9298 -1021 3708 -5531 -3364 6158 -397
1906 -397 -3851 4955 2223 -5739 1825 4385 -4971 -4309 2771 68 -4779 3000 5079 -672 1284
1921A284M620p531q63M041l644j430L370N79l611L912J742k716P96L511m039j889
1937a868K265k024k879L450J140k776M131K649m154J526K834l434l271M237k113
1952b87n243L753L226n270J346P401m292k265O104o88o980K520M480r026P91Q315
1968C885m983m972J0093J954r905N205N726r393k642R652m110p662P784M721j0715
1983e362L264R145o079n077R843j324j0959O046N064r756r56J1417l983p479Q563
1998B367M443j1053L537Q418p856n793R246j016j0175P646N265q255J738P527
2012F039l951o499P300K194j0084L747N804p101j684O804j750n323O975J811o837
2027b555J665L767l576l736O359k025m550N497K597n150Q05N796m278k613M572
$$ plain form
1921 1284 5904 -1627 -2490 1551 -2093 -3523 -153 426 -3185 727 2469 -247 549 4060 21 -1868
1937 -1868 397 -1627 -4506 -1056 84 -2692 1439 4088 -66 1460 4294 860 -2411 1826 -287
1952 -287 -5530 -1777 1449 -3821 -2475 4926 634 -1631 4473 3785 -3195 -675 3805 -5221 -4430 3885
1968 3885 -1098 -6070 4023 5977 -3928 1277 7003 -2390 -5032 4620 510 -7152 632 5353 -5362
1983 -5362 -2098 7047 968 -4109 5734 4410 -6549 -503 4561 -5195 -6151 5266 1283 -6196 2367
1998 2367 6810 -4243 -706 7712 -144 -5937 3309 2293 -7882 -236 5029 -3226 -1488 6039
2012 6039 2088 -4411 2889 5083 -5001 -1254 4550 -2551 -4235 2569 819 -4504 2471 4282 -2555
2027 -2555 -890 2877 -699 -4435 1924 -101 -4651 846 3443 -1707 -902 4894 616 -1997 2575
2042B575j926l105L000n15k904K674K168l621P45M477l162j934L819k660l486
2057c855L464J133l956J289N104m446n20N227j410l752L885J950q663J808N754
2072C012n182j469P286j092p332O204M008q229J167O714n331n411Q460n33r322
2087g050N960N537p088O74Q400m973o238P639J184j0300L979P045p093k342R390
2102D724k596p511P455L671r089J693O783n468m070O511k96p787N979M633o569
2117a937k031Q717l693o074P535J681q287J115O630n709j444O320j295m984N189
2132A733K091p045K402M535m525k659N077j71m595L315K954n199M42N324m103
2147d24j767L287L48k561K143k00l268J578M185k885r46L153k314k373L171o22
$$ plain form
2042 2575 649 -2456 544 29 -2875 -201 1967 -1654 -909 3568 406 -1528 2291 -369 -3855
2057 -3855 -391 742 -3214 -1925 3179 -1267 -1787 3440 2030 -1722 2163 4113 -4550 -2742 3012
2072 3012 -2170 -3639 3647 2555 -4777 1427 5435 -2794 -1627 5087 -244 -5655 2805 2272 -7050
2087 -7050 -1090 4447 -2641 -1967 6433 1460 -4778 2861 4045 -6255 -2276 4769 -2324 -4666 4724
2102 4724 2128 -5383 2072 5743 -3346 -1653 5130 -338 -4408 2103 1807 -5980 -1 4632 -1937
2117 -1937 -3968 4749 1056 -5018 2517 4198 -4089 -2974 3656 -2053 -3497 2823 1528 -3456 1733
2132 1733 3824 -3221 -819 3716 -809 -3468 1609 1438 -3157 158 3112 -2087 -1645 3679 -424
2147 -424 -2191 1096 1444 -1117 1026 826 -2442 -864 3321 436 -510 2643 329 -2044 1127 505
2163E05l366J459L111l446O38L813l100j918N511j643n668M341K594n870O38M291
2179A890j433l727N484P18n962L837K929n676j34N299l491l799N016J222o278
2194d105M344M534n750k019P599l144o183N830K662p286J249O105l910l351N436
2209B011o58n130M293K832n805J252N385m355l964P236K00p218M142L699n463
2224a543j684O029j392m791M423J813m879J472L084l895j854N033q37m495L189
2239c27L761n593o78P062m145k356M460q04l940K858J563l020j231M079p49k901
2255a961K196J298l681J813K223l164J087J861j253j782J638K49j511R53K002
2270A968k818M10K328k368j876L374p24j787J972J560m202P67L202k301j93J919
$$ plain form
2163 505 -2861 -1402 1709 -1737 -1099 2714 -386 -2304 3207 1564 -4104 237 2831 -3039 -2401 1890
2179 1890 457 -3270 2214 2932 -3030 807 3736 -1940 -2074 3225 -266 -4065 951 2173 -4105
2194 -4105 239 4773 -977 -2996 4603 1459 -4724 1106 3768 -3518 -2269 3836 -74 -3425 2011
2209 2011 1353 -3777 516 3348 -2457 -1205 4180 -175 -4139 3097 3297 -3921 221 3920 -1543
2224 -1543 -3227 2802 1410 -3381 1042 2855 -2024 -552 2532 -1363 -3217 1816 979 -3516 -327
2239 -327 3434 -2159 -2837 4225 80 -2276 2184 1380 -2560 298 1861 -1159 -2390 1689 940 -1961
2255 -1961 235 1533 -2148 -335 1888 -1276 -189 1672 419 -1363 275 524 -987 -34 1968
2270 1968 -850 -440 1888 -480 -2356 1018 294 -1493 479 2039 -2163 -1396 1806 -495 -688 1231
2286A231o47j908J779J702m307J385L115l125j652M805j437l331L888R79l819
2301a342k17M346l442j385M493j290m010K977K748m317l08M645l638k528N951
2316B683j162m498J839M008l788j401O166j651n069L770J387n556J870L822l160
2331g40j298L640K16l690K391K889m291k66L406k417l914M027J138l493O16O192
2347D406m695m73K687j209k736J955J561l015N82J845j861j628N101r71l123K834
2363A260L87k374m80K377k958L9J923L11j540J286K46m23N88J482k226k75J094
2380G17l45k593J531J611j984J197R34j754N97K276j734j641K095j2k327J065
2396c67J645l264M10K717l71j665J582J037l178Q17J078j538j657L689r05q46
$$ plain form
2286 1231 584 -1324 455 2157 -2150 -765 2350 -775 -2427 2378 941 -2390 1498 2477 -1342
2301 -1342 -1559 2787 -655 -2040 2453 1163 -2847 130 2878 -1439 -1747 2898 -740 -3268 2683
2316 2683 1521 -2977 -1138 2870 -918 -2319 3847 2196 -2873 897 2284 -3272 -1402 2420 -740
2331 -740 -2038 1602 1818 -1872 519 3408 -883 -1149 2257 -160 -4074 -47 1091 -2402 -1786 4406
2347 4406 -289 -762 1925 716 -2020 -65 1496 -1519 -937 908 -953 -2581 2520 1549 -1574 1260
2363 1260 1647 -727 -1207 1170 -1788 -1749 174 485 -1055 231 477 54 642 2124 -102 -377 717
2380 717 372 -2221 -690 921 -1063 134 1068 -686 -89 2187 453 -1188 907 895 -1432 -367
2396 -367 1278 -1986 -1576 1141 770 -895 687 1724 -1454 -637 441 -1097 -2754 935 30 -816
2412h16K136J586m487J659K991l032j418K916j181l682L541J967l732O0M761j841
2428A428k834K845o34k887Q41K765l050r27M198j821k157L593N39l621K472K051
2444B801l345j393K472n41l818K974K430k892O24L395j428k209K974j075k727
2459a758L86K311l027q22M656k163m15L420l61l057Q45J169j806j090J857m06
2475b61j207J806J365k635J729J400l104J399K367l418j955K609p92o64R45J440
2491A024r64M80J411r42j654K096n35k089P24r1j956J907R31L66j736K613O17
2508B202k947R95J157k088j822K768j410p74K369R4j819K690N26k289P25J336
2524A713k887j624L366j93k716J885K545k694k44M302k833l39L76N77k057o62
$$ plain form
2412 -816 1320 2906 -1581 78 3069 37 -1381 1535 354 -3328 213 2180 -1552 -1492 3269 1428
2428 1428 -1406 1439 805 -2082 -1241 1524 -1526 -2453 1745 -76 -2233 1360 1899 -1722 750 2801
2444 2801 -544 -1937 535 -6 -3824 -850 1580 -1312 -688 2707 1279 -930 2044 969 -1758
2459 -1758 -1372 939 -2088 -2910 1746 -417 -832 2588 2227 -830 15 1184 -622 -1712 145 -261
2475 -261 -1468 338 1703 -932 797 2197 -907 492 2859 -559 -2514 95 -697 -1361 -416 1024
2491 1024 60 540 1951 1009 -645 1451 916 -1173 -449 -540 -2496 -589 342 708 -1028 1585 2202
2508 2202 -745 250 1407 -681 -2503 265 -1145 -1919 450 544 -1275 1415 1941 -348 377 1713
2524 1713 -1174 -2798 568 375 -2341 -456 2089 -605 -849 3453 620 281 657 1234 -823 -1485
2540a485J224k879Q12M144q71r16K018R01k628q37J649k583q18J617n39j172K001
2557c62K233k883K287J523j987j773J340M14l600Q09K367j641n4L904j041j291
2573B45K378o48k155j75P23j514M10J13n7o24J486J884k065J473P97j032j933
2590f94P35K89l238J322J891j007k05J947j93j022J888M16j928p1N69j946n58
2607a805K348j020Q0K439o00j411R28J65j172p72M92p04o17P93J285k174K953
2624A208L91l40l12J210j529j817J618j504j280N07K370j417N24J857k10j496
2640b20L222j293l650J164J294l057k27K657q60L14J863R71j015Q30j19k363j271
2657a760J421o15j095J970r7O6P03J222j514J66K055j427l114J825j23k049N16
$$ plain form
2540 -1485 -261 -3140 -2328 1816 945 29 2047 2948 320 -517 1132 -1451 -2269 -652 -1191 -2363 -362
2557 -362 1871 -1012 1275 2798 811 -962 378 792 -2808 -1999 368 -1273 -1327 2577 1536 245
2573 245 2623 1975 -180 -355 368 -1146 -736 -623 -680 -1304 182 2066 1 1474 2271 1239 -694
2590 -694 41 330 -2908 -1586 305 -702 -907 1040 847 -175 1713 2129 201 130 699 -1247 -1805
2607 -1805 543 -477 -397 2042 1442 31 959 1124 -48 -820 -328 -1032 -1649 -856 429 -1745 1208
2624 1208 1599 1259 947 2157 628 -1189 429 -1075 -2355 -1848 522 -895 -371 1486 1276 -220
2640 -220 3002 1709 -1941 -777 517 -2540 -2767 -110 -970 -656 1207 2178 1163 1993 1874 -489 -1760
2657 -1760 -339 -954 -2049 -79 -176 -110 593 1815 301 467 2522 1095 -2019 -194 -317 -2366 -1850
2674a850K220M99j779L292Qk773J936j6k512n46R97j442k62K123J402p91K28J340
2692B074m25m90N56q28j889l56M27j078Q62J580L85J80J633j473l08p16M80j730
2710a116q3M50l39r03J996Q99N88l86p54J188m84r02j186l89L20k60j26J237O59
2729D09O3J143j006L53o88K84j485r57P4Q79j271J903L00N12M45m0O15j494L27
2748C66k4k097p92J491q37J36K169M3N74P08O43j027j263Q00k103j752J131N92
2766a242q05J387J793m81m68K036j112j356K92L74k576J94M31L4m2K444Q00p54
2784I49J320J22j892m64K9j040j001J324L0q46J414K608k369M01J610r64k019
2801g88M55J61k139J09J046M12K04J950K27m72M84M58k666k06m59j073M91M93
$$ plain form
2674 -1850 370 869 -910 2382 2390 -383 1553 1537 -975 -1521 -524 -1966 -2228 -105 1297 506 734 2074
2692 2074 1649 1159 1715 887 -1002 -1358 -931 -2009 -1147 433 818 998 2631 1158 850 134 614 -1116
2710 -1116 -1199 -749 -1088 -1991 5 904 1492 1106 352 1540 1056 154 -1032 -1421 -1101 -1361 -1487 -250 409
2729 409 472 1615 609 962 274 558 -927 -1884 -1810 -931 -2202 -299 1 513 958 918 1533 39 366
2748 366 342 -1755 -2547 -1056 -1893 -1757 412 455 1029 1737 2380 1353 90 890 -1213 -2965 -1834 -1242
2766 -1242 -2047 -660 1133 652 184 2220 1108 -248 44 418 -2158 -1964 -1533 -1499 -1541 903 1703 949
2784 949 2269 2391 499 35 64 -976 -1977 -653 -623 -1469 -55 2553 184 585 2195 1231 -788
2801 -788 -333 -172 -2311 -2202 -1156 -744 -540 1410 1637 1165 1649 2107 -559 -765 -1224 -2297 -1806 -1313
2819a313P78K43Q42Q59k79o60J361j528o99o30q15j89L25J436k05K49Q67M01Q00
2838A843r5j895p51N42m85p39L63j97L14N68J904M78j02k52Q8j988k42k77p95
2857a718o79L12J806M79J130J359r72R04j125k832o8R5k22q64j36K561p89N76
2875a83K098l58K98r47n31n59r17m11k42q15L208J23q34J621P07j150k68Nj339
2894d94j063K04K8q61J172K113q89O78J672p72j298n1j30j633M66K85n91p37K229
2913C28O21l58J585k85j030o07m5j094l07P54j801K75K106Q04o94P71O13n65l67
2932G04l61j182o01n48J038R9k51J886P74j185J612l54o82rj814o05k28L77o81
2951b011K0K423O42o91P08J33L80k090Q68j066q92Q09o89l99K041Q10m68J827
$$ plain form
2819 -1313 -535 -292 550 1409 1130 470 1831 303 -396 -1026 -1841 -2030 -1705 -269 -474 -225 642 1043 1843
2838 1843 1748 -147 -898 -356 -841 -1580 -1217 -1414 -1100 -532 1372 1850 1748 1496 1584 -404 -646 -923 -1718
2857 -1718 -2397 -2085 -279 200 1330 2689 1717 2621 1496 -1336 -1404 -1309 -1531 -2395 -2531 30 -759 -183
2875 -183 1915 1557 1855 908 377 -182 -1099 -1510 -1752 -2567 641 764 -70 1551 2258 1108 840 845 -494
2894 -494 -1557 -1353 -1325 -2186 -1014 1099 210 888 2560 1788 490 439 309 -1324 -858 -573 -1164 -1901 328
2913 328 949 591 2176 1891 861 254 209 -885 -1192 -438 -2239 -1964 142 946 252 1023 1636 1071 704
2932 704 343 -839 -1440 -1988 -950 -851 -1102 784 1558 373 1985 1631 949 940 -874 -1479 -1707 -1330 -2011
2951 -2011 -1991 432 1074 383 1091 1224 1604 -486 382 -684 -1576 -767 -1456 -1855 186 996 528 2355
2969B355j08j137j044K01j086j531j35J229r2J009J803j076J354%r6j328m15l80
2987d77j894Q51l52L24o25L413k65j21J379p56m01n50l62j334j587R97M15L10
3005a035J250O77P21Q44q9j95k061k91O52k381j76J158Q32n07K211q02l8O35K01
3024A606j347n18L55j952k44j80K199K32K71K148j317M03J19j574q91p74m6n94
3042b104MJ596K07R58M62N22m41R31n6k428j24m67q53J43J346P1J234O5R08p40
3062A234j24k03p96j061r82M58j137J968J13P90p2J680j52p36L03j302j270N10
3080g79n07j45o09J535N22J009R34O68r32m24lr26j613j215J9J120M01P77P96
3099F28P25J437j100o02J96j435j032N47p62j045J628J063o45J404J028j46j027
$$ plain form
2969 2355 2247 1110 66 267 -819 -2350 -2485 -1256 -1348 -339 1464 388 1742 1742 1646 318 -97 -477
2987 -477 -2371 -1520 -1872 -1548 -2173 1240 975 854 2233 1477 1076 526 164 -1170 -2757 -1760 -1345 -1035
3005 -1035 215 892 1613 2457 2368 2173 112 -179 473 -1908 -2084 -926 -94 -601 1610 808 770 1405 1606
3024 1606 259 -259 96 -1856 -2100 -2280 -81 151 422 2570 1253 1656 1775 201 -690 -1464 -1510 -2104
3042 -2104 -2100 -504 -297 661 1123 1645 1204 2135 2079 -349 -473 -940 -1793 -1650 -304 -233 1001 1066 1974 1234
3062 1234 1110 907 111 -950 -1932 -1474 -2611 -643 -530 260 188 1868 1716 980 1283 -19 -1289 -779
3080 -779 -1286 -1431 -2040 -505 17 1026 1960 2628 1696 1272 1269 343 -1270 -2485 -2466 -1346 -945 -168 628
3099 628 1353 2790 1690 1088 1284 -151 -1183 -636 -1398 -2443 -815 248 -397 1007 2035 1889 862
3116H62k2j217q32m52K35k88M31Q72J119N63q6J140j34j867K10j225j636J260
3134a067m44o83J425J060J64K05K936k153j214P80r35j134n71R28j449N69J937
3151C54j43J059k75L63k62q75K44j454j396P58J269j897K193J191n91J343j80
3168A701L68j116l82j330j558N65P84K23P01J66R76L44L74p37r63k2k27j973R7
3187b009Q34K09Q68J171O67j231J130l57p0j560l01n71l06Q6J005o52J186J481
3205A580j485J364k10q47p51K77j067j043O34O68L95J332O97M76j067P63P02k575
3223a57p10m82q69K69J629j07l32J259R63o37J64N27j890l32J00p33j379J810
3241i07K39j139K030J790j121Q87l17J04k108j207J079j243K11P80M32M74J484
$$ plain form
3116 862 840 -377 -1209 -1661 -1426 -1714 -1283 -411 708 1271 1185 2325 2191 324 534 -691 -2327 -1067
3134 -1067 -1511 -2194 -769 291 455 660 3596 1443 229 1009 74 -1060 -1631 -703 -2152 -1583 354
3151 354 211 1270 995 1358 1096 221 465 -989 -2385 -1627 -358 -2255 -62 1129 538 1881 1701
3168 1701 2069 953 571 -759 -2317 -1752 -968 -745 -44 122 1098 1442 1816 1079 116 94 -133 -2106 -2009
3187 -2009 -1175 -966 -98 1073 1740 509 1639 1282 1212 -348 -649 -1220 -1526 -1440 -435 -1087 99 1580
3205 1580 95 1459 1249 402 -349 -72 -1139 -2182 -1548 -880 -485 847 1544 2020 953 1716 2418 -157
3223 -157 -867 -1349 -2218 -1949 -320 -427 -759 500 1463 826 990 1517 -373 -705 -605 -1338 -2717 -907
3241 -907 -668 -1807 223 2013 892 1779 1462 1566 -542 -1749 -670 -1913 -1702 -922 -490 -16 1468
3258A468J49n21N11m31k111Q2K31j066nJ459j48J30J069J165j277J4J272j465
3276E26k160N52N57q60N15R73n42J033J661q54k01R23j630j642K34j40L53n98
3294a300J543k46O36P72l07k16J29R8k335N53l95m87r6R23N08K88J754M8k98n36
3314A036J11q61k109P1M89m33L30K400j068L11J687m41M52m78j135k141R99K14
3332e66q35O10J031m02J030P4O18p45j38n98q12j007L39Q54j947J917J659l58
3350G24J169l47K17j352P9n94j403o2J555o07m19J847O7K12M11K45j539m67m13
3369f77p42l24l59J125o34J958R35q39J99O93k30j012N38j851p02L79M47K64k42
3388a074K366k68m25J872j606q24R6r38j037Q20m35j37R14J214Q56j592K240p14
$$ plain form
3258 1468 1617 1096 1607 1176 -935 -853 -622 -1688 -1693 -234 -382 -252 817 1982 705 719 1991 526
3276 526 -1634 -1082 -525 -1385 -870 103 -439 594 2255 1401 1200 2123 493 -1149 -915 -1055 -702 -1300
3294 -1300 243 -3 633 1405 1098 882 1011 1109 -1226 -673 -1068 -1555 -1651 -728 -220 68 1822 1870 1572 1036
3314 1036 1147 286 -1823 -1752 -1263 -1696 -1366 1034 -34 277 1964 1523 1975 1497 362 -1779 -780 -566
3332 -566 -1401 -791 240 -162 868 942 1560 815 677 79 -733 -1740 -1401 -547 -2494 -577 1082 724
3350 724 1893 1546 1763 411 490 -104 -1507 -1569 -14 -621 -1040 807 874 1086 1497 1742 203 -264 -677
3369 -677 -1419 -1743 -2102 -977 -1611 347 1282 443 642 1335 1105 93 631 -1220 -1922 -1543 -1096 -832 -1074
3388 -1074 1292 1024 599 2471 865 41 137 -801 -1838 -1018 -1453 -1590 -676 538 1394 -198 2042 1328
3406A328r71m86k74p60K76M67l65r08J595R63j12J048k07o00o59r9j321J33o43
3425a595J83M74P17J767m88JN08p68j639J057k15j572O77K41o57J303J856M8j381
3444E17j91J766k261j81J68j835J456n51Q09m30k29K174l8j42k79o20j546J378
3462c5j050m76K09J054R99r36J958m0p18m43l92j138K26O71k127M00K195m16o56
3481g15J443j9N15p53P50j92k323M11k95j301J337N66k8J256R38l24j77Q55j190
3500G54q92n59J67j912J052J742l32J97N22M80l88j76K13j829j69N25M8p2K37
3519c92J310j236J331m33O9o01j23n22n17R67l32n60N04K58R67k5Q08j25j057
3538B91J42l50k319J042L18K43K01L38J269j377R42m51L12j306J459p04k047L21
$$ plain form
3406 1328 357 -129 -403 -1163 -887 -420 -785 -1693 -98 865 753 1801 1594 994 335 236 -1085 -952 -1595
3425 -1595 -1412 -938 -221 1546 1058 1059 1567 799 -840 217 2 -1570 -893 -652 -1309 -6 1850 1898 517
3444 517 326 2092 -169 -350 -182 -2017 -561 -1112 -303 -733 -962 1212 1174 1032 753 133 -1413 -35
3462 -35 -1085 -1561 -1352 -298 701 -235 1723 1683 965 522 130 -1008 -782 -111 -2238 -1838 357 -59 -715
3481 -715 728 709 1224 471 1221 1029 -1294 -883 -1178 -2479 -1142 -576 -604 652 1590 1266 1089 1944 754
3500 754 -138 -697 -530 -2442 -1390 352 20 217 739 1219 831 655 868 -961 -1130 -605 -557 -629 -392
3519 -392 918 -318 1013 580 649 48 -75 -597 -1114 -147 -479 -1039 -535 -277 690 665 1473 1348 291
3538 291 433 83 -2236 -1194 -876 -633 -432 -94 1175 -202 740 289 601 -705 754 50 -1997 -1676
3556a676O13L86R48L81r84J118k44j16n00k34k50o09rK50O57l12J402k27n49J439
3576A484p37R6o78j13j138m4P70j193L82K302k2j505J172J234k148J02n64Q94
3594B94k121J230J10o96R87J045k66j17K69R2l39m14o50r62M85R14j8l21J161
3613F83M99r84J992n64j400o07q6r2j183J580J5l70P30P68o79J979j101o50J3
3632E43l36j74j366Q74m39j09Q11N32p3m50J240n80r85Q48m21o04j49O58p52R89
3652E7J238l17r33J030j03j305l9o0o56p46K120o29J3j37R37O83L73p02n05p94
3672d75L91o06l82K52O51k92l0K541r87j823J612qj679N76j36k27J5k43N46M43
3692A39J504j197O7o0j3q97k84l70N55r13M75J010r9Q94J035m98j017P44j334
$$ plain form
3556 -1676 -1063 -677 271 652 -332 786 542 426 -74 -308 -558 -1167 -1176 -926 -269 -581 821 594 45 1484
3576 1484 747 843 165 52 -1086 -1130 -360 -1553 -1171 1131 1109 -396 776 2010 -138 -36 -600 294
3594 294 -1827 -597 -487 -1183 -196 849 583 466 735 827 488 74 -576 -1538 -1053 -139 -157 -478 683
3613 683 1182 198 2190 1626 226 -381 -467 -559 -1742 -162 -147 -517 213 981 302 2281 1180 530 543
3632 543 207 33 -1333 -459 -898 -1007 -196 336 263 -187 1053 473 -512 336 -85 -689 -838 -180 -932 57
3652 57 1295 978 45 1075 972 -333 -372 -432 -1088 -1834 286 -343 -330 -467 470 1153 1526 824 319 -475
3672 -475 -84 -690 -1072 -820 -169 -461 -491 2050 1063 -760 852 844 -835 -259 -395 -622 -607 -850 -304 139
3692 139 1643 446 513 453 440 -457 -741 -1111 -556 -1469 -994 16 -83 811 1846 1348 331 1075 -259
3711b59n55K25j02l11L8Q06J35N62m84R53j79K99j108n93l47K12K72%q12M91O39
3732a18Q42L93r62n76J548k025J18l39N02j030J243J166j059P78J345j749j0k06
3750a39p73j31j21R42k2l85N42j82j90J913n88o02J67r38j61P05l57r26O73M13
3770a60O34j82J004K31n86k29K28j229j537J481l89m59R18J658j669J567Jk84
3788I98r29N60m87j323J164l12j099N66J827r49N71L0L24o51l50q98r59O37Q99
3807c81L64j291J763P97j282R38l69L67r48P09j78j193L89l00K14N56J621j226
3825E50J08R2l45L24l07l35j623P04J117j226K87J083m93N02Ok33j04j20J02L13
3845D02j064j31q08J443p54J202J31J6M46L43j302j19O85j146O82n22mJ126K19
$$ plain form
3711 -259 -814 -589 -691 -1002 -964 -158 -23 539 55 1008 829 1128 20 -573 -920 -708 -436 -436 -1248 -757 -118
3732 -118 724 1117 155 -421 1127 -898 -780 -1119 -617 -1647 -404 762 -297 481 1826 77 67 -139
3750 -139 -912 -1043 -1164 -222 -244 -629 -87 -269 -459 1454 866 264 431 -507 -668 37 -320 -1246 -573 -160
3770 -160 474 292 1296 1527 941 712 940 -289 -1826 -345 -734 -1193 -275 1383 -286 1281 1282 998
3788 998 69 629 142 -1181 -17 -329 -1428 -862 965 16 587 617 941 290 -60 -958 -1917 -1280 -381
3807 -381 -17 -1308 455 1252 -30 908 539 906 -42 667 489 -704 -315 -615 -401 155 1776 550
3825 550 658 750 405 729 422 87 -1536 -832 285 -941 -654 429 -64 438 444 211 107 -13 89 402
3845 402 -662 -793 -1601 -158 -912 290 421 437 883 1226 -76 -195 490 -656 26 -496 -500 626 845
3864H45n33L80N31J96j932k2M05j551Q50K07K78m43J442l85k18O65J49o63K05
3883D06p58L06p52K79Q93q15Q97L97j183J171n61l48j46M49n27j34q89L84N67
3902c64J85M24Q57j60Q2k10mo85j98l18J28P6n65j39Q82J560j430K29Q64j850
3922f36r2k39P60j672J283O12P9j44Q54j289J442j41j837L12L95r33O47p64O35
3941g28Q58j57K86J48L01l40M76j779O45j98m56Q02j13J852o11p80P61j447J55
3960c25J073o23p31j58J00K44n29J262J23K64L88j72n52m43R12j639J053M0o24
3979c37l22J029m55j071J066J479j371M58o27m02O78l56o62r4J130l94O92o1P7
3998D57J12j85p38M74j028L26K10j206J247r5J067j028J739r33j041R2o07L95
$$ plain form
3864 845 312 692 1223 1419 -513 -535 -130 -1681 -831 -624 -346 -789 653 268 50 715 864 201 406
3883 406 -352 -46 -798 -519 374 -441 456 853 -330 841 280 -68 -214 235 -292 -426 -1315 -931 -364
3902 -364 -179 245 1102 942 1024 814 810 125 -73 -391 -263 -187 -752 -891 -9 1551 121 350 1214 -636
3922 -636 -728 -967 -207 -1879 -596 16 95 -49 805 -484 958 817 -1020 -708 -313 -1246 -599 -1363 -728
3941 -728 130 -27 259 407 708 368 844 -935 -290 -488 -944 -142 -255 1597 986 206 967 -480 -325
3960 -325 748 125 -606 -764 -664 -420 -949 313 436 700 1088 916 364 -79 833 -806 247 287 -337
3979 -337 -659 370 -85 -1156 -90 1389 18 476 -151 -553 125 -231 -893 -987 143 -251 441 380 457
3998 457 569 384 -354 120 -908 -582 -372 -1578 -331 -426 641 -387 1352 419 -622 -530 -1137 -742
4016g42M99O85n64k61Q20R72j679J564j074O34q34L18p56q3L67l03q8N30O44o03
4036D6M35J06j392J146p00N21q33KJ480j584Q99q99J168L55m13M38k027N11P40
4055am9k28j27n94r4o1R71J255q01P43j206jo32O31m75l87J579j274m9R39j36
4076CN03K10j77j112R72m38m89p03Q98P52j218J333%r72N95Q8m5K86m7j013J55
4097d19R28k88q17O78l5Q09k12K94l45r65r6j74K33m07J654j247l80O30J089j51
4117G79n6r76l82P93o54j296J421N66J56m86N32J365j599r6J7P04P3q45P8r24
4137h30J478j161J95J1R81r48Q80J81o91L26r89J216j223m98R91K62o52J299O17
4156A445j379L05m1M48q76j99n5K05N95r62J19M71J153j570M58n9J3l72K10L96
$$ plain form
4016 -742 -243 442 -122 -383 437 1409 -270 1294 220 854 20 338 -418 -501 -134 -437 -525 5 649 46
4036 46 481 587 -805 341 -359 162 -671 -669 811 -773 126 -773 395 750 337 775 -1252 -741 -1
4055 -1 -50 -278 -405 -999 -1093 -1154 -183 1072 271 1014 -192 -193 -825 -194 -669 -1056 523 -751 -800 139 3
4076 3 506 716 539 -573 399 -39 -528 -1231 -333 419 -799 534 534 -438 157 245 200 486 439 -574 -419
4097 -419 509 221 -596 82 47 856 644 938 593 -372 -468 -642 -409 -816 838 -409 -789 -159 930 779
4117 779 723 -253 -635 158 -496 -1792 -371 195 351 -135 397 1762 163 67 84 788 861 16 94 -830
4137 -830 648 -513 -318 -307 674 -274 606 787 96 422 -567 649 -574 -1072 -81 181 -471 828 1445
4156 1445 66 371 330 778 -98 -297 -352 -147 448 -514 -395 76 1229 -341 117 58 71 -301 -91 305
4176C05mK23L5r88J445k29n04o02o84J016L99j383J241q56J206j097L05j74M95
4195A49N39n76L9J71K2j717J312K03o69M59Q33j162J225l29j08j314J077q07J255
4214F02o82P00j487L90Q23n58M60n3O90l95p55l39K87o43J044Q7n12L43l35N19
4234A86l21j13J248j366M31k56n36P95k57p19M44N97J05J262q42n27n31P26q66
4253e40M78k9N89j400n9K096p92m43J433q72q17P43k13P2n61P16r54Q3P83M27
4273G40j034L23L21o66L6n49O73L25j39l38R0L82Nn67P48l40M70q3n27M98j195
4294h27J154P25l58r85N31J82q40P26N02q41j7o44Q13Q3j77L86o76j37k73P45
4314G2o56O67M61r96q04Q14j6L82M63l26l07J239j383O7L82J43N75p19J09j043
$$ plain form
4176 305 301 524 559 -429 1016 787 283 -319 -1003 13 412 -971 270 -586 620 -477 -172 -346 149
4195 149 688 112 151 322 344 -1373 -61 142 -527 -68 765 -397 828 499 391 -923 154 -653 602
4214 602 -80 620 -867 -477 346 -212 248 195 885 490 -265 -604 -317 -960 84 171 -341 2 -333 186
4234 186 -135 -248 1000 -366 65 -191 -727 68 -189 -908 -464 133 238 1500 658 131 -400 326 -540
4253 -540 -62 -91 498 -902 -961 1135 343 -100 1333 461 -356 387 174 246 -315 401 -553 -470 313 740
4273 740 -294 29 350 -316 -280 -829 -156 169 30 -308 -218 164 169 -398 350 10 480 397 -130 368 -827
4294 -827 327 1052 694 -291 240 422 -418 308 810 -31 -48 -692 121 204 27 413 -263 -400 -673 72
4314 72 -584 83 544 -452 -1256 -442 -458 -76 387 61 -246 993 -390 -323 59 202 777 58 167 -876
4334h76N02L9k30J218p24o85N79N49N99j013l47K98Q93j80l0n36p1J60k09R04
$$ plain form
4334 -876 -374 -335 -565 653 -71 -756 -177 372 971 -42 -389 -91 802 622 592 56 -15 145 -64 840
$$ [...]
8191C69
##END NTUPLES=NMR FID
##END=
