##TITLE=1H_UK_23_5
 CD2Cl2
 108 sc, 
 16.12.2021
##JCAMPDX= 6.0         $$ Bruker NMR JCAMP-DX V2.0
##DATA TYPE= NMR FID
##DATA CLASS= NTUPLES
##ORIGIN= UXNMR, Bruker Analytische Messtechnik GmbH
##OWNER= root
$$ XWIN-NMR		Version 3.5
$$ Thu Dec 16 11:50:49 2021 Russian Standard Time (UT+4h)  she@DPX200
##.OBSERVE FREQUENCY= 200.131346
##.OBSERVE NUCLEUS= ^1H
##.DELAY= (6, 6)
##.ACQUISITION MODE= SIMULTANEOUS
##.ACQUISITION SCHEME= undefined
##.AVERAGES= 108
##.DIGITISER RES= 18
##SPECTROMETER/DATA SYSTEM= spect
##.PULSE SEQUENCE= zg30
##.SOLVENT NAME= CD2Cl2
##.SHIFT REFERENCE= (INTERNAL, CD2Cl2, 0, 15.7039)
##AUDIT TRAIL= $$ (NUMBER, WHEN, WHO, WHERE, WHAT)
$$ ##TITLE= Audit trail, XWIN-NMR		Version 3.5
$$ ##JCAMPDX= 5.01
$$ ##ORIGIN= Bruker BioSpin GmbH
$$ ##OWNER= she
$$ F:/spectra/data/she/nmr/H-F/1/audita.txt
$$ ##AUDIT TRAIL=  $$ (NUMBER, WHEN, WHO, WHERE, WHAT)
(   1,<2021-12-16 11:49:44.98 +0400>,<she>,<DPX200>,
      <continue with go, POWCHK disabled, PULCHK disabled
       configuration hash MD5:
       00 E9 B6 7A A2 85 ED C7 34 08 36 98 17 FE 4E 26
       data hash MD5: 16K
       CE 86 CF 03 67 C3 78 D4 4F 7F C1 28 73 9A A5 37>)
$$ ##END=
$$ 
$$ hash MD5
$$ 91 E7 C2 7C B8 38 AC EE 11 86 7C A6 7A 00 5E A9
##$RELAX= 
##$RELAX= 
##$RELAX= 
##$RELAX= 
##$RELAX= 
##$RELAX= 
$$ Bruker specific parameters
$$ --------------------------
##$DU= <F:/spectra>
##$EXPNO= 1
##$NAME= <H-F>
##$PROCNO= 1
##$TYPE= <nmr>
##$USER= <she>
##$AMP= (0..31)
100 100 100 100 100 100 100 100 100 100 100 100 100 100 100 100 100 100 
100 100 100 100 100 100 100 100 100 100 100 100 100 100 
##$AQSEQ= 0
##$AQ_mod= 1
##$AUNM= <au_zg>
##$AUTOPOS= <>
##$BF1= 200.13
##$BF2= 200.13
##$BF3= 200.13
##$BF4= 200.13
##$BF5= 200.13
##$BF6= 200.13
##$BF7= 200.13
##$BF8= 200.13
##$BYTORDA= 1
##$CFDGTYP= 0
##$CFRGTYP= 5
##$CHEMSTR= <none>
##$CNST= (0..31)
1 1 145 1 1 1 1 1 1 1 1 1 1 1 1 1 1 1 1 1 1 1 1 1 1 1 1 1 1 1 1 1 
##$CPDPRG= <>
##$CPDPRG1= <>
##$CPDPRG2= <>
##$CPDPRG3= <>
##$CPDPRG4= <mlev>
##$CPDPRG5= <mlev>
##$CPDPRG6= <mlev>
##$CPDPRG7= <mlev>
##$CPDPRG8= <mlev>
##$CPDPRGB= <>
##$CPDPRGT= <>
##$D= (0..31)
0 1.2 0 0 0 0 0 0 0 0.06 0 0.03 0 0 0 0 0.0002 0 0 0 0 0 0 0 0 0 0 0 0 
0 0 0 
##$DATE= 1639640598
##$DBL= (0..7)
120 120 120 120 120 120 120 120 
##$DBP= (0..7)
150 150 150 150 150 150 150 150 
##$DBP07= 0
##$DBPNAM0= <>
##$DBPNAM1= <>
##$DBPNAM2= <>
##$DBPNAM3= <>
##$DBPNAM4= <>
##$DBPNAM5= <>
##$DBPNAM6= <>
##$DBPNAM7= <>
##$DBPOAL= (0..7)
0.5 0.5 0.5 0.5 0.5 0.5 0.5 0.5 
##$DBPOFFS= (0..7)
0 0 0 0 0 0 0 0 
##$DE= 6
##$DECBNUC= <off>
##$DECIM= 32
##$DECNUC= <off>
##$DECSTAT= 4
##$DIGMOD= 1
##$DIGTYP= 9
##$DL= (0..7)
0 120 120 120 120 120 120 120 
##$DP= (0..7)
150 150 150 150 150 150 150 150 
##$DP07= 0
##$DPNAME0= <>
##$DPNAME1= <>
##$DPNAME2= <>
##$DPNAME3= <>
##$DPNAME4= <>
##$DPNAME5= <>
##$DPNAME6= <>
##$DPNAME7= <>
##$DPOAL= (0..7)
0.5 0.5 0.5 0.5 0.5 0.5 0.5 0.5 
##$DPOFFS= (0..7)
0 0 0 0 0 0 0 0 
##$DQDMODE= 0
##$DR= 18
##$DS= 0
$$ [...]
##$SUBNAM2= <"">
##$SUBNAM3= <"">
##$SUBNAM4= <"">
##$SUBNAM5= <"">
##$SUBNAM6= <"">
##$SUBNAM7= <"">
##$SUBNAM8= <"">
##$SUBNAM9= <"">
##$SW= 18.0517287032376
##$SWIBOX= (0..15)
0 0 2 0 0 0 0 0 0 0 0 0 0 0 0 0 
##$SW_h= 3612.71676300578
##$TD= 16384
##$TD0= 1
##$TE= 0
##$TE2= 300
##$TE3= 300
##$TEG= 300
##$TL= (0..7)
0 120 120 120 120 120 120 120 
##$TP= (0..7)
150 150 150 150 150 150 150 150 
##$TP07= 0
##$TPNAME0= <>
##$TPNAME1= <>
##$TPNAME2= <>
##$TPNAME3= <>
##$TPNAME4= <>
##$TPNAME5= <>
##$TPNAME6= <>
##$TPNAME7= <>
##$TPOAL= (0..7)
0.5 0.5 0.5 0.5 0.5 0.5 0.5 0.5 
##$TPOFFS= (0..7)
0 0 0 0 0 0 0 0 
##$TUNHIN= 0
##$TUNHOUT= 0
##$TUNXOUT= 0
##$USERA1= <user>
##$USERA2= <user>
##$USERA3= <user>
##$USERA4= <user>
##$USERA5= <user>
##$V9= 5
##$VALIST= <valist>
##$VCLIST= <CCCCCCCCCCCCCCC>
##$VD= 0
##$VDLIST= <DDDDDDDDDDDDDDD>
##$VPLIST= <PPPPPPPPPPPPPPP>
##$VTLIST= <TTTTTTTTTTTTTTT>
##$WBST= 1024
##$WBSW= 4
##$XGAIN= (0..3)
0 0 0 0 
##$XL= 0
##$YL= 0
##$YMAX_a= 599627
##$YMIN_a= -524696
##$ZGOPTNS= <>
##$ZL1= 120
##$ZL2= 120
##$ZL3= 120
##$ZL4= 120
##$ABSF1= 10
##$ABSF2= 0
##$ABSG= 5
##$ABSL= 3
##$ALPHA= 0
##$AQORDER= 0
##$ASSFAC= 0
##$ASSFACI= 0
##$ASSFACX= 0
##$ASSWID= 0
##$AUNMP= <proc_1d>
##$AZFE= 0.1
##$AZFW= 0.1
##$BCFW= 1
##$BC_mod= 2
##$BYTORDP= 1
##$COROFFS= 0
##$CY= 11.3945322036743
##$DATMOD= 1
##$DC= 2
##$DFILT= <>
##$DTYPP= 0
##$F1P= 2.36226072786647
##$F2P= -0.459571619588291
##$FCOR= 0.5
##$FTSIZE= 0
##$FT_mod= 4
##$GAMMA= 1
##$GB= 0.15
##$INTBC= 1
##$INTSCL= 1
##$ISEN= 128
##$LB= 0.24
##$LEV0= 0
##$LPBIN= 0
##$MAXI= 10000
##$MC2= 0
##$MEAN= 0
##$ME_mod= 0
##$MI= 1.114404
##$NCOEF= 0
##$NC_proc= 0
##$NLEV= 6
##$NOISF1= 3.799351
##$NOISF2= 2.8
##$NSP= 1
##$NTH_PI= 0
##$NZP= 0
##$OFFSET= 15.70392
##$PC= 1
##$PHC0= -15870.7
##$PHC1= 13.60079
##$PH_mod= 1
##$PKNL= yes
##$PPARMOD= 0
##$PSCAL= 0
##$PSIGN= 0
##$REVERSE= no
##$SF= 200.130013532006
##$SI= 16384
##$SIGF1= 3
##$SIGF2= 2
##$SINO= 400
##$SIOLD= 16384
##$SREGLST= <1H.CDCl3>
##$SSB= 0
##$STSI= 0
##$STSR= 0
##$SW_p= 3612.71676300578
##$SYMM= 0
##$S_DEV= 0
##$TDeff= 0
##$TDoff= 0
##$TI= <>
##$TILT= no
##$TM1= 0
##$TM2= 0
##$TOPLEV= 0
##$USERP1= <user>
##$USERP2= <user>
##$USERP3= <user>
##$USERP4= <user>
##$USERP5= <user>
##$WDW= 1
##$XDIM= 8192
##$YMAX_p= 0
##$YMIN_p= 0
$$ End of Bruker specific parameters
$$ ---------------------------------
##NTUPLES= NMR FID
##VAR_NAME=  TIME,          FID/REAL,        FID/IMAG
##SYMBOL=    X,             R,               I
##VAR_TYPE=  INDEPENDENT,   DEPENDENT,       DEPENDENT
##VAR_FORM=  AFFN,          ASDF,            ASDF
##VAR_DIM=   8192,          8192,            8192
##UNITS=     SECONDS,       ARBITRARY UNITS, ARBITRARY UNITS
##FACTOR=    0.0002768,     1,               1
##FIRST=     0,             0,               0
##LAST=      2.2672688,     0,               0
##MIN=       0,             -524696,         0
##MAX=       2.2672688,     599627,          0
$$ Real data points
##PAGE= N=1
##DATA TABLE= (X++(R..R)), XYDATA
0 0 0 0 0 0 0 0 0 0 0 0 0 0 0 0 0 0 -5 107 -108 108 -108 108 -165 214 -216 227 -322 325 -428 434 -536 626 -678
33 -678 763 -864 983 -1110 1253 -1397 1557 -1738 1931 -2140 2372 -2613 2899 -3198 3522 -3880
49 -3880 4275 -4711 5186 -5719 6313 -6977 7721 -8568 9535 -10665 11989 -13582 15525
62 15525 -17971 21139 -25450 31668 -41493 59384 -103000 500753 195299 -208504 500482
73 500482 -32507 -498398 102587 336472 -271747 -2225 347835 -155493 -327418 229506
83 229506 94094 -267313 71564 218573 -326241 -361408 37318 -93553 -274244 160671
93 160671 317969 -33739 -2655 240159 -12375 -138709 164522 102933 -186852 -7774
103 -7774 81445 -213055 -136451 185224 74397 -27022 187295 129550 -123706 -70673 -15485
114 -15485 -125608 -60315 36702 -43764 -31141 51797 -1779 17706 146720 117687 40953 59590
126 59590 -6370 -111352 -77111 -61971 -95124 9390 92080 -12455 -23845 102387 34044
137 34044 -87094 38451 96184 -103201 -139138 9532 -83103 -170261 50954 125917 -34799
148 -34799 73007 204961 -25212 -85239 142034 21199 -194784 33601 120058 -174216
158 -174216 -102124 183652 19272 -98859 186692 168559 -121097 -11719 108187 -155903
168 -155903 -170982 94397 -22424 -197819 56333 143670 -117161 -33834 217104 30411
178 30411 -133635 90328 76625 -195627 -92405 92660 -80794 -97484 154832 88960 -84530
189 -84530 98061 159324 -84300 -47878 132055 -48982 -186997 13601 36912 -136493 -24843
200 -24843 136952 20559 -18008 114435 56920 -70924 -602 24864 -92352 -68745 34309
211 34309 -31294 -76714 46775 88085 4732 29963 98958 23794 -55030 -23823 -21645 -73274
223 -73274 -62180 -17297 -12445 3727 33427 37755 35722 43277 38039 7537 -21883 -29139 -33967
236 -33967 -54180 -61284 -1569 40385 5687 16869 88389 61321 -17131 16350 41414 -48841
248 -48841 -75735 -5821 -34116 -74256 3497 41089 -14717 34254 100319 11399 -35787 46912
260 46912 9675 -111508 -44775 37722 -61070 -76583 64151 57073 -29960 53018 102590 -12748
272 -12748 -22663 53439 -34148 -107156 806 10063 -92113 -11768 102971 5712 -34577 97822
284 97822 72614 -60976 -7768 51856 -67792 -96538 15992 -8881 -70721 31028 76674
295 76674 -16936 18108 102211 5159 -64877 30095 19218 -103626 -52339 42058 -31945 -60545
307 -60545 58485 70585 -10165 33395 72811 -13874 -39748 16157 -30300 -81217 -13224 17249
319 17249 -43589 -7393 78360 37891 -16752 46335 57022 -31414 -43418 4763 -32444 -69253
331 -69253 -15703 10808 -14802 16969 54965 23886 11856 45319 19728 -41412 -23350 -1368
343 -1368 -46681 -57165 3826 24838 -9490 16629 61904 40075 2012 13971 10059 -30390
355 -30390 -39801 -19331 -34852 -36168 3060 14998 2004 32093 59305 18556 -8703 19978
367 19978 7226 -51490 -48118 -1338 -20808 -43255 11906 42451 9345 18564 49174 19135
379 19135 -11393 7734 -9208 -56014 -29849 2061 -36676 -30153 46071 37611 -10493 33663
391 33663 68397 -4206 -33392 15577 -6080 -64917 -25376 9404 -29551 -12441 50452 26620
403 26620 -1524 49955 39571 -40310 -20656 25769 -41345 -77438 3620 15481 -45794 343
415 343 68396 15992 -7965 49657 25497 -39863 -6925 7442 -59532 -42855 27182 -6920
427 -6920 -33596 47054 62570 -12200 10234 63629 -1956 -52693 -1635 -864 -59424 -27009 19575
440 19575 -12409 -6435 49918 29170 -7269 32464 32374 -39921 -30912 12352 -29972 -59657 150
453 150 23941 -15427 8588 50248 25797 2686 20545 5625 -25867 -16209 -17341 -37909 -22438
466 -22438 11010 4621 -665 32372 39615 13722 4124 12736 853 -25837 -31987 -16763 -11078
479 -11078 -12632 -3474 19156 27743 20600 22110 24285 7028 -8130 -11036 -24642 -31992 -12212 -11635
493 -11635 -23588 6621 37821 11208 -366 40140 26047 -29664 -16334 10208 -32210 -44511
505 -44511 3051 -183 -18438 26178 39907 -959 15580 46933 -7974 -35599 15656 259
517 259 -62269 -20415 34635 -15365 -22455 46145 34164 -14651 21573 34121 -27761 -24929 12665
530 12665 -31489 -52816 17107 13403 -38460 12890 61911 -251 -16049 44981 16917 -46198
542 -46198 -10725 12370 -40414 -31542 19380 -4319 -13781 43220 32459 -13354 18606 36728
554 36728 -24414 -34539 11482 -12243 -49148 -6067 22176 -7255 3892 36261 17757 1551
566 1551 19287 3972 -24120 -9015 -6269 -32767 -18932 13062 2947 -7024 21333 29294 9536
579 9536 3950 7726 -7124 -14905 -19908 -24035 -13537 -2186 -9429 -588 26379 21522 6767 19170
593 19170 14661 -9275 -8733 -7980 -23182 -14166 2438 -10467 -6245 31448 24561 -7677 18570 31309
607 31309 -12201 -24213 6069 -12521 -39817 -5782 8077 -16592 6714 34297 5430 -378
619 -378 34612 8958 -34192 -2925 12680 -39164 -33110 22143 3315 -24686 25033 37555 -7836
632 -7836 6270 32018 -13754 -26299 13186 -13136 -45541 3017 22110 -25312 -3417 48319
644 48319 12939 -17930 25430 21475 -31119 -16292 9529 -24764 -26141 13655 3900 -11521 25036
657 25036 30241 -9267 3773 30676 -9258 -30455 568 1276 -32828 -13133 15616 962 -886
670 -886 23629 15688 2276 12881 3430 -19516 -9732 28 -22049 -17052 8972 5840 -2985 13757
684 13757 20700 8456 4974 3758 -7050 -4585 -10138 -20213 -9936 2899 -4532 -2141 19062
697 19062 15302 2103 8269 11719 -5844 -7118 -6329 -17770 -14138 2277 -4695 -10474 18198 23163
711 23163 -3427 3331 24974 -190 -22531 -1584 -1154 -25372 -10384 9110 -8620 -4079 26281
724 26281 9427 -5299 21806 16604 -25739 -10044 14677 -21079 -29823 10433 8392 -17549 8756
737 8756 27599 496 -817 18947 -2680 -19517 2390 -2328 -30047 -6702 19503 -8316 -9612
750 -9612 29057 19689 -13066 6667 19879 -12503 -19503 2146 -8099 -20287 3000 7464 -9127
763 -9127 10754 24398 451 -1722 20096 3258 -23229 -5885 4165 -16967 -13772 6971 2961
776 2961 176 12043 10679 3410 7523 3351 -10349 -7899 -288 -9233 -13534 216 7737 -336
790 -336 4377 12330 10720 4077 -1167 -1411 -1772 -8081 -13852 -10310 2408 325 -1599 7090 13490 5857
806 5857 3453 3860 -3 -5610 -4274 -11704 -10553 3898 -51 -8415 8004 18310 1297 -2006
820 -2006 13154 4676 -14429 -5350 -737 -11075 -8867 2089 -3626 -1941 13506 7548 -4289 7527
834 7527 11156 -11471 -11790 7899 -3712 -20727 -248 11554 -4445 -475 15479 7193 -2608
847 -2608 8712 1889 -13222 -1432 845 -17571 -10332 11472 3080 -11976 10374 18668 -3005
860 -3005 -1722 10844 -680 -14122 -3496 -1833 -11917 -2696 5569 -2221 2070 14852 5896 -6067
874 -6067 5490 7122 -11074 -11428 3071 -2738 -13023 253 8480 2172 2546 8151 4357 474
888 474 3670 -2555 -10333 -3301 -1000 -9810 -5982 8057 4662 -2265 4676 10109 3672 -4262 -531
903 -531 543 -6368 -8629 -3116 -468 -960 453 2294 5778 7806 3855 -1240 421 2228 -4180 -9925
919 -9925 -4639 1659 -1132 -4745 4696 10283 4960 -1102 4878 4568 -2694 -6174 -2581 -3671 -5573
934 -5573 -2069 -1519 1559 8398 3909 -845 1731 8446 -2486 -11951 -1406 -113 -8660 -8619 5634
949 5634 2305 -3123 4310 7803 2605 1554 1426 -4732 -4489 1328 -3733 -8852 3252 7727 -4847
964 -4847 -587 12139 6132 -8750 2509 6504 -6893 -7880 31 -1592 -5217 2439 2869 -594 5011
979 5011 10138 -4305 -2399 8918 -1083 -13147 -1702 4767 -7333 -7085 5260 4074 -3372 3449
993 3449 5276 -660 1814 1684 -5978 -5716 2824 -3344 -8330 3817 9567 -4341 -2873 8056 3587
1008 3587 -6556 -2430 3272 -4297 -5406 379 -2960 1292 4271 610 -3181 6300 4761 -5467
1022 -5467 -3262 6323 -3476 -8958 -4799 996 -2159 -2471 1553 3153 2511 -82 -3301 908 3147
1037 3147 -4127 -6064 -178 767 -2139 -1395 2510 2962 3463 707 -11 2181 1199 -5257 -4366 2774 401
1054 401 -6275 -510 6855 769 -1556 5476 3702 -2647 -729 961 -5001 -1666 2932 -4593 -3904
1069 -3904 5772 1349 -7037 2828 9205 -4969 -3964 6866 47 -8929 657 3132 -5352 170
1083 170 5188 -3953 -46 7918 -1032 -7067 3309 5712 -8167 -5296 9312 254 -8855 2517
1097 2517 7020 -3050 99 6181 -228 -731 5822 -3551 -7973 5214 2696 -9142 -1302 8272
1111 8272 -1604 -7274 6284 5068 -5817 -1875 5677 -5450 -3797 3390 -3232 -2299 5676 2111
1125 2111 -6301 2909 8237 -3160 -3150 5525 1757 -6718 -2695 3005 -1375 409 1318 438 409 3495
1141 3495 -1831 -2555 3206 781 -5859 -302 5282 -748 -4312 1826 144 -2221 97 1654 -565
1156 -565 3686 688 -4367 2008 3780 -4382 -3800 5670 2211 -5339 -99 4798 -2582 -53 1189
1171 1189 -3189 -658 3426 -1157 -4706 4253 3029 -6552 -2237 4802 -1260 -7634 3035 3808 -4517
1186 -4517 -779 5021 -2967 -1665 3894 -2262 -3841 5537 2673 -9744 784 8513 -3760 -5863
1200 -5863 6840 2350 -7834 1343 5267 -3118 -2567 2608 -1632 -3929 4118 431 -5783 4363
1214 4363 5619 -6220 -2574 7858 -877 -7551 2000 4431 -2506 -1810 3525 -1123 -1467 1830 -452
1229 -452 -2961 1415 2566 -5519 -1521 4074 -482 -4566 2462 3624 -2563 918 1660 -488 -1279 190
1245 190 -1212 -122 592 -1235 -2348 2385 3535 -1650 -1249 4221 -138 -2388 1844 506 -1031 948
1261 948 -211 -618 2868 949 -2473 -1247 5072 -2213 -4646 1095 1831 -2367 -2301 547 -643 -1836
1277 -1836 2495 -588 -1922 3505 -164 -5132 -68 4390 -4951 -4483 5798 1229 -5992 1169 4425
1292 4425 -2627 -1315 4443 -1252 -2735 978 -1490 -3114 1994 2109 -5864 -2055 6427 -67 -5245
1307 -5245 1926 3949 -4531 -3127 1811 -1693 -1981 169 -219 -2146 3343 2254 -2901 423 6837
1322 6837 -1023 -3825 2125 1699 -5745 -3709 2626 -454 -2113 2198 952 1462 2602 785 -1975
1337 -1975 769 1082 -2616 -2922 1395 -325 -4166 1505 4341 405 326 18 25 915 -1693 -1368 -2863
1354 -2863 429 -266 -1778 381 3713 -49 -1236 2608 2063 -1434 -1752 -798 555 -15 -2051 -620
1370 -620 2816 2868 -2628 880 5433 1804 -3597 -1087 1845 -2354 -3121 -110 -823 374 1314 379 1399
1387 1399 3231 1849 -2341 -17 4222 -2941 -4850 -57 1819 -3458 5 3378 1922 242 452
1402 452 1486 -920 1669 -1837 -3815 -537 1082 -3276 -3117 3538 3915 -653 1559 4030 -619 -4224
1418 -4224 1621 -1584 -1611 1441 -1674 -1323 2716 3430 132 1394 4362 54 -4877 973 1560 -2149
1434 -2149 -3601 -2110 2453 -1126 -281 1235 2557 1459 -682 -232 -2058 2470 -1449 -3301 -1306
1449 -1306 673 -1090 -1246 3927 3147 49 -1416 -198 263 -1638 -1953 -1175 -1812 1056 -571 -1727
1465 -1727 5365 4528 395 -1338 2055 717 -2920 -1706 442 -627 -4216 -2052 2731 2592 1413
1480 1413 1511 2381 356 324 -1618 618 -144 -1109 -2888 -1580 2295 2169 -313 19 3513 570 -565
1497 -565 -2165 1601 -1133 -2816 -2625 299 -621 -876 1193 2664 2307 4 2040 -350 258 -462 -1619
1514 -1619 -1342 1561 -251 -3193 1399 1744 2388 1270 2761 3371 -2038 -2839 -1252 -1678 -715 -1438 -2359
1531 -2359 2590 2280 1189 -2779 2021 2779 -2227 -2930 872 1091 -3954 -822 1116 -121 907 343
1547 343 1852 1885 1115 -1959 -3424 -178 -1472 -3195 -3537 1805 325 -124 1388 3230 503 -1965
1563 -1965 2016 595 -2179 -1687 -1919 -277 -353 -1333 -976 1088 3440 1657 -389 126 2976 -2191 -3054
1580 -3054 318 -561 -3779 202 987 2063 3222 1790 2669 -13 45 -1940 -2021 479 104 -2695 -2701 2800
1598 2800 1820 1986 929 2795 3023 -1134 -2548 545 -826 -1885 -5619 38 362 665 40 2048
1614 2048 4136 459 -1940 -594 -1852 -1390 -2367 -1821 660 1108 612 1463 3717 5103 -485 1123
1630 1123 2074 157 -2742 -1468 19 -1982 -704 554 -400 2650 2036 465 -41 3766 560 -4525
1646 -4525 -1131 998 -3603 -2717 221 1567 1466 2372 3224 3259 645 1278 -1737 -1296 1059 -1237 -3425
1663 -3425 -295 2023 -569 -69 2747 1508 -2142 465 1841 -3323 -2566 -1499 -3098 -1376 829
1678 829 -441 1106 3449 3006 -271 1620 1770 -1151 -3011 -584 -933 -1955 631 641 1840 3519
1694 3519 1420 163 1650 2857 -1968 -2544 -235 -473 -2796 -1597 2088 1562 -207 1747 1034 1142
1710 1142 49 -1337 99 993 -371 -2611 2 2093 417 -1068 1986 2803 1132 -438 224 -111
1726 -111 -227 -832 -2614 -619 268 -1007 -141 2963 3283 -667 -1586 1474 -660 -1493 -2265 -1704 -900 -632
1744 -632 191 1532 1333 2520 746 88 1479 859 -2620 -1830 -392 -3555 -4057 769 1309 932 792
1761 792 2249 1365 1247 328 -1400 -3233 225 -941 -3875 1431 3446 417 -64 3989 2393 -23
1777 -23 -179 1773 -2272 -1650 -1680 -1246 1237 1851 68 574 4139 2067 -2176 -407 821 -346 -1924
1794 -1924 -1370 -317 60 -651 1034 821 1245 782 5 473 1340 211 -3392 -2944 964 -533 -2095
1811 -2095 1794 2630 1983 1818 1917 1000 1055 -160 -867 404 -136 -3209 -954 -276 1876 -247 431 2523
1829 2523 1260 -481 -1109 -135 -1389 -1835 -3349 -1375 2145 1042 -581 824 3034 -21 -679 291
1845 291 292 -2168 -462 -587 -1280 -208 -415 245 56 1934 1034 -1768 -764 836 -2337 -1519 -99 -857
1863 -857 -4053 -332 2048 731 2582 501 1555 -15 174 -1017 145 -1437 29 -3599 -1285
1878 -1285 3321 1599 -860 1529 2846 236 -1594 2 -1084 -1546 -93 -2221 545 588 484 468
1894 468 2973 3786 608 -301 0 -85 -1785 -310 -268 -788 -534 -658 1822 3086 1672 1363 198 1906
1912 1906 1146 -1897 -2002 892 -846 -2174 -931 503 1341 -629 -317 -1312 1330 84 -2524 -1275
1928 -1275 -195 28 -1728 808 2629 -754 83 1140 245 508 -1302 -1555 -496 158 -2810 -1904 620
1945 620 7 -123 240 2541 2970 -238 -1854 2100 -2025 -3382 -1462 -1205 0 -1234 -2159 776 2289
1962 2289 231 -816 -201 1926 -2561 -524 -1482 -1136 -2112 -25 527 1486 -6 -183 -319 349 991
1979 991 -960 -3496 -823 -313 -1438 -2875 1896 2206 -1062 -811 1368 1059 -1421 -1326 -1445 -272 -269 109
1997 109 539 1198 1537 -348 1213 2346 361 -465 -249 272 -2498 -2584 -3926 -1175 -681 -1554 1322 895
2015 895 1183 439 -1113 990 518 15 -1286 -301 -580 -2830 -1379 1778 1529 -846 -523 1488 1177
2032 1177 668 -758 -2121 155 264 -1170 183 1703 1112 -328 639 1561 -29 -1535 -662 -571 957
2049 957 -4 -1465 -874 1705 -679 511 -109 -171 49 -1212 163 575 -589 -633 -1256 1138 887 509
2067 509 878 2964 1542 -976 521 11 116 -1318 543 1441 -546 -1262 -649 1111 21 -981 387
2084 387 -315 404 -1099 -343 -217 677 -496 101 -202 923 -397 -1004 806 364 658 -1176 -359 430
2102 430 85 -151 102 775 1406 109 895 549 504 484 -73 895 -89 -1537 -2059 -399 -477 -1232 -245 854
2122 854 -401 1110 755 -264 1251 522 -1268 -1540 516 847 -1063 -93 1601 -1509 248 599 525
2139 525 -757 -771 -1518 -85 668 -1310 -178 -229 238 2010 34 575 1660 -451 -892 -1453 -514 96
2157 96 -229 415 765 -292 -341 -1114 1582 1430 -822 -505 -162 -597 -1038 -973 642 -377 404 -826 799
2176 799 1003 -388 -824 -446 893 -549 -2391 -305 99 -995 -1221 -733 1510 204 947 1304 567
2193 567 -42 -1006 -863 227 770 -160 -182 456 212 -466 -139 150 -739 -1011 -293 252 -107 264 -1568 -320
2213 -320 270 -395 -1833 256 450 276 -1130 -3 1835 -747 -762 786 248 115 -492 1130 -621
2230 -621 229 -340 80 -118 421 -752 -441 1221 1156 -245 861 267 -152 199 405 488 251 866 -149
2249 -149 -711 501 193 15 428 1929 248 -501 785 826 23 -1295 1666 576 -477 -351 -72 -514
2267 -514 916 -771 -1646 -2481 -966 989 -1894 425 1145 -1608 541 974 2723 258 640 -1355
2283 -1355 -2016 -202 -1131 -1154 2055 747 -484 -582 299 -905 -1653 -31 -83 -194 -678 -107 481 -806
2301 -806 -623 840 430 484 -588 -1396 371 1137 -1598 -1006 -549 1424 -574 160 541 -55 -958 -1633
2319 -1633 -176 -143 -311 -712 -2042 270 -274 -1295 173 937 -2 -815 -323 477 333 -324 -694 366
2337 366 804 -736 -280 -345 1023 371 -1694 438 1118 -1196 -875 -185 709 296 -183 1047 -433 728
2355 728 1578 -1077 -432 592 470 -1557 1499 1334 -682 -192 598 329 -760 -1188 -463 1008 719 450
2373 450 -106 172 45 -1228 -610 1102 957 -518 -214 639 201 -955 -1246 -473 -600 -708 164 -131 166
2392 166 139 303 -14 1521 545 -706 2252 729 -999 -248 -257 513 142 -1255 -790 488 -128 1905
2410 1905 -185 1666 -101 -1328 -123 -144 342 89 -780 403 141 -886 -57 2460 -344 -346 -678 -862
2428 -862 -161 -339 -466 -1040 167 -976 264 1647 -587 -1404 -215 -10 138 95 -869 -367 -1050 -1777
2446 -1777 348 -793 839 1937 -654 1194 1059 -648 -1177 350 -298 29 -1150 128 245 562
2462 562 918 -609 750 827 77 -1958 -950 322 113 -784 -680 1343 2067 -804 733 1099 491 -67
2480 -67 782 1070 1318 -1317 -9 -1511 -266 205 447 2952 611 792 -182 509 226 66 858 -834
2498 -834 324 -680 -329 524 1865 493 -550 -1166 296 -1418 -225 -1239 1593 -80 -123 620 -71
2515 -71 379 1123 501 995 716 -910 -772 -206 -26 -580 -777 657 603 -179 -512 492 489 1284 -154 -1562
2535 -1562 104 -401 -1392 -1351 324 -352 -819 139 230 999 632 -657 735 80 -1480 -707 -215 -182 -9
2554 -9 1444 910 969 -246 -1696 584 524 305 -1127 209 -721 67 -927 116 708 291 900 728 331
2573 331 -10 7 -792 -693 -546 -1141 -884 -521 602 306 -732 2544 937 -1034 -424 -611 -1425 -729 -488
2592 -488 379 2483 -111 1123 247 1137 1466 -935 -944 -1170 -1139 -334 -1805 990 377 -981 1000 1283
2610 1283 699 251 -59 -221 504 -2360 -1096 -260 658 -1288 -663 968 1476 21 -493 623 775 -716
2628 -716 -910 -580 -2045 118 -1134 491 282 347 1144 987 503 568 290 -1470 -310 -552 -1847 -353
2646 -353 537 561 182 1226 2420 219 -577 -728 1161 -904 -629 -1714 -989 557 238 1171 905 678
2664 678 -216 232 593 773 719 -718 -2600 -290 62 -1717 1287 986 1504 693 781 1135 -383 -1123 -1084
2683 -1084 -1661 -459 585 -1346 -677 1536 -67 845 55 1366 -989 -1337 -892 -993 -575 -1268 -1193 -626
2701 -626 815 -97 807 562 2367 -753 -404 -482 -1305 -766 -1951 -1057 755 48 559 1767 1672 -280
2719 -280 -1267 57 -732 27 -1725 -1691 -830 -1638 -1120 142 1441 1025 -367 249 1160 250 15 -587 -920
2738 -920 -618 -1614 -887 1950 1773 -682 -137 1037 1262 -251 -1141 -896 -1630 -1138 -546 -272 1094 327
2756 327 659 2016 1782 478 -1236 -1214 435 -1390 -1633 -1803 120 -584 1049 301 813 2649 907
2773 907 -53 846 -976 -968 -717 -776 -1153 -162 -1066 1891 855 1545 60 -530 -400 -450 -1515 -777 -65 -649
2793 -649 -710 -1559 3109 1052 218 -378 1043 188 -404 -289 -783 -840 -1162 -2139 436 679 -637 971 2239
2812 2239 1560 625 -373 -192 -911 -1228 -724 -224 33 91 216 60 1773 1393 446 -293 101 -976 -2266
2831 -2266 -1712 -291 -374 -270 217 595 1063 451 761 1445 -729 154 -2046 -221 -547 -47 -824 561
2849 561 283 739 2073 1122 1656 498 -517 -644 -1002 -1056 -1628 -573 643 611 889 1698 2077 1436 12
2868 12 -1902 -875 -827 -948 -1083 -713 877 1597 151 1868 2033 -65 214 -565 -1040 -1635 -307 -762
2886 -762 -99 -979 273 291 811 1525 -1265 203 -119 262 -2758 -1348 -838 -1006 -859 -196 2104 1062
2904 1062 1681 298 1195 -213 -579 361 -665 -1938 -1309 -249 -539 1248 924 -535 277 2993 203
2921 203 -831 -556 -546 -1388 -180 -2067 -128 32 805 1464 1616 3263 854 -468 -284 222 -1381 -2593
2939 -2593 -1262 -1605 79 668 1557 2053 818 -580 699 433 -2336 -1201 -1643 967 -639 -699 1009
2956 1009 1665 1719 624 557 917 -652 -523 -2056 -1170 -737 -1899 -138 -39 2082 1149 1797 1926 1008 941
2975 941 -1048 -179 -1527 -916 -546 29 451 -18 1731 1156 420 340 277 173 -317 86 -2232 -667 1115
2994 1115 91 713 338 2081 2257 1686 35 557 -610 -1165 -1976 -2004 -1091 -677 -717 1887 645 1948
3012 1948 1415 1709 1431 -304 -488 -1159 -1979 -504 -679 12 -239 1264 1576 -184 1108 53 -500 436
3030 436 -2137 -1871 -1056 -863 197 396 463 473 2348 3148 1004 -1694 -1486 -554 -1369 -2123 -1440 176 813
3049 813 -297 538 430 2671 15 849 -22 -396 -667 -1513 -1084 -16 738 501 738 1656 1568 580 806
3068 806 567 -635 -1302 -933 -545 -1058 883 620 1707 1215 1275 841 306 60 -1886 -1170 -668 -1143 -1948
3087 -1948 -1159 -1217 416 842 1221 2389 1989 1289 -694 -784 211 -1638 -1986 -65 -425 -545 2313 880
3105 880 1995 1407 297 366 -247 -909 -1653 -2066 -338 546 -875 30 121 1754 1918 875 485 -110 -211
3124 -211 -1059 -1341 -1714 -1052 -210 849 -130 485 1237 1503 -716 -274 -245 -2004 187 -616 -614 -1378 761
3143 761 1166 1064 367 1282 979 1455 -655 -1775 -976 -1652 -1083 -845 687 -204 656 1343 1630 1311 -63
3162 -63 -688 -919 -1295 -2230 -2265 -961 -24 -574 275 1582 1349 882 -451 1146 -872 -1631 -1210 -814 -2660
3181 -2660 -957 -554 584 -247 448 -292 696 833 -365 -1348 -1035 -858 -1692 -530 -602 1422 658 827
3199 827 640 1835 -137 -618 -1183 -568 -3012 -1469 -247 439 -319 -960 697 1216 1098 -396 363 405
3217 405 -416 -1054 -1344 -2216 783 -207 -151 923 1819 769 1751 -897 486 -207 -1450 -1513 -2653 775
3235 775 -731 -439 588 1343 204 675 995 -616 -9 -1229 570 -53 -946 -738 1260 658 556 2780
3253 2780 2574 617 656 -692 -1478 -573 -1358 -1372 -140 -1286 1362 1261 588 2368 1085 -1054 -874 -849
3271 -849 -1505 -2010 -2114 804 -590 -755 418 126 1323 649 669 -249 483 -345 -1703 -811 -1298 63
3289 63 -66 905 1282 1074 199 1614 967 -109 -2096 -618 -1870 -924 -453 -347 1790 806 1347 707
3307 707 2470 -211 -964 -770 -117 -878 -289 113 517 1069 587 82 2981 1977 1750 -748 -189 -1782
3325 -1782 -128 -1889 -1483 -1318 408 -226 -422 1442 1537 1213 984 168 -1091 -398 -2570 1029 -727
3342 -727 -1138 -690 -109 635 1418 63 182 447 -567 -1045 -2298 -824 -582 -826 -314 1635 -293 804
3360 804 -338 1514 -203 -474 -337 -1281 -1226 -1646 -587 31 110 1200 -156 957 1108 198 195 -855 -937
3379 -937 -1117 -924 -1574 -1062 -571 -521 1544 1909 242 93 -252 300 -380 -697 -789 390 -368 -254 1061
3398 1061 528 1153 1004 -509 -1341 -213 -1238 -16 -687 -138 -1792 902 316 127 586 1962 1874 1177
3416 1177 354 -290 -599 -974 -1608 -752 -264 -177 1563 728 1190 2015 463 -654 -197 -1073 -1493 -779 -74
3435 -74 -117 372 1006 865 1813 1541 1439 734 446 -552 -1685 -1949 -900 1481 435 -283 189 1437 777
3454 777 -721 189 487 245 -1209 -983 -948 -2374 -1063 -1009 1151 830 1157 517 1270 -448 -908 -939 422
3473 422 -128 -1626 -1533 49 805 1128 799 547 841 -1233 -770 -704 -786 -1878 -1251 -491 166 -533 -356 843
3493 843 1727 401 -615 -444 -65 -1109 -1693 -124 776 767 -806 -105 760 1693 522 -1414 -30 1481
3511 1481 -1023 -951 -1200 91 -1377 -880 413 923 655 171 470 895 262 -1287 -539 -679 -685 -2205 -510
3530 -510 -94 1162 1579 -863 2290 286 -204 1557 -736 -2604 286 107 1074 716 952 -422 1354
3547 1354 829 596 1074 -503 -938 964 -1888 -1009 -653 841 -79 191 1512 856 611 -275 1319 -1374
3565 -1374 1042 -2104 -30 638 1239 -1240 1 1087 600 -74 -1571 -1535 1231 -1069 -1350 618 -1442
3582 -1442 -810 1199 924 -686 -433 1782 1081 636 -651 -2111 -1772 -1819 -1007 435 1069 -933 659
3599 659 57 2063 1031 1083 -152 -2134 -434 -1590 -1618 -1136 -1204 -620 1059 536 1155 307 476 248 -1061
3618 -1061 -996 -995 -1132 -742 -493 531 212 1260 1986 -292 -213 1950 -328 -1120 -472 -631 -641 -178 -308 -295
3638 -295 129 924 388 1010 355 644 -207 495 -1030 -1777 -557 -387 -201 -967 1566 572 92 382 710
3657 710 -326 664 -1415 -1375 -807 -1405 1033 -298 -342 934 1674 -255 -150 -1161 -1676 -198 -1052 -1784
3675 -1784 -1351 1199 -394 1577 165 2766 2347 426 57 -83 -1372 -487 437 -428 150 -666 -172
3692 -172 -335 150 1822 -1029 262 733 -1121 203 56 -893 302 883 -245 610 483 172 -592 787
3710 787 353 169 452 -113 -1454 -917 137 918 -139 1305 797 349 -251 731 -1072 -1051 -1216 -1294 -1363
3729 -1363 629 -217 -72 589 920 -130 886 309 607 -1038 -1352 642 293 -1094 214 -25 670
3746 670 699 626 531 341 1089 427 277 243 210 -191 1132 1197 930 980 392 600 -366 1343 1164 -1051 -1179
3767 -1179 -839 -658 -655 538 2261 1199 1371 1212 1236 -1959 -1514 1233 300 -1337 -845 -314 654 -690
3785 -690 -2196 2379 326 771 1603 -713 -754 -885 -1578 -882 1114 -71 155 -38 692 1498 607 -238
3803 -238 957 967 -239 -1528 1045 222 -117 -313 1242 311 124 1983 202 -363 69 17 149 -1243
3821 -1243 -1549 509 -978 1046 178 1190 535 544 224 -1045 382 -45 -924 -973 -1189 -67 -402 1030
3839 1030 -320 174 1392 2002 1518 192 -283 -678 994 -1894 -1662 -604 590 247 -448 650 540
3856 540 -336 -114 -485 28 235 -381 -170 345 134 444 1031 -247 1839 588 208 1314 59 223
3874 223 -733 -11 -675 -1566 -1067 -774 -737 1120 253 -68 -1309 -1962 -398 -1308 -658 -281 859 140 58
3893 58 -696 125 709 542 423 -201 -290 -1454 -534 -488 -519 -853 -478 1149 -358 -191 -190 917 -615 -750
3913 -750 371 -1185 -961 -965 1096 -683 166 1335 577 456 871 1532 203 -1577 -1278 -715 1133 681
3931 681 -74 400 -1256 1412 1065 150 1271 -1251 -1716 -1392 -1395 1004 173 194 -1260 -569 1769 213
3949 213 -601 454 -216 77 244 109 110 -781 343 429 337 679 293 -77 -244 311 -122 -809 -852 -992 295
3970 295 -580 14 1265 627 956 1177 -274 328 -506 -211 -691 973 -25 -188 519 1240 33 563 1075
3989 1075 260 937 -404 573 665 107 -114 354 -2167 -498 -516 861 -940 1254 -2132 -3 900 -1655
4007 -1655 -807 -551 -1240 -80 -554 -140 796 -42 -707 -961 -536 -526 581 244 65 -1743 -188 256 -669
4026 -669 232 989 139 -144 1023 -834 -556 374 -1357 -1202 15 -1343 529 871 638 1568 1372 448
4044 448 30 375 -242 -231 -235 -13 -78 -473 414 -898 877 604 640 530 23 246 520 -831 -84 51 -1364
4065 -1364 -486 231 951 491 -753 -437 -301 521 187 -1256 -175 -253 -1588 -194 465 1259 335 -221
4083 -221 -1048 -1126 -1372 -1142 234 -540 250 880 707 -1441 295 -1388 113 556 595 -611 -582 -293 275
4102 275 -652 -723 402 -126 410 -1110 -1489 -1227 115 -461 1625 237 -876 646 752 1216 461 1352
4120 1352 38 -705 620 665 -1017 553 247 -23 549 -1155 -1430 495 -453 -351 240 -665 -357 150
4138 150 1169 164 -769 -481 7 757 -26 299 1397 520 432 167 -556 -518 521 -228 835 220 -175
4157 -175 311 329 -908 -735 371 -893 -522 1019 -533 53 -6 -76 409 -511 -765 -482 1437 -54 723
4176 723 484 -1396 -213 806 585 -81 -605 885 -20 -53 -78 481 395 1589 353 -818 -639 204 215
4195 215 -724 -306 -150 -1847 -248 -200 -1007 310 -189 -420 -63 598 1001 -427 -878 -578 44 -112 -1061
4214 -1061 232 145 1525 -936 -1613 -671 -684 1218 -1168 -1483 -1098 -233 252 303 -159 197 -46 -1051 880
4233 880 -1415 1050 -2121 -748 -367 -297 -1307 -882 933 1005 288 -350 8 479 191 -1416 489 -113
4251 -113 -212 506 -114 161 -220 -1359 557 -89 -1022 1009 1118 254 -121 152 1641 135 213 -210 -141
4270 -141 399 752 -398 500 126 705 1637 -307 1108 1014 741 -158 -148 854 -50 40 51 -165 -805 -425
4290 -425 950 430 -573 384 -1034 -242 -623 781 -8 76 -217 -561 478 418 -1077 197 137 344 -1575
4309 -1575 -821 1207 7 576 -1819 -81 -1769 163 -22 463 -1452 697 758 334 1110 -282 333
4326 333 59 1042 902 -577 80 1044 -266 -7 531 -336 -173 -298 -103 -801 371 -321 449 755 235
4345 235 -856 -218 662 364 -875 193 950 -922 100 -246 -1001 -1287 1284 -822 -948 166 798
4362 798 88 681 -15 326 133 -686 50 41 98 -375 -263 356 1053 196 470 -545 134 -1461 -335 496
4382 496 246 427 73 1488 143 -368 339 666 -346 979 -279 -51 -9 84 -565 -20 223 -261 77
4401 77 636 463 245 -753 276 137 -441 -1229 -956 -578 352 -241 4 1183 509 220 141 91 -760 500
4421 500 585 545 -434 236 249 340 -491 -1001 0 550 336 -1471 1105 -248 335 318 -674 -403 1240 242
4441 242 -1452 6 -709 -75 1651 68 -1394 262 -27 -282 -368 -18 -40 -822 823 405 98 788
4459 788 -189 -911 -172 -195 783 654 -187 -626 -482 927 -485 -76 616 963 -86 -254 -1065 1165 506
4478 506 1488 548 -923 1142 1531 -1289 59 -318 -819 -1288 231 271 1554 459 -780 1143 -878
4495 -878 559 1072 -803 -1526 267 1164 480 544 -675 -158 506 -282 -1258 -374 -489 1351 1060 -349
4513 -349 -1191 -1465 161 481 435 -639 -1188 -691 671 485 -393 -988 450 -955 11 515 974 -996
4531 -996 216 -416 635 -381 -918 -1076 -2 2117 408 1534 2210 691 -91 -63 -635 471 63
4548 63 1619 -177 -347 335 -879 -346 -368 321 -449 -582 539 -1306 555 -1476 388 384 -1151 -472
4566 -472 104 476 145 335 -59 1680 1126 -394 -776 762 644 711 -747 117 1020 -1466 -266 -102
4584 -102 -18 -12 -747 607 -303 -140 -69 -1202 1281 1182 -262 -677 -741 -142 302 -69 984 -935 982 146
4604 146 1579 -215 -198 -506 1050 314 -950 -1190 591 -1568 -338 442 185 -1092 -1150 -1007 21 -366
4622 -366 725 -711 -384 29 49 -326 75 248 998 -235 -726 953 714 151 289 896 -642 357 -83
4641 -83 123 -138 535 -638 853 -848 -94 -5 786 506 -150 -988 -880 813 -411 -1226 -332 -420 537
4660 537 -327 -1043 -820 127 797 742 -1119 1279 258 -518 -237 -67 530 1516 -416 -520 886 -1424
4678 -1424 -117 -512 748 -1587 -883 -54 -678 -949 -668 541 1404 1092 -855 486 -333 -669 919
4695 919 173 259 -1066 157 2146 -997 1290 -357 151 1001 -412 274 790 646 -688 1050 -456
4712 -456 -724 -547 72 734 -38 4 454 1186 994 -1122 91 1095 -3048 1711 -824 -1125 -302 701
4730 701 -107 106 513 821 -1260 -208 147 114 -561 -744 1352 1807 -590 -958 735 -772 694 -1859
4748 -1859 -1690 -363 478 1100 -2199 -1643 -364 548 1636 -705 353 518 -9 -1151 -133 -142 697 2545
4766 2545 -870 -185 319 1108 892 519 -895 343 338 -165 -249 1292 656 -635 -86 659 -466 306 290
4785 290 255 671 391 537 -304 -921 2052 676 838 1463 -194 169 1514 -104 2344 -27 -2130 881
4803 881 315 -212 -183 409 -767 816 1235 1649 560 -1566 -309 -567 538 882 -253 975 387 -1677
4821 -1677 -49 -611 2209 551 -741 -785 -589 887 783 -1620 -1159 -1310 1134 -1920 2374 2070 1033
4838 1033 -29 1355 337 -292 -148 -345 20 -663 -562 -1153 -351 -809 1105 -1443 -416 525 -92 -10
4856 -10 245 503 -129 56 517 -507 -173 476 1122 1060 747 1364 739 240 217 527 -773 1383 349 368
4876 368 -188 156 123 -447 500 658 179 59 -98 -619 -1468 -873 595 97 3118 218 1032 2359 -1031
4895 -1031 -302 -828 443 403 1731 1424 40 -647 -1472 -979 523 501 -1617 1135 -680 922 -757
4912 -757 64 -930 -355 -904 774 1104 784 -313 -493 721 -4 -692 495 -502 1222 1107 298 -732
4930 -732 1376 1595 221 181 -1937 1051 219 -1165 166 348 -110 1465 -205 455 -117 466 -540
4947 -540 -455 1389 -237 975 -186 1663 1064 -520 303 -4 1254 -1372 1416 81 -724 2208 -637
4964 -637 730 -932 714 484 -863 532 -1126 728 783 295 619 -446 875 116 335 -1424 -119
4981 -119 -314 234 572 1220 -753 861 -348 -471 -1288 -639 -398 1832 27 823 -443 -38 -57 -957
4999 -957 -201 -489 302 103 -713 -461 -748 -694 -231 11 895 56 646 -1576 67 -1051 -176 -747 -383
5018 -383 -324 231 74 44 324 -83 291 425 49 15 491 890 -425 -86 16 372 -27 261 -183 630 -496
5039 -496 -959 712 796 -761 -356 668 -457 103 807 -970 -895 1311 48 208 -918 -255 -963 -1360
5057 -1360 -1376 1390 -532 -1240 -818 -713 -1383 72 643 -71 116 -814 213 1139 249 -537 500 228
5075 228 382 -489 61 66 177 704 868 499 -771 89 -679 156 846 -271 93 -687 64 656 -626 772
5095 772 -1275 -321 -942 -1762 -1816 962 -539 740 179 -212 1400 193 34 337 -189 -304 787 107
5113 107 -443 -589 987 -32 1 -427 -796 732 -1840 -1129 -365 -146 -576 771 -198 590 14 1687
5131 1687 -234 -15 802 -423 -321 -834 25 -132 686 726 879 574 1268 -21 459 692 25 -1230 -144
5150 -144 349 -998 1273 602 1544 1197 -739 798 194 -651 -14 -572 -901 -121 352 464 416 367 -1404
5169 -1404 -218 815 387 1033 594 1030 1 -261 583 -123 -327 -271 227 -741 609 1508 -533 70
5187 70 1270 -577 -509 142 141 -707 -620 1075 149 -911 -318 239 -287 575 956 -728 670 -714 -291
5206 -291 336 499 -568 556 158 -1737 -231 847 -270 -1024 279 -726 -12 -446 1233 -514 514
5223 514 -287 407 938 -838 -73 380 268 -327 -1478 303 602 112 92 513 -77 7 -75 34 -56 -904
5243 -904 -170 -56 208 -394 -256 -1024 321 71 1071 -10 24 240 535 462 4 -172 102 24 804 421
5263 421 -82 21 -301 -1344 95 945 -973 74 469 -763 -276 1115 220 -163 -237 -73 -430 -331 825
5282 825 183 -205 904 164 -939 -76 -683 1479 387 256 142 535 110 206 -508 -422 -272 -43 207
5301 207 -376 -816 -408 91 680 64 -244 388 -698 -171 -473 -195 387 583 507 -259 -1090 -455 107 -81
5321 -81 168 -106 1759 667 554 -561 608 -183 -344 -859 -1413 -392 1157 -456 1079 152 377 274
5339 274 -470 324 -55 433 -829 -1073 481 -311 -1219 -265 -395 -471 -333 -1071 281 -821 -622 40 -430
5358 -430 271 551 334 -466 -589 666 330 201 -465 576 1041 170 -1696 -695 299 -779 96 55 759
5377 759 -1223 20 -280 1427 1608 -384 -752 476 843 -1112 1389 -1449 -354 -68 25 -85 246
5394 246 35 -204 411 -321 -286 211 -128 -856 2200 -351 902 434 -789 -954 -491 -766 -376 -1157 61
5413 61 -1233 741 476 610 -211 -227 680 544 658 447 -327 -631 -396 102 -1395 -14 -222 442 261
5432 261 -27 -736 -721 342 994 -550 282 -727 -1021 -602 -267 311 -138 -540 -255 -227 484 -1185 -127
5451 -127 195 827 309 -529 -38 -454 491 -556 243 -1386 -711 -1053 -1520 84 1148 77 -1107 153
5469 153 -588 -173 272 401 -1919 -987 832 461 1899 30 -946 180 -956 -320 862 392 784 271
5487 271 -257 238 -22 -135 876 -574 305 128 -541 -1858 -118 -157 647 -1159 498 -979 -351 1243
5505 1243 215 -659 -405 -29 -836 -697 -247 49 834 693 -1005 822 1200 -1390 -330 1013 -457
5522 -457 253 -409 -1248 -436 732 -879 333 -34 -839 -1389 812 18 462 -347 -368 -244 -1904 265
5540 265 204 87 516 -192 -319 496 408 -118 294 -41 28 -932 343 410 866 750 -253 -244 -28 -214 58
5561 58 -241 230 123 214 -234 -43 -634 -256 -286 -390 248 786 -638 183 639 133 939 803 -118 426 -472
5582 -472 -432 879 11 -256 142 549 -262 200 1543 721 35 -13 1103 2147 -306 -251 346 995 645
5601 645 393 558 534 -166 1454 12 -575 -82 -463 -1450 -213 513 811 183 233 37 -171 -238 -549 -83
5621 -83 1172 172 -238 -1154 -826 83 948 701 232 413 -269 -25 404 718 -375 342 1161 969 -417
5640 -417 -208 -104 -884 -153 624 -271 651 24 724 228 99 650 501 361 -586 -291 402 310 844 -571
5660 -571 -426 -190 591 3 477 1138 -676 -1943 294 134 -1223 1657 1521 -396 -493 -1322 337 811
5678 811 -216 -471 225 683 370 -74 446 479 -662 36 364 106 1375 363 -613 -444 145 -890 -1474
5697 -1474 122 775 90 -224 612 -1020 1105 -1781 -1069 -72 1316 93 -86 -646 1122 1206 404 353
5715 353 1226 -427 -6 1072 148 2145 -249 548 -878 941 265 -556 1560 1322 1005 -363 -246
5732 -246 106 187 -658 242 420 163 -169 798 295 314 290 1091 -7 -172 -733 -5 -401 -510 -26 -517 -308
5753 -308 970 -400 -493 164 38 1053 577 522 524 95 -794 -200 11 17 -219 142 693 -213 -894 30 -597
5774 -597 -1244 432 -66 -235 -423 -173 302 23 1148 -284 215 250 -346 -438 22 1237 1568 -99 -191
5793 -191 -253 704 -404 328 697 -1116 202 -895 -442 120 -502 -8 415 -860 14 98 884 -1135 890
5812 890 -131 52 -710 -1552 1038 341 -274 -629 -406 -316 -113 266 -283 97 412 357 785 663 740 -31
5832 -31 29 317 -164 -11 -335 278 347 403 -550 581 742 -618 264 1240 -442 140 107 796 409 -231 -109
5853 -109 -249 -429 298 257 -172 -162 254 766 -643 -1192 -1197 1 -645 -1464 -295 -1164 413 -64 858 623
5873 623 -57 -1065 -789 -185 -436 493 -523 21 162 -465 -517 911 381 -251 -738 -709 -60 264 -1020
5892 -1020 -591 -399 259 464 -1086 280 639 -285 788 -345 -445 -671 154 -912 -65 142 207 325
5910 325 637 675 -272 690 487 911 540 -352 218 -1000 -17 99 -347 73 -1027 1141 -174 -52 560
5929 560 -741 -1136 -880 434 -382 516 76 -1357 -1332 454 128 224 290 229 373 273 1527 392 -331
5948 -331 1048 715 -310 296 268 595 74 -192 700 -1283 301 -274 426 81 -514 825 -203 -1144
5966 -1144 -280 90 10 -1470 749 -862 607 -1065 -1452 -78 -275 -1078 624 559 -145 -599 -582 -981
5984 -981 -622 529 -48 -1339 -252 71 -1439 -961 775 -288 -560 87 354 -1262 50 -866 156
6001 156 -214 461 -164 336 197 -43 73 705 -77 -18 261 830 1063 -515 -297 -539 566 -42 1140
6020 1140 -161 219 330 -598 232 821 -494 69 -107 722 -196 373 386 62 150 -244 226 276 -314 -331
6040 -331 343 -1575 -377 415 -834 831 -442 -23 -1140 94 -456 -633 1196 -47 -143 -777 -21
6057 -21 505 61 -72 325 -510 447 128 -1243 342 -561 -223 -4 74 73 -340 -245 25 559 1019 -327 450
6078 450 181 598 119 -40 117 -1194 -51 -1623 -180 35 -219 21 -295 -913 637 58 -789 422
6096 422 399 -1204 -313 973 -649 -341 24 673 466 -849 -1464 -392 1203 765 39 822 -351 202
6114 202 1535 210 1901 895 543 -633 728 -653 -1111 52 -642 1004 -1163 1503 -608 1888
6130 1888 -324 -1137 -697 879 -269 486 -33 1070 55 -474 -158 761 -740 -343 -233 154 -882
6147 -882 -871 -332 -1029 -627 221 462 -177 -572 -470 1789 306 -298 280 955 -1778 -74 -497 -1606 2279
6166 2279 -341 71 -742 -168 440 -297 -36 715 223 -700 346 -896 -348 -546 859 314 793 -300
6184 -300 -881 688 -330 215 242 -158 504 317 -432 -1579 921 -304 -496 -199 -807 3 540 -452 -266
6203 -266 385 -1036 -21 -726 1042 211 729 106 1214 454 293 -1808 1018 -68 -603 146 -2 830
6221 830 -702 212 932 -1382 -450 -233 -1156 -61 -1269 242 -447 282 755 894 710 812 403 133
6239 133 735 194 703 350 -357 -1063 34 -1524 393 -185 1010 417 1018 -201 -1298 363 -628 416
6257 416 1674 9 -1015 -359 -1435 791 -1403 102 1014 -1176 -1928 2 811 -417 -1063 1063
6273 1063 1637 633 765 470 410 -1042 -1245 108 -277 -549 -1549 581 -84 -576 1428 -172 1180
6290 1180 545 574 2175 -1062 -579 -140 908 -1142 587 342 -892 -932 -437 153 87 -2115 -600 -991
6308 -991 108 -1833 -1941 1361 469 1291 528 339 781 954 -687 -1097 -853 -972 417 -606 -232 -851
6326 -851 -943 1078 -761 1091 662 -429 109 1136 -870 -1437 33 765 111 290 1330 -862 -365
6343 -365 591 -745 -1106 -1503 -392 -133 271 -526 -216 624 -5 1387 -245 154 -525 -478 327 1024 -1152
6362 -1152 -405 -1377 -303 -1232 -919 -36 -144 -1142 968 299 -445 -269 -1242 -477 219 -1650 1011 252
6380 252 493 808 47 919 -1298 -632 414 -750 -159 -1420 632 -247 30 999 -1153 208 1486
6397 1486 460 -113 -549 -384 -369 299 -307 -323 -267 -426 -1254 -370 -119 -77 1269 1238 732 841 -1382 16
6417 16 -487 285 1207 1899 804 -1030 409 524 -1051 -448 -1697 -488 756 -1078 1195 199 -1301
6434 -1301 688 387 -197 1086 145 -951 -799 -529 1880 -817 -604 -314 299 883 407 678 589 336
6452 336 727 -1338 -524 539 601 744 124 -15 65 774 736 448 741 681 -146 444 -2466 1255 693 1051
6472 1051 2251 -588 -206 -1758 -1316 -69 -682 202 689 50 596 -1724 892 -1000 -365 -596 543
6489 543 671 1713 807 821 -365 -305 70 775 724 650 230 644 603 1849 1905 620 -810 701 -72 1775
6509 1775 525 5 19 18 201 -1902 862 273 -857 1552 751 -1680 -676 235 -1017 561 230 -637
6527 -637 615 303 -472 219 -729 2473 1158 -380 473 -569 -929 -78 1061 438 5 1347 600 166
6545 166 166 29 -295 270 -473 -34 547 876 -2347 -420 -103 58 11 -1219 -243 813 -487 -423 -263 373
6565 373 -827 -981 -716 -649 528 -887 -281 -42 148 -308 -2174 -529 -1794 920 -374 186 21 410
6583 410 2008 -991 -246 468 667 52 -266 -532 77 -696 1718 223 173 -287 507 -65 -387 1068 104
6602 104 -347 283 -307 872 -73 900 231 1145 -399 -1055 1089 -1975 390 1167 -115 767 -201 -512
6620 -512 783 -1061 474 2252 792 -17 944 380 -2024 -915 -778 -61 458 788 458 -1309 -415
6637 -415 313 -744 -848 383 -426 -827 469 804 112 480 -482 -308 -365 -348 -215 1409 -79 931 1860
6656 1860 1062 -664 568 -448 1632 530 -135 669 1174 -1353 -220 724 548 -846 399 -185 -215
6673 -215 -124 -1048 -554 1141 -749 -614 -1018 247 -587 -1439 -947 -967 -1488 881 -7 -891 -432 2539 -118
6692 -118 -571 2446 -834 1088 -1276 1101 1069 -2132 -806 -803 563 415 -85 371 85 -811 1374 -1090
6710 -1090 -1427 63 238 -812 592 1337 -1385 -1038 238 -669 1258 595 1053 -805 -1253 877 -318
6727 -318 1654 -524 1584 -568 3291 279 773 -1262 -790 269 -3078 -694 236 -607 -636 -351 1258
6744 1258 1860 -577 -1534 642 66 -214 1489 462 -138 -130 298 500 423 -8 -750 1386 -13 238 -485
6763 -485 -2173 -819 -1350 -1270 -309 86 170 1917 0 1836 110 -2359 -563 1100 89 -757 -25
6780 -25 -1985 1797 109 -1720 1395 -1883 -1099 -361 -892 -610 736 59 -349 1268 257 1152 -917
6797 -917 320 807 83 -453 -342 -106 1256 -173 -192 389 -551 64 1362 -274 777 -124 271 2972
6815 2972 -1592 1399 -1351 -1539 -1870 -545 -41 -174 496 574 332 -382 -1309 -1922 -2097 1191 -612 -676
6833 -676 128 1523 -160 526 -544 -408 -224 -116 -950 798 -950 -1712 -686 72 9 755 1630 -31
6851 -31 1588 -908 63 -575 756 403 914 -989 -38 -640 80 630 467 547 671 1232 824 -2020 1227
6870 1227 -707 -1195 401 -1298 -1117 -1770 -727 846 221 805 796 -1484 -1189 183 -800 -490 736 -1197
6888 -1197 -552 1591 1081 303 -96 -370 447 -321 -235 963 1133 -687 -546 595 1574 -802 -320 -1343
6906 -1343 1941 1070 -46 -1180 370 1072 -39 1138 -298 785 617 -1490 1777 -916 859 -2253
6922 -2253 436 -808 -61 1342 -696 -405 -556 -333 -312 260 2662 -18 -588 -1945 -1070 -1403 -707 195
6940 195 6 -1013 -734 -382 1306 -1865 -598 -880 311 -444 -1427 -1237 -644 1083 -668 50 1506
6957 1506 112 1078 77 -2588 384 -924 714 -440 810 813 -1399 2058 -787 -1061 837 -1154
6973 -1154 -898 -542 -2728 -2018 -302 522 -1820 -2166 -1135 1015 1906 -76 156 -927 10 -675 404
6990 404 -422 227 -747 454 -1116 1397 -1061 -539 1563 501 -26 -2293 1062 -1977 -581 -1154 571
7007 571 -38 1621 1983 649 379 370 -1290 -9 -414 -667 -326 -2080 -240 -317 22 503 193 220 -588
7026 -588 1001 554 742 185 -522 121 454 1198 -1048 -987 1161 1266 563 1326 525 896 818 -409 212
7045 212 -1172 -700 -339 -1175 -904 361 -514 -530 -1216 -796 -369 1157 169 -74 -2079 -1066 1598 -877
7063 -877 652 -323 1480 -662 -917 938 -14 911 -398 1812 -90 -45 -1805 1797 1472 3336 858
7080 858 1766 -34 -565 187 -826 404 -58 1534 -949 -845 1523 2009 827 -232 1235 84 -1626
7097 -1626 943 2022 -454 245 -445 -345 -1516 1267 144 -980 1578 784 914 -108 2105 -523
7113 -523 1480 -232 18 -2094 -1 283 739 -763 -502 -1002 529 -161 463 -1417 -78 -347 1020
7130 1020 418 944 638 -123 320 920 -554 432 801 516 1242 -1181 -420 -6 -276 -658 -13 -657 -763
7149 -763 -1292 -1284 1459 -24 720 -553 -642 -1005 -885 -301 352 -609 -1001 -1053 656 210 -2013 -519 229
7168 229 -727 869 -1053 2613 754 254 -1344 86 -524 -336 -1447 -1000 -1050 -1164 131 -28 1306
7185 1306 -761 -848 -1942 538 -1338 725 369 -1031 -976 -130 -1743 -491 1018 727 445 -908 616
7202 616 -7 466 700 -494 1093 -1276 143 169 614 -1576 -934 -851 -666 1122 -1493 705 1458 615
7220 615 -53 580 -924 590 -413 2849 629 613 1799 1049 -670 2955 -44 1066 1144 2733 2143
7237 2143 691 1432 -1614 924 59 201 988 -144 1521 -1198 1145 561 -433 1226 515 586 -1017
7254 -1017 -13 -1461 -449 621 -382 -813 -1113 946 63 228 -1202 1579 803 659 2524 -1312
7270 -1312 997 -1261 515 286 986 1271 1987 2252 658 -1338 877 565 208 -1043 667 -528 -2413
7287 -2413 -2751 497 480 -87 -1164 -1281 -348 646 1404 338 1598 508 -732 2276 -3251 -42 -221
7304 -221 959 631 -710 2307 -1642 -927 -413 -1627 1147 1194 22 580 3 -256 -201 -467 889 -2215
7322 -2215 -1117 529 -337 494 276 689 -305 393 -427 -2347 -2010 677 -1223 762 -1419 2078 -885
7339 -885 -753 1493 645 431 -992 -326 -485 -197 1537 275 -148 -1285 222 727 -103 -566 820 423
7357 423 1284 1315 220 1955 -222 -501 -291 -59 -715 -237 965 402 -177 398 -235 1034 627 -1264
7375 -1264 -1660 -832 758 -604 -554 -274 921 722 -637 -613 233 -14 540 -1133 615 -144 -1 1059
7393 1059 -344 2151 339 -410 -482 -373 673 196 97 1458 -194 -858 -110 -734 -1766 240 30 434
7411 434 1242 -610 -428 1208 -524 672 -878 151 -27 -833 -702 -55 -1842 -762 802 156 630
7428 630 -1515 858 -403 -1520 -1321 168 99 136 -883 -1506 646 -97 876 -583 -1538 -342 1591
7445 1591 -588 -474 196 647 -117 -543 405 -963 -1351 -1467 2060 1260 -901 95 379 517 -638 -106
7463 -106 -391 286 -627 -142 950 1640 241 795 -775 187 1856 123 -1144 -800 -1342 -871 -580 -1457
7481 -1457 255 1074 -328 -1007 210 -986 -1108 1369 1594 -125 1645 915 -1311 -2190 170 542 -649
7498 -649 629 -588 302 -1840 -236 -110 -711 -353 -1520 822 -661 184 -551 918 -1515 487 -1553
7515 -1553 -2416 -345 -1839 -242 595 957 -423 1015 1125 768 233 -160 -2032 -868 145 143 2362
7532 2362 -1975 772 -1556 214 -147 -75 275 462 -120 -538 -326 -1604 -701 -1075 670 -795 -1415 557
7550 557 -592 -258 -513 928 452 352 -544 -846 2031 596 172 -778 -1116 1371 518 -57 306 -103
7568 -103 -1183 -317 100 424 -101 -1742 -946 -257 347 796 494 811 -2931 -1967 -482 -981 -1031 -296 -554
7587 -554 -1078 -289 -198 -1040 18 532 -985 -1112 -846 593 1706 -1619 -1850 -773 -863 -670 453 414 364
7606 364 885 264 -1877 -370 -1742 100 925 1374 -1139 747 -538 295 141 293 1400 -130 -1379
7623 -1379 28 215 840 700 -846 -79 -1475 1317 -560 -916 -1025 397 -1184 -469 -1649 -286 -1169
7640 -1169 -292 -1079 490 -897 -862 1217 -12 292 1149 972 871 319 -1554 696 60 1435 -828
7657 -828 193 -689 -881 -74 653 -1544 -1021 -255 -128 172 -1225 -1220 269 1099 -312 -487 69 -997 853
7676 853 305 -1032 -744 -881 -119 -675 904 -594 435 432 536 -1026 697 -168 -1831 979 948 -1059
7694 -1059 -671 105 -112 -1252 -2307 1313 399 508 787 -112 -184 -821 -1 27 -854 -1342 -530 -758 -75
7713 -75 274 -779 605 -346 7 759 -381 266 -4 -605 -1700 -188 205 1172 1411 724 129 420 -375
7732 -375 678 1053 -376 478 2762 644 1408 -1110 197 -449 169 103 80 2020 361 1343 -236 1050
7750 1050 -148 -1727 -209 1207 2179 -576 -1725 1724 166 -461 556 1118 414 38 -294 907
7766 907 259 889 1292 574 -700 -1292 -166 1846 2050 314 657 -1331 -1025 342 1505 -1506 -285
7783 -285 183 -433 -381 -981 -279 333 -2275 328 -1358 1246 272 -705 -489 124 -62 -1289 -32 -572
7801 -572 -1667 -933 38 861 -2495 -56 452 -881 -440 1314 406 302 211 707 -285 568 818 800 -969
7820 -969 666 -1304 -514 -985 -6 651 992 -443 435 -630 65 -811 -1355 581 -654 467 1001 1011
7838 1011 278 234 -952 -317 41 917 -2411 -825 431 958 1712 -711 -1771 591 -1642 486 121
7855 121 1908 1266 781 1325 -154 1863 36 -317 -264 1416 18 1276 727 440 486 223 -1024 110
7873 110 1216 -274 2224 167 -1031 -1192 655 571 490 25 1426 659 -557 876 -717 -476 571
7890 571 329 559 -263 1486 -161 1659 -1416 883 -1388 -1861 409 -1359 2105 -1828 -701 -282
7906 -282 1797 1000 -520 -665 -540 1035 -696 -1018 -77 433 1331 -163 -1462 2505 1031 -1611 915
7923 915 548 -898 1224 1213 1661 133 -1046 916 977 -1343 -231 727 -147 -1448 -2462 -665 -780
7940 -780 -1783 664 -223 -532 -1647 -2150 1666 -1027 -515 563 235 1328 -83 1877 1341 -665 -1595
7957 -1595 123 457 130 -2744 962 -164 212 254 -963 152 -256 -244 -1253 -775 -225 -824 -463 -1694
7975 -1694 264 810 591 818 -277 -1874 793 702 92 -103 -945 -1483 1394 701 29 -1843 -74 1505
7993 1505 424 -1582 1236 -55 -537 -1493 479 743 -2010 1377 -2246 302 223 -49 55 2323 -522
8010 -522 544 108 1160 -1038 539 -1049 525 1225 -767 598 -1259 -245 -1827 595 645 -469
8026 -469 663 306 -1582 -1274 1338 -94 42 -195 -830 -570 79 259 3391 578 378 1495 -889
8043 -889 1877 690 -240 1189 169 -155 1289 -1009 -779 1490 -1998 -303 -2031 -290 611 -599
8059 -599 -278 1332 355 -181 -37 748 -630 1747 -998 2162 -1433 731 223 -681 2300 1013 1902
8076 1902 308 169 -238 -355 -2268 643 -653 123 715 635 -66 -228 -1010 -1854 -781 -1968 1420 -984
8094 -984 -893 94 -2440 1427 -581 -2086 -120 1652 -687 626 1309 56 371 446 -917 263 -1270
8111 -1270 -1188 416 1653 -824 -1170 256 144 887 57 -1367 1350 -555 255 1766 -760 483 -1978
8128 -1978 553 1056 228 2998 -2424 -1502 217 -419 -1853 -544 -2716 1284 -191 -1574 -445 608
8144 608 906 1816 -1699 -2 -176 22 1076 -611 -88 -254 -656 -275 1004 -789 1276 155 984
8161 984 71 0 -808 -1012 1417 -58 -16 1322 3198 1256 -1917 -209 -863 1047 -645 -687 -775 -509
8179 -509 -67 -1978 -676 -1418 259 -229 -5 -780 75 -254 -2050 1587
8191 1587
$$ Imaginary data points
##PAGE= N=2
##DATA TABLE= (X++(I..I)), XYDATA
0 0 0 0 0 0 0 0 0 0 0 0 0 0 0 0 0 0 0 0 0 0 0 -79 106 -107 108 -108 108 -108 154 -212 215 -218 267 -318 332 -387
36 -387 432 -483 541 -598 659 -740 820 -908 1004 -1110 1225 -1344 1476 -1633 1791 -1975
52 -1975 2177 -2404 2659 -2957 3294 -3669 4121 -4657 5313 -6126 7167 -8562 10522 -13464
66 -13464 18347 -27975 53547 -254134 -524696 409089 266629 -396988 40077 364665 -227477
77 -227477 -32508 599627 251169 -98245 299431 138663 -406616 -134458 226282 -144466
87 -144466 -204445 221606 70024 -310996 -23947 214579 -93127 -89239 222678 -1580 -288514
98 -288514 -58946 -11952 -240345 -6792 266578 32122 -24993 226272 72180 -149066
108 -149066 63762 128249 -103113 -74766 17080 -134410 -143989 8518 4581 33949 154616
119 154616 91381 -6761 29344 -22385 -114590 -39919 10854 -44727 -10943 20518 -36036 23920
131 23920 131478 70342 44067 143234 57314 -137018 -80182 10188 -126558 -132843 77432
142 77432 52315 -91443 45119 121724 -63484 -23276 150795 -29285 -161289 38210 -19023
153 -19023 -251366 -35592 172429 -57248 -47516 247810 101077 -130992 89499 143921 -143883
164 -143883 -74388 129293 -84978 -172744 99312 65144 -130113 88340 232656 -45354
174 -45354 -78393 150124 -12798 -233461 -9147 83919 -165268 -102664 133488 -6830 -101470
185 -101470 137461 129562 -85207 36088 135176 -113457 -143957 71992 -26432 -167910 50474
196 50474 143492 -52386 -10382 155013 32749 -69533 58721 39088 -110815 -57012 12458
207 12458 -84301 -67149 70026 43969 -20344 75056 107718 -11995 -30206 42278 -13928 -88571
219 -88571 -34435 -282 -42937 -30668 28469 39799 38598 56509 41880 7037 -7609 -26437
231 -26437 -51511 -57355 -40872 -20823 -16647 -12908 32593 64486 25057 9351 62851 36638 -52915
244 -52915 -36115 4789 -58537 -75204 17767 32563 -15294 42694 83592 9552 8411 64565
256 64565 -13922 -80730 -674 1146 -105089 -49093 65631 -5334 -42114 87595 91287 -30921
268 -30921 6526 66194 -45808 -80627 16088 -23176 -95898 10239 59914 -37388 10063 125670
280 125670 31121 -54381 55329 49484 -99604 -63172 38168 -47826 -84826 43290 53644
291 53644 -31053 38143 94720 -8073 -20905 62010 -14019 -105459 -13119 19151 -86878 -41993
303 -41993 81272 25806 -32133 68092 83782 -25985 -17099 34792 -40444 -76560 -4077 -12227
315 -12227 -63570 6477 62691 2221 8674 86389 38675 -42930 -479 25649 -58190 -68915
327 -68915 4068 -6308 -42337 13166 52877 16907 21052 49285 12819 -21194 185 -16206
339 -16206 -64461 -41356 5050 -16006 -23925 37928 57572 13084 14442 51607 16732 -33804
351 -33804 -23044 -12598 -41490 -40307 -4083 1286 241 33179 44265 17950 21896 34631 -10074
364 -10074 -45171 -12822 -8792 -54195 -39913 20008 15344 -10131 35969 62077 13477 -3757
376 -3757 21177 -6429 -45793 -22851 -16646 -46773 -17935 31539 5513 -4720 55532 50056 -19593
389 -19593 2805 36887 -29651 -68952 -6925 -1164 -49756 -10474 45940 11991 5653 60361
401 60361 36634 -17365 14474 16757 -55664 -46079 19357 -19996 -57343 26256 56463 -12873
413 -12873 6942 70938 11283 -42035 9079 4817 -63400 -33831 9515 -36646 -27039 48621
425 48621 29182 -17230 44478 61133 -24589 -27701 32436 -18539 -72292 -11817 20426 -29621
437 -29621 -6057 53772 22503 1592 46241 27779 -29117 -4699 8561 -52368 -47199 15226
449 15226 -2496 -35626 22229 53625 5235 4017 41349 10156 -28777 -11147 -13587 -37322
461 -37322 -22382 -1034 -13134 2498 36750 27960 7354 24200 24849 -11704 -26578 -11440 -16724
474 -16724 -34593 -25023 118 13106 11208 16144 31169 28463 10417 1105 461 -15252 -27363
487 -27363 -20068 -17013 -16022 7096 18447 4822 22893 45350 13534 -16228 12168 4168 -47537
500 -47537 -36249 7348 -18559 -32013 19681 29442 -1659 23233 41014 -8876 -13321 19670
512 19670 -23933 -53577 -1391 9913 -44450 -6157 57818 16514 -12662 48141 39574 -26851
524 -26851 -6960 19502 -36785 -42238 11220 -8313 -33691 28791 40329 -17638 10775 59130
536 59130 -4191 -42618 17224 5010 -60018 -23931 24507 -19734 -18669 37845 22951 -7191
548 -7191 33567 30158 -24839 -11525 17887 -32157 -47823 10362 6609 -30136 8622 47205 8660
561 8660 408 30044 10409 -20855 -5688 -8567 -33445 -15119 3091 -11590 -1953 32235 21439
574 21439 16 18679 25034 -7411 -16418 -8259 -16019 -21455 -12746 -7356 4586 18087 8691 8361
588 8361 25262 14301 -10621 -8723 -5147 -24660 -24323 -5469 -10405 -5436 18095 11583 5837 31589
602 31589 23545 -16006 -4658 16040 -22781 -37787 3598 1350 -24133 5886 30083 3926
614 3926 6089 32763 4518 -15855 12318 -1588 -44344 -15101 18217 -21660 -23142 35964 25089
627 25089 -19485 19575 39268 -13472 -16510 15059 -18964 -38975 8877 4143 -30266 11727
639 11727 40970 -6741 -3166 45929 12762 -36361 2557 15986 -36070 -25886 14630 -7327
651 -7327 -17660 24685 22835 -5246 19125 25340 -16508 -14108 15001 -13986 -39840 -1641 13449
664 13449 -18128 -3261 32637 13180 -2912 18245 10463 -12677 -5505 -5154 -23819 -11871 5339
677 5339 -9271 -6419 21676 18257 -162 11853 18233 -4899 -10677 -6149 -13715 -10235 -7064 -11268
691 -11268 647 16569 8457 4334 19217 14364 -7109 -6672 -1314 -12701 -15827 -7970 -8769 -5645
705 -5645 14280 9266 727 17926 20483 -7887 -11064 11872 -7685 -30892 -6485 7965 -14029
718 -14029 -2352 21620 5401 -1491 22406 9320 -16339 4929 7251 -29947 -18333 15007
730 15007 -6706 -23388 19532 25533 -8018 4216 26759 -4231 -15664 7930 -6926 -25621
742 -25621 -30 5908 -18060 -445 28645 5165 -10565 23469 16606 -22673 -11393 11713
754 11713 -16122 -26028 5563 3797 -10426 10521 20133 -959 5937 21215 -5250 -16409 7322
767 7322 -2500 -27114 -6647 13260 -6530 -6527 15868 13783 678 8352 7190 -4509 -5145 -6383
781 -6383 -13774 -11559 3519 -1926 -6242 7684 16299 5253 1268 8054 2649 -6081 -9036 -8900 -5519
796 -5519 -5357 -6580 -550 8949 9557 3371 8326 10793 -4 -6285 -2220 -6975 -10346 -4957 -5779 -3451
812 -3451 9853 7135 -994 8957 18136 -1194 -9515 5322 683 -18616 -9124 5013 -4743 -4821
826 -4821 10125 7936 -33 12038 7172 -10684 197 5048 -13811 -16679 5858 2749 -16044
839 -16044 3550 20154 3121 -2715 11830 5732 -8744 -315 441 -15217 -4954 5872 -6714
852 -6714 -3363 19266 11693 -6895 6396 16975 -6416 -13520 3848 -1120 -16976 -3447 6103
865 6103 -3838 1584 11065 2583 1029 10508 2442 -10787 -2637 5352 -11066 -13015 6720 4250
879 4250 -7292 3530 13647 2601 106 4272 -348 -5505 -3836 -3796 -7830 -3019 742 -2759 -456
894 -456 12258 7781 -3615 1382 6285 75 -11092 -6246 -1285 -5705 -3910 2104 5500 6302 3263
909 3263 3180 3769 5710 -1764 -4943 -3926 -1995 -2977 -6232 200 4701 2834 1280 3127 9071 1515
925 1515 -6175 -1544 268 -5029 -6866 1407 1594 -1762 2213 3229 5866 5868 1879 -2124 -2300 2366
941 2366 -3299 -10991 -349 4129 -5296 -2438 8732 6174 -1653 3049 5658 -836 -3873 -823 -4659
956 -4659 -6309 773 138 -4380 4983 10568 -1001 -2909 9672 3003 -11604 -4170 5581 -4915
970 -4915 -7945 3988 3259 -3332 4323 5283 -668 1747 5815 -5566 -7383 4331 -2032 -12990 -918
985 -918 9654 -2349 -5494 10694 7566 -5429 650 5634 -3232 -4405 -719 -7177 -6645 2975 1803
1000 1803 -7125 3920 11291 -2447 -5025 5332 2076 -9296 -4080 2962 -2286 -3538 790 1879
1014 1879 311 4228 3678 -1382 6016 4620 -6215 -4982 3926 -596 -8383 93 6284 1730 -632
1029 -632 3783 3881 2047 -720 -2950 -1611 1314 -3704 -5748 401 1562 -893 -1174 4305 5387 -212
1045 -212 128 -134 -181 0 -4432 -3178 2740 2859 -3817 1363 6558 565 -4938 2742 2183 -2747 -3129
1062 -3129 706 -3342 -2045 2915 -2803 -2598 5808 1891 -6888 2831 7675 -5882 -8805 3816 2067
1077 2067 -7923 791 6854 -971 -3134 6332 -2486 -1196 4140 -583 -8898 731 6882 -8217 -5868
1092 -5868 10195 3488 -7996 2367 8166 -2522 -2322 6095 -1663 -5862 1449 776 -5317 2688
1106 2688 7188 -5677 -2728 10447 618 -7751 4910 4588 -7010 -4276 4162 1611 -1978 2088
1120 2088 -887 -712 3494 2057 -3866 979 6590 -2541 -6882 5254 2797 -5291 593 5582 -1313
1135 -1313 -819 1070 803 -210 1586 -2535 -3674 470 -155 -4412 -3087 5182 -897 -2941 1898 1420
1151 1420 -1298 810 -148 -1241 927 73 -3615 2876 4529 -2873 -4788 5266 4594 -2492 -271
1166 -271 5058 -838 -3718 1213 -174 -1825 678 -2302 -5567 3122 3543 -6028 -1878 8309 -430
1181 -430 -4623 515 7010 -3759 -2275 5058 -1469 -2375 3569 1142 -3735 1801 4628 -5883 -1483
1196 -1483 8684 201 -7328 6059 4793 -7139 -2280 7324 -1825 -3916 3356 143 -3713 5051
1210 5051 2494 -6315 2835 5336 -5126 -5077 5663 3585 -6108 1264 6706 -1942 -3011 3231 1161
1225 1161 -2729 201 -1101 -3750 2086 3347 -5928 -1050 5382 -145 -6067 2693 5425 -2175 -2903
1240 -2903 3123 -207 -3138 -457 -1717 -742 3746 -593 -2725 1909 4305 -4246 -1379 2880 -69
1255 -69 -2331 -951 639 -1154 774 1138 -60 1995 1659 -1524 104 3644 515 -6040 1776 2594
1271 2594 -3765 -2034 2360 875 -122 2739 867 -330 3146 837 -4570 -354 5285 -3936 -4550
1286 -4550 4649 2734 -4943 -1550 6626 -201 -1176 4897 -618 -2321 2161 -814 -4390 2701 4794
1301 4794 -1939 -1576 7880 940 -5422 2492 4229 -2769 -2237 4228 1538 -3095 -132 1069 -673
1316 -673 2596 3599 -2753 -2011 4640 -2479 -5988 2245 4765 -4839 -1795 5179 1638 -2578 2780
1331 2780 3350 -1116 3467 -1174 -986 -623 1854 -2484 -1788 4741 2071 -2411 566 3786 499 -993
1347 -993 282 143 -1871 -2234 -2513 272 1845 670 -604 1736 4641 233 -4540 -314 2011 -2279
1363 -2279 -4271 -1237 320 -285 -329 795 2349 3124 -496 1327 2652 819 -3226 -2102 1714 -677
1379 -677 -1736 463 2603 1279 1966 280 -227 2307 88 -4297 -1290 1470 -1844 -4997 2465 2900
1395 2900 -909 -1561 3433 1777 -1933 -1396 -242 -1236 719 788 -2476 -258 3454 -1227 358 3244
1411 3244 3339 -1952 -2682 4322 -1525 -4078 -508 1451 -1871 884 2660 -413 2926 4306 89 -1020
1427 -1020 2855 343 -6781 1415 3386 -1181 -3067 187 4689 1380 987 2385 -1257 -1845 -556
1442 -556 -2971 -1641 707 -722 -1900 1144 4428 -546 -726 2933 4044 -2685 -3129 682 -715 -493
1458 -493 -1193 -353 520 2249 342 1405 3251 1280 -836 -1485 1475 -653 -2068 -2481 1092 531 -210
1475 -210 -775 2158 2185 1631 105 1273 824 -3478 -2014 -842 562 511 408 2121 3061 2123 625 733
1493 733 1209 218 -3030 -3283 -66 114 -3417 -706 2676 1145 297 1876 2831 1093 -666 -896 -805
1510 -805 -688 -2002 -3817 739 2906 645 -980 3374 3942 145 -1978 1250 -15 -2941 -1897 518
1526 518 -2368 -1554 482 905 973 2273 -511 -1181 -663 722 -1839 -3779 -1043 1757 -2610 853 3736
1543 3736 3510 1285 -30 3172 1828 -899 -1067 -2018 462 423 -1643 -107 3852 3512 690 2503
1559 2503 3000 -1695 -4116 465 -1278 -3030 -841 100 816 2731 810 1591 1250 2042 724 -2744
1575 -2744 -2041 -472 -6546 -5130 314 526 -174 975 4782 3196 531 1153 -2243 187 -2676 -3197
1591 -3197 -2996 -560 -396 -1560 2147 3063 2602 18 -749 2671 873 -2169 -2127 -357 -1296 -1117 -2604
1608 -2604 2181 2762 869 -582 2229 1844 -1806 -228 -169 905 -694 -2225 -1009 86 2547 -86
1624 -86 1264 3128 2708 -684 -1101 782 -993 -3267 -1495 2846 735 62 2318 2503 1853 -136 -532
1641 -532 -1100 -558 -383 -5031 -880 -93 -754 -1572 2303 1822 -911 -1025 150 -251 -1146 -589 -2343 -3901
1659 -3901 494 -696 -1597 2900 3406 740 178 4778 1146 -2748 -868 -237 -1419 -1844 -225 -357
1675 -357 1328 3416 1341 1317 3030 700 -1577 -1676 -1482 -1954 -2863 253 589 77 1542 3453 2836 753
1693 753 -772 -37 -398 -56 -3036 -2085 -1181 -177 -1660 528 3573 2278 -306 -150 -827 82 -120
1710 -120 -2375 -1727 263 277 -764 309 3858 1300 -914 -118 1488 -1422 -3918 -925 -1391 -1179 -386
1727 -386 323 963 1244 2092 397 1382 3752 -1905 -2838 1363 453 -3996 -1000 318 331 -775 1211
1744 1211 130 2444 2046 -158 -864 289 -1573 -2802 -1393 851 1668 -1726 2277 3549 2703 -812
1760 -812 645 480 -719 -1154 -1458 -2525 1239 903 163 1455 4764 1482 -1029 1447 1665 -1598 -2132
1777 -2132 -732 -2076 -1520 -431 876 2079 1580 1696 688 1182 2049 -851 -2469 1127 -1268 -777
1793 -777 39 679 949 -261 988 1411 1668 537 -146 -1125 1275 -838 -1947 570 2379 999 1192
1810 1192 2056 2643 630 586 1636 -960 -163 -1075 -2948 -1923 -1002 -288 -732 1199 1799 -297 256 2412
1828 2412 -389 -1813 -2468 -1483 -925 -264 -660 -358 2884 2463 -276 1011 2530 -182 -2630 -857 1128
1845 1128 -1721 -1277 1041 1330 1395 1464 -255 1077 2515 121 -2478 -1212 1829 -2542 -2483 1466 2188
1862 2188 -80 1644 2736 1482 -159 3272 -556 -1420 1407 -1487 -353 661 1320 -1921 -236
1877 -236 4537 3080 648 404 3711 -1030 -1069 -653 -1754 -583 -1009 -13 2512 955 1072 -4 448
1894 448 1353 -1478 -683 -702 102 -942 -284 -287 1399 430 2881 2587 962 310 -106 -1220 -935 -1655 -2373
1913 -2373 -2555 103 612 -1043 909 2179 381 312 1138 1084 293 -520 -2009 -1577 2068 -1734 630
1930 630 2102 2024 -1052 1510 2135 740 -2739 -667 -1502 -967 -407 -1027 985 886 1340 -707 187 1320
1948 1320 142 -2315 1196 1024 -1504 -1255 644 -560 1737 14 1485 1717 382 742 -2998 -289
1964 -289 1610 385 -1813 568 2500 2619 1802 1456 2206 -20 -2598 -846 372 579 -1790 -236
1980 -236 1706 205 196 -1780 1600 1503 1212 138 -217 1022 -1261 -325 -867 -1360 -194 474 -315 -335 1117
1999 1117 664 -599 2174 550 -2144 -604 77 -1587 -268 -674 1681 1405 -189 495 777 -1727
2015 -1727 104 -267 -227 -259 -1068 -1525 -310 1516 715 306 868 1333 208 -915 90 277 -534 -483 -1212
2034 -1212 542 939 -266 978 3577 1230 50 -732 -5 647 -296 647 -564 348 87 509 1428
2051 1428 2518 213 400 360 431 -838 -1187 -1210 -1314 438 1112 1693 1435 949 -1223 -702 600 2556
2069 2556 -903 -661 175 1223 -1249 -336 2355 49 251 -200 2650 703 400 -1007 -915 -981 -716 -1552
2087 -1552 -670 2005 -46 -60 1716 1790 209 -954 -764 -552 -232 -2502 -41 -421 -865 -577 -159 -96
2105 -96 1550 -535 -493 2298 748 -1375 -1381 -229 -137 -1039 -688 1121 608 604 190 575 992 327 -581 185
2125 185 -360 -27 -149 -1411 756 -165 -950 -82 1827 401 -780 172 1467 338 -1121 -588 297
2142 297 274 894 -110 594 1772 306 -1498 1324 304 70 -1430 240 799 -1020 -213 197 559
2159 559 802 253 -1919 1591 1085 -1114 -155 957 690 -1798 -539 431 3 425 -1201 1082 1102 -118
2177 -118 -1041 649 317 -699 -2238 968 236 976 -1613 551 737 -587 -323 36 -410 -470 -853 -136
2195 -136 685 1332 37 -273 1342 1069 -493 -307 3 280 -1043 -170 652 401 362 -340 -450 224 380
2214 380 -1715 284 376 1069 -1850 98 789 692 -857 1401 579 1557 -445 -217 -25 757 1241 -999
2232 -999 -145 1030 499 -1212 428 2095 94 -236 984 1100 480 -798 -420 -1546 12 -95 -357
2249 -357 -740 579 -265 1345 1016 523 492 -291 883 869 -539 -77 951 -981 195 -294 504 479 -59
2268 -59 -919 524 -126 -535 -1901 2120 -906 -906 -210 1568 1442 -2123 -1393 405 414 1588 -500 267 766
2287 766 344 7 -60 -1051 -629 -1691 -129 1110 131 211 577 467 755 -208 786 575 -463 7 -743
2306 -743 -983 2040 -439 1376 1624 -382 -984 -105 793 1018 -215 840 -726 -205 1221 1006 -370
2323 -370 441 483 -1841 -521 671 -501 -828 -693 746 44 -785 -86 -304 -395 -266 -1117 739 856 -168
2342 -168 -1453 1042 1038 -545 -1354 1308 1402 -317 -889 158 749 960 -116 -354 944 -564 249 -1155
2360 -1155 558 753 -518 -29 1825 850 507 229 1091 1305 -2004 -988 -123 868 -249 -157 -842 591
2378 591 743 -346 64 816 -609 -858 -15 -693 197 -270 -857 732 367 -404 733 1417 1521 401
2396 401 -1702 152 133 -1384 -931 -1017 1032 -1842 1873 965 755 -432 210 -13 -454 968 -1056 -318
2414 -318 -631 -140 -1140 113 1647 823 -817 -367 93 -867 -519 -1267 248 1642 -651 -893 701
2431 701 507 -43 108 2321 2919 336 987 -875 270 -626 -474 -1112 768 2179 474 -237 398 765
2449 765 -27 -426 -139 579 884 291 286 369 711 958 656 2586 1189 491 -742 684 32 -265 -486 766
2469 766 -873 -1609 752 1071 718 -570 613 89 -245 -2101 -1489 -557 -632 1549 1853 1353 543 440
2487 440 1592 943 289 -745 529 230 508 415 -874 -625 1549 -63 -327 1713 399 -764 -86
2504 -86 -1290 -663 -733 -603 -715 903 -62 1305 -331 547 1432 999 758 -438 -663 -755 3 -502 -2067
2523 -2067 867 942 2382 468 587 754 145 571 -968 -2043 -3072 -1055 37 -1489 740 -130 1297
2540 1297 348 1503 1601 502 -1024 461 -595 -606 104 -624 1084 1805 -432 869 94 2996 24
2557 24 -957 -320 -2 -1345 -1821 -174 402 79 -536 -72 1116 -469 -10 1640 -75 -420 -72 693
2575 693 168 -322 -663 312 1028 637 1499 -488 2293 330 -2062 -1127 -841 118 -628 -489 27 375 1036
2594 1036 -765 166 486 -522 76 451 -1446 -1222 -30 -87 2207 2059 638 -928 810 1173 -503
2611 -503 -136 -724 -706 -1637 79 -204 40 671 -357 348 1881 52 -20 -619 -899 -1349 -2104 -1166 -149
2630 -149 -84 155 1132 1854 1576 -175 140 -404 109 -874 -971 -1143 346 -715 393 727 368 534 -143
2649 -143 631 315 223 -440 -537 -2252 -512 -731 185 972 671 660 -301 1071 -301 848 -568 -323 -1302
2668 -1302 -1633 -176 500 938 403 990 2423 1620 346 219 -286 -579 -772 -22 -1918 818 355 -1810
2686 -1810 487 568 44 575 -234 -138 -899 -2205 -1157 -1 -886 -1032 -141 1556 1179 1314 37 -315
2704 -315 -328 -1683 -1086 52 -106 380 -211 479 1098 427 1874 2058 1362 713 -1244 -765 -835 -1698 -718
2723 -718 409 650 626 -282 481 -817 211 -271 -1383 -564 -820 -1658 -892 270 586 -231 -73 1433
2741 1433 1464 -168 483 1688 77 -1523 -1179 -1098 -1765 724 -56 213 1709 2461 413 130 427 -1697
2759 -1697 -1324 -1012 -425 -1351 -2261 109 2097 1081 431 -20 249 1252 367 -1480 -613 -187 -827 -258
2777 -258 -10 -113 109 1779 1333 674 -738 274 -983 521 -837 -1145 -881 -486 -374 229 998 1971
2795 1971 2463 1145 -320 922 -1799 -2430 -743 -861 -481 -847 -529 488 2039 708 473 303 -16
2812 -16 -1958 -1231 -414 -720 -491 -793 161 885 1793 403 132 882 -429 -342 -1900 -1416 -1158 -674 -376
2831 -376 943 1040 923 1936 587 686 615 231 751 -718 -1170 -1100 -839 -3 416 422 1031 1812 928 34 -126
2852 -126 -738 -1208 -1847 -2344 -832 865 -43 385 1197 1850 844 899 856 -1414 -1864 -1087 -1092 -481 540 774
2872 774 -379 1711 77 -780 1201 880 -922 -1486 -1216 -1204 -1445 54 -676 713 2366 3409 2592
2889 2592 235 976 86 385 -1037 -2186 -1684 1 -30 1554 751 1924 692 1025 370 504 1038 23
2907 23 -897 -1946 -204 0 1187 288 -7 1972 883 -63 1238 485 -702 -2523 -461 -854 41
2924 41 -754 371 1025 1255 1450 -242 1875 985 -940 -1165 -378 -1334 354 -962 -366 1313 505 1078
2942 1078 803 1670 931 357 -1807 -1121 -1358 -942 177 -776 671 653 1048 3069 430 145 281 -1792
2960 -1792 -1297 -693 -794 -837 -71 -147 1533 1856 989 255 1156 91 286 -836 -1880 -2080 -320 -1465
2978 -1465 44 274 1191 1040 -45 407 -241 -933 -402 -1120 -146 -797 -827 218 1162 656 1663 924 629
2997 629 803 -1032 -357 -1251 267 -2614 -637 -52 -288 289 822 1173 880 1726 -419 1435 -253 -798
3015 -798 -2101 -423 -1387 386 974 375 2131 1033 931 706 -391 -1394 -1173 -2107 -336 15 1258
3032 1258 83 2084 1349 1050 962 1127 -110 -243 -1412 -1211 -1303 -1802 9 -310 1284 913 2038 1674
3050 1674 1333 -1342 -598 -1442 -1005 -974 -1517 -717 -751 195 1038 1811 1478 242 441 1036 -1206 825 -1031
3069 -1031 -1209 -1481 -405 1995 1306 1665 2165 847 294 208 -281 -1167 -1354 -1965 -898 141 -711 1282
3087 1282 1194 1027 641 1448 869 250 -860 -1788 -1566 -1225 -970 -153 1017 3373 1384 1090 567 1060 979
3106 979 -529 -1071 -304 -1629 -1463 -96 2804 575 744 2753 740 1162 -419 -54 -290 -1600 -1633
3123 -1633 -1164 -691 -791 -182 621 1748 888 74 643 -373 -516 -1800 -1239 -1183 76 -308 297 744 1786
3142 1786 815 -210 1878 -210 33 -2102 -1527 -1199 -1817 -316 820 1104 2003 650 1015 1635 774
3159 774 -854 -979 -754 -1391 -1338 -375 113 835 1123 801 1018 393 884 273 -942 -443 -1709 -796 -1105
3178 -1105 578 -649 745 1056 2925 2128 828 123 -964 -1195 251 -2017 -668 -925 -429 -64 998
3195 998 895 1716 1172 -57 9 -1699 -1542 -840 -493 -616 -238 -150 1698 1211 1133 -491 2189 91 -1435
3214 -1435 -420 -496 -1149 -1336 -1437 760 1186 2199 422 1383 574 -1736 -541 -1012 -1304 -932 23 -104
3232 -104 -536 -239 -32 567 1921 1285 592 -1068 177 543 273 -1449 -53 3 -637 445 2169 1042
3250 1042 2459 -162 998 -850 -997 -1135 -690 817 -1932 -18 1730 3209 -1143 -812 -514 503
3266 503 -420 -1081 -821 -2335 -1490 575 -120 61 -641 1914 861 -686 699 -835 -1226 -2113 -958
3283 -958 -1472 -1639 435 -368 -44 878 956 687 215 -745 -33 -339 -691 -1865 -1648 -1163 -113 -1343 995
3302 995 2432 1044 540 680 1235 -322 -2605 -413 -2860 -923 462 13 943 1647 141 -117 31
3319 31 -90 -264 -852 -1502 -82 -1625 -1471 688 62 1109 2681 422 742 383 -962 -2384 1225
3336 1225 -1368 -1990 -1764 -118 169 1124 102 886 165 140 -1487 -397 -791 -2346 -411 -985 -382 -940
3354 -940 710 2095 486 479 553 -194 -521 -976 -1248 -992 -788 -259 353 1480 1375 305 -284 -553 279
3373 279 -164 -1014 -584 -1862 845 -1911 808 599 534 1361 1969 1052 689 41 -1474 -484 24 -795 -1054
3392 -1054 -1147 1816 0 370 1072 -844 -342 406 -382 -1405 -596 -1394 -249 -1230 852 -220 322 903
3410 903 22 -854 1500 -45 114 533 -533 -459 -205 238 -649 1418 1518 731 862 -318 155 -954
3428 -954 -778 -914 -2037 -468 -398 23 -544 804 1044 567 1037 -490 -978 -845 -168 -653 46 -8 89 652
3448 652 1105 1241 1050 969 426 722 79 -165 -1499 -1289 -2266 176 420 563 217 1973 897 744 766
3467 766 -1432 -179 -3230 -369 -491 1455 117 -1240 1787 1041 1501 32 126 248 -1074 -65 -344
3484 -344 -1517 -996 -270 627 323 644 -625 309 -109 -571 -1161 -292 -1494 -1466 -432 993 365 1813
3502 1813 460 1982 1027 88 444 -1195 -84 -351 -601 271 -155 1364 552 703 1185 1330 -593 -1361
3520 -1361 -1060 -108 168 -880 -1271 -885 -120 41 608 937 2522 1057 890 -131 86 -50 310 1515
3538 1515 -583 -960 1713 1015 896 -329 777 -2027 -997 -1072 -1467 -1415 -839 -669 56 1876 1814 -195
3556 -195 -241 111 157 718 -977 -1085 -584 -893 -2339 -1032 -1548 -794 2015 943 2247 1061 -171 -653
3574 -653 -2037 532 -1786 -1997 -548 1579 242 129 -8 743 883 72 550 477 -1426 -1286 -987 -1139
3592 -1139 -8 10 769 514 1559 -361 942 639 1008 495 647 72 -654 53 -433 422 657 763 1511
3611 1511 821 1374 -1204 -634 -402 -59 331 -1262 -618 92 -189 -628 -11 2050 1304 169 -610 314
3629 314 520 197 -105 -1118 -83 -1927 913 733 519 161 585 -582 380 36 -1782 -1395 -947 -687
3647 -687 -130 -643 -1322 358 -273 -1012 -474 -198 81 -607 -1371 -201 -444 568 648 1203 921 595 685 -423
3667 -423 -910 -621 -180 381 -760 459 846 1991 -815 543 388 494 1025 1077 820 582 -957 266
3685 266 -131 1293 1339 2900 576 -133 -236 563 -1664 -114 431 -930 -248 -498 613 -483 -2452
3702 -2452 -252 1169 2244 -555 -119 1480 348 -1030 -143 -632 -208 -1185 1 761 912 20 1294
3719 1294 473 1484 352 -557 -985 -1208 -1463 -520 -61 1255 118 2009 121 -186 177 -1504 -1425 392
3737 392 -1724 -766 -2126 13 129 881 460 673 540 -1344 -249 -468 -1836 -311 -424 -2 528 -419
3755 -419 992 1895 901 1263 1500 562 922 -1334 489 -945 665 -536 337 929 1936 1631 1856 2189
3773 2189 1345 -112 -1050 -719 1055 -355 1794 -170 1289 650 34 365 366 1666 896 -1169 -785 -1279
3791 -1279 -623 1254 75 -10 -393 -242 -1109 -43 -490 -857 -528 -1034 -278 -2014 -1180 -1727 76 -671
3809 -671 -652 565 817 -297 603 700 -628 179 -959 -57 245 275 -152 295 774 1252 -142 120 234
3828 234 -217 -434 -1020 690 -1190 -400 -819 -200 43 581 1333 535 -209 512 -1534 -2738 1319 -337
3846 -337 -248 554 695 -926 -376 -316 1881 -423 -1338 1444 833 220 -336 34 351 -318 63 1281 214
3865 214 425 1586 696 294 -1597 -666 -1486 -306 -243 -107 223 615 1047 730 39 299 -399 -869 208
3884 208 -628 -497 -141 -450 85 -48 -545 -369 -21 452 -19 -188 389 -728 342 159 780 -250 27
3903 27 -636 1091 1286 -84 -113 -49 301 -846 -1591 230 1352 -1300 811 458 -1222 -266 -9 -633
3921 -633 -861 656 -605 -812 544 918 612 41 -151 556 872 211 193 -1703 -1602 91 -573 350 -138
3940 -138 -636 760 797 1120 1867 1870 -1145 -106 -170 -1064 -1299 -673 630 583 -216 579 -216 1325 1610 303
3960 303 212 -202 -961 -518 -812 22 -386 686 123 368 -300 360 462 339 -1073 -1206 -539 -36 -294 -318
3980 -318 -25 -44 -108 -327 510 564 603 323 -1397 -741 763 -940 52 43 -903 -562 -248 824 -11 -124 -78
4001 -78 -196 -1414 -390 13 -1537 -186 -508 -879 -563 320 670 -753 -128 -44 -1442 1191 80 1523
4019 1523 -1745 -448 1145 939 -332 1219 1151 1463 -31 198 -382 -219 -575 -689 -472 666 491 1018
4037 1018 327 333 -231 416 -464 -186 -170 -1095 -313 -589 -29 379 944 94 1615 1060 -217 -329 -456 204
4057 204 -911 -867 -2235 -935 1708 -959 809 -230 -462 288 542 -306 1279 -486 -207 -544 618
4074 618 -1098 -924 -719 236 253 -179 852 59 -967 -1843 238 -1730 13 -135 1488 1145 -750 -120
4092 -120 1032 -712 -908 -157 -1572 604 -2238 939 -950 65 -218 326 1174 554 19 1049 -401
4109 -401 -214 -1551 -400 97 -972 -148 1285 758 -489 1157 -174 -787 -97 -431 -532 1670 65
4126 65 -53 -1001 -282 -277 563 -648 -712 644 488 -380 -219 167 -832 -1129 615 -32 196 260 -654 842
4146 842 886 459 204 276 -642 -961 -218 228 -241 184 663 59 2469 375 -52 1536 -355 1052 -1574
4165 -1574 -628 -178 832 28 -113 -350 1771 -349 251 704 526 -294 722 -1562 766 -793 -736 881
4183 881 955 594 1244 -128 -328 131 -573 -921 -1364 -1840 -36 259 753 645 65 -1666 -461 1035 717
4202 717 -85 193 251 488 1655 -706 320 -235 65 1159 546 51 860 -771 -133 291 919 -618
4220 -618 -1722 -687 114 -752 377 184 -1137 218 -435 898 -1224 -150 -1727 -1571 1343 -591
4236 -591 -377 -1314 -195 -73 -741 1095 -222 187 -229 -624 -269 -152 273 637 391 238 474 -666 3
4255 3 190 778 -87 -87 295 1753 479 453 157 631 847 -714 -682 65 -459 -226 -442 -1148 403 208 539
4276 539 -143 -1013 849 429 240 265 -1023 540 233 629 532 406 -378 168 486 -311 17 1129 -17
4295 -17 -955 -510 30 -560 344 -133 967 -101 -336 1760 490 -261 169 -1011 506 -837 -1215 -828
4313 -828 -813 432 576 1115 -759 311 209 -35 -294 -280 -908 -2134 251 18 495 304 1305 921 -1077
4332 -1077 -1873 -205 -626 912 1186 330 -186 -933 -550 -615 1031 -264 -617 641 111 1049 621 36
4350 36 1714 -1022 1023 -348 618 1036 366 346 612 216 302 -259 -748 915 378 -990 -1179 659 486
4369 486 78 -575 -51 652 909 -920 -349 374 -470 -22 -772 -317 162 654 -975 -603 166 -416 160
4388 160 -324 810 324 -337 266 66 -1097 -366 95 190 -486 -203 253 698 98 356 159 -227 -775 627
4408 627 -111 -175 485 -397 -1020 -187 -802 -1083 200 853 235 72 -391 -370 -274 523 -211 -380 -610 -754 -702
4429 -702 477 -1137 492 -576 -583 366 -363 -379 127 -602 -171 -1380 -181 46 -922 -685 214 1025 694
4448 694 686 696 2 -514 -854 22 -909 -180 -777 83 1150 30 -1289 776 444 -667 391 166 629
4467 629 1260 898 -2247 559 678 -132 -262 -591 -467 -330 570 -121 -1101 -542 -1433 -556 -559 909 1654 -1005
4487 -1005 -93 1418 -551 -980 -249 -984 84 -557 -63 -1399 -405 -362 -5 -303 -290 -86 -1331 -313
4505 -313 190 -1368 637 982 -11 -845 1057 -781 409 -1062 -512 1187 447 1354 708 278 -46 323
4523 323 -222 -498 713 -233 -805 -353 -1119 -782 850 -22 -124 228 395 438 -186 -100 -1527 -647 776
4542 776 271 472 -377 93 2406 1076 -83 51 -634 -1443 258 -285 254 585 7 -345 86 435 -1274
4561 -1274 -1105 -768 -446 877 532 230 708 -498 -247 628 669 109 -104 943 207 38 134 1021 299
4580 299 -1071 774 -175 429 920 -263 -1269 -500 236 288 407 -318 -695 -668 -16 320 -190 470 327
4599 327 -425 1079 -774 296 251 1517 -534 -522 -741 -1801 174 557 -567 1010 641 91 -704 226
4617 226 506 -298 -577 1018 -510 -323 386 -133 168 -379 526 296 4 -786 -655 69 242 50 842
4636 842 388 -180 320 -640 -500 -1006 1244 746 -568 -206 -167 1039 693 -267 -1147 142 -345 1364 -1057
4655 -1057 -1022 -203 264 55 -289 -470 276 -872 -112 1182 550 171 880 567 772 194 -649 -645 1518 112
4675 112 851 1596 -1402 1703 826 -351 -138 -46 1470 898 1478 272 -406 -75 99 967 1761 447
4693 447 23 177 483 -283 -1573 176 808 -400 141 -361 592 904 -1524 208 1263 1128 301 380
4711 380 -892 126 -241 -319 59 95 -1602 -982 -692 -1061 -546 1411 -792 41 -1413 621 -806 542
4729 542 -70 1078 735 -542 846 -1562 451 -297 -556 550 -118 15 -146 434 -183 -1851 -125
4746 -125 65 1306 -218 -1864 1129 606 -1795 -2327 -379 -321 520 781 -1055 89 -404 -970 -214 -44
4764 -44 911 1793 -374 841 -157 -1159 958 1458 658 130 -440 640 600 -534 -735 342 -650 -210
4782 -210 -1842 -923 -19 14 -1764 2509 351 936 -683 -1510 -675 -1057 416 -468 294 -1785 1129 -204
4800 -204 410 944 -663 436 1324 -276 -949 237 -1207 -17 280 723 301 -288 1188 -1216 196
4817 196 -713 523 -514 1574 466 40 759 -2136 604 1496 -199 1610 2178 1621 602 988 2157
4834 2157 -631 -1026 -768 -1314 -200 -492 -327 -3 -337 811 1910 1608 -324 1471 -192 -880 1043
4851 1043 -1164 -899 897 285 830 -750 363 1348 915 1059 -1967 2 258 -289 360 -206 -1665
4868 -1665 638 522 609 1940 304 -454 -703 -1565 -748 635 -494 -279 -1242 945 -407 750 954
4885 954 287 158 1118 264 -1468 902 -1013 1760 459 -53 -826 478 -510 -213 -1656 -331 -218
4902 -218 1924 -1492 -1262 92 -1711 537 -2049 -1374 835 605 636 269 -82 1166 -148 78 1527
4919 1527 -593 335 -266 -956 -1442 -402 1930 -327 119 656 -760 -405 552 -879 -913 -575 -300 -926
4937 -926 175 1092 97 65 -980 124 -597 -475 182 -66 -85 -121 -551 26 296 461 1557 -37 144
4956 144 664 149 -51 -804 -447 -658 -1439 723 -1065 -16 1036 1179 -817 41 -1014 1134 -119
4973 -119 -1998 503 598 -414 -526 -977 -473 1277 -1126 -893 108 215 -47 790 -1281 -211 -305 -491
4991 -491 718 -310 -781 -837 -265 931 499 118 -34 -301 -5 -978 -31 -66 160 -69 405 678 1516 -998
5011 -998 -552 175 -264 -1118 -636 117 -119 -582 -158 907 1093 413 153 -176 -650 -31 -421 -637 -319 797
5031 797 -776 -100 226 -29 -286 73 243 -1353 -1271 -522 -411 -311 -728 551 -9 -105 95 112 1389 1053
5051 1053 757 -799 -261 1125 -1786 -606 -91 302 932 597 -422 -885 631 809 -434 795 977
5068 977 -1325 899 54 275 784 -162 -864 -500 -307 9 -54 573 -576 698 797 -248 1137 95
5086 95 148 286 -620 18 364 -109 -344 694 526 1198 477 -1675 850 -302 689 767 1721 -146 -298
5105 -298 1515 21 -874 312 638 330 -836 -1239 1461 -712 -392 1548 -455 519 304 443 -308
5122 -308 293 473 488 371 -863 1031 22 -175 916 860 -381 341 -404 -201 -191 844 300 -239 45
5141 45 -323 240 -425 834 -258 250 561 457 706 -130 95 389 392 763 68 1344 -185 1254 553
5160 553 -377 -833 -497 882 656 -1223 1101 9 -651 72 1557 -532 -443 23 -1033 -168 -44 99
5178 99 267 1852 776 1039 -330 -193 -17 -199 597 -137 2 -367 282 821 422 -1161 142 45 317
5197 317 -53 -1000 -198 -635 -1034 948 424 -482 781 -148 -1359 488 643 535 -229 -149 442 -1549 1665
5216 1665 -1328 -609 -1052 -199 1119 -633 -997 -175 -133 -891 -225 -351 -459 630 1022 -787 -462 272
5234 272 39 -17 -136 591 59 520 -674 126 277 1215 408 -759 -246 823 159 -163 -582 22 354
5253 354 -241 -1466 -389 -116 192 624 232 853 202 -579 -115 -641 256 -75 415 -166 -196 900 51
5272 51 913 1539 -122 -323 50 933 -439 -969 175 -773 164 -332 424 24 28 959 1 209 -419 -422 691
5293 691 -746 1316 231 -708 129 -616 -565 -120 1134 -525 221 141 -113 -410 -427 -223 -295 225 -282 267
5313 267 695 738 -1189 -163 -570 17 -572 -168 23 -363 114 -286 -17 -791 511 -36 2007 291 -722
5332 -722 -10 -645 403 259 -138 -66 951 -140 -37 1795 542 275 550 -276 1125 762 299 -126
5350 -126 565 120 222 -611 1131 158 -980 425 316 1157 621 -286 -223 -74 -1085 438 -453 -633 946
5369 946 -312 97 -648 -506 940 253 76 483 -725 -19 1008 205 -623 339 180 -313 -1735 32
5387 32 -825 888 422 1945 824 5 962 -945 1204 -972 -719 1004 121 -150 -542 605 -1217
5404 -1217 716 567 -620 -1074 347 475 -136 -50 168 197 186 655 -420 -407 24 -129 628 -501 -1547
5423 -1547 691 -361 -1796 -838 158 230 518 970 692 -670 -610 -667 -396 -113 167 559 -1232 -1257 -117
5442 -117 591 53 -695 -673 -48 856 -121 -241 22 1192 -628 -349 707 -573 -204 38 811 -255 464
5461 464 -98 110 1097 -116 -319 -101 -185 305 -1035 315 556 386 131 251 -232 -740 24 -450 -31
5480 -31 806 -1125 541 580 236 514 -551 726 -60 -567 226 656 759 131 542 -842 -783 676 -536
5499 -536 240 -133 -556 -150 -1004 -512 -368 260 -16 -958 734 527 150 -251 -835 -183 -551 -688 67 563
5519 563 -541 1071 -267 1980 -17 348 1607 2258 116 -252 114 -408 685 697 1169 -550 312
5536 312 -744 -991 -24 2167 1072 439 -959 130 756 -2 -457 -14 1066 144 33 -81 442 -468
5554 -468 -161 -129 -151 448 275 -353 -552 -1073 -513 21 605 -469 -1037 -765 266 -251 -923 -238 -151 -666
5574 -666 -571 -724 316 -130 -82 661 -51 451 -1635 -447 97 1074 -816 -7 398 492 -617 737 -1621
5593 -1621 147 -130 723 -989 -39 474 -95 662 458 601 152 462 806 -966 242 1069 -1310 -33
5611 -33 -552 -605 159 192 -1171 380 -929 199 577 56 -295 -676 -435 -647 567 -23 327 210 -64
5630 -64 877 -36 -718 208 -722 374 -261 -299 622 -189 -258 -508 -460 -67 -283 303 -496 506 454 -823 -802
5651 -802 -538 571 -507 1166 284 321 309 -197 399 863 -60 585 -469 99 -723 397 -1092 -668 -2204
5670 -2204 -1143 -476 917 24 -144 -420 -125 -296 -421 980 -1556 946 -1097 -282 -209 1156 -705
5687 -705 -657 502 419 776 690 449 466 1431 754 74 257 328 720 -1241 487 -635 -246 -110 1545 848
5707 848 -321 2409 -1217 -261 199 453 -59 -880 916 930 -152 877 -478 -110 -2054 666 1489
5724 1489 -60 1217 369 52 -777 -1276 -29 -576 -389 -482 -888 856 -1219 -816 1260 321 -334 -8
5742 -8 -658 -686 -249 -146 214 -199 160 738 -550 -904 84 572 -665 -555 -360 133 -211 493 -51 -759
5762 -759 749 1590 303 -326 194 594 452 -509 111 -647 574 -903 25 -802 966 -1129 587 -309
5780 -309 208 238 754 733 -99 1613 444 -438 799 1239 72 -330 1203 256 53 -189 228 422 784
5799 784 689 924 -621 1178 -49 -227 180 -975 -325 1070 794 -478 -574 826 -590 -724 791 1147
5817 1147 -73 1233 -255 -121 1160 -475 -260 -849 -1246 617 848 896 702 -129 -384 -85 -817 390
5835 390 -58 792 602 720 -47 51 -1036 1190 5 -21 362 -462 46 -466 -1624 -988 283 -1243 818
5854 818 -249 -833 -807 905 -58 523 -215 -423 1224 -227 147 -97 -43 518 659 -608 70 -533 -215
5873 -215 59 -457 -998 -647 -650 -1078 925 129 1010 426 690 1148 -337 -124 -1370 -429 -503 1306 306
5892 306 448 -83 -508 137 133 278 -137 629 420 -714 157 35 -115 298 -271 719 639 -651 -367 -460 351
5913 351 173 -40 0 -154 131 1074 -477 511 180 236 1560 -732 -571 -1078 554 -2 -1063 -603 -1419
5932 -1419 197 -135 1263 835 735 243 -414 -639 176 505 -457 -159 387 300 1270 -14 864 -145 -867
5951 -867 -662 391 -560 -223 -421 -506 -820 -447 -70 -819 60 -1104 894 942 -37 -692 687 -1258 540
5970 540 -96 -1084 -139 -362 118 -1334 952 -440 -573 63 -166 -1176 -467 -1227 -1327 -286 -1714 -356
5988 -356 -47 -479 -532 1201 -120 897 -1267 -1744 -1070 -243 167 257 672 -243 453 -508 513 961 786
6007 786 1408 629 -1309 -1200 74 -642 -870 830 -676 -312 1365 -664 -636 1061 -747 418 -1329
6024 -1329 342 117 -147 -97 526 289 364 1282 -14 -167 83 -712 311 -95 -274 -198 540 -582 -300
6043 -300 596 797 -338 637 -425 -807 -469 -737 78 334 336 -651 823 1006 569 -736 1103 600 539
6062 539 -548 807 -876 -34 438 29 -926 1342 710 178 63 340 -267 125 -686 52 -167 -69 80
6081 80 671 -334 -651 497 1319 198 -1349 790 369 301 64 -215 135 -1256 -1513 720 1439 1021
6099 1021 530 -661 -3 -1060 -1270 564 -938 322 -619 -182 -499 -498 -1038 -1060 616 -805 -467 -45
6117 -45 -2608 -62 -1492 -514 -142 -523 585 -69 271 -166 401 -483 141 -617 891 441 -336 697
6135 697 -240 193 611 -200 -668 -1420 1054 -1682 747 -622 676 126 -224 759 -236 -1053 -239 817
6153 817 -1004 -187 -581 -932 -681 1419 -959 225 -928 -197 1350 610 -1076 -735 371 -1259 -769
6170 -769 902 -538 -1192 663 -1920 -1299 -101 -128 14 -155 -584 -13 277 -116 238 -292 363 -1505
6188 -1505 -586 -481 1111 -440 414 901 -709 -879 -685 96 561 -1032 -1141 78 443 542 992 250
6206 250 1489 65 395 -168 -1159 -2027 -1718 -1702 -313 -1052 -690 950 789 -1179 602 -574 -511 -80
6224 -80 372 -3075 138 537 -750 1844 243 -450 -796 -943 395 476 -380 -52 -992 -142 -751 -529 944
6243 944 1511 1017 -849 -15 -797 -681 225 -1601 -611 -739 1147 528 242 -331 -200 -288 -149 -1019 1456
6262 1456 240 -540 -505 346 -2239 537 -528 2117 1495 993 -827 -494 2314 -510 -314 1172 -1692
6279 -1692 1587 1641 -261 -1008 -140 806 369 723 42 1084 -462 -517 1623 -611 -623 519 629 1059
6297 1059 -593 817 -1276 835 -999 -231 -697 103 -196 -50 337 -2 -1116 -352 487 -632 -213
6314 -213 -349 -701 -674 -1051 1967 -760 -223 -302 -1438 -803 371 -101 -299 1059 792 18 -562 -294 -1378
6333 -1378 -912 -1273 -856 -596 -94 -296 404 1102 1178 -67 -58 -474 263 -581 -1370 -300 -169 847 403 693
6353 693 59 872 45 -203 -2256 -649 603 -900 -401 723 -859 529 -428 -106 -183 1149 -270
6370 -270 -101 -415 315 -44 52 1240 901 675 339 909 757 -775 76 -27 -1388 -881 109 753 -1206
6389 -1206 261 -135 -990 412 632 -699 -846 -296 -1561 252 79 -329 660 -48 823 -231 1253
6406 1253 -413 620 830 685 365 -2062 -441 -300 -2058 -229 94 32 -14 614 1920 -492 120 719
6424 719 -1409 -481 1107 1130 461 -828 988 343 1046 -344 -528 -304 449 -45 -1227 -266 52 151 -232
6443 -232 332 1556 612 232 411 -437 -1186 789 679 -1395 1459 -593 -897 81 1402 2 -729 -521
6461 -521 261 -632 -990 1174 359 942 -2189 -1265 701 497 1484 213 -83 -1331 -850 -1483 -1625 556
6479 556 287 -619 1218 -32 820 1390 597 -1323 944 1632 1027 -222 30 414 -404 79 -463 -214
6497 -214 -118 -557 -312 97 -527 -610 -1230 329 -1426 -890 -628 309 -1217 450 -701 347 -1576 253
6515 253 -70 156 1258 -1617 91 -132 -704 -352 1299 144 53 -1743 403 1296 -108 -911 3296
6532 3296 430 749 108 -72 555 -834 918 -550 -318 218 127 -160 -413 -2256 329 -638 -339 -1430
6550 -1430 -303 -276 1112 -69 606 735 399 -487 -2455 56 90 1593 -493 -427 -1134 217 570 -1036
6568 -1036 -78 -675 -1006 -1050 58 243 -239 610 -1197 -96 1337 1286 1007 -292 1213 375 17 -1282
6586 -1282 -1387 -1555 48 -61 754 -802 625 58 705 317 -1465 1171 -394 753 -412 -199 583
6603 583 372 -40 -1366 -17 697 601 580 -634 -781 -266 -149 -535 -488 -1100 -29 -342 989 -1051 71
6622 71 5 -460 648 -550 295 -927 -1123 -1247 133 -59 299 601 -332 -233 500 -627 -1529 6 -1286
6641 -1286 780 221 -245 864 345 -683 1503 1691 143 -693 -1427 -1290 -1997 258 -670 737 659 -1036
6659 -1036 -660 -739 -606 261 -51 -140 -666 71 541 1660 694 63 -1117 1890 678 -685 1711 -25
6677 -25 -1877 1253 -1672 -1398 -1366 -892 627 -600 53 -285 2112 -665 701 331 -1670 -412 697
6694 697 969 -685 -1074 1092 -634 1136 -229 -121 -386 -728 -1757 -591 -798 286 -3192 360 -189
6711 -189 150 2458 1313 -123 -586 -718 -750 -96 -486 433 118 1297 -1666 -768 -893 -76 -1571 -826
6729 -826 -774 707 607 -122 2005 1575 1082 86 -76 1516 1275 -114 1113 119 1042 1495 -1112 -1880
6747 -1880 -1238 1114 832 1142 -143 157 357 935 -102 641 -1039 153 -1040 111 29 1670 800
6764 800 129 -393 -234 -531 873 -511 -599 831 -921 3554 -128 -438 -1640 -1124 59 252 -92 1834
6782 1834 -504 -913 -1237 159 858 -322 -1245 -673 -636 861 -174 1188 -768 209 2025 -1003 754
6799 754 1034 -285 -617 -140 411 -1760 -983 642 1814 -503 868 1312 -301 853 -1555 508 1475
6816 1475 929 -376 25 -288 813 -797 456 437 396 281 97 -1253 -332 794 -288 -306 718 -1006
6834 -1006 -920 848 -854 1569 -825 398 12 -1659 710 221 88 388 -293 -42 567 552 -1553 120
6852 120 836 -652 -1410 -218 -254 -1060 365 -876 -1098 -547 1751 501 47 -174 -1639 -62 1026
6869 1026 -1542 1238 1664 -465 908 1027 857 -1812 -253 84 586 163 -1719 865 794 373 643
6886 643 -892 1013 -985 -902 -359 -741 -397 -1090 450 405 959 -609 -1410 -1165 1 -685 -135 -503 -359
6905 -359 -1364 -495 -917 -1319 107 -256 -38 1148 1227 -1432 -15 -509 62 54 -1209 -331 1381 416 909
6924 909 -779 -358 -1019 1239 540 1175 -1867 -1129 -637 -507 444 752 1039 1083 351 742 104 1920 -697
6943 -697 1152 -199 161 -199 -1620 128 -61 678 1287 -1308 -300 -1824 -659 1021 1095 1181 421 -1828
6961 -1828 -364 51 1227 -743 -1739 1150 22 853 -572 33 -605 -40 263 455 749 -357 -1785
6978 -1785 -978 748 89 151 -156 -736 728 453 -452 -1442 1354 2263 -1611 560 1266 -243 -308 1019
6996 1019 -833 562 462 -169 1430 -1487 936 1714 -371 -327 2129 1550 841 985 537 1951 1031
7013 1031 -1494 1320 703 746 1904 379 423 -1866 353 -512 696 -988 1367 -193 -754 2009 -2201
7030 -2201 1260 -518 445 840 -142 -40 -33 -1275 -253 108 -362 423 1325 1828 268 -1816 -1021 1028
7048 1028 -1499 72 -1318 1143 -28 2476 1340 84 623 -548 -629 -360 -720 -1277 -122 620 -175
7065 -175 1409 -254 -132 -737 1006 -186 -1491 -548 -690 -736 -587 -1930 393 1015 311 149 -686 -2020
7083 -2020 -962 -1626 -264 252 -569 -244 151 655 259 674 -1358 -665 -990 -76 598 839 -91 720 -287
7102 -287 787 -353 -302 -97 -230 -391 384 266 381 357 1052 1646 -608 263 -501 -616 -151 -73 93 1087
7122 1087 -1514 577 561 243 218 837 322 -744 -113 -657 -96 766 -1980 -1477 249 910 -398 454
7140 454 -86 -915 422 -1040 238 -3 11 826 -1651 540 -1650 1265 110 805 950 -958 -40
7157 -40 87 647 244 -1864 -3057 -487 -505 159 -55 1092 -289 487 -69 263 1002 -246 -813 -721 -494
7176 -494 -637 262 -377 -553 -311 1551 -799 2614 611 1012 297 -804 479 -167 627 741 572 235
7194 235 653 1612 1087 1224 169 752 -808 -375 -1582 -430 1484 -382 -895 -898 -834 -1373 -1875 -359 247
7213 247 694 -1739 -1746 471 -1260 1309 434 -55 1221 613 1160 -1097 -1381 494 397 309 -1140 397
7231 397 1130 1058 -2329 1473 -49 -599 913 -553 -233 91 -585 -1765 535 -554 489 56 1836
7248 1836 735 570 -1125 -61 -763 -295 737 1792 -574 -364 727 51 1545 8 26 -482 18
7265 18 -101 951 127 183 -45 1306 -1213 -1115 251 -2477 -826 1444 598 -429 1016 127 301 -991
7283 -991 -670 227 -877 -1169 2029 -1499 -884 1111 743 750 818 -1154 -1693 623 -60 606 866 1919 492
7302 492 -631 814 353 1129 944 -377 -477 -475 -1262 1437 -220 1888 215 1233 1808 1196 494 1144
7320 1144 -4 -1117 213 221 -1590 -600 -431 1337 488 -408 225 -1197 1511 -959 86 -511 570
7337 570 -1678 -797 -1191 -792 1242 -1624 -248 -937 -218 1274 -811 -759 -733 -686 -1150 -112 -1658 1163
7355 1163 268 -148 -744 1736 -1649 -1100 -596 1195 328 -562 854 811 -883 -1198 -1111 -460 2551 1272
7373 1272 891 -694 -91 -210 -788 -128 653 -117 985 129 416 -29 -1000 -111 -1753 -671 1445 -216
7391 -216 442 465 819 -19 164 -646 375 611 -294 1400 1205 587 -2635 364 569 -1462 -343 1425
7409 1425 -98 383 -268 1220 1216 262 -1422 729 -688 -995 -733 -1239 -440 -679 2577 -360 350 1355
7427 1355 40 -479 1330 464 -1232 -1773 -431 8 -978 -1067 534 565 272 -752 210 -325 759 -61
7445 -61 319 1131 842 -327 52 858 180 1408 491 -1028 -1357 -539 -56 329 260 -245 222 853 1891
7464 1891 -1210 -791 -1047 128 100 -1031 -480 -274 650 721 579 -1557 -1843 722 1440 1337 748 46 370
7483 370 -753 -197 626 1114 1327 908 -2455 1059 -673 -84 -82 21 -639 -124 245 -1 994 -705 1021
7502 1021 1057 -582 -678 -343 1279 -978 -1223 1485 658 -378 -1405 430 1328 -317 -48 1636 -12
7519 -12 -607 -222 1081 394 1445 -559 72 -403 -35 -1786 599 1772 1930 -1467 531 1069 524 750
7537 750 513 -77 -969 -959 1411 -855 1642 -182 8 -1293 404 1027 -191 -610 -940 138 860 872
7555 872 -400 172 474 1797 -544 -1381 1037 1873 -262 -937 -397 -1020 860 546 -681 -282 351 70
7573 70 -904 384 -1020 486 1467 236 -1408 272 438 -220 -1307 -857 -384 -971 -2100 379 258
7590 258 62 -736 -1324 738 498 340 -761 161 1218 -452 2046 -609 -1129 -1180 840 2096 1375 1411
7608 1411 -1891 306 -1149 51 -3322 -1206 2073 -986 1407 -536 1027 45 -536 1 947 -191
7624 -191 212 -621 -1600 -1400 -625 -2668 993 -841 -2769 -625 -178 -966 -1376 -859 1890 -1763 -185
7641 -185 242 -367 845 -454 -60 -2135 495 477 -571 -1809 -45 -369 -750 -1180 640 -1759 944
7658 944 -368 -550 1159 -898 -1343 1449 -768 183 -985 1575 985 -402 603 238 699 1194 1927
7675 1927 -590 -1018 656 1829 377 -806 -370 -764 -1274 272 1508 1217 -1556 109 166 -1413 440
7692 440 -127 302 209 -902 414 -1036 -760 -58 -297 -2129 2068 -41 -133 -484 -269 437 -738 -829 -1430
7711 -1430 -267 -760 -719 1196 -1809 -8 309 773 -171 -1785 -496 -368 -87 -125 1483 -405 749
7728 749 -137 -1361 933 -505 -59 567 -1508 -498 -756 298 -564 72 49 702 1261 -1404 407 -467
7746 -467 -639 -92 33 -1391 835 -485 -95 -127 80 393 42 -2384 -1007 172 -1148 1063 -1014
7763 -1014 -1077 -1353 -623 -1084 -50 680 -1642 291 587 263 -1640 -433 537 1376 -600 -130 -553 2053
7781 2053 673 -2438 1057 187 -1247 -43 478 -684 530 94 83 1126 -1846 2802 -281 925
7797 925 1211 1167 742 -963 -7 -12 -900 448 852 -376 807 884 2164 -220 367 -843 740 -99 302
7816 302 575 -448 351 -510 -944 -907 744 135 -1425 245 373 -1644 -1109 890 -207 -1241 503
7833 503 1251 -24 -601 362 -574 741 -112 -2669 670 -390 -732 -433 -1596 62 1817 177 -655
7850 -655 747 -1128 -74 -1085 -263 -62 173 -59 1361 -123 86 -393 -1684 142 556 -652 -900
7867 -900 358 -535 -548 -27 72 369 493 -333 389 879 863 1626 -253 602 2448 177 1146 87 -993
7886 -993 373 -1011 -1004 -1859 -426 535 927 11 1926 1794 -845 2025 -381 2251 -2088 240 2172
7903 2172 2126 -1528 -1889 193 399 -305 -612 -1576 -1108 76 716 684 -1846 -1894 463 -2403 -1408 2298
7921 2298 -2744 -1127 1067 42 1428 79 -298 417 -257 -1143 1282 761 2962 -1095 665 1358
7937 1358 1150 -512 -582 195 499 62 2874 -318 256 -1096 655 -669 -782 264 -851 120 -220
7954 -220 -1063 1293 -1092 842 352 -620 201 -451 83 908 922 -389 -861 -579 -236 1487 -2055 -1169
7972 -1169 -1917 -405 369 1055 1795 -1361 -363 22 485 0 278 135 520 124 324 862 221 26 -1629
7991 -1629 69 -243 -23 -469 465 1424 -998 167 1654 955 -1785 -1956 561 -1423 1638 1214 170
8008 170 550 -379 730 -1674 -328 1222 1528 -260 1472 605 -1162 -222 -201 -1367 1626 474 500
8025 500 -109 -659 -807 -848 -338 187 -83 275 1213 435 -81 -646 556 -1473 -368 -213 529 -1472 -1319
8044 -1319 -2024 -511 -413 59 -1068 -1006 775 1318 685 -961 -1826 1097 814 -975 -878 -1147 1014 -27
8062 -27 2396 -1293 -1620 -636 22 -628 -735 -435 462 305 -1113 122 407 -1073 -932 -1588 -2646 -1996
8080 -1996 -599 -1492 -210 1891 1307 2061 156 -1015 -491 185 -711 -467 115 623 -214 208 30 1272
8098 1272 -281 858 1887 -1169 -122 -495 -27 -761 1128 -1318 -1519 789 -455 -57 645 -46 533
8115 533 2094 1319 33 1287 1044 424 -1037 204 669 554 -693 -1803 -366 -2243 1297 -321
8131 -321 716 440 880 -295 -1141 176 -695 1139 36 -588 1063 -676 -894 -1323 -1147 866 -267
8148 -267 894 -1613 1299 -410 449 336 -1372 1030 -268 1101 -541 1562 -487 -1048 1719 499
8164 499 -3581 -1243 686 -717 -779 -723 -151 3076 -1813 662 1305 -1338 -1185 373 -274 901 -426
8181 -426 178 -1040 -512 1395 -649 840 2121 -587 -733 51
8191E1
##END NTUPLES=NMR FID
##END=
