##TITLE=1H_UK_23_4_1
 CD2Cl2
 8 sc, 
 19.09.2022
##JCAMPDX= 6.0         $$ Bruker NMR JCAMP-DX V2.0
##DATA TYPE= NMR FID
##DATA CLASS= NTUPLES
##ORIGIN= UXNMR, Bruker Analytische Messtechnik GmbH
##OWNER= root
$$ XWIN-NMR		Version 3.5
$$ Mon Sep 19 14:36:22 2022 Russian Standard Time (UT+4h)  she@DPX200
##.OBSERVE FREQUENCY= 200.1313499994
##.OBSERVE NUCLEUS= ^1H
##.DELAY= (6, 6)
##.ACQUISITION MODE= SIMULTANEOUS
##.ACQUISITION SCHEME= undefined
##.AVERAGES= 8
##.DIGITISER RES= 18
##SPECTROMETER/DATA SYSTEM= spect
##.PULSE SEQUENCE= zg30
##.SOLVENT NAME= CD2Cl2
##.SHIFT REFERENCE= (INTERNAL, CD2Cl2, 0, 15.7039)
##AUDIT TRAIL= $$ (NUMBER, WHEN, WHO, WHERE, WHAT)
$$ ##TITLE= Audit trail, XWIN-NMR		Version 3.5
$$ ##JCAMPDX= 5.01
$$ ##ORIGIN= Bruker BioSpin GmbH
$$ ##OWNER= she
$$ F:/spectra/data/she/nmr/H-F/1/audita.txt
$$ ##AUDIT TRAIL=  $$ (NUMBER, WHEN, WHO, WHERE, WHAT)
(   1,<2022-09-19 14:34:44.56 +0400>,<she>,<DPX200>,
      <created by zg, POWCHK disabled, PULCHK disabled
       configuration hash MD5:
       00 E9 B6 7A A2 85 ED C7 34 08 36 98 17 FE 4E 26
       data hash MD5: 16K
       1D 73 B5 E9 B7 94 C9 AA AF 5D 1D 39 2F 9C 00 A2>)
$$ ##END=
$$ 
$$ hash MD5
$$ C8 BF 5F 0D DA BB 7A CD 21 66 AA A6 BB D1 EC 7C
##$RELAX= 
##$RELAX= 
##$RELAX= 
##$RELAX= 
##$RELAX= 
##$RELAX= 
$$ Bruker specific parameters
$$ --------------------------
##$DU= <F:/spectra>
##$EXPNO= 1
##$NAME= <H-F>
##$PROCNO= 1
##$TYPE= <nmr>
##$USER= <she>
##$AMP= (0..31)
100 100 100 100 100 100 100 100 100 100 100 100 100 100 100 100 100 100 
100 100 100 100 100 100 100 100 100 100 100 100 100 100 
##$AQSEQ= 0
##$AQ_mod= 1
##$AUNM= <au_zg>
##$AUTOPOS= <>
##$BF1= 200.13
##$BF2= 200.13
##$BF3= 200.13
##$BF4= 200.13
##$BF5= 200.13
##$BF6= 200.13
##$BF7= 200.13
##$BF8= 200.13
##$BYTORDA= 1
##$CFDGTYP= 0
##$CFRGTYP= 5
##$CHEMSTR= <none>
##$CNST= (0..31)
1 1 145 1 1 1 1 1 1 1 1 1 1 1 1 1 1 1 1 1 1 1 1 1 1 1 1 1 1 1 1 1 
##$CPDPRG= <>
##$CPDPRG1= <>
##$CPDPRG2= <>
##$CPDPRG3= <>
##$CPDPRG4= <mlev>
##$CPDPRG5= <mlev>
##$CPDPRG6= <mlev>
##$CPDPRG7= <mlev>
##$CPDPRG8= <mlev>
##$CPDPRGB= <>
##$CPDPRGT= <>
##$D= (0..31)
0 1.2 0 0 0 0 0 0 0 0.06 0 0.03 0 0 0 0 0.0002 0 0 0 0 0 0 0 0 0 0 0 0 
0 0 0 
##$DATE= 1663583684
##$DBL= (0..7)
120 120 120 120 120 120 120 120 
##$DBP= (0..7)
150 150 150 150 150 150 150 150 
##$DBP07= 0
##$DBPNAM0= <>
##$DBPNAM1= <>
##$DBPNAM2= <>
##$DBPNAM3= <>
##$DBPNAM4= <>
##$DBPNAM5= <>
##$DBPNAM6= <>
##$DBPNAM7= <>
##$DBPOAL= (0..7)
0.5 0.5 0.5 0.5 0.5 0.5 0.5 0.5 
##$DBPOFFS= (0..7)
0 0 0 0 0 0 0 0 
##$DE= 6
##$DECBNUC= <off>
##$DECIM= 32
##$DECNUC= <off>
##$DECSTAT= 4
##$DIGMOD= 1
##$DIGTYP= 9
##$DL= (0..7)
0 120 120 120 120 120 120 120 
##$DP= (0..7)
150 150 150 150 150 150 150 150 
##$DP07= 0
##$DPNAME0= <>
##$DPNAME1= <>
##$DPNAME2= <>
##$DPNAME3= <>
##$DPNAME4= <>
##$DPNAME5= <>
##$DPNAME6= <>
##$DPNAME7= <>
##$DPOAL= (0..7)
0.5 0.5 0.5 0.5 0.5 0.5 0.5 0.5 
##$DPOFFS= (0..7)
0 0 0 0 0 0 0 0 
##$DQDMODE= 0
##$DR= 18
##$DS= 0
$$ [...]
##$SUBNAM2= <"">
##$SUBNAM3= <"">
##$SUBNAM4= <"">
##$SUBNAM5= <"">
##$SUBNAM6= <"">
##$SUBNAM7= <"">
##$SUBNAM8= <"">
##$SUBNAM9= <"">
##$SW= 18.0517283424941
##$SWIBOX= (0..15)
0 0 2 0 0 0 0 0 0 0 0 0 0 0 0 0 
##$SW_h= 3612.71676300578
##$TD= 16384
##$TD0= 1
##$TE= 0
##$TE2= 300
##$TE3= 300
##$TEG= 300
##$TL= (0..7)
0 120 120 120 120 120 120 120 
##$TP= (0..7)
150 150 150 150 150 150 150 150 
##$TP07= 0
##$TPNAME0= <>
##$TPNAME1= <>
##$TPNAME2= <>
##$TPNAME3= <>
##$TPNAME4= <>
##$TPNAME5= <>
##$TPNAME6= <>
##$TPNAME7= <>
##$TPOAL= (0..7)
0.5 0.5 0.5 0.5 0.5 0.5 0.5 0.5 
##$TPOFFS= (0..7)
0 0 0 0 0 0 0 0 
##$TUNHIN= 0
##$TUNHOUT= 0
##$TUNXOUT= 0
##$USERA1= <user>
##$USERA2= <user>
##$USERA3= <user>
##$USERA4= <user>
##$USERA5= <user>
##$V9= 5
##$VALIST= <valist>
##$VCLIST= <CCCCCCCCCCCCCCC>
##$VD= 0
##$VDLIST= <DDDDDDDDDDDDDDD>
##$VPLIST= <PPPPPPPPPPPPPPP>
##$VTLIST= <TTTTTTTTTTTTTTT>
##$WBST= 1024
##$WBSW= 4
##$XGAIN= (0..3)
0 0 0 0 
##$XL= 0
##$YL= 0
##$YMAX_a= 21153
##$YMIN_a= -26535
##$ZGOPTNS= <>
##$ZL1= 120
##$ZL2= 120
##$ZL3= 120
##$ZL4= 120
##$ABSF1= 10
##$ABSF2= 0
##$ABSG= 5
##$ABSL= 3
##$ALPHA= 0
##$AQORDER= 0
##$ASSFAC= 0
##$ASSFACI= 0
##$ASSFACX= 0
##$ASSWID= 0
##$AUNMP= <proc_1d>
##$AZFE= 0.1
##$AZFW= 0.1
##$BCFW= 1
##$BC_mod= 2
##$BYTORDP= 1
##$COROFFS= 0
##$CY= 11.3945322036743
##$DATMOD= 1
##$DC= 2
##$DFILT= <>
##$DTYPP= 0
##$F1P= 2.36226072786647
##$F2P= -0.459571619588291
##$FCOR= 0.5
##$FTSIZE= 0
##$FT_mod= 4
##$GAMMA= 1
##$GB= 0.15
##$INTBC= 1
##$INTSCL= 1
##$ISEN= 128
##$LB= 0.24
##$LEV0= 0
##$LPBIN= 0
##$MAXI= 10000
##$MC2= 0
##$MEAN= 0
##$ME_mod= 0
##$MI= 1.114404
##$NCOEF= 0
##$NC_proc= 0
##$NLEV= 6
##$NOISF1= 3.799351
##$NOISF2= 2.8
##$NSP= 1
##$NTH_PI= 0
##$NZP= 0
##$OFFSET= 15.70392
##$PC= 1
##$PHC0= -18042.88
##$PHC1= 20.40069
##$PH_mod= 1
##$PKNL= yes
##$PPARMOD= 0
##$PSCAL= 0
##$PSIGN= 0
##$REVERSE= no
##$SF= 200.130013532006
##$SI= 16384
##$SIGF1= 3
##$SIGF2= 2
##$SINO= 400
##$SIOLD= 16384
##$SREGLST= <1H.CDCl3>
##$SSB= 0
##$STSI= 0
##$STSR= 0
##$SW_p= 3612.71676300578
##$SYMM= 0
##$S_DEV= 0
##$TDeff= 0
##$TDoff= 0
##$TI= <>
##$TILT= no
##$TM1= 0
##$TM2= 0
##$TOPLEV= 0
##$USERP1= <user>
##$USERP2= <user>
##$USERP3= <user>
##$USERP4= <user>
##$USERP5= <user>
##$WDW= 1
##$XDIM= 8192
##$YMAX_p= 0
##$YMIN_p= 0
$$ End of Bruker specific parameters
$$ ---------------------------------
##NTUPLES= NMR FID
##VAR_NAME=  TIME,          FID/REAL,        FID/IMAG
##SYMBOL=    X,             R,               I
##VAR_TYPE=  INDEPENDENT,   DEPENDENT,       DEPENDENT
##VAR_FORM=  AFFN,          ASDF,            ASDF
##VAR_DIM=   8192,          8192,            8192
##UNITS=     SECONDS,       ARBITRARY UNITS, ARBITRARY UNITS
##FACTOR=    0.0002768,     1,               1
##FIRST=     0,             0,               0
##LAST=      2.2672688,     0,               0
##MIN=       0,             -26535,          0
##MAX=       2.2672688,     21153,           0
$$ Real data points
##PAGE= N=1
##DATA TABLE= (X++(R..R)), XYDATA
0@%%%%%%%%%%%%%%%%%%%%qJ6j6J6j6J6j9K7l2L2l7M5n1N9o7P5q4R5j07J16j28
41f8J44j61J79j97K19k43K69k96L25l59L95m35M80n30N86o50P22q06R04j017J155
62F16j331J551j841K253k873L936o281K5123k2639j3250L2170k0087k0967K1659
76a961J1868k5462P679K5280r732j5053J8729L563k2007j730J5452j1162j3292
89a7828J4105J0314j3339K494J8048l866j3305R191N829j6110o095J1392l187
102b357j1153Q262J2329o570l823J3028L010j4482m00J0849j0241j3571J2300
115b819O904j6002M283J9993p442j1359J6783M557k0610O15J4682j3798j2585
128a6798J6485M834j5801P019J7816r259r320J4836J458j8670J871J2069j1715
$$ plain form
0 0 0 0 0 0 0 0 0 0 0 0 0 0 0 0 0 0 0 0 0 0 -8 8 -8 8 -8 8 -11 16 -16 16 -21 24 -27 32 -35 40 -44 51 -56 60 -68
41 -68 76 -85 94 -103 116 -127 142 -154 171 -188 207 -228 252 -278 308 -342 380 -426 478 -539 616
62 616 -715 836 -1005 1248 -1625 2311 -3970 21153 -1486 -14736 17434 -2653 -23620 -1961
76 -1961 9907 -15555 -7876 17404 7672 -7381 11348 14911 -7096 -8826 6626 -4536 -17828
89 -17828 -3723 6591 -6748 -4254 13794 9928 -3377 5814 11643 -4467 -10562 830 -2357
102 -2357 -13510 -5248 7081 511 -3312 9716 12726 -1756 -2156 8693 -1548 -15119 -2819
115 -2819 4085 -11917 -7634 12359 4917 -6442 10341 14898 -5712 -5097 9585 -4213 -16798
128 -16798 -313 4521 -11280 -4261 13555 4296 -5024 9812 11270 -7400 -5529 6540 -5175
141e175j0120J5638M868j3383O636J4709q050q515J0744L23j4696M60Q801o890
155d650o464J0174O065p186J689J0084k501r229L653M505j0405n463R430J05r237
170i430O794J1498p152m526J2238m44j4002K816Q352j1593o706J2798J268j1157
184i246P822J2789r137n573J2925j011j6281M106R111j1999n912J4665J129j1100
198g712Q574J1493j0580m974J1352k975j3174M249O865r571l032J1739J444p610
212c912N891Q361p310n498O824p29j0401P90P319m507m873R277M820p097J202
227A57Q882m625q667N085K752j0226j697R947k132o593Q717P136q426j218R824
242H916m545j0988N595M786j1260j093J1362k029p245R270O878r763j276R122
$$ plain form
141 -5175 -15295 343 5211 -8172 -1536 13173 5123 -3392 7352 7675 -7021 -6561 2240 -4650
155 -4650 -11114 -940 5125 -2061 -372 9712 7211 -2018 1635 6140 -4265 -9728 -298 -193 -9430
170 -9430 -2636 8862 1710 -2816 9422 8978 -5024 -2208 6144 -5449 -12155 643 1911 -9246
184 -9246 -1424 11365 2228 -3345 9580 8569 -7712 -3606 5505 -6494 -12406 2259 3388 -7712
198 -7712 862 12355 1775 -3199 8153 5178 -7996 -3747 3118 -6453 -9485 2254 3698 -3912
212 -3912 1979 10340 3030 -2468 4356 3627 -6774 -5984 1335 -3172 -8045 1232 6052 -1045 157
227 157 9039 4414 -4253 832 3584 -6642 -8339 1608 -524 -7117 1600 8736 310 -908 8916
242 8916 4371 -6617 -1022 3764 -7496 -8589 2773 744 -6501 2769 9647 -116 -1392 7730
256G730n152j0268O065M042r497l1J0816j749o076P816N231q330j930O364l672
271A359q523L900M544o370n37Q613O42n099M196M981o157m415M832q95p650J567
287e012O224l352k838P966L313o612R72O757n446p084N267J450q693J069Q648
302B629k906m746R083L882q895O33P436o190p823O389J916q636K261Q975l270
317G38m360Q616K509q746M55O251o054o693O452J995o949J665Q386k140l789N720
333D056K801p195j470M747l666n835M069L571m888N55P397j85n002L441L883o547
349b68l541N356j503o910L241O569m800j453Q216R00p180K792M925p505m337O119
365F21l78p406M162P173m873k366Q793j51p583K732M123o934m105O684n20n991
$$ plain form
256 7730 2578 -7690 -1625 2417 -7080 -7111 3705 1956 -4120 3696 8927 597 -1333 5031 1359
271 1359 -7164 -3264 1280 -5090 -5627 2986 3628 -1471 2725 7706 1549 -2866 1966 1071 -6579 -5012
287 -5012 1212 -2140 -4978 2988 6301 -311 661 7418 1972 -5112 155 1605 -7088 -6019 2629
302 2629 -277 -5023 4060 7942 -953 -320 7116 926 -6897 -508 1408 -7228 -4967 4008 738
317 738 -3622 4994 7503 -1243 -788 5463 -591 -7284 -832 1163 -5786 -4121 4265 2125 -1664 4056
333 4056 6857 -338 -1808 2939 -727 -6562 -2493 1078 -3810 -3255 4142 3957 -1045 2396 6279 -268
349 -268 -3809 1547 44 -6866 -3625 2944 -1856 -3309 4907 5807 -1373 1419 6344 -1161 -5498 621
365 621 243 -7163 -3001 4172 -701 -3067 5726 5575 -2008 724 4847 -2087 -6192 492 -28 -6019
381f019M454O073m345j543O829n76o682J667L228n840l026M924J081m278K791
396a262N501k139k713M457N79n729r12L663l053m191M238K926l651J017O013j051
412C693m715L230K309o204k429N046j938m913M394M820m487k66P060j838n866
427b104L338K631o963j722N692j484n034M988M898m859o4O263k096n752K998K197
443B927o325j232N152q35l735M238L971l512q29M535j255n360J408K201m078k138
459d867M989P05l314K479M773k772k911M051L8n969O4L870k953l362M900K622
475B343l806J434N336k625m614M006N89n826p92N319k961l522N602K822m287R46
491c6N593l606m608M143R09o526L71N322l020k436N649K183m784J461M173l383
$$ plain form
381 -6019 -1565 4508 163 -1380 5449 4873 -1809 -142 3086 -2754 -5780 -856 225 -4053 -1262
396 -1262 4239 2100 -613 3844 4423 -1306 -2218 1445 -1608 -5799 -1561 1365 -2286 -1269 4744 3693
412 3693 -1022 2208 4517 -1687 -4116 930 -1008 -5921 -1527 3293 -1194 -1460 5600 3762 -2104
427 -2104 1234 3865 -3098 -4820 872 -612 -5646 -658 4240 -619 -683 5580 3484 -2268 730 2927
443 2927 -3398 -4630 522 -313 -4048 190 4161 649 -180 4355 3100 -2260 -852 1349 -2729 -4867
459 -4867 122 827 -2487 -8 4765 1993 -918 3133 3171 -2798 -2734 1136 -1817 -5179 -279 2343
475 2343 -1463 -29 5307 2682 -1932 2074 2663 -3163 -3955 1364 -1597 -5119 483 3305 -982 -36
491 -36 5557 1951 -2657 1486 2395 -4131 -3760 1562 -1458 -3894 1755 3938 -846 615 4788 1405
507A405m143L272L50n020N90M481j331k151M098K414l443m49L229k192m053J662
523a281J762l451n57M346K08k607K746L054k947j868K933j041m718J189L056k896
539b072j775N233J091l698K019M041l796k958L772p92n160J432L954l257j414
554c380N689Q96m235K247L121l825l029L484o53m298J563L845k592j113M441J005
570C166l658J351K323k974k479K222L46l595J047L469r85j836L593J595l236p67
586d18K631j867l681J905J972k895k80M040K38l073K874K495l770j789L712j640
602D54m293K388K578l210k02N018k60l830L033K350m830j470L811j537m401L135
618a266K732l179l2M908q32l415K426J803m184j440L124j203k932K310K910k474
$$ plain form
507 1405 -2738 534 884 -4136 -3546 935 -396 -2547 1551 3965 522 73 3302 1110 -2943 -1281
523 -1281 481 -2970 -3527 819 1027 -1580 1166 4220 1273 -595 2338 1297 -3421 -2232 824 -2072
539 -2072 -3847 1386 2477 -1221 798 4839 1043 -1915 1857 1065 -4095 -2663 1291 -1966 -3380
554 -3380 2309 3205 -1030 1217 4338 513 -2516 968 315 -3983 -2420 1425 -1167 -2280 2161 3166
570 3166 -492 859 3182 208 -2271 -49 297 -3298 -2251 1218 233 -1603 1990 3585 349 -418
586 -418 2213 346 -3335 -1430 542 -2353 -2633 1407 1645 -1428 1446 3941 171 -1618 2094 454
602 454 -3839 -1451 1127 -2083 -2285 2733 2473 -1357 1676 4026 -804 -2274 1537 0 -4401 -1266
618 -1266 1466 -1713 -1745 3163 2331 -1084 1342 3145 -1039 -2479 645 -558 -3490 -1180 1730 -744
634g44j96L445j19k764Q79J805l097j884K716p7k724J540L413j951j129K867Q78
651B858l419k89K615k214k913K893J210l119Q56M027j216k207K844Q61m332J93
667a352K945k300k803L175J659l605J334M016j379k639L087K14m066j4K730j902
683i00k327L123J242k431J088L030j281k562K305L91l269k34K211j129j728K309
699a62K019j799o85K946o80k594J104J314k818j099K313M86k436J423K879j383
715H28j432K613m1l080K43K032k196j936L204P23k979J682L240k109j728K882
731A946k27l774Q96K542k635k066L843N07k616J733K531k141j592K420j62l234
747b029N82J987j533j336K717R49k223J193K001j310j847J741jk707K77K054j123
$$ plain form
634 -744 -940 2505 2386 -378 501 2306 -791 -2675 41 -36 -2760 -1220 2193 242 -887 1980 2858
651 2858 -561 -850 1765 -449 -3362 -469 741 -2378 -1522 2505 1289 -918 1926 2787 -1545 -1352
667 -1352 1593 -707 -3510 -335 1324 -2281 -947 3069 1690 -949 2138 2352 -1714 -1728 1002 -900
683 -900 -3227 -104 1138 -1293 -205 2825 1544 -1018 1287 1678 -1591 -1825 386 -743 -2471 -162
699 -162 1857 58 -627 2319 1639 -955 149 1463 -1355 -2454 -141 345 -2091 -668 2211 828
715 828 -604 2009 1968 -1112 -869 1163 -1033 -2969 235 958 -2021 -339 2901 792 -936 1946
731 1946 1719 -2055 -1159 1383 -1252 -3318 525 1032 -1584 149 2680 539 -1053 1367 1205 -2029
747 -2029 -1447 540 -993 -2329 388 1337 -886 307 2308 998 -849 892 891 -1816 -1539 515 -608
764f08j220J851K018k033k68K421q77k434J062J045k698m03K563k58j946K095
780C10J973k211n10K551p39l076J143J559k615p44L543m74k283K134K093k565
796H9p46K621j455k561J473J565k499l29K722m0j940J649J921k346r11J793o08
813C98k305J001J433j388o87K625n1j261Q00J334j608j369J570J20j955K51J530
830D38p32q55J764J099k114L07J783j199k160J298J105k492J75K750o20j671K279
847A155J164k769J24J862j207k149J681P14k054O1K740q89j499J981R82k292l88
864g83J900j386j393J258J030j957L13K512p24j640J799R12k323k37J404n84j264
881a163N11J169p66q54K123K07j873J183J082j691j242J866j01j909O84J837j270
$$ plain form
764 -608 -1828 23 2041 8 -260 2161 1284 -1150 -88 957 -1741 -2144 419 161 -1785 310
780 310 2283 72 -438 2113 1374 -1702 -559 1000 -1615 -2359 1184 710 -1573 561 2654 89
796 89 -657 1964 509 -2052 -579 986 -1513 -1842 880 840 -1100 549 2470 124 -787 1006 398
813 398 -1907 -906 527 -861 -1548 1077 1026 -235 565 1899 291 -1078 492 612 -1343 -1092 438
830 438 -294 -1149 615 1714 -400 -93 1690 491 -1669 -371 734 -1758 -1583 1167 547 -1124 1155
847 1155 2319 -450 -326 1536 329 -1820 -139 575 -1479 -1418 1322 433 -1066 915 1897 -395 -783
864 -783 1117 -269 -1662 -404 626 -1331 -1018 1494 770 -870 929 1841 -482 -719 685 101 -1163
881 -1163 -652 517 -249 -1103 1020 1227 -646 537 1619 -72 -1314 552 451 -1458 -774 1063 -207
898b07q95K180L09j963O71J157j497j351J960R0k177Q72K116j215j076K474Q3
915A531k472N68J909j889j197J755L44k122J184K082j396j125J756K25k039N55
931c31J203j379q68J706J74j486M09J922r41j003J381K79j683l08J282n64j156
948a363J162J038j304K14J287j67j452P25R81j614n27J455l18j687J553J393j591
965b15k82J922n54j539N69J090j786n02J860l60j349J065J338j711j5J549j65
982I15j968R95Q43j594k20J466l2j474Q98J256j161n18J471k9j590O29P64j383
1000g32l44J242J48r32M12J213o03p79O85K19j203J1J245n06j044R72O90j190
1018d96j1J754q40j204J120N34j576k04J817r63j030J676M79j584K54J426q84
$$ plain form
898 -207 -1102 1078 1387 -576 95 1252 -245 -1596 364 454 -1723 -851 1265 50 -1026 1448 1531
915 1531 -941 -373 1536 -353 -1550 205 549 -1573 -389 1693 297 -828 928 1153 -886 -331
931 -331 872 -507 -1375 331 505 -981 -572 1350 409 -594 787 1066 -617 -925 357 -207 -1363
948 -1363 -201 837 -467 -253 1034 867 -585 140 1121 -493 -1020 435 117 -1570 -17 1376 -215
965 -215 -497 1425 871 -668 -99 991 -795 -1297 563 203 -1146 -81 1257 -454 -469 1080 915
982 915 -1053 -58 785 -809 -1029 437 405 -1069 -171 1085 -76 -594 877 848 -742 -113 651 -732
1000 -732 -1076 166 314 -618 -206 1007 404 -375 310 529 -674 -663 582 76 -968 4 694 -496
1018 -496 -507 1247 407 -797 323 857 -719 -923 894 -69 -1099 577 1056 -528 -274 1152 268
1035B68j529J298M96j317J9J313n03j212J410Q73j372mJ203n49j360J223M38j632
1053i37M55J006k38r19P59Q88j428Q4R31k26j424O87Q48q12l08R64J8j099L88
1072c63Q92m89r22J480nj520N99P76r88l64J394K23j474O95J026q23r13J203J88
1091F15j312M42J061r24p81J346M05j371M42J153j139m59R30j4j087K90J074r99
1109c28l14J063J39q56J44J023r86m87Q69M33j461M00R12l88n62N82M39q88k42
1128e08R57j12o64N29N18j061l51J380k69j144P56O64j068k94J273P4j645P37
1146b28R08j045n93J477n0j358J048N16j120l3J192l34j195P35P29j122n0J217
1164F94l71q56O77O80j044q0R50k69j147M17J015q99R2O66l54m84L4J079n78p14
$$ plain form
1035 268 -1261 37 533 -784 -765 548 45 -1167 243 1116 -256 -260 943 394 -966 257 695 -937
1053 -937 -482 524 286 -633 126 1014 -414 -330 601 375 -1049 -362 486 -326 -634 330 348 -751 -363
1072 -363 529 40 -882 598 593 -927 -328 448 -540 -904 490 713 -761 -66 960 137 -776 427 615
1091 615 -697 -255 806 -118 -899 447 852 -519 -77 1076 -63 -522 408 394 -693 -403 671 -328
1109 -328 -642 421 560 -296 -152 871 -115 -602 267 700 -761 -361 551 163 -399 183 622 -266 -508
1128 -508 449 337 -327 202 720 -341 -692 688 419 -725 31 695 -373 -667 606 680 -965 -228
1146 -228 680 -365 -958 519 469 -889 159 675 -445 -478 714 380 -815 -80 649 -473 -523 694
1164 694 323 -533 144 824 -220 -300 650 381 -766 -349 666 -233 -141 525 171 -313 -279 800 222 -492
1184d92O57M25j004K61R01o41p63R98p0p81L8J076m60q44Q38N18j343N03J019
1203H36n62j012P95P18j257K72J078r02p03J022N01j462L26J024p07n88O69O86
1221G34j147J5J204n26j052R15M88j212J93O69k71n13P15K79o41k58J013l95m60
1240b50K90M09n35m08P86k57o8J69M93o02n38Q31J16o91j20J000o79n82Q90o6
1260A88o65K28R25p40m86R24M9r67J16R23o92m70Q20L10q79K34J037q34m77P50
1280B94k8q80K26Q52n94n61Q07K63o69J38O94l68o37L96M87r82K82M46k89k90
1300d13L63N52p23K0O98k86n74N50J58m87k66P73k58o12N87L85o44r0P90N9j191
1321f09O77K15n66l37Q97r8r71R07Q28j066j79O57j67q33K42R27q87k58R15n3
$$ plain form
1184 -492 165 590 -414 -153 748 107 -656 342 272 -509 -471 605 145 -699 139 657 -686 -183 836
1203 836 274 -738 57 775 -482 -210 868 -34 -737 285 786 -676 -350 674 -33 -621 48 734
1221 734 -413 -398 806 280 -772 143 631 -581 -388 281 10 -503 212 491 -150 -408 605 210 -250
1240 -250 40 449 -86 -494 292 35 -33 136 629 27 -511 320 436 -255 -375 625 -54 -636 254 188
1260 188 -477 -249 676 -64 -550 374 423 -544 -428 495 -197 -667 153 463 -416 -182 855 21 -456 294
1280 294 266 -614 -388 464 -130 -691 116 379 -290 -152 542 174 -463 -67 420 -562 -280 166 -123 -413
1300 -413 -50 502 -221 -201 497 211 -363 187 345 -142 -408 365 107 -505 82 467 -177 -267 523 582 -609
1321 -609 68 283 -283 -620 277 179 -792 115 943 -123 -302 355 188 -645 -403 524 -363 -621 294 241
1341B41o68N53N72q05k28Q71m58j008Q87K53n21J17M17J40o83M37K99l84k77M62
1361B17p7m51q5M81l49J18N16Rj82jL40o40l76M68L45p16L2N66j21n65O13L69
1383E11n98j26O33k97q96P13O02j016j51J136j68o43N56K46m58j10M20m42m25
1402e13N61J73o53q1J215n69l80M88L14q35J3L36r6m80J74O27m03j7O65l7n00
1423BM5N42l53n65M69p8n31K18N97o20j78R66J09q04O7N58k64p85N72Q1k82j38
1445c72Q39n44r0N35J72n42l28O48n03l96P02j39m84Q2J008l42l30M25K95j109
1465d73M64Q0k86j42L83J23o21K87P09l80k86L48L92p44j72K66k62m5L39L06m39
1486a53l0O80k60o96P61J53o64j72M10K8m89M27N20o98j5M14J1l53J59J56m28
$$ plain form
1341 241 -427 126 698 -107 -335 536 78 -930 -43 210 -311 -194 223 363 -320 117 416 32 -245 217
1361 217 140 -311 -396 85 -264 -146 370 379 197 196 536 -104 -480 -12 333 -383 -351 215 94 -471 142 511
1383 511 -87 -213 420 123 -773 -60 542 -474 -625 511 343 -300 256 502 44 -66 354 -88 -513
1402 -513 48 221 -432 -513 702 133 -247 241 555 -280 -267 69 -27 -507 -333 294 -109 -126 539 502 2
1423 2 47 589 236 -329 140 62 -469 -251 346 -274 -452 514 623 -181 -114 444 180 -605 -33 48 -234 -372
1445 -372 467 -77 -167 368 540 -2 -330 318 -185 -581 121 -18 -502 -420 588 246 -84 341 636 -473
1465 -473 -9 71 -215 -357 26 149 -472 -185 524 144 -142 206 598 -146 -318 -52 -314 -359 -20 286 -153
1486 -153 -183 497 237 -459 302 455 -209 -381 29 57 -432 -5 515 -183 -198 216 227 -126 33 189 -239
1507b39k74O48j00m52N49M12n79J44L60r1p54L59K47o27l5P32j06l19L02K59p45
1528c09J66N63k39o12P4R37p59k34N79k10J04J27L10j84k06J75l2m17k73M00j22
1549a62k75O21L38n10k53P60k54n07J88M16m89k29L77j84j53L74M61l44m84Q13
1569E04R6j003M05K01p57K28K09K14m52M14M82l63l89P21k48p56L64J28l81j16
1589d99Q83k41m01K59L17l01K0M05j76m71o7N19l50q0K78o6m9QN32l85l60L38
1611A13l1n55K87K47k54k8L96J33l49K41J95m32l18L36K58o70K11L47l07j23Q04
1632E01l3m04q9N11m76n45N36k7m40J87M82k51j42M55J34l52j68N25n07l70K02
1653b71L71M3l57J44K91l16J29O14m82k57K54k25j28K53n1j73r2L64N8l79L03
$$ plain form
1507 -239 -513 135 35 -417 132 544 -35 109 469 378 -376 -17 230 -397 -432 300 194 -125 177 436 -309
1528 -309 -143 420 181 -431 -357 580 -179 -413 166 -44 60 187 497 313 107 282 250 -167 -440 -40 -162
1549 -162 -437 184 522 12 -241 519 265 -242 -54 362 -127 -356 21 -163 -316 58 519 175 -309 504
1569 504 600 -403 2 203 -554 -326 -117 97 -355 59 541 178 -211 510 262 -494 -130 -2 -383 -499
1589 -499 384 143 -258 1 318 17 37 442 266 -205 -272 247 -103 -183 95 29 -20 -12 520 135 -225 113
1611 113 82 -473 -186 61 -193 -221 175 308 -41 200 395 -37 -355 -19 239 -431 -220 127 -180 -303 501
1632 501 468 64 -25 486 10 -535 1 -26 -466 -279 203 -48 -190 265 399 47 -121 404 -103 -473 -271
1653 -271 100 143 -214 -70 221 -95 34 648 166 -91 163 -62 -190 63 12 -161 -253 111 169 -210 93
1674I3J67j93l97K35j2l06L16K48m14j9M82J88k18qJ15l97j58J97J12p84N54M55
1696B56n29J31M12K32p15N06J60l35l69K06M8m32K81L80j57K1K09q9k05j76K23
1717E8l58k5J74J39k73J70L32o1j96K40j33k97K99J33m59k33L52K79k46RO49l39
1739B14k23M4K66o43j1L30q0l97L19K54n6M0K54J90n47L20j71j96j4K83n06O4
1761b66K59R9j45OK55J00n05M38M6k79m21J24J58P9J78K25l94K9J79O9r9j44j13
1784a22k00n0J07L92m74L56O6J74j61N3j4j81k03L88j23k70J46K70k53K1N28k80
1806A70j85L34k88l50K12K28j70k18M91j77j42N6N15k56o3l3k5k48k72M04p6n1
1828a44N2J77j33J29K53k51N8l33L11l02o9K82J09j84L8J67j96p6L45L2n00J54
$$ plain form
1674 93 260 67 -330 -95 -107 -413 -97 151 -263 -282 200 388 170 162 277 -120 -278 -81 31 -753 -199 256
1696 256 -273 -142 270 502 -213 293 453 118 -251 -45 3 -429 -148 232 75 96 305 216 11 -165 58
1717 58 -300 -325 -151 -12 -285 -115 217 156 -40 200 67 -230 69 202 -257 -490 -138 141 -105 -96 553 214
1739 214 -9 35 301 -342 -353 -23 -103 -500 -181 73 17 57 311 501 -46 274 103 -93 -107 176 -330 -266
1761 -266 -7 92 -53 -47 208 308 -197 241 287 8 -413 -289 -131 -52 126 351 -43 -14 165 234 135 -9 -122
1784 -122 -322 -372 -265 127 -347 9 75 249 88 141 127 -54 -257 131 8 -262 -116 154 -99 -78 450 170
1806 170 -15 319 31 -319 -107 121 -49 -267 224 47 -95 -39 476 220 157 124 99 -149 -421 -17 -93 -144
1828 -144 -92 85 -48 81 334 83 141 -192 119 -183 -252 30 139 -45 -7 160 -36 -112 233 265 -235 -81
1850h1M05n04j41L83j67j4J61J17k1kJ79k0o70J84N64n25j48M23j86k16L44L61
1872D26l76o0K10j67k69K93o3j89k08P33j6m54M44k68J11o1Rl8m64L29m1R8j91
1895b12L20K6k32K23K93m60l52M55j46j87R6L62rl19J07N33m89j35L06k99j9J16
1917b2j26q1j14L94J23l10M02J12k64m01L52k3l38K21J07k87k7L75nk43K72N9
1939A76L8l22J88J17j99l8J16k36J40J72j03k83O83j44k36j42K0j25NN4q8R6R
1962a02K37R0j28k09N19j50o16K43K75l46O7L44k42Q7j42P0j41J00K24L1l91J37
1984d3R4k84L5L77j20j89K15J4q8k54M96m71j46K53j01q6J44K74p1k36Q0L59n72
2007c20L21L5j25j07M7K81k03J01J09p3j81J29J40j44k39K53j8k45K42l7p8J83
$$ plain form
1850 -81 324 -180 -321 62 -105 -119 42 159 138 136 315 295 -375 -191 373 -152 -300 123 -63 -279 65 426
1872 426 50 -10 200 33 -236 57 -6 -195 -403 330 314 -140 304 36 147 86 95 57 -407 -78 -119 -21 -212
1895 -212 108 134 -98 125 418 -42 -394 61 -85 -272 -176 186 177 -142 -35 498 9 -126 180 -119 -138 -22
1917 -22 -148 -229 -343 51 174 -136 266 378 114 -287 65 42 -296 -75 32 -255 -282 93 88 -155 117 176
1939 176 214 -108 80 197 -2 -40 76 -160 -20 152 49 -234 449 305 69 -73 -53 -178 -173 -119 -207 -111 -102
1962 -102 135 225 97 -112 407 257 -359 -116 159 -187 -120 224 -18 69 -73 -3 -144 -44 180 211 -180 -43
1984 -43 51 -233 -198 179 59 -130 85 99 11 -243 253 -218 -364 -111 -212 -298 -154 120 49 -187 -107 252 -320
2007 -320 1 36 -89 -196 -149 132 -71 30 139 66 -115 14 154 10 -229 24 6 -239 3 -34 -112 71
2029G1M5K37k44k6J26k98lM5K07l13r5K45O4l5p8J98Jl02J56J37k97K55j09n9
2053g2NK65k08J38L4nk42O0J71p9j92K10k50J11N3l1Rk48L64j25J0l10L78k94
2077b48L10j30J80O7j57RK05k89J48j07K2j23j11M07l49L26l7k31J09J29j87L
2099e4O3R7k96J29J75k25rJ5J20q2R8L7J73m14J60L88o24k8K49K51j35l5Q3O3
2123A99Rl1m6j16k1q7M3j58J50R1j98J47J17l56J21j14J78rJ08oq3L6J9J04j6
2148H1k92M94j39k44K99k5l38P0K54Pn83O42O3l61Q2J70J25l27l3R4k12m4J74
2171d3N3R5MK67m12k1M3L0j09qJ93j17J6J9p7J41j20J77k69q6P1K3L7K54K0k66
2197h5J38j04J34k92K65j54N2j36L24Q6k07j7J36j39n2K23o4j15n3J97k50N6K5
$$ plain form
2029 71 116 353 109 83 209 -89 -92 -47 160 -153 -248 -3 61 26 -52 146 147 -155 1 138 -159 96 -13 -72
2053 -72 -67 198 -10 128 162 157 -85 -25 146 67 -125 85 -165 -54 -1 -32 -23 -271 93 -32 -22 -332 46 -248
2077 -248 62 -68 112 179 22 31 236 -53 95 -12 10 -113 -224 183 -166 160 123 -108 1 130 -57 -54
2099 -54 9 106 -190 -61 114 -111 -120 -105 15 -67 31 68 241 -173 -13 375 -249 -277 -28 223 88 53 136 199
2123 199 208 177 131 15 -6 -93 -50 -208 -58 33 -165 -18 99 -257 -136 -250 -72 -81 27 21 -62 -26 -7 97 81
2148 81 -211 283 144 -100 199 174 -164 -94 160 167 -416 226 289 -72 10 180 305 -22 -55 39 -173 -217 -43
2171 -43 10 105 109 376 -36 -57 -14 16 -93 -101 92 -25 -9 10 -67 74 -46 131 -138 -224 -153 -130 -93 161 181 -85
2197 -85 53 -51 83 -209 56 -98 -46 -182 142 228 21 4 140 1 -51 172 108 -7 -60 137 -113 -57 -32
2220c2J56j50j36M36m51m0J32M03l07r6J1j36K05OK46n53K46k94M92l51J98j00
2242a15p4N4K31j55N3N1j64J20K0L62n85J26J11O1k57K4K10j84M3J06k1l65J55
2265a93J73j8J74M1J36n21K33K2K72l41K9J57l43J07L30p6m48K93K12n97K44J22
2287Hj07J85O3J26k94m3J59J14j89O6j76r7J76P7J88k20L5J08n46P9L10J10q3
2310D9o4O0j02k07N06o1k25J15j69J42L6K08j89o0l5J71q8Op3M4k2k05L17j66
2334a2k11M64l65J80J30J01n96L07j89K18o4L5j8P1k37L78j44N7l21R1J16J23
2356A14j22L0j77L2N8L10k58K2p1j15J96J27J33l69J91j43q3K80j88J77j30j73
2378a59M79l61K22o9k34J5j35M32j58j16q3K55j85M01l85M6j72K60r9R7j21J78
$$ plain form
2220 -32 124 -26 -162 274 -177 -217 -85 318 11 -85 -74 -210 -5 1 247 -306 -60 -354 138 -213 -15 -115
2242 -115 -189 -135 96 -59 -6 45 -119 1 21 383 -202 -76 35 96 -161 -137 73 -111 -68 38 17 -348 -193
2265 -193 -20 -38 136 177 313 -208 25 47 319 -22 7 164 -179 -72 258 182 -266 27 239 -358 -114 8
2287 8 -99 86 149 275 -19 -62 97 211 22 88 -88 -185 -9 68 256 36 71 179 -367 -288 22 132 49
2310 49 -15 45 -57 -264 242 181 -44 71 -98 44 80 288 99 39 4 175 87 93 20 64 42 -163 154 -12
2334 -12 -223 241 -124 56 186 287 -309 -2 -191 27 -37 -2 -20 51 -186 192 48 105 -216 -125 -9 114
2356 114 -8 22 -155 -123 -65 245 -13 9 -62 -177 19 146 279 -90 101 -42 -125 155 -33 144 14 -159
2378 -159 320 -41 181 112 -122 -107 -242 190 32 -84 -167 88 -97 304 -81 -35 -207 53 -46 51 -70 108
2400A08k8l89L93Q5l04Q6L85j35j16M3j50q3q4J74o0J59j35L19k16l2J63l48J99
2423C4J8J06j25j5o9j71J52K06j56j26k46N58q0kj85J02k19R0K10j77J69KJ15
2446A91l16J34m5P2j18J09M2r8jj28L94qp4j61J96l34M29k11m15L89m9k55J12
2469a45O01o71K22j41N9n0P6K50m31K49k00K20k02K62j23O4K40j20O9o3j91k99
2491c24J35J73j08J0J17j08m9L97m12K44J43j82K1k3m4k4k4K71j59j38K99k40
2513b5R1j60Q2j74l9K85j85R1n2K22n0j12n0K57k39QJ21k86J30J13Pn6k13L68
2537A34m13K11K20k56R2J7j26J83po8M2J71k48J39m8k02K34mp2J02k77K2K23N4
2561A23ok74K70k13L6Q0m3J4J06l03J86R1j60K03j47q4K98j6m4O5m06K08K2jq5
$$ plain form
2400 108 80 -309 84 169 -135 -49 336 201 85 128 -22 -105 -189 -15 -75 84 -51 268 52 20 183 -165 34
2423 34 52 158 33 18 -51 -222 -70 136 -20 -146 -392 166 86 84 -101 1 -218 -128 82 -95 74 76 191
2446 191 -125 9 -36 36 -82 27 69 -29 -30 -158 236 228 154 -7 189 -145 284 73 -342 47 -2 -257 -145
2469 -145 456 -215 7 -134 -75 -125 -49 201 -230 19 -181 39 -163 99 -24 40 280 160 229 166 -25 -324
2491 -324 -189 -16 -124 -114 3 -105 -154 243 -169 75 218 36 57 34 -10 -34 -58 213 54 -84 215 -25
2513 -25 66 -94 -12 -186 -225 60 -125 -34 -86 136 86 -26 -76 181 -58 -50 71 -215 -85 28 35 -21 -234 134
2537 134 -279 -68 152 -104 -12 5 -121 62 55 -13 29 200 -48 91 43 -159 75 71 -1 101 -176 -154 69 123
2561 123 117 -157 113 -100 -64 16 -27 -13 93 -210 -24 67 -93 110 -37 -121 177 161 117 182 -224 -16 6 5 -80
2586h0R3k10J92J2J66J19k48r7j2j37K88j04k28K11J36l26nL56k31L46j68j08
2608c5O3n2j46L18k48K01k09o3J96J35Nr9k5j08k97K88K6o2p9K93Q2m4j39J64
2632A65O6k78j29k62L84O7j59Q4O6l6j15L11k83J84q4j24J64q9j39N1K77j52n
2655c6nL04k09Q7k1m7L5r9o7l6q7J10J35k52L94r7k3o6N6N7m53L80m0l81J04L00
2681D3m3J29j53J87l34j53K50l0r2P1R3L0k90K90q8J02N7L0Q6p7m35L44%j04J13
2706B6p8J82K6L8n3j09o6M0L4j20j11jJ63R5r6N6N5J41j55r9m2jp1K46l35J64
2732g1R6J38p0P4RJ1m74L54J65k53r9m60N21M4l3R5J61Q2J04m35M8k22L60l29
2756a84L8N3o9M33q7L2j68L29m05QK24m92K08o8k36L49L4k36L29O1J59k35j18
$$ plain form
2586 -80 13 -197 -5 7 173 292 44 -53 -65 -202 86 -18 -246 -35 101 -225 -230 126 -105 241 73 -35
2608 -35 28 -24 -170 148 -100 101 -108 -171 25 160 165 66 41 -67 -364 -76 -50 -112 -191 102 184 140 1 165
2632 165 231 -47 -176 -438 -54 13 -146 -62 4 -32 -147 164 -119 65 -19 -143 21 -68 -207 -156 121 -31 -36
2655 -36 -41 263 54 141 120 73 108 9 -58 -94 -181 -71 64 -188 206 109 86 20 76 133 -320 60 20 -361 -257 43
2681 43 0 129 -24 163 -171 -324 -74 -104 -196 -125 -32 -2 -292 -2 -90 12 69 99 185 108 -327 17 17 -87 26
2706 26 -52 130 156 194 141 32 -34 6 40 -80 -191 -192 -29 66 -30 26 81 222 67 -32 -74 -75 -146 100 -235 -71
2732 -71 25 163 93 167 176 187 -287 67 232 -21 -120 -580 -59 -15 -48 47 208 290 394 -41 7 -215 145 -184
2756 -184 -146 -93 -162 271 184 216 48 377 -28 -20 204 -288 -80 -148 -384 -35 -1 -237 92 153 312 77 -41
2779d1l6j11Q4k3n8k0K45n4j2R8LJ7M6j75p9k28R4J37K7j83K52R6O6J31l50K14
2805A40k42n2Mj04J93j46J81j27j3j80N31j74O2p5o5n4Q8jk53L06r3K39j98K22
2829A89n0k71M2Q6l2Q7k11L7j78M13O4k95J98K17k34m3O5k37j99J99K46n69M61
2852a5J20l9J49k22L6L8j90K1k5k81L78j46K30j90K58j18R8p2k6K8n3n3j73k0
2876b67K02k32M9J87L87l63K34Jl68M6L8k54K33K82l52n6J48J80j2O4l1M7k61
2899i8mo5r2R7J70K03l12K46LJ0M4l25K07q4R2k13P1k2J51k4O4o7O2n3M3k27J81
2926E8k23O6J38n7l5K23J12l43K59k47J32o5j16J23j2j84r4J53K47r0N7J60m49
2949a87M04k25K85l13k62M01l35L30j36R8N6k9j06J94j66r8L6Q8l91J37K18o9
$$ plain form
2779 -41 -77 -188 -104 -127 -185 -205 40 -14 -26 72 75 92 138 -37 -116 -344 -250 -113 -86 -269 -17 79 145 276 -74 140
2805 140 -102 -154 -150 -254 -61 -207 -26 -153 -166 -346 185 11 73 -2 -67 -121 -33 -34 -287 19 -74 165 -33 189
2829 189 139 -132 -90 -4 -36 51 -160 -123 -301 112 176 -119 79 296 62 19 84 -153 -352 -153 93 -476 -15
2852 -15 105 66 215 -7 29 67 -123 -102 -127 -408 -30 -176 54 -136 122 4 102 30 4 32 -21 -74 -247 -267
2876 -267 -65 -297 -248 -61 326 -37 197 198 -170 -124 -86 -340 -107 175 -177 -233 -85 95 83 147 116 163 -98
2899 -98 -102 -167 -259 -162 8 211 -101 145 148 158 202 -123 84 0 92 -121 -50 -72 79 55 119 52 114 61 104 -123 58
2926 58 -165 -99 39 -18 -53 170 282 -61 198 -49 83 18 -98 25 13 -171 -265 -112 135 45 102 262 -187
2949 -187 217 -8 277 -36 -298 103 -232 98 -38 60 116 87 -19 175 9 -89 -53 35 -356 -219 -1 -70
2971g0R7k04K55J17k57r3K18j86j54J19P3j14O3J77N8k57L32k3k0r6M2j43j51
2994b17J69j74M32j80j83J64K69j81%n5j04K27j91k77M52o5m0q6RJ95l5j27k02
3017b00rJ24K56j50m8K12j47n5J25J33l07o2L78j75l22M28m30J57N7J76k31L73
3039B83j68J26j18m02L58k41m1L77j23o5j37J55M73l50j56L27o8l22J90k31J33
3060@L3j13r0L03l62K87L79k17pj66j47j8qL14o2k97J47J82m8p0LL8m7q3l8K15
3086A28j97Q8j36K11L1j57l8j94L76KO7k93K98m10J84J1J5J82k83L97l34j34J60
3109b6K70l21j01J52l6J42K8k88K93k6J72k65p3K17k96J96j28k18L93j69N4j42
3131a72J52K72j29J46k12N2k14J96m4j42J34Q1k72J36L6j45K08j6p5j13J05j18
$$ plain form
2971 -70 27 -177 78 195 -62 -155 63 -123 -277 -158 -85 -199 -136 41 99 -158 174 151 131 35 77 -66 -217
2994 -217 -48 -222 210 30 -153 11 280 99 99 44 -60 167 -24 -301 151 86 46 -40 -31 164 129 2 -200
3017 -200 -209 -85 171 21 -27 185 38 -17 108 241 -66 -128 250 75 -247 181 -249 -92 -35 141 -90 283
3039 283 115 241 123 -279 79 -162 -203 174 51 -14 -151 4 477 127 -29 298 230 -92 98 -133 0
3060 0 33 -80 -170 133 -229 58 437 220 213 47 -100 -118 -126 188 126 -171 -24 158 110 40 43 81 34 -49 -87 128
3086 128 -69 19 -117 94 125 -32 -70 -264 112 114 181 -112 186 -224 -40 -29 -14 168 -115 282 -52 -186 -26
3109 -26 244 -77 -178 -26 -62 80 108 -180 113 87 259 -6 -79 138 -158 38 -90 -308 85 -84 -30 -172
3131 -172 -20 252 123 269 57 109 -105 91 47 -95 39 120 -152 -16 20 -125 83 67 -8 -121 -16 -134
3153a34j08q6M09l55L63j19P3l91M50j83L54k10k53K18k04m3K35L7PJ63p8k36
3175i1J57q8R2J35o03J30M62j10k9J67l86J79N3N5k54m8j33R6K23p0K1q9K55K
3199A26q0N3J31j97n4l17J32k6P1L31p1K5J8J5j90K75k40j92L44n9j70R5m9L02
3223B73j36R0k40k09K55K65k40r4j54J49J08k4n8R3j57K02J7j83J78j63N9k10
3245a79J26m1o2k5J99Q5J66j03J20l76k3J55O8j81M10k91M1OJ4k52K12k47N16
3268C38Q2o36n3N31l28R0m3PJ89p1k23K55m00K30J1K9K61l35J57j43p8J04J9J5
3292HK59l16K65k82J30l92N74j31j90J63j6J01j45j49O92n03m3l7k17J18K00j56
3314f7K43j64Mm6nqL2P1l18l8J82QP2q9K56j83K51j38j97K05j74J25J70l73j6
$$ plain form
3153 -134 -242 -328 81 -274 89 -30 43 -348 102 -81 273 63 -190 28 -176 -219 16 53 60 223 145 -91
3175 -91 66 -22 70 205 -398 -268 194 84 55 222 -164 15 68 123 -131 -179 -312 -216 7 -63 -42 -131 124 126
3199 126 46 99 230 33 -21 -338 -206 -232 -161 170 99 124 142 157 -33 242 2 -190 154 95 -75 20 -29 273
3223 273 137 227 -13 -222 33 298 58 -36 -190 -41 67 43 -15 78 -79 123 140 -43 135 -28 31 -179
3245 -179 -53 -94 -156 -181 18 103 269 166 286 -90 -113 42 110 -71 339 48 89 95 109 -143 69 -178 338
3268 338 420 -216 -269 262 -66 24 -19 -12 177 106 -117 138 -262 -32 -21 8 269 -66 91 -52 -130 -26 -7 8
3292 8 267 -49 216 -66 64 -328 246 115 -75 88 72 173 28 -121 571 68 25 -12 -229 -111 89 -67
3314 -67 176 12 16 -30 -35 -43 -11 60 -258 -296 -114 -106 -34 -123 133 -50 201 63 -134 71 -103 22 192 -181 -197
3339a97O5L28k82K13N2j90j9L7k05K08J75j06j71J10l01K92J35j80L48k82j0R0
3361A10k52J14p2J03o7L23j21R8J1k84K20Pk26R2j48L3J50k27R6J28R4j39J62
3384B05l38L0K89J9j63n1j0P2Qj14J40l2m1pj15J84j40k6J23k39J45M4Mn5J65
3409I7J0o4R9K1j76m6J60mk19J48J26q3O0R6j46n2k59L50j59po6o6r0M05k51N7
3435e9r0M46j32l94N21k22k00J32k1J03j07mk28K00R6QO9l88M57j84j90L65j88
3458a0Q0r1K1J40L7N4l55J67J1n00J94K47j9q4J67n6O7j1q9J41l8k16L45l01j68
3483b67K11k95M04J79r8k30K8J74J1j1l67m2L28n9J21j82K42j30J6q5j3K57j05
3506H7l73K05J31l55M54k46Q3J84K16j46k7j75J26k50M4J27l8o5p2o4J50J04k03
$$ plain form
3339 -197 -132 196 -86 127 179 -11 -30 7 -198 10 185 79 -92 18 -283 9 144 -36 312 30 20 110
3361 110 -142 -28 -100 3 -64 259 138 236 247 -37 183 190 -36 56 -92 -59 91 -136 -40 88 182 43 205
3384 205 -133 -103 186 205 42 -9 -19 53 61 -53 87 55 14 7 -108 76 -64 -90 33 -206 -61 -17 -13 -68 97
3409 97 107 43 142 163 -13 -59 101 97 -122 26 152 69 129 225 79 27 -232 118 -41 -48 -114 -180 -270 135 -116 -59
3435 -59 -149 297 165 -229 292 70 -130 2 -19 84 -23 -27 -255 -55 41 49 118 -270 187 3 -187 178 -10
3458 -10 70 -21 0 140 177 231 -124 43 54 -446 -252 -5 -24 -108 59 3 70 59 -30 111 73 -143 202 -99 -267
3483 -267 -56 -351 53 232 134 -96 -68 106 117 106 -261 -303 25 -34 87 -95 147 17 33 -52 -65 192 87
3506 87 -286 -81 50 -305 149 -97 -14 170 386 240 213 38 164 -86 -42 85 47 -18 -90 -154 -4 100 -103
3529a03L35m18K60m1j80K25k42L74p6k12K92j58l9l5j66l8M5K04p1M6J5j03K91
3552B05l1J86m01P2Q5n3n6j73m5M3K65J75l64O6K70l9k61N3qM3m0R0j73J75j76
3577i2N8j20j8K76k24K63R1n53K06K7M3m5M4L3P6J00j65J93j38j46K77l44k00
3600c58K75p0K80l00Q2K48k46K59k25Q6J60l81J16q5J11j01m6K24N1j35J17K09
3622B71m13R9J25M6k47K7j14L45J41k79n5M94n93K19L9j41K06j30m0j9m4P9j51
3645a35J32P1j10O4J6j80P8K73j40J19l04L62k13j6m2K02l17K00p5J70m44K26
3667f3J92j85J00K7J36r9P3k03J80j45j31K56n4l12J11N55l78k08J15J30J24m32
3689b11K25k73K21L1p5P8K0n6R0O7k67J39P2l20J63K08l26K49j40j24M71k37J17
$$ plain form
3529 -103 232 -186 74 33 -147 78 -164 210 134 -78 214 56 17 -18 -184 -222 -177 27 -44 2 17 -86 205
3552 205 174 360 -41 31 116 63 7 -166 -211 -168 97 272 -92 -26 244 205 -56 -3 -11 32 -8 82 -91 84 -92
3577 -92 -34 -154 -172 104 -120 143 234 -319 -113 -86 -43 -88 -44 -11 65 165 0 193 55 -91 186 -158 -358
3600 -358 -83 -153 127 -173 -91 157 -89 170 -55 31 191 -190 -74 -159 -48 -149 -195 29 80 -55 62 271
3622 271 -142 -43 82 128 -119 -92 -206 139 280 1 -54 440 -153 66 105 -36 170 40 0 -19 -63 16 -135
3645 -135 -3 68 -42 22 38 -142 -64 209 69 188 -116 246 33 17 -25 177 -140 60 -15 155 -289 -63
3667 -63 129 -56 44 71 207 108 181 -22 158 13 -118 138 84 -228 -117 438 60 -148 -33 97 221 -211
3689 -211 14 -259 -38 -7 -82 -4 16 -40 50 117 -150 -11 61 -259 -96 112 -214 35 -105 -229 242 5 122
3712A22L8o2j74J3K11o6j90K20j48k66K54oM3J02j67Q1J59r7j74K47j25j80N1
3735a14R7l8m8J96j91j4J03P6n2k95J23K97j85P5J20j34q1J5O3J93n09O0J49R4
3759@q4P6j43J77J25q8J74r5O3k21K63m04J34n1J52o4Oj08K47l43L15l73L24J42
3783B24p8Q4j63k48j4K22n2R6j22K25l55K82n3N6q5j79j70L17n4K74N9l53J07
3806B0P1j88p7L46l12J09Q8j66L31L9k93L1L73l55J00j73J76j88Q8j88K65j68
3828g1J95M3n6j7p9r4K58j16k82M83k28P8k8J50Rk9l52L6j46J87o5m3J82O5P6
3853A56j22k9J61k57OK56J42j94l17K34K10j72o0nM9k68Q8K81k79J5J54j9L1j15
3877e4O2j93K12L8j74J10J97k9j99j09J8J4K45l13J34j53J51KK1k2L13m00J91
$$ plain form
3712 122 160 98 -76 -63 148 82 -108 112 -36 -302 -48 -54 -11 91 -76 5 164 67 -107 140 15 -165 -114
3735 -114 -17 -55 -103 93 -98 -112 -9 67 15 -280 -157 140 -45 30 150 16 -65 -50 13 206 -303 -243 -94 0
3759 0 -84 -8 -151 26 151 63 237 142 205 -16 247 -157 -23 -74 78 14 20 -88 159 -184 131 -242 82 224
3783 224 146 230 67 -181 -195 27 -25 71 -51 174 -181 101 48 104 19 -160 -330 -13 -67 207 266 -87 20
3806 20 91 -97 -174 172 -140 -31 57 -109 222 261 -32 -1 372 17 117 -56 120 -68 20 -168 97 -71
3828 -71 124 167 111 94 15 -79 179 63 -219 264 36 114 86 236 245 216 -136 -100 -246 -59 -124 -167 15 80 156
3853 156 34 5 166 -91 -85 171 313 119 -198 36 246 74 14 9 58 -210 -122 159 -120 -105 49 30 61 -54
3877 -54 8 -185 27 65 -109 1 198 169 -30 -139 -121 -107 138 -175 -41 -194 -43 -41 -20 -42 271 -129 62
3900F2L10k76k32N8L24k36K21m28K92j04J47J9kk58K98l22M1j96J98L8m9j1J86
3923H0J1o4m0m1K06k57L40k21n4P4m15M75j71N8J80m07j3K16r9L07k34K14k25
3946h0L1L24j04j99J03K5j33J15j92K57j45J64r7j54R1m6J35J22k62O6k27M54
3968B48l89j91K66QpN0l7O9N1N6j73J64j24j32K43k41J27n8K04n9J80l8k47K10
3992A80j93o4J73j21J39l09L54o9j71O8J36L5j7k4j86K94n96N46j60q9%o4q0K78
4016F0k02K12r2k33M2J41J22k81M8K39k1k20J81M9J95k81r4K4p1J95j88J91j06
4039i0K49j00K3k88J31k9q5J59J00O5j79j8K44j80J6N0q4K52k53l6K38j48j34
4062i7M4j04M16j78j02MR1J01o3j01J64k91j19J53p4K14j50J23K5j96M43k67o6
$$ plain form
3900 62 372 96 -136 -78 246 10 231 -197 95 -9 138 157 155 -103 195 -127 -86 -282 -84 -46 -95 -106 80
3923 80 91 27 -13 -54 152 -105 235 14 -40 34 -381 94 -77 -19 161 -246 -259 -43 -142 165 -69 145 -80
3946 -80 -49 275 171 -28 75 100 -33 82 -110 147 2 166 69 -85 6 -40 95 217 -45 21 -206 248
3968 248 -141 -332 -66 -58 -65 -15 -52 17 68 124 -49 115 -9 -141 102 -139 -12 -70 134 75 255 217 -30 180
3992 180 -13 -77 96 -25 114 -195 159 90 -81 -13 123 158 141 117 -69 225 -371 175 15 -74 -74 -138 -218 60
4016 60 -142 70 -22 -255 -213 -72 50 -231 -183 56 35 -185 -4 45 240 -41 -135 -111 -182 13 -175 16 -90
4039 -90 159 59 82 -206 -75 -104 -189 -30 70 135 -44 -62 182 2 18 68 -16 236 -17 -53 185 37 -97
4062 -97 -53 -157 259 81 -21 -17 74 175 112 11 175 -116 -235 -82 -156 58 -92 31 56 -140 303 36 -30
4085c0j92j6K04M7k82K32K12j51o8k8J17k25K92l73K95j32P4j61K85M1q7Oq9J3
4109a6j75J55p4J36Q5j55L0l4n0q7J67Q9Q2J7k50R1L2p7j45J71J51K8j86jJ24
4134A08J64j48k46J28OPj26P7j58J58j07J36j82J3j7K16k10J36P7J62l67L50k96
4157a19L5K57o4j89J12J03n7k3r8l3R1P3r6ljJ00j5o7pJ85l42R8j2Q0P2r3q3n9
4185a55L22m6k30K36q9Q4j43j4J25j56j50K81j39J06K72l43nj1J9o0j81L66J29
4208B18m07L40k50q0K9K78m5J06l51J37j85J46M02p05N12l24k2L02j22j53J64
4229a0N7Q1j77J27n1k46N66m00J93j12r3J44K3m4m0p1p4R9l5M8J04n0k27L44m4
4254A12r7J18o1j60P0q2j1R2l6k9N8j3j02K69p8L5k85J55J34l04J58N8L4j18R2
$$ plain form
4085 -30 -222 -238 -34 13 -269 -37 175 24 -44 -72 45 -180 112 -261 34 -98 -24 -185 100 141 54 60 -29 -16
4109 -16 -191 -36 -110 26 111 -44 -14 -48 -98 -185 -18 71 153 170 -80 11 43 -34 -179 -8 143 171 -15 -16 108
4134 108 272 124 -122 6 12 19 -107 -30 -188 -30 -137 -1 -183 -170 -187 29 -181 -45 32 194 -173 177 -119
4157 -119 -84 173 109 -80 32 135 78 55 -43 -76 15 88 -8 -11 -12 88 73 6 -1 184 -158 -60 -72 8 80 -13 -96 -155
4185 -155 167 121 -109 127 38 122 -21 -35 90 -66 -216 65 -74 32 304 -39 -44 -55 -36 -96 -277 89 218
4208 218 -189 151 -99 -179 -150 128 83 189 -162 -25 -210 -64 338 -367 145 -179 -201 101 -21 -174 -10
4229 -10 47 128 -49 78 27 -219 347 -53 140 28 -65 79 102 58 18 -53 -127 -28 -63 -15 89 39 -188 156 112
4254 112 15 133 72 -88 -18 -100 -111 -19 -55 -84 -26 -39 -141 128 50 85 -200 -45 89 -215 -57 1 35 -83 9
4279Ij1p8L4J47j59K19l57R9J3O5Oj15J26J55l23J73m0J47m2r0J39j98K80Rk93
4304h5K12n2j84J63j39j34L91j88K5P1j25J04J3p2m0j2j33L0K44j49n0L31k04
4327A7M40k99j79k76m3L76j87Q8J07m7k32L50k24l6J3L1J42k1m4L2j06M9j32J84
4351Cj12L00r3j47k3J30j38J04m7J39l0K1n9q1K28k45m4J01l8k6K6o3n9K28r1
4376a6J22j72M9J41j6k81K71n8K26k97R3j72J93r9L7N8k16J98k50K04l0J43L0
4399A58k70L50k00lo0p1J7K56j78J32r4J56k15J39p7j18j10O8K75k11p5K51N9
4422A79k02O2o6J24k2P8k51J99k5q1k25L16k23n5M62l21J92j19K6m8M8k73M31
4445B06k38O2j70O0J46k39R5P5j64M9O0j63L90k38K07k1op9o5J3l9J19j31Jk82
$$ plain form
4279 9 -2 -80 -46 101 -58 161 -196 -97 -84 -19 -13 -128 -2 153 -170 3 -37 110 68 -22 117 -81 199 208 -85
4304 -85 127 75 -109 54 -85 -219 172 -16 9 80 -45 59 72 0 -40 -52 -185 -155 89 -60 -110 221 17
4327 17 457 158 -21 -297 -340 36 -151 -63 44 -3 -235 115 -109 -145 -132 -101 41 20 -24 8 -98 -49 -181 3
4351 3 -109 191 98 -49 -72 58 -80 24 -23 116 86 107 48 -33 195 -50 -94 7 -31 -57 -31 -94 -153 75 -16
4376 -16 106 -66 -17 124 108 -173 98 40 266 -31 62 -110 83 -16 21 79 -137 61 -189 15 -15 128 158
4399 158 -112 238 38 35 -25 -96 -79 177 -1 131 37 193 -22 117 40 -78 -188 -120 155 -56 -131 120 179
4422 179 -23 39 -27 97 75 153 -98 101 76 -5 -230 86 -137 -192 270 -51 141 22 48 0 48 -225 206
4445 206 -32 30 -140 -80 66 -173 -78 -3 -167 -118 -58 -221 169 -69 138 117 111 32 -33 -20 -59 60 -71 -70 -352
4470c52K51j52K11J39L4N9m6j22j37K49j38j11K18l1j9L69n01P5o5J03N0q7R9
4493I6j00n5J66j94J69r9J3K08k10K91m19P4j29L20l41L67p6M9J60P5l85J53k23
4516i0J14lj46J0J35n0P2%J44mO5l00k02L27l5Q3j85K92j86p3J81j65J08M7J29
4541B68k88j43K67p8RJ56l07J5J74k9J25k28M1K15L4j47Lk10J56j13K78r4j86
4564h2K62k74J87r0n9j72M00j50R6l93J02M21M0j83j38Q9j72p5L60j53J39k69
4586a14J32J03j04k38J23J01q7Q8p9J20o4k02M94l69M8K0M3k57L45j26M1j4n1
4609d7R4m9L7M9M1Mp9K2P6q8k13J22L0Q1j60q6K3Q3r2O1J24J91j85j76K57k29
4635a09J86J43l66J78Q4j98K8J01m3M6l4l6j49K13j41J07Q2m3o1P9j15Q4j95J09
$$ plain form
4470 -352 -101 -253 -42 97 131 190 144 22 -115 134 -4 -115 103 72 53 422 -79 -4 -69 34 84 -3 96
4493 96 -4 -59 107 -87 82 -17 -4 204 -6 285 -134 -60 -189 131 -210 157 81 130 290 365 -20 133 -90
4516 -90 24 21 -125 -115 20 -30 42 42 186 182 247 -53 -255 72 37 120 -65 227 41 -32 149 -16 92 139 268
4541 268 -20 -163 104 26 35 191 -116 -101 73 44 169 -59 -18 197 231 84 87 -123 33 -80 198 104 -82
4564 -82 180 -94 93 3 -56 -228 172 22 118 -275 -173 248 288 105 -33 56 -116 -191 169 16 155 -114
4586 -114 18 121 17 -221 -98 3 -84 4 -75 45 -19 -221 273 -96 -48 -28 15 -242 103 -23 18 4 -47
4609 -47 47 -2 35 84 125 129 50 72 148 60 -153 -31 -1 80 -80 -166 -143 -60 -152 -91 33 224 39 -137 120 -109
4635 -109 77 220 -146 32 116 -82 -54 47 4 50 16 -20 -169 44 -97 10 92 49 -12 67 -48 36 -159 -50
4659e0J45p3j53L45j19k37L59j96J03q2K35k67k33L63r0l8K88k42j20p2R1P4m3
4682a2J7J65k27K31j9k83P4K25l52J95J57l52O2L7o6K06o3M8pj15J15P2j47L3
4706fj09M6LJ47k16LK42k07L90j92r9J31N4k19P6l1L65m28K37k19k8K9p9J67k15
4731a58J92J15j65j2Q1n48M17K7L2R3p7j5k80L79K5j7J18k79J27j61r4Q4N1K05
4755A40M8j24l17L9K19K25k71j01K03K1j11K45j27Rk94J82p7J44P7k27K00j12
4777iJ33j90Q2n6J51L5j03j45Pj06J69k60K84K8K3n6L4Qrr2M2L9Q3j23L20k70
4803A9N6KJj19P2l5n5k12K37J38j95k36M59p2j12J18j66K96Ll16N1K2l0J73j91
4828i2O5n1J09j13K8%J47o1J29k19j63J82k0K57j93K36l57J80J44m24K59J74j58
$$ plain form
4659 -50 95 22 -131 214 95 -142 217 21 124 42 277 10 -223 140 50 12 300 58 -62 -134 -43 31 -12
4682 -12 5 170 -57 174 155 -128 -54 171 -181 14 171 -181 -119 -82 -148 58 -5 43 36 -79 36 108 -39 -6
4706 -6 -115 -69 -66 81 -135 -132 110 -97 293 101 2 133 187 -32 44 13 378 -50 187 -32 -60 -31 -110 57 -158
4731 -158 34 149 -16 -28 53 -495 -78 -51 -19 74 -3 -18 -298 81 106 89 207 -72 55 -106 -200 -116 -65 140
4755 140 188 64 -253 -214 5 230 -41 -142 61 82 -29 216 89 98 -196 -14 -91 53 130 -97 103 -9
4777 -9 124 -66 16 -40 111 146 43 -102 -95 -201 -32 -292 -8 20 43 -13 21 29 20 -72 -30 9 92 -31 289 19
4803 19 75 77 78 -41 31 -4 -59 -271 -34 104 -91 -327 132 60 -52 66 -100 196 199 -117 -66 -44 -74 99 -92
4828 -92 -27 -78 31 -82 -54 -54 93 32 161 -58 -221 -39 -59 198 5 241 -116 64 208 -216 43 217 59
4851E9J02m1k37K19j42q3L3J48j83J56j12R3q8P3R2j76j37M03l72L46j85J08k5
4874E1q1q2R1J02k97J75l8J38k71K25l85K38J61J95l53P5R2k24L40O0j65K8n4
4897B1p9p5p2p6L38j25m4J47j51K50k15L21j38k14q1j6M05j93J17j6j49M9l8P6
4921D2K4j56K06k27J79J60l68J41o6J21j02l9J35L1k50L4q2M1K43k42K86k85K02
4944B8K21j93l6P2l13J53J22k64K16R7j91K10M7r9m9n1J40j68Q6j56L47j50J45
4967B14j15j02k19K64L0R8j91k0j21K67p2J0J2j36RJ01k60K46O5j30NR7j11L7
4991b2k2Q4j6P8j18N3j38m5J74k26R8J67l98L41J16J50j86m3R8J36n42L04k91
5014b48L06K63n03J93j28J2L39l40K9P6N3m1m4k4K05m29Q2K59N0m9o6N5j12Q7
$$ plain form
4851 59 161 120 -117 102 -40 -123 -90 58 -125 31 -81 12 -76 -3 89 -87 -224 179 -193 153 -32 76 51
4874 51 -30 -112 -21 81 -216 -41 -79 59 -212 13 -372 -134 27 222 -131 -56 36 -188 152 212 47 75 21
4897 21 -58 -133 -205 -281 57 -68 -112 35 -116 134 -81 240 102 -112 -193 -209 196 3 120 104 -45 4 -34 42
4921 42 66 -90 116 -111 68 228 -140 1 -65 56 -46 -85 50 81 -169 -135 -217 -176 67 -175 111 -174 28
4944 28 249 56 20 92 -221 -68 54 -210 6 103 -88 122 169 70 21 -30 110 -58 28 -128 219 69 214
4967 214 99 -3 -222 42 72 170 -21 -41 -162 105 33 43 55 -81 -72 29 -231 15 80 -50 -45 52 -59 -22
4991 -22 -44 40 24 102 -16 37 -101 -146 28 -198 -100 67 -331 10 126 276 90 47 145 281 -261 43 -248
5014 -248 58 321 -182 11 -117 -105 234 -106 -77 -1 52 11 -33 -57 148 -281 -199 60 110 61 -5 50 -62 25
5038B5n8PJ14J7j25k5L8r3R8q9J66J25k95O9J73p2j05K16m20J51J13J21l74L42
5062A19M3j19K2k74L09k26K48j53Ok6m7J41OKq7K67k34J30l31J55R2L8k27J25
5086b1%K03k35J28%J07l4lk27M27k85K7M2q5J5j44N1J21k94L00j50P5n4pN5J09
5112A21j93L60%k99J0n9J89k10j50K22r4L1K31j70J80k59K77k1n7qm5J76k96J31
5136F7kj20k17J50J55p5K00j16J17l54J78ql24K30J07oj51J65k31Q2L70j30j35
5159d8m6O8q4J14K00k86L27p2O4j86j4k65J58K33p9o8r4L5J13j95k5K65j11r9
5183i5N2K11j51J3Np8r4Rj2J6L36j55L6p1J44L2j41k84L03n7o1K9J80l30j2K14
5209C9J70pm40N20k41j45O1N5O9m6P8j0Oo5q2RJ50k21j43P1pL70L9l38P8J72J70
$$ plain form
5038 25 -33 -26 88 105 -20 -45 -7 -100 -2 -91 75 200 -95 -26 147 75 -30 186 -234 -83 30 151 -223 119
5062 119 162 43 65 -209 100 -126 122 -31 -25 -51 -98 43 49 51 -36 231 -3 127 -204 -49 43 81 -146 -21
5086 -21 -21 182 -53 75 75 182 148 145 -82 345 60 87 129 44 59 -85 -34 87 -207 93 -57 18 -36 -43 12 121
5112 121 -72 288 288 -11 -1 -60 129 -81 -231 -9 -103 -72 159 -11 169 -90 187 166 109 101 56 232 -64 67
5136 67 65 -55 -272 -122 33 -42 158 42 159 -195 -17 -25 -349 -119 -12 -18 -169 -4 -235 -153 217 87 -48
5159 -48 -94 -26 -110 4 204 -82 245 173 237 51 37 -228 -70 163 84 16 -78 -43 70 -125 -150 115 4 -95
5183 -95 -43 168 17 30 35 -43 -137 -128 -140 -124 212 57 93 22 166 198 57 -227 76 19 -42 -13 167 -163 -175 39
5209 39 209 202 -238 282 41 -104 -43 12 81 35 113 103 109 44 -38 -29 121 -100 -243 -172 -179 191 230 -108 -30 142 312
5236C12j31k18N5j98J78O0j80m5J6J23m0j07N9q1K64k70L87l44J77j46j05J49
5258h5Q6p6j02K20pJ33k89o4L54k98M11k15k10J48K92l38q7J27o6mkJ42j65J13
5282A8JP0K80l78J3L0J62k12J13R3k20m03N02k70L18L5l03j3J00O3J37k85N4J33
5306C8K25k97J24Ro5J35k80J63j67J21p9P0j45K53l5j6j24J29P5m1m5j69P4j16
5330a63Q0J48Q0Q6j99j06J03K11n0l61k1L33j30K59l36R1j51K64j10k5j9O6j34
5353h4J26q4J27K54j51m6k84R7J19j25j83K76oO7j50r3M7j00L89k50L3J91N9j60
5377F9j72J98l18J06q8m2K53M8k5m3J89n3k4o3j63J53Mj71j11N80m65M55l67L9
5401a1J80j39P0J1j62K59%k99J17k18J48M4j5L5o8K2K6K86n72K85J14m75N76j43
$$ plain form
5236 312 181 -37 18 -180 -2 58 -122 -167 -151 -28 -68 -175 -116 -197 67 -203 184 -160 17 -129 -234 -85
5258 -85 1 -75 -177 43 36 169 -120 -184 170 -128 283 68 -142 6 298 -40 -127 0 -66 -70 -72 70 -95 18
5282 18 19 89 369 -9 4 34 196 -16 97 190 -30 -433 69 -201 117 152 -151 -164 -64 -1 136 -149 -95 38
5306 38 263 -34 90 99 34 169 -111 52 -115 6 -73 -3 -148 105 70 54 -70 59 134 93 48 -121 -47 -163
5330 -163 -83 65 145 231 32 -74 29 240 190 -171 -192 141 11 270 -66 25 -126 138 28 3 -16 50 -84
5353 -84 42 -42 85 339 188 142 -142 -45 74 -51 -234 42 36 103 -47 -140 -93 -193 196 -54 -21 170 229 69
5377 69 -103 95 -223 -117 -205 -247 6 54 29 -14 175 122 98 35 -128 25 29 -142 -253 327 -138 317 -50 -11
5401 -11 169 30 100 111 -51 208 208 -91 26 -192 -44 0 -15 20 -48 -26 0 286 -286 -1 113 -362 214 71
5425G1q8M2j20P1m4J70k57L11pK64l14j08J28p6j3J91k44N2O9j51m2M93l56L5
5449G7q0l2J26j46J1m18L89K07k05Q2q8m0L7j5J9L2K44j32J04k65n4J7P5K3j9
5474e1Q1J93j52j26o2J84l8Q9Jj21K92n02J86J13j36j21K62j8o6k7j21K97j78
5497b1J46j57N5k94K71j00J37j7p7J00N2k11J79k14K13l7j63K96j22j8n6J53M9
5520A64j12J79k33O9j05Q0m4j55M4k3J26J06l52L10n0N4o7j14K6L13j93k0J07
5543A10Rj36P6j68J49pJ90j90J6Nl09L64K5r5J65j0j47k21L9K45k73J51J38j9
5567A07l23L64k00K51l7j38K17j58k19l0L29l80K85%j40o7L70m51O4J03OR4o8
5590b1m1P3j96MJ6J52rJ33j06k0N1K6o5k5J47k35K22k63J75J56p2n0J8k32J98
$$ plain form
5425 71 -17 25 -95 -24 -68 102 -155 156 149 413 99 -9 119 43 30 221 -23 29 98 -53 -95 398 42 77
5449 77 -3 -35 91 -55 -44 -462 -73 134 -71 11 -77 -117 -80 -95 -76 -44 200 68 172 -93 -147 -130 -55 -32 -51
5474 -51 30 223 71 -55 -117 67 29 118 119 -2 290 -212 -26 87 -49 -170 92 74 8 -19 -140 157 -21
5497 -21 125 -32 23 -271 0 -100 37 20 -57 43 95 -116 63 -151 62 25 -138 158 36 18 -38 115 164
5520 164 52 231 -2 67 -38 42 -2 -157 -113 -136 -10 96 -256 54 4 58 -9 -123 -97 216 23 3 110
5543 110 119 -17 59 -109 40 33 223 33 49 54 -255 109 134 39 204 194 47 -174 -135 110 -163 -12 126 107
5567 107 -216 148 -52 199 162 24 241 83 -136 -166 163 -217 68 68 -72 -139 231 -220 -156 -53 -47 47 -21
5590 -21 -62 11 -185 -181 -165 -13 -22 111 5 -15 36 62 -3 -28 119 -116 106 -157 18 174 102 52 70 -162 36
5615C6n6K1K6j71L07l29J18j32N2R1j11J87m8j27o3n4L30j5k84J83P1j7k74J89
5639g0P8PJ46j23j00K75k77L14n57J66q4L19J3j19oK25k49n1J97r1N6j19J65J8
5663A33l06L2L8J20J03j35j00J54k37J42j09J13k3l04M99J8k47L8k35L89m13L03
5685b7J43j51j12J1J45l94L72k09K54j33J67k16J05N4j86k8Q0N2J56j06n3J31
5707E5J87l36R6J32p3P1k25J61q9j8l4R2Mj82l9K18l11M48j34L22l54J3P8K44
5731C26k64j57K2m2M9N3n4m0R4K68j29l03N3O3K11r8j72L53l88J34P0j36J11j17
5755i3o8K32j31k9K00j58OK06J41k44j19j46K07J06j66l9L34k30j2J92k60k8J26
5778B7o8QO6R5J40l26M0J09pj35o0R2j36J52N3RO9j72K70l27K15N8j00j1J86l45
$$ plain form
5615 36 -20 1 27 -144 163 -166 -48 -180 -128 -37 -148 39 -9 -136 -199 -253 77 62 -222 -39 32 15 -259 -70
5639 -70 8 15 161 38 -62 213 -64 250 -307 -141 -225 94 107 -12 -18 207 -42 -93 104 13 69 -50 115 133
5663 133 -173 -141 -103 17 120 -15 -115 39 -198 -56 -165 -52 -75 -379 120 138 -109 -71 -306 83 -330 -27
5685 -27 116 -35 -147 -136 9 -385 -13 -222 32 -101 66 -150 -45 9 -177 -205 -125 -73 83 -23 -76 55
5707 55 242 -94 2 134 61 132 -93 68 -21 -39 -73 19 23 -159 -198 20 -291 157 23 345 -9 4 82 326
5731 326 62 -95 -73 -115 -66 -13 -67 -107 -13 255 126 -177 -124 -61 150 52 -120 233 -155 -21 49 -87 24 -93
5755 -93 -161 71 -60 -89 111 -47 -41 165 306 62 -57 -203 4 110 -56 -95 239 9 -3 189 -71 -99 27
5778 27 -41 -33 33 128 268 -58 -18 91 84 -51 -111 -19 -155 -3 50 59 128 -44 226 -101 114 172 72 61 247 -98
5804i8J35j21L23j09l50M03Jn9p6K1k89L53j71n7k1K06J6k84K84q5K5k31J24j19
5828a79J43kK76j79n6k69Q4K53j26r0l5J32J1J53n8P5j43K0q9J51k66K84k6K04
5852B68l14k4J55j68J02r2KJ3R0k75j4M99k59Qn5J09Mj87j8j2L39m41K8L36J03
5877A97l89J25J76pJ6k41K61j65l2Q9l8mM6J50j04l8j71L6J67o2J31K0l80K54
5901C7q4J40l55K39L0Rm0J19K0m3l2J50O6k33ojJ50j62N7o0J50k73J35Q9j34k1
5927e3L08j85L9k18J40r6r3L61l30J83k94L48l57Q0J99N7J08K6m59J26J08R0m0
5950D8J54m81K93J68k73J62J15m18p3L69m0m5j47J49J43o5j58l15R4J06L04J33
5972B23k01j43K69j56j30L3J92k77O9RN1K46n20L37J48o6j25R3k87K67J74k99
$$ plain form
5804 -98 37 -84 239 130 -220 183 184 125 49 70 -219 134 -37 -94 -115 91 107 -177 107 22 47 -184 -60 -179
5828 -179 -36 -38 238 59 3 -266 -182 71 -55 -145 -180 -48 -37 116 58 133 -10 10 -79 72 -194 90 64 268
5852 268 -46 -70 85 -83 19 -73 -71 -58 32 -243 -257 242 -17 -9 -64 45 49 -138 -156 -168 171 -270 -242 94 197
5877 197 -192 -67 109 102 118 -123 138 -27 -59 30 -8 -12 34 184 80 42 -129 -93 74 12 143 163 -217 37
5901 37 -47 93 -262 -23 7 16 -24 95 115 72 40 190 256 23 17 16 166 4 61 1 151 -122 13 102 -32 -53
5927 -53 255 70 109 -109 31 -65 -158 203 -127 56 -238 110 -247 -167 32 89 197 223 -236 -110 -2 88 48
5950 48 202 -279 14 182 -91 71 186 -232 -305 64 24 -21 -168 -19 124 59 -99 -414 -320 -214 90 223
5972 223 22 -121 148 -8 -138 -105 87 -190 -121 -112 -61 185 -335 2 150 84 -41 52 -235 32 206 -93
5994i3J35j00J20j5r0L40k71J56J92k45nj64J8k9q9M15k40p7j18J44J79n6j74
6017f7jo6M5m5J23j35L81l9J0l82K54j05L5q4J26R8l81N70k32L8j9o7k06L11j80
6042a8qJ27p7l8k26J17R8K82l13K16k92J79O1k69K11m1K43k07j8l13M63j24k00
6065a47L60j95J24K29l73Q1k7r0Q0q6r8l34N42j17N0O8j27l9L0j67N29k55O7K6
6089A31j03o5r7J1Q5K22p5q0J26M7k14R0q5K39m98M37j14L1m76L54L4j1j10p6
6113a97j13M10J38k50N7k7j34j36M90j02k78L14k48M8j80N4K58J46k62J14j3P8
6135A67q2r8qk9Kj3J86l91k5K43M01m29l8o8J68j01K27O6Lpl08J26K7J85j62K7
6161F9m0q9Q0k19J6O8P6M8J2j65L25L7k74K35k9j12k55K51j78J66o6K07j75q1
$$ plain form
5994 -93 42 -58 62 47 -43 297 26 182 374 129 124 -40 -22 -51 -140 275 35 -42 -160 -16 163 107 -67
6017 -67 -68 -134 -89 -134 -11 -146 235 196 206 -176 78 -27 8 -76 50 148 -233 337 105 143 124 57 -149 162 -18
6042 -18 -26 101 24 -14 -240 -123 -25 257 -56 160 -132 47 108 -161 50 9 252 45 27 -286 177 53 -147
6065 -147 213 18 142 371 -2 79 52 -38 42 -44 -142 -476 66 -51 -1 67 -60 -99 -69 -236 293 38 105 131
6089 131 28 -37 -134 -123 -38 184 109 29 155 202 -12 78 -7 232 -266 171 57 88 -388 -34 0 -11 -121 -197
6113 -197 -310 100 238 -12 45 18 -116 -252 238 136 -142 172 -76 -28 -208 -154 104 250 -12 102 89 167
6135 167 85 -13 -21 -50 -48 -61 125 -266 -291 -48 353 -76 -114 -182 -14 -115 112 178 181 174 -134 -8 19 204 42 69
6161 69 29 -60 20 -199 -183 -115 -39 9 21 -144 181 218 -56 179 150 38 -217 34 -144 22 -44 163 -12 -93
6185i3OJ51j76L05k89Q2rP6K26m35J11j86J93k91M40r9j15k9N2L65o43M05j57
6208a10P9K8L0p2J02k17J32K46k26k61K60J22j79p3J85k25J84K3r0K20k40K41
6230A59o1rm9J41k39L0l1o5J85J07o1j39p5q1mJ17K0K19l04j56M00N0k80M00l87
6255a13P1J41j76L51j74L1j95j24K75k50L20p3O6n3q0l4L7J59q9k84J08J88j66
6278f4R9j53L00j10N5j85J84k5m5n2r1J43j6p0j25J62pr0n3J54K35k23q2R9j32
6303i2K61l9l13j6K11j11K29m3K6m76J90K82j57J05k75K41r0J66p1J32p4J42l09
6326h1L8L1k04L04j26L4K37j58M3m90J52K63m23M01lR9j34Qj17m3N4P8N3J47j09
6351E4l4M4nK21k54J2j02K87m43R6o0kJ63R1k85J76k96L39l7j78R8J71k8o4M3
$$ plain form
6185 -93 -87 64 -112 193 -96 -14 -23 53 279 -156 -45 -231 -38 -329 111 12 -103 -132 -80 285 -358 47 -110
6208 -110 -31 -3 27 -45 57 -160 -28 218 -8 -269 -9 113 -66 -139 46 -179 5 28 -62 158 -82 159
6230 159 98 89 40 181 -58 -28 -59 -124 61 168 107 -32 -107 -188 -192 -75 -55 164 -140 -296 104 154 -126 274 -113
6255 -113 -42 99 -77 274 100 131 -64 -188 87 -163 157 84 150 97 17 -17 20 179 90 -194 -86 102 -64
6278 -64 35 -118 182 72 127 -58 126 101 56 4 -87 56 40 -30 -155 7 0 -90 -143 11 246 23 -59 40 -92
6303 -92 169 130 -183 -199 12 -99 130 87 113 -363 -173 109 -48 57 -218 23 -67 99 28 160 86 228 -81
6326 -81 -43 -12 -216 88 -38 -4 233 75 118 -372 -220 43 -380 21 18 117 -17 -9 -126 -169 -115 -37 16 163 54
6351 54 20 64 59 280 26 38 -64 223 -220 -124 -184 -186 -23 68 -217 -41 -337 2 -35 -213 -115 56 28 -36 7
6376Gk50M19j93K30m18K03m1J0j61K24m70M76j67q3M79k91n9jN7K25j15j23k0
6399f2j4K10k57R7J4J69k91O7N3J12r7mJ5q6L6k8K69l07pL22r2j30J48k17k11
6424b91L20J36l48k0J10O4k01J13n7K19%j2O0r8M6k0l0O1j41L3O8J22j70K4n6
6449f8J03j5R2j02L1j2k1O1j28J0j04j26N91k75k06Q6J34p2J84l76J29K05q7l8
6473dJ8n4L2J44m83M04j24j39M87m45L43q8J08l59R2p1J84k0K5j81O7k8Q5k7n8
6498i2J40J9q7J26j40R0o6J42r4n2q3j37L32l03K56J14R9m18K12M0R2l0l94K18
6522a6L3K32j50J25j98k88K10m4J13j6K13r0l79J81j5R2K03k52j07K11oj52J18
6545A8J51k55k29K25k79M18j68L17m15L23N5jk68K63q4j98L44k86L2P5r8N9j1
$$ plain form
6376 7 -243 176 -17 213 -205 -2 -43 -33 -194 30 -440 36 -131 -214 265 -26 -85 -86 -29 196 81 -42 -62
6399 -62 -76 134 -123 -26 -12 157 -134 -67 -14 98 1 -3 12 -74 -38 -66 203 -104 -111 211 119 -11 137 -80 -291
6424 -291 29 165 -183 -203 -93 -29 -230 -117 -174 45 45 33 93 -5 41 21 -9 52 -89 -56 12 134 -36 -12 -68
6449 -68 35 20 112 10 41 29 8 69 -59 -49 -153 -279 312 37 -169 -83 51 -21 163 -213 -84 121 34 -4
6473 -4 14 -40 -8 136 -347 57 -67 -206 281 -164 179 91 199 -160 -68 -139 45 25 50 -131 -64 -92 -7 -34 -92
6498 -92 48 67 -20 106 -34 56 -10 132 38 -14 -97 -234 98 -205 51 165 264 -154 58 98 190 160 -234 -16
6522 -16 17 249 99 224 26 -262 -52 -96 17 1 214 124 -255 -74 -89 3 206 -46 -153 58 52 -100 18
6545 18 169 -86 -315 -90 -369 49 -119 198 -217 106 161 160 -108 155 71 -127 217 -69 -37 38 -60 -1 -12
6568a2j73J56j36N1J95k46Q9K4J03k68N43k07k11J03oj52K40l9J3K7J44o0j81
6591cJ2k77K99kj65L09j41J7J88j00k50K11j27J05k4J7r7K87m21m2L55p9k65M2
6615a51J38j35K64j41Q0m9o5n5K61k6k94J00K00k40J62j73K6k0P3R5j71J50J97
6638B26m04J37M3n0RQ0O8o3j29J25j07J4K59o9j2j60J54R4j72J06j92p2K38Q0
6662B03j95J9j13J81q3OJ40k06n5j16J76k34J46N9K25J06k43lj17M9J49k50K33
6685G7l5r2k5K11J03l39m6NQ6P4m5K60j84r9J61n0j34Q5j36J27j24L85k67n2L7
6710a7R6M9q4j8j38J52P4j49n0Q5O2j10j52J19M6qK54l05J96j1l12L92l92J08
6734a13l7J63K16l25k9M02n75M72j12j87J51K24k79J27k48K77j35k22L03K3j14
$$ plain form
6568 -12 -185 -29 -165 -114 81 -165 -76 -52 51 -217 326 119 -92 11 5 -147 93 54 67 94 238 178 -3
6591 -3 9 -268 31 29 -136 173 32 49 237 137 -113 98 -29 76 52 69 -28 259 -162 -204 151 72 -193 -151
6615 -151 -13 -148 116 -25 55 6 -59 -114 147 121 -173 -73 127 -113 49 -124 -98 -118 -45 50 -121 29 226
6638 226 -178 -41 2 -48 -39 41 109 46 -83 42 -65 -51 208 139 127 -33 121 215 43 149 -43 -115 123 203
6662 203 8 27 -86 95 12 18 158 -48 -103 -219 -43 -277 -131 -72 153 259 16 13 -104 -55 94 -156 77
6685 77 42 -50 -75 136 239 -100 -146 -141 -55 19 -26 234 50 -49 112 62 -72 13 -123 4 -120 265 -2 -54 -17
6710 -17 79 128 44 26 -112 40 114 -35 -85 0 62 -48 -200 -81 -35 -43 211 -94 102 91 -221 171 -221 -113
6734 -113 -150 13 229 -96 -125 277 -298 174 62 -125 26 250 -29 98 -150 127 -8 -230 73 96 -18
6755a8Pj5p3j7J48r8K7J30L3l35K98o4n1Q7r9J44j40ll46K91o4J92M8r4j12J09
6781a5J41m0J3k27J11J49k04J85l25K33qJ48k11k48L94j99L6J07j84K31k51K48
6803H4j89J41k06N8K46o2J84j71q4n0J13J87m14N6J20J68l65K10qJ16Mr5P9j57
6827c5J47m0r8P4r3L0j6j28M5K31j33J05Q4j37q3O8j0j46k22L64p5J10r2K88K9
6852B67l08J88j99J64p0k26K61p5j56K67k18j5J45J30j5j33K19m09j57N95j79
6873G6o8J1p9o7M6K51k09J21k7j1K0l44L56j78J48p5L5J27J54j46J04m8j83K2
6897C6j0r4k2M8J10k13r0L31k09K47k94L42q3L1m8p7pj97J40J94N0j44m7K34m
6922B24j28L2K8j11n5J43j24M5k09j16K88k1P9k61J56k2J37J01k13p1J46k10K2
$$ plain form
6755 -18 -11 -26 -99 -116 32 -66 -39 91 124 -211 87 23 -28 59 -40 104 -36 -39 -385 -94 -158 34 82 -12 -124 -15
6781 -15 126 86 99 -128 -17 132 -72 113 -212 21 13 161 -50 -298 96 -103 -67 40 -144 87 -164 84
6803 84 -105 36 -170 -112 134 72 256 85 1 -49 64 251 -163 -107 13 181 -184 26 18 134 138 43 122 -35
6827 -35 112 72 -26 48 -45 -15 -31 -159 -114 117 -16 89 173 36 -47 21 11 -135 -357 7 -68 42 -50 238 267
6852 267 -41 147 -52 112 42 -184 77 2 -154 113 -105 -120 25 155 140 7 226 -183 -340 255 76
6873 76 8 19 -60 -127 -81 170 -39 82 55 44 64 -280 76 -102 46 -29 6 133 287 141 245 197 14 36
6897 36 26 -68 -90 -42 68 -145 -235 96 -113 134 -160 182 99 130 82 5 -2 -199 -59 135 185 41 -6 228 224
6922 224 96 128 156 45 -10 133 9 54 -155 -271 17 -4 75 -186 -30 -52 85 186 -27 -98 48 -162 -140
6945a40%R7j69K27Qj65J87m3J78j05m7J30l99J67J88P9k20J29j63J11nL2MJ46
6969B27j53j0l2j41J88j03K09l74J58Q9k1J29k35J10k02P1J07p1j08m4L21j64
6991d9J24j46Q2j32R2L04o9j72k13J76j16M2J10k89M10j34j9k89M89k11j34K83
7013A39j5j29j20Q2J15K2k0j5%j36J3p7L69m41J72K11j05p7j7K48j10j45O9j6
7037A7k24M4J25o8OL13l81O0K13k19J6N6n1J89k21L45k76J8R8j21L53k08J98l50
7061f8p9J67n5k66J81L15j64j70O7N4L4j62J50J06j10j99K48R6o5j33J4j12L02
7084A51j00l3K7QQ1k94K10j78O6J16m20M31Q1l01L7L82k33j49N5k2P3j54K03O5
7108A02q9p6P2K5J71j05j85J35k00K52j23k20J44L89m31K81j52J09J03j09J18
$$ plain form
6945 -140 -140 -43 -212 15 23 -142 45 2 180 75 28 158 -241 -74 114 193 -27 102 -61 50 45 77 81 227
6969 227 74 64 32 -109 79 -24 185 -189 -31 58 37 166 -69 41 -161 -90 17 -54 -162 -206 115 -49
6991 -49 75 -71 11 -121 -29 275 206 34 -179 -3 -119 -77 33 -256 154 20 1 -288 201 -10 -144 139
7013 139 124 -5 -125 -43 72 94 74 59 59 -77 -64 -141 228 -213 -41 170 65 -12 -29 219 109 -36 33 17
7037 17 -207 -163 -38 -106 -100 213 -168 -108 105 -114 -98 -42 -93 96 -125 220 -56 -38 60 -61 292 84 282 -68
7061 -68 -147 20 -35 -301 -120 195 31 -139 -72 -18 16 -146 4 110 0 -199 49 145 80 -53 -39 -151 151
7084 151 51 18 45 53 134 -160 50 -128 -62 54 -366 65 146 -155 -118 264 31 -118 -63 -85 -12 -166 37 102
7108 102 13 -63 9 34 205 100 -85 50 -150 102 -21 -241 -97 292 -139 142 -10 99 202 93 211
7129B11k67k1K26j85J90j84L55l61L04J2k33Mj72Q6m1O1O6J90j60j6k06K46J1
7152A16j71O0J41k10J6R5j14J13m2k1j4L8k32j52K13J2K54j14j9j14P2p9M00m51
7176b03M29k24j2P6L2p1j87J85J60k02n5M3l0L6m9l8J55o6J53j20l22L20jj64
7200a55K81j48O0L5j03N2p1K23j51K1m20M46k63O0K55j15J64j51M7l81M96R1k51
7223B2Q4k70M7O2R7J86j13n2J68m23L31j82M5J00j28R2j64J04l44J78l48O11J6
7246A19j43j35L08k00jJ53rl27K17R8k19K51l4rj07L5l3j97L23r8j32M7o7K58
7270I8k15J45n6J06l06J59J66o7l21K46N8O2k82J60J77k28J38j33q0K28m3o2j1
7293f1J57o2j36L02k75R9K62m85P3J56j42K29j75O0L08m64K17p4k11K68o4k7o0
$$ plain form
7129 211 -56 -77 149 -36 154 -30 325 -36 268 280 47 51 -121 -35 -76 -15 51 241 81 65 -141 105 116
7152 116 -55 5 146 -64 -48 47 -67 46 4 -17 -31 7 -225 -377 -164 -152 102 -12 -31 -145 -73 -152 248 -203
7176 -203 226 2 -10 66 98 27 -160 25 185 -17 -72 -29 -59 -23 -72 -110 45 -21 132 12 -310 10 9 -155
7200 -155 126 -22 38 73 -30 22 -49 174 23 44 -376 70 -193 -133 122 7 171 20 67 -314 182 273 22
7223 22 106 -164 -117 -55 42 228 115 63 231 -192 139 -43 2 102 -26 66 -98 6 -338 -160 -508 103 119
7246 119 -24 -159 149 -51 -52 101 92 -235 -18 80 -139 112 78 69 -38 -3 -36 -233 90 -8 -140 -93 -160 98
7270 98 -117 28 -28 78 -228 -69 97 30 -291 -45 13 75 -207 -47 130 -98 40 -93 -173 55 12 -50 -61
7293 -61 96 34 -102 200 -75 24 286 -199 -126 30 -112 117 -58 2 310 -154 63 -11 -222 46 -18 -45 -105
7316a05K5M6P2J93j54M1l02K71p8J36j17J28M7j78P5j7j48J6N3j3J12J59l55J30
7340C7j33QJ44j53M2l3J66L4j75p5K42o0r5O6M9k88Q7jP6J62j75J13j30q8R6j
7366h5J91k5M3j28n1m1N5M1j01K21l58M52j02l24K20l2K38q3j02r9K10l44PL79
7390A82n3q8l12L92P1j05k22N8M2n2K33q0j21j22M76l81J19j53J62r3k0L2J9J38
7414A22j93J45j58J48j48J55k63R8J28J62j75J7M3Nj28J1M02l39L1L5K8j0n1k13
7438a48M6N3M5Pk98L89j84k16Q1J60O7j28L0n5J5M16k31n8j19p7L95j80p8L12
7462B44k04r6K9o4J83k56L36q3j25qK18l26L2J18Pm4L1K5p2k7k5j5J7J58m4J74
7488A83l70J00J6m2M1j4L5j24J95m6R2k44Q5J18j55J4L4J89K1l0l5kLl36M45k39
$$ plain form
7316 -105 -80 -34 38 231 77 118 -184 87 9 145 28 156 203 25 100 83 -65 -49 4 -9 103 262 -93 37
7340 37 -96 -88 56 -97 -55 -88 78 112 -63 -138 104 44 -51 15 64 -224 -137 -138 -62 100 -75 38 -92 -180 -84 -85
7366 -85 106 81 124 -4 -55 -96 -41 0 -101 120 -238 214 112 -212 8 -24 214 131 29 -70 140 -204 -197 182
7390 182 129 41 -271 121 192 87 -135 -77 -35 -87 146 66 -55 -177 299 -82 37 -116 46 -47 -67 -35 -16 122
7414 122 -71 74 -84 64 -84 71 -192 -94 34 196 21 38 81 86 -42 -31 371 32 63 98 126 116 65 -148
7438 -148 -102 -49 -4 3 -295 94 -90 -306 -225 -65 2 -126 -96 -151 -136 280 49 -9 -128 -205 190 10 -68 244
7462 244 40 -56 -27 -91 92 -164 172 89 -36 -44 174 -152 -120 -2 5 -39 -8 17 -55 -82 -107 -122 -105 53 9 183
7488 183 -187 -87 -71 -113 -72 -86 -51 -175 20 -26 66 -178 -93 25 -130 -116 -82 107 128 98 63 61 64 -272 173 -66
7514f6J48l22J43J30j42J98P3l98K77o6j08N0j92Q1J4K4K45Kl23J76J06J29J5
7537A94l07j65L78j87K4r6j08M38R7l08k1Q4o2J0j43K72q6P0p5j70R0p5J37k30
7561b39J82K40K9MMk71n6O8J24k44J57m0j70L37K8KJ75m56o1L97n0k90p9L75K6
7586A92J5l32O4J94k7j08l1j99rK74j23N9OKN9l0j90L43J04l83J78K89m46O3k34
7611b70K65j87K03J8j5n0p4K25l59J73K83m45M37J8m5n7j24J18m3O5l67K16K60
7634B45j96N6k85K58j22m4j63J42J74j0Q1k68M52j42l1Rk70L33N1j06k09P4RJ25
7658A63j31Q5k8l28K81m29N82j82n8k00L95j10j01J05q8l2L31k85O8Q3l3j95J80
7681G3k6m6%O3oo9j7j30K01K0K2j70J76J17n03L50K57j44l28L6N3O6r3p2L17k80
$$ plain form
7514 -66 82 -240 -97 33 -109 89 162 -236 41 -25 -133 -83 -275 -194 -180 -156 89 91 -232 -56 50 179 194
7537 194 -113 -278 100 -87 -63 -159 -267 171 268 -40 -61 23 -39 -29 -172 100 14 84 9 -161 -71 -146 -9 -239
7561 -239 -57 183 212 216 220 -51 -107 -39 85 -159 -2 -42 -212 125 153 155 330 -126 -187 210 160 -130 -209 166 192
7586 192 207 -125 -61 133 106 -2 -33 -232 -241 33 -90 -31 -25 -23 36 6 -184 159 263 -120 58 347 -99 -36 -270
7611 -270 -5 -192 11 29 14 -36 -110 115 -244 -71 212 -233 204 222 177 120 -4 114 71 136 -231 -15 245
7634 245 49 105 -180 78 -44 -88 -251 -109 65 55 136 -132 320 178 147 156 -114 219 270 164 -45 29 38 163
7658 163 32 117 89 -239 42 -387 195 13 -45 -245 150 40 -61 44 -44 -76 255 -30 38 121 88 -107 73
7681 73 47 1 1 64 58 -11 -28 -158 43 63 85 -85 91 208 -295 55 312 168 -160 -124 -71 -5 -98 -170 147 -133
7707a33R5j85K80k15O1J24j72L41l78J49K19j22R6N8l74J88N5q1J77L4k69j83
7729b35J19P1K92k90K40j66k83L12k72q7M20j72J16k21Q2J37J30k52L2K6Q0L4
7751A13r9J72j86J29l82L83PJ8k71J59J22k14P3L3j67L51l92L75k71P6K64m14
7773a21L5l8m1J03k19J69k40J74nJ61J0j72K32m1J80j48p6J59j70k80L72L56m27
7796b7J15k5j44R5L1J5N5j27k10K51N1r3O9l68K10Q8n1r5N1L74l11K31n4l73J16
7821a26r6L83J99j72q1j33J22j51Rl50M18JK04l53J16j42J2J72J9k15J42J22j71
7844g1J82L9j99j63J99J52k59j14J69n4K36m22L5K79q0J57Lj32J44k23K40j08
7866A0j49j48M77j42j70M9j5M1J32Mq1O6k31J04j76J71J18j61J27R7J00k01K17
$$ plain form
7707 -133 -38 -223 57 -158 -97 27 -145 196 -182 -33 186 64 160 218 -156 32 87 6 183 217 -52 -235
7729 -235 -116 -45 247 -43 197 31 -252 60 -212 -299 121 -51 65 -156 -74 63 193 -59 -27 -1 79 113
7751 113 14 186 0 129 -253 130 137 155 -116 43 165 -49 24 57 -110 241 -151 224 -47 29 293 -121
7773 -121 -86 -124 -165 -62 -281 -112 -352 -178 -183 -22 -12 -184 48 7 187 39 -37 122 -48 -328 44 400 -27
7796 -27 88 63 -81 14 45 60 115 -12 -222 29 80 -13 56 -312 -102 -14 -65 -160 -109 265 -46 185 131 -242 -126
7821 -126 -222 161 360 188 107 -26 96 -55 -46 -396 22 23 227 -126 -10 -152 -140 32 51 -164 -22 100 -71
7844 -71 111 150 -49 -212 -13 139 -120 -234 -65 -119 117 -305 -270 9 -71 86 89 -43 101 -122 118 10
7866 10 -139 -287 190 48 -122 -73 -88 -47 85 89 8 74 -157 -53 -229 -58 60 -101 26 123 223 22 239
7889B39j30j6J19n48M47j37Q0j20J06J2M3k71K88k17K04K75n18m0O0K9m5K15N8
7912A33j1q2r6j32J23K0k19J27K50o44P05J1j10n4j71L5J35J16j35n6MK8J2K22
7936B11k1j50O0k53L10k72K2J40lk6O3k96K06J80o2Oj0j43K87k56J44m03K87n4
7960c3J57k57Q7M5J38k2q3J73n33K83N6J13r0J96m3j61Mj98J75k96K83j4o0k32
7984c12M68J39l01j08J02j76K07j67j10K69J75l52OL9K30j95NM6J68l34K03J3
8006A5j23J16oq0J95J02k96N1J42j73J72k28J66j06MQ3n4L7Q0m5Lk0J35O9k72
8031c3M9K0M1J68j95q2R8p9R0m2q6K18j27p4R9j34n7N7J44j54pK00j82O9K82l88
8057a05K01k02J85J37l11r8O4K40O7k99o3K34k22P2L11k47K94k87J32qq1j83R9
$$ plain form
7889 239 109 93 212 -336 111 -26 54 -66 40 52 95 -176 112 -105 99 374 -144 -184 -124 -95 -140 75 133
7912 133 122 40 -56 -188 -65 -45 -264 -137 113 -531 174 185 75 21 -150 -115 20 136 1 -55 -51 -23 -11 211
7936 211 190 40 100 -153 157 -115 -93 47 44 18 81 -215 -9 171 109 115 105 -38 249 -7 137 -266 21 -33
7960 -33 124 -133 -46 -1 137 115 32 205 -328 -45 11 124 34 230 187 26 30 -168 7 -289 -6 -20 -80 -312
7984 -312 156 295 -6 -114 -12 -188 19 -148 -258 11 186 -166 -160 -121 109 -86 -81 -35 133 -201 2 15
8006 15 -108 8 2 -78 117 219 -77 -26 116 -57 115 -113 53 -53 -49 34 -20 17 97 52 55 35 170 239 -33
8031 -33 16 36 77 245 50 -32 66 -13 77 35 -51 167 40 -34 65 -69 -126 -69 75 -79 -86 114 -68 1 283 -105
8057 -105 96 -106 79 216 -95 -193 -129 111 178 -121 -184 50 -172 -100 211 -36 258 -29 103 95 14 -169 -70
8080g0J08k66O8K32j5n9o2K5N6j55J64k5j44p6%K26J35M0l58K93l53L44j74j5
8104h1L26r7k58J05p0K61j13j71K05n62N64Lk08j8L48k13P7m2J32n24K16K37k87
8127a70J78j73J6J21J67q0j34Q5O5l20R9K7l8Q1Q5R5r7l9Q0k42j7P2P6J57o7p7
8153e0J02j61J01L9p4j27L27J3r8l64L02J9Rq1K93l96O3J88J16k19L06j52j70
8176a4K25k95m5J0K27k67L39J18Jk61j12J80k27J5K37
$$ plain form
8080 -70 38 -228 -160 72 57 -2 -64 -39 17 -138 26 1 -143 -219 -219 7 142 182 -176 117 -236 108 -66 -81
8104 -81 245 148 -110 -5 -75 186 73 -98 107 -455 109 112 -96 -114 234 21 98 56 188 -336 -120 117 -170
8127 -170 8 -165 -149 -28 139 59 -75 10 75 -245 -146 -119 -157 -76 9 104 7 -32 48 -194 -211 -139 -63 94 27 -50
8153 -50 52 -109 -8 31 -43 -170 157 170 72 -292 10 29 38 -43 250 -146 -83 105 221 2 308 156 -14
8176 -14 211 -84 -129 -119 108 -159 180 298 299 38 -74 106 -121 -106 131
8191A31
$$ Imaginary data points
##PAGE= N=2
##DATA TABLE= (X++(I..I)), XYDATA
0@%%%%%%%%%%%%%%%%%%%%%%%kRj5J6j6J6j6J6k1K7l0L2l4M0m6N0n6O2o9P7q5R5
45E0j04J15j28J42j56J72j90K06k25K49k76L07l43L85m36M96n66O56p77R42j184
66f65J572k286M012j5505j3663L5348p937k3436K1543J9691k3623K46K5801r443
80A1655k2069J3328P339k2379l275J9402m864j3200J3991J4148j2835l256J5728
93A3713m549j7433N202Q425j4141n890J4881K447r937P362J3042o814q076Q810
107G042K188j5337l248J1608n619j1954J2324J1889j2471k91J9323n884j6540
120f970J1093O956k0654l180J7538p244j3242J6815J0514j5198J821J7299q647
133F901j5019J1235M043j8511n09J6121o408j0052J5120R211j3714J217J4096
$$ plain form
0 0 0 0 0 0 0 0 0 0 0 0 0 0 0 0 0 0 0 0 0 0 0 0 0 -2 7 -8 8 -8 8 -8 8 -13 14 -16 16 -18 22 -24 26 -30 32 -37 40 -45 50
45 50 -54 61 -67 75 -81 91 -99 107 -118 131 -145 162 -181 204 -232 264 -302 354 -423 519 -665
66 -665 907 -1379 2633 -12872 -26535 8813 876 -22560 -1017 18674 -4949 -4703 21098 11655
80 11655 -10414 2914 10253 -12126 -15401 4001 -863 -14063 -72 14076 1241 -2015 13713
93 13713 9164 -8269 -3067 5358 -8783 -14673 208 2655 -7282 80 13122 6308 -1768 7042
107 7042 9230 -6107 -9355 2253 -3366 -15320 -2996 8893 -3578 -3869 15454 9570 -6970
120 -6970 4123 11079 -9575 -12755 4783 -2461 -15703 1112 11626 -3572 -1751 15548 6901
133 6901 -8118 3117 7160 -11351 -11860 4261 -2147 -12199 2921 12132 -1582 -365 13731
146A3731q704j2925Q841K982j4256O31J2271l375o059J0250O853q235k018P826
160G813l369j1073J929O095p051m834J1068M429q606M116J1275p168q643R148
174E129P34j4538P48J1289p452p022J3674N666j1594L448J2778q912j0852J0315
188C411J568j5816K260J2789p358o522J4769M395j2542M401J0558j0000r309J0163
202B767k67j3121M050J0451o285m150J1941L149r568J918P702p516q220O179J929
217I59q734J013J0142k067m958P620N534q397k468P122m173r528M537N018p536
232e916j370J1107O93p700O225O921q591n805Q698k182j1587M570Q314p858k079
247f560J2339N63r452O185O985j0663n001Q744k720j0433N886P907p345j170J1362
$$ plain form
146 13731 5027 -7898 943 3925 -10331 -9700 2571 -804 -6863 3387 10240 2005 -13 7813
160 7813 4444 -6629 -4700 1395 -5656 -10490 578 5007 -3599 517 11792 4624 -4019 5129
174 5129 5863 -8675 -7927 3362 -4090 -11112 2562 8228 -3366 82 12860 3948 -6904 3411
188 3411 4979 -10837 -8577 4212 -3146 -9668 5101 9496 -3046 1355 11913 1913 -7396 2767
202 2767 2500 -10621 -6571 3880 -2405 -6555 5386 8535 -1033 885 8587 1071 -7149 -970 959
217 959 -7775 -6762 3380 1313 -3645 3975 9509 1112 -1356 5766 1593 -7935 -3398 1620 -5916
232 -5916 -7286 3821 4514 -3186 3039 9960 1369 -4436 4262 2080 -9507 -4937 3377 -4481 -6560
247 -6560 5779 6342 -3110 3075 10060 -603 -5604 3140 420 -10013 -4127 3780 -3565 -4735 6627
262F627m78q164M724M857r101m020O594j566p695M939O735m175j603Q024J026
277F724p275J147M336o156n311M741J852o123J914P986j576m270O389L032p770
292c60j922O056l970q026N727M496o619M79R829j468o517N849M471r944k432P860
308C509m534q005O681N555p237Q34J0440k756p020O265L044r661k081P235l811
323a542o515O732N174o052O55Q210k114o566L934K686p650k346N573j453m961
338f235M451N901l828j429O680l15o692J218L767n880m228N861J545n829K920
353b093P632l021l988N931J416q607L24N439n462n304P112K860o584L379P710
368F744m384m295O485K92q803M98N860n376m283P519K597o167L386O938m604m140
$$ plain form
262 6627 6149 -2015 2709 7566 -1535 -5555 1039 -527 -8222 -3283 3452 -723 -2326 5698 6724
277 6724 -551 596 4932 -1224 -6535 -1794 58 -6065 -4151 3835 2259 -2011 4378 7410 -360
292 -360 -2282 3774 -196 -8222 -2495 2001 -4618 -4139 5690 4222 -2295 3554 8025 -1919 -4351 3509
308 3509 -1025 -9030 -2349 3206 -4031 -3197 7243 4487 -2533 3732 6776 -2885 -4966 2269 -1542
323 -1542 -8057 -1325 3849 -2203 -1548 6662 4548 -2018 1916 4602 -3048 -5394 179 -1274 -6235
338 -6235 -1784 4117 289 -1140 5540 5225 -1467 -249 3518 -2362 -6590 -729 816 -5013 -2093
353 -2093 5539 2518 -1470 4461 5877 -2730 -2406 3033 -2429 -7733 -621 2239 -4345 -966 6744
368 6744 2360 -1935 4550 4842 -3961 -3463 2397 -2979 -7262 257 2854 -3313 73 7011 2407 -1733
384a733N205k51p493M19M889l725k715O023K538m074J586N114l052m412K778P81
400A878n488r43M419j016l061M189M241l434j207N318j464n752J167L011n268
415c410k172N629P50m525L894N710m475k748N656j082p201J635M432n201k626
430e734P051O88n071M040N397n111k717N217j494p102K427L999m517j906O766
445A933K21m046L328M129m288k822L800j260n368J043M069k395j729M715K184
460C514l754J058L745k698m353K536J226n174k27M977p75l454M926L188m395m20
476h0M397k548n579K762K671n777m12O497p88m040N043L289n396j241N256k982
492A072n969L726K742n386L91O048j175l677M638K497n437o73L853k697m642L279
$$ plain form
384 -1733 3472 3221 -4272 -3853 1036 -2689 -5404 619 3157 -917 669 5783 2731 -1681 1097 1878
400 1878 -3610 -4553 -134 -1150 -4211 -22 4219 785 -422 4896 3432 -2320 -1153 1858 -3410
415 -3410 -5582 47 797 -3728 166 5876 1401 -1347 4309 3227 -3974 -2339 2093 -3108 -5734
430 -5734 1317 2005 -3066 974 6371 1260 -1457 3760 2266 -4836 -2409 1590 -2927 -4833 1933
445 1933 2154 -1892 1436 5565 1277 -1545 2255 995 -4373 -3330 739 -1656 -3385 1330 3514
460 3514 -240 818 4563 1865 -2488 48 1274 -3900 -4127 850 75 -3379 1547 4735 340 -80
476 -80 4317 1769 -3810 -1048 1623 -4154 -4566 1931 1143 -2897 2146 5435 39 -1202 4054 1072
492 1072 -4897 -1171 1571 -3815 -3424 2624 1449 -2228 2410 4907 -530 -1203 2650 -47 -4689 -1410
508a410K439m001K91N378m40l161K981J939l776k115L125j366m054J672L371k191
524a318o59M463J007l726J054K919l153l680L075N83m340Q36M822j895j965M936
540B959J495m813J92L330l364l765L378J405m972J684N260k179k277M558J209
555D100n148J82L626l648l301M006R94l996J726M429j889k121L853Q77m394m42
571a146K654k546k809K720K117k777N65M015n90k675K088J512l682j579K770r97
587c60l024J920K954j571r96L916K56l800J272K335m086k211L700o6l951K235
603a477M344k857j281M579j8m861J561K362m020k135L998j0l606K697L908k737
619D47j340M020k17m755J371K393l612j701L474K66k785K376L048k084j535L209
$$ plain form
508 -1410 1029 -2972 -2681 2697 2257 -904 2077 4016 240 -1875 1250 -116 -4170 -2498 873 -1318
524 -1318 -1977 2486 3493 -233 821 3740 587 -3093 -18 565 -3775 -2939 1883 -12 -1977 2959
540 2959 4454 -359 -167 3163 -201 -3966 -588 817 -4155 -2471 2789 610 -1667 2891 4100
555 4100 -1048 -866 2760 -888 -4189 -183 811 -3185 -1459 2970 1081 -1040 2813 3690 -704 -1146
571 -1146 1508 -1038 -3847 -1127 990 -1787 -1222 2793 2203 -472 1616 3128 -554 -2133 637 -360
587 -360 -3384 -1464 1490 -81 -1077 2839 3095 -705 567 2902 -1184 -3395 305 239 -3712 -1477
603 -1477 2867 10 -1271 3308 3290 -1571 -10 2352 -1668 -3803 195 185 -3421 -724 3184 447
619 447 -893 3127 2910 -1845 -474 1919 -1693 -3394 80 346 -2439 -63 2985 901 -634 2575
635B575l52l683J99J758j796j859K751J417k225R00L672j435k701J825R55l387
651a386p89K931j504k286K755K235k508j84L989j395l252K042J141l935p29L255
667C80p77k452K908K670k868m16L714j378l562K051J073l717n39L547o48k254
683b268L020J985k651m7K505j298l324J629J171k848l94K760L23j913J686K239
699B575j954j229K220l90k862J39J928j526j338K787J168k329P63K835j494k365
715a072J899K24l276m35L360j170k081L131J887l020L32L147j850l015K388R99
731A448l698j6L167j398j599L361J173l026N09K922k695k347K267O25k779M47
747a639K895j413j149K644J017k441m41K407j614k133J294J266k553J81K437l2
$$ plain form
635 2575 2223 -1460 -1261 497 -1299 -3158 -407 1010 -1215 -315 3357 1922 -779 1046 2001 -1386
651 -1386 -2175 756 -748 -3034 -279 1956 -552 -736 3253 1858 -1394 648 1789 -2146 -2875 380
667 380 -397 -2849 59 2729 -139 -555 3159 1781 -1781 270 1343 -2374 -2913 634 -14 -2268
683 -2268 752 2737 86 39 2544 1246 -2078 -449 722 -2126 -2520 240 563 -1350 336 2575
699 2575 621 -608 1612 1222 -1640 -1501 427 -1099 -2437 350 1518 -811 -48 2787 1293 -1072
715 -1072 827 1051 -2225 -2660 700 -470 -2551 580 2467 -553 -221 2926 1076 -1939 449 1448
731 1448 -2250 -2266 901 -497 -2096 1265 2438 -588 -79 2843 148 -2199 68 693 -2086 -1639
747 -1639 1256 -157 -1306 1338 2355 -86 -527 1880 266 -1867 -573 693 -1860 -1679 758 726
763G26j513J474J495k047q89J827o66k445J084J646k028o44L116K60k067J086
779D15K179k225j989K383rl324J264K390k032p03L274K03k699J261K055k575j764
796a896K579Q3l253J468K381j753n04K572J27k403R52J616k545j247K021R2k092
813a802R41J925j000q17K005K61j954J55J534j558j526J391Q41j531N8K233k72
830H84j429J411J041k180p39K051j025j944J282J651j711k95K528k09k146J534
846G04J233k394j000K322p88k440J921J526j752l00L028q64j886J180J070k165
862f05q40K180n65k076J601J378j496j04K317o40k023R52J152j840p76J356mj546
880a579J003J852r62n84J489M81k310j46J592j219j486J834O86j805O10J914q11
$$ plain form
763 726 -787 687 2182 135 -754 1073 407 -2038 -954 692 -1336 -1980 1136 1396 -671 415
779 415 2594 369 -1620 763 754 -2570 -1306 1084 -948 -1651 1623 1826 -873 388 2443 -132 -1896
796 -1896 683 766 -2487 -1019 1362 -391 -895 1677 1804 -599 353 1969 -576 -1823 198 290 -1802
813 -1802 -861 1064 64 -753 1252 1513 -441 -286 1248 -310 -1836 -445 396 -1135 -1077 1156 884
830 884 -545 866 1907 -273 -1012 1039 14 -1930 -648 1003 -708 -1003 1525 1316 -830 704
846 704 1937 -457 -1457 865 77 -2363 -442 1084 -668 -968 2060 1196 -690 490 1560 -605
862 -605 -1445 735 170 -1906 -305 1073 -423 -527 1790 1150 -873 79 1231 -609 -1385 -29 -33 -1579
880 -1579 -576 1276 314 -270 1219 1700 -610 -756 836 -383 -1869 -35 651 -1154 -544 1370 559
897E59j356J756O75k359m07J988j028j547K136O71j932K90K247j124j487J945
913A027L54k430J11J931j369j477J997R81j991N13J872q81j408J237M98k049J30
930i54J228m50j268J579Q14j253j39J881p47j483Q47O13j540j69J334j94p56N47
948a10J301j227k06J052K13j698J94J510j869n02J712L4j267Q90J387j368p36
965f90J500P4j968M54J174j164q81K077J92j456J047Q47q11j331J559R0k039O93
983f33J359j289n63J557L71j501P75J148q54j228J088L01j339K26J363j049p62
1000a030J564M60j222l80J601p94j133J002O25j444j87J768l99j407J441P49j404
1017a90k42J541n92j719J125O83j181o28K070l38j527J295J072j463o74J743q69
$$ plain form
897 559 -797 959 1634 -725 -1132 856 -172 -1719 417 1088 -844 -554 1693 569 -918 1027
913 1027 1381 -1049 -938 993 -376 -1853 144 1125 -866 -353 1519 638 -770 467 965 -1084 -954
930 -954 274 -176 -1444 135 949 -304 -443 1438 691 -792 55 668 -872 -1041 293 99 -657 -110
948 -110 1191 -36 -242 810 1023 -675 -481 1029 -840 -1342 370 404 -863 27 1414 46 -690
965 -690 810 884 -1084 -630 544 -620 -1501 576 768 -688 359 1206 395 -936 623 713 -1326 -633
983 -633 726 -563 -1126 431 802 -699 76 1224 370 -858 230 531 -808 -582 781 -268 -1030
1000 -1030 534 994 -228 -608 993 199 -934 68 693 -751 -938 830 431 -976 465 1214 -190
1017 -190 -432 1109 517 -1202 -77 606 -575 -1203 867 529 -998 297 1369 -94 -768 975 106
1034A06j516J100J048j431JJ630l34j354R29R98j669l45J468j18j536Q99Q03j023
1052c44m2R30L1j053O60N86j081n54J038J89j134K71R56o84o25J474J45j233J51
1071c19J142r11q56R97N10j270K59J227p39r61J564K52j271o4J190o79j036J138
1089A73K92j306K08J577p64j094J502K53j407J08J182q95p89J107L85j257J53
1106e72J382m52p41N71N41j178N5Q45m04r30Q61L86q51M8J077j79q50K60Q30q76
1126a77l79J121l22q99K86J071j057l68J231k7j054M37Q97r29p09J196J70j340
1144h52O81Q22o42q54J596n5j509O28R12q59o13J449l04j138O34Q70q08n48Q68
1163B78N2r46L17P89o88n91J166K7j063M97P72p01m49R46o2j093M27R46m45q28
$$ plain form
1034 106 -1410 -310 738 -693 -692 938 604 -750 179 1177 -492 -837 631 513 -1023 -124 679 -344
1052 -344 -386 544 575 -478 182 768 -313 -867 171 360 -774 -503 453 -231 -856 618 763 -470 -319
1071 -319 823 -88 -944 53 563 -707 -448 779 40 -921 643 895 -376 -440 750 71 -965 173
1089 173 465 -841 -633 944 180 -914 588 841 -566 -458 724 -171 -960 147 532 -725 -572
1106 -572 810 358 -383 188 729 -449 -394 451 47 -883 -22 364 -487 -439 638 459 -391 -131 699 -177
1126 -177 -556 565 243 -656 -370 701 -356 -724 507 480 -574 -137 760 -169 -878 318 488 -852
1144 -852 -171 651 9 -845 751 696 -813 -185 727 -132 -745 704 400 -738 -104 766 -42 -590 278
1163 278 330 -616 -299 490 -198 -789 377 404 -659 -162 610 -91 -540 406 344 -749 -322 624 179 -649
1183f49R48L92j486L39R21m08q26Q25N79o96o30J042j2j092P59O65j026k87J132
1202D90k79j023R03P49j191k33J235l30j332J050O50j009k47J156m77r13P87N55
1220E41j012m0Q36k67o06O83O47j337J15P12o8q95N44P31p44q8O58r0j126N36
1240b70P89o88k90P02J80o71L91L11m99n77N42N57j205M50M70q0m81P96P4q98
1260c97L8J193o88n72O54L08j013n8J016m91q45Q56N79r16o7J171o46o34O46L95
1280E29j163Q2J368p65n49O50N12r36k8Q57o69l55K93M79n87k97J018j88n02N39
1300B88K39p45j37N99K75r87J80N18m89l25R06J10o71K15P43p91n25O67M27j240
1320g43L48R82p45l20O61L46j338O60O14m20r01R32M02j086K87P86n35n06J263
$$ plain form
1183 -649 299 691 -795 -456 465 57 -769 56 635 -61 -691 351 339 -753 6 671 -355 -642 490
1202 490 211 -812 91 840 -351 -584 651 321 -1011 39 689 -320 -567 589 112 -801 -14 541
1220 541 -471 -511 325 58 -548 135 782 -555 -440 272 204 -691 -147 584 -160 -248 410 320 -806 -270
1240 -270 519 -169 -459 243 423 -248 143 454 -45 -622 -80 477 -728 -278 192 112 -369 427 501 -397
1260 -397 -359 834 146 -426 228 536 -477 -535 481 -10 -855 1 580 -336 -403 768 122 -512 134 529
1280 529 -634 -552 816 51 -498 152 664 -272 -300 557 -112 -467 -174 305 -282 -579 439 251 -251 288
1300 288 527 -218 -355 244 519 -468 -288 230 -259 -584 322 432 -239 -24 719 -72 -597 70 497 -743
1320 -743 -395 587 -158 -478 183 529 -809 -149 465 45 -856 76 478 -608 -321 465 -70 -576 687
1339F87j63q48K09M49m10l25N89P3q69J35Q18m61k67M61L92q05K51M41n48j01
1359b92L76Km80K23P16l76n28N27M17o52l18P67j65q14N54L85n11k9O98k6q27
1380c53N57N36j030RR13o84o97O97M17m07l84J228l37r37N25M59p77k41P58k69
1400a7n97O85M03p50j44J070j03j097N76L74m60n30N67j3n29L88N58o11L26p0
1420B6J72j58j83K02k01k79L90L16m77K5M89j63m39N16m2l14k39O77n21m16N08
1441a11N77o61k00J178l71n93N25Q1r18O1Q89n54m41L88N81l57k83N76r9m12L07
1462A63J83r10J50P95l08l57J39N60o61L13N40j01o97J08L75o65j02Q27j91o01
1482d40L49N16l23j18K95m9n83K53L90m78o41Q45L44n64J51O19m40l77O80j28
$$ plain form
1339 687 524 -324 -115 334 -76 -401 188 261 -608 -473 345 -116 -383 78 470 -335 -84 357 -191 -292
1359 -292 84 86 -394 -171 545 169 -359 168 585 -67 -385 382 217 -597 -43 342 -169 -198 500 474 -353
1380 -353 204 740 -290 -281 632 -52 -749 -52 365 -42 -426 802 465 -472 53 512 -265 -506 252 -17
1400 -17 -614 71 474 -276 -420 650 547 -550 26 400 -60 -590 -23 -36 -565 -177 381 -230 96 26
1420 26 198 40 -143 59 -142 -421 -31 285 -192 -167 322 159 -280 236 194 -120 -359 318 -203 -619 -111
1441 -111 466 -195 -395 783 412 -181 344 425 -493 -432 457 -97 -538 -150 431 74 -209 367 268 -144 163
1462 163 346 -564 -414 381 73 -284 -145 415 -246 67 607 506 -191 -83 292 -373 -475 352 161 -440
1482 -440 -91 425 102 -16 279 230 -353 -100 290 -188 -829 16 360 -204 -53 566 126 -251 429 301
1502C01o61K89L7j79n21J071n1l18J29M11l98j71K30l7o76K23N88n18q0N65L33
1523E67n64K10J45k47n69O79k26l03K74M90p03J76L56K39o72J86N47m20m22K37
1543b0J49o04J16J75J30k49K12N07k64k89K39k5l98K50L12n07q4O70j66l06K12
1564F0O07p57r2L95m31j04L17Q8n51J1P33O9o72P23%m15j52M57Lp56M71P1k08
1587a33n8N90j98l84K71K78m71j99J41L56q03N89J05p1k8J60Jj57kL21l88k91
1609c71K74L0j47l56O83J00l25N16pm86j31L69m20p2J39M09n51Q1P02q0p42Q04
1631D19k18m91QK57jl92K47L02k20J20K58j64k48L53p8j45Lj4j18o11P07J17k14
1654a23M0L46J39j15M1l2n42J62j67J4k88L17M98j81q5L52k12j51m2K98l85j18
$$ plain form
1502 301 -360 -71 -34 -213 -734 337 286 -32 97 508 110 -61 169 132 -544 -321 267 -251 -331 234 567
1523 567 3 213 358 111 -458 221 -5 -308 -34 456 -247 -71 285 524 -148 38 585 165 -257 -20
1543 -20 129 -475 -359 -184 -54 -303 -91 416 152 -137 102 77 -321 -71 241 -266 -350 320 154 -152 60
1564 60 667 -90 -182 213 -218 -322 -5 83 -468 -457 276 345 -327 396 396 -19 -171 286 289 -467 4 75 -133
1587 -133 -191 399 201 -183 88 366 -105 -304 -163 193 -610 -21 84 13 -15 145 146 -11 -13 308 -80 -371
1609 -371 -97 -67 -214 -570 113 213 -112 404 397 -89 -220 149 -271 -343 -204 205 -346 -265 437 357 -385 419
1631 419 201 -290 -282 -25 -26 -418 -171 131 -89 31 289 125 -123 230 152 7 10 -4 -122 -733 -26 91 -123
1654 -123 -83 263 402 287 328 296 -246 -84 -251 -237 -525 -208 290 109 24 376 164 13 -29 269 -116 -234
1676b34K47Q2m71J55P15l04l60M58K51p78K34l7j71j72K9K97m12L73M11r9k35
1697b1K48J24l96l30N49k86l25N15Ql29K78M12l16k39M66l74l40J40J17j50n2
1718c01K36M5j23K78Q8J27m22K39J59n07k45L74q7j68L82M94n02n4K75M9n12K86
1740A11j86k65k4M97M7n81L11M88n58O6M29k11o79M32M1j63pJ44R7j11P9M74k77
1763A54l67P83o99j78K16q3k14Q3M88j98P9j10L91l02j74M84k95k18m20Q26k45
1784Ak55L45J41j84Q5J09j02l00J76k3l38K52J63N1n70N87L11l92KJ67n9n29M11
1807D9J92n43J43J57P6k36J86O18n55l3J85n40j49K88J72k43j57N98j76j53M08
1828B87J21m00k31L80j90m10L54K62j63k68K23J6j79L70N8K3l15K93q5m18K91
$$ plain form
1676 -234 13 95 -376 -221 494 190 -170 288 539 -239 -5 -42 -213 -385 -356 -59 -471 -98 313 214 -21
1697 -21 227 351 -45 -375 174 -112 -437 78 86 -243 35 447 131 -108 358 -16 -356 -216 -99 -249 -301
1718 -301 -65 -20 -143 135 223 350 -72 167 326 -181 -426 -52 -139 -307 75 569 67 13 288 337 -175 111
1740 111 -75 -340 -364 133 180 -401 -90 398 -160 -94 335 124 -555 -123 -82 -245 -252 -108 -11 -122 -43 431 154
1763 154 -213 570 -129 -307 -91 -174 -388 -305 183 -15 64 -46 345 43 -131 353 58 -160 -580 246 1
1784 1 -254 91 232 48 133 242 140 -160 16 -7 -345 -93 70 121 -449 138 449 57 59 226 167 -362 49
1807 49 241 -302 -159 -2 74 -162 24 642 87 54 239 -301 -450 -162 10 -233 -390 208 32 -121 287
1828 287 408 8 -223 157 -33 -443 -89 173 10 -258 -35 -19 -198 172 230 253 -62 231 146 -272 19
1849A9J84k54m00N05Q8p2r9P6R6m48K00J53l23j24L74o9k1P5L12m95M09O2j57
1872I1k65K68j65k90K31L22m9k55O2M83l29M2N7m7n57L15J54l62K15M61j58j76
1894D8L54j78k56j35L50l46J8L0J26k55J70K78k63J82M0%J2k71N7k0j78Q6K63
1917A12O1m32M56L31o34L05J48l00p7K46k03m04M27nj2L2q4N25p47K28O1q3k33
1940b82L89o8l25L50O9j12N4K17j39j89j08K5R7K41j47J00k61O0K09j52j09K25
1962A44J06j89l24J91K67m81L24K5k23L7L10J49l96j02L48l27j21J27N7l31K24
1983a85M35q7j49M04l71l07M63p1m55J1K78J58l26K11K7l6J37J56J2m98L95k38
2005c6J11l68K60R4k64P0L86l86K14Q4k02r1MK12l03J26M6j48J35k3M3L20n07
$$ plain form
1849 19 203 -51 -451 54 142 70 -29 47 143 -305 -105 48 -275 -399 -25 -94 -115 -40 272 -223 186 248 91
1872 91 -174 94 -71 -361 -130 192 143 -112 -50 433 104 146 203 156 -401 -86 68 -294 -79 382 224 48
1894 48 402 224 -32 -167 183 -163 -145 -115 11 -244 -74 204 -59 123 163 163 175 -96 -39 -59 -237 -151 112
1917 112 173 -259 197 528 -106 199 347 47 -30 216 13 -391 36 31 19 51 -33 492 -255 -27 34 -49 -282
1940 -282 107 39 -286 64 133 21 75 292 153 -36 -144 -119 -22 219 72 172 -89 -29 180 28 -81 144
1962 144 250 61 -263 -72 195 -286 38 63 -160 -123 187 336 -60 -162 186 -141 -262 -135 -78 -409 -185
1983 -185 250 163 14 418 47 -260 203 132 -323 -312 -34 124 -202 9 36 0 137 293 305 -193 202 -36
2005 -36 75 -293 -33 61 -203 -133 253 -133 81 165 -37 -128 -124 88 -215 -89 -43 -191 -56 -79 -36 284 -223
2028b23N03l8l13j39K00l4N6m5p4nM8M32k52L0j34j5m0Q3j06J40k22J11K95m41
2052a83M20J20j24l31M18j91j12k22K62l81J11j2L96j39n6J03k7n76L97J99j25
2073e3j05P9K65j53K43k23n5j22J57n3k64K93K17k89P9m09J58J38J08J81j68J33
2095A57J85l23l09J67P6l2k63L94K44k35J33j08j50J34o5J19l45K28O6n4l24N83
2117B78k12J53j45J23j57k13J14L0j64J1J85Lp2K11r8k94L22k9l22j39O01j04
2139H2M3l22N85l62j56K00j3P9q1p3p4RJ00j55k1k2K56O8k75L26J23j52R8M8j22
2164A89k68o7J22m39J52M13j63O4o3N15l65l5M4j38l47L19K12j04N0K94l60q2
2186e7K77k83J7N0J17n7K0J0l42N02j76r0o4O8m5K42l62J96j50L33j25n2lJ03
$$ plain form
2028 -223 280 242 -71 -210 -10 -44 12 -33 -107 -112 -64 368 116 146 12 -3 -43 40 -66 74 -148 -37 258 -183
2052 -183 237 357 233 -98 320 129 17 -205 57 -324 -213 -225 171 32 -24 79 52 -524 -127 72 -53
2073 -53 -158 -79 186 33 276 53 -2 -124 33 -20 -284 9 226 -63 16 -393 -235 -97 11 192 24 157
2095 157 342 19 -290 -123 -47 -79 -342 52 296 61 194 86 -64 70 5 124 -221 7 73 19 -305 278
2117 278 66 219 74 197 40 -173 -59 -29 -193 -182 3 6 -66 145 47 -247 75 46 -276 -415 186 82
2139 82 125 -197 388 26 -130 70 57 136 55 -18 -92 -83 17 -138 -159 -181 75 143 -132 194 317 165 263 311 189
2164 189 -79 -146 -24 -463 -311 102 -61 3 -60 455 90 55 99 -39 -386 -67 145 41 91 385 25 -57
2186 -57 220 -63 -46 4 121 64 84 94 -248 254 78 -12 -76 -8 -53 189 -173 23 -127 206 81 29 26 129
2210A29j81J02K8o9l23J14K68k31J06Q1O2p1N1j94R4j27K65j09k71L50k0o7K11
2233A98j99J71k0j51l5j30L6J44J84k94M10l67m9Om6Q2j64L16j45L52l88m2J93
2256F2j25J10j37J46m6k43J71j40K19L07n10%J93l04K54J94l43J16K92l12N0k3
2278f9K13k75k46L42J83k48J34j56K20j13K8J5l03L57M5j14n8o8J17L4j73J61
2300B6J23k90L9J20j35q6L12j40m8J68k3Mj20N3K32m25j7N60l28N2J45l5k56J12
2324D3j0j22q0J37K8n5Pj64K54l28K50J87J12k83Q2O5k14J99j82J22j07L11l32
2347h0k09L83r6J37k85L7j32J29j10K30J27k39o1J56l08J34J85j58K46l2l49j18
2369d13K10K10jJ0L18N5n12p0J05p5L39k86P4j72L08j6N9l61K85o3J7k4j1R9o6
$$ plain form
2210 129 -52 50 78 9 -314 -200 68 -163 -57 24 86 15 66 -128 -34 -161 104 -5 -276 74 54 -13 198
2233 198 -1 170 150 -1 -36 -166 -130 14 198 -96 314 -53 -102 -96 -142 -60 -224 92 -53 299 -89 -131 62
2256 62 -63 47 -90 56 10 -233 -62 -202 17 324 -186 -186 7 -297 -43 151 -192 -76 216 -96 -46 -69
2278 -69 144 -131 -377 -35 148 -100 34 -122 98 -15 13 28 -275 82 127 13 -45 -113 4 38 -135 26
2300 26 149 -141 -102 18 -117 -203 109 -31 -79 89 66 70 -50 3 235 -190 -207 353 25 77 222 187 -69 43
2324 43 33 -89 -169 -32 -4 -59 -52 -216 38 -290 -40 147 259 -24 58 123 -91 108 -74 48 -59 252 -80
2347 -80 -289 94 -2 135 -150 -113 -245 -116 -226 4 131 -108 -169 -13 -321 -187 -2 -160 86 54 -295 -413
2369 -413 -203 7 6 16 334 389 -123 -193 -88 -163 176 -110 -36 -208 100 84 143 -218 67 4 21 -3 -14 85 19
2394A9k42K07j92J29J79RJ12l14K45r0K1k29J39PJ97j0m45K68K64k36J31k22O8
2417A5p6M7J73k66q1J40p6j42M28k48K67nj06m5L5j87L86k23k82K65q2K27r2L6
2441A08J80m24j5P2J84p4J05k39r2K62P4j56j65L69p5j59j39K59j96k23K34K09
2463I9m33K02J13Q3P7K4k58l6P7K71r6l66M85m8l98P7J45j80K57k80N03n24J30
2486g6L2m8j53Q2J57k0Rr7K60l40J51r9j16L22j32k6J56j23p3kL9J64l8L4rN1
2512A05k31l3qK51o1K6j98L41j66o9J41j93K42l8j03l15K90j65O3K87p0q5J14
2535A25J22k72J41j1m3k47Q6j08L18q8r9L13k18J38R4k16l5j26k0q0J11Q4p8L12
2559B03N7l06J14j56R4J70l60P1J11j44P5Rl0N4j09K90j12m7J69j88l6J1J61p1
$$ plain form
2394 19 -223 -16 -208 -79 100 109 221 -93 152 62 83 -146 -7 0 197 187 -258 10 274 38 169 -53 15
2417 15 -61 -14 159 -107 -188 -48 -124 -266 162 -86 181 176 70 25 60 -127 259 36 -246 19 -63 164 72 108
2441 108 288 -136 -151 -79 105 31 136 -103 -195 67 141 -15 -180 189 114 -45 -184 75 -121 -344 -110 99
2463 99 -334 -132 -19 64 141 165 -93 -129 -52 219 123 -243 242 194 -204 -127 18 -162 95 -185 318 -206 -76
2486 -76 -44 -92 -245 -163 -6 -26 -17 -114 146 -194 -43 -142 -258 64 -68 -94 62 -61 -134 -136 -97 67 29 63 54 105
2512 105 -126 -159 -167 84 23 49 -149 192 26 -43 98 -95 147 109 6 -309 -19 -184 -121 166 96 11 125
2535 125 247 -25 116 105 62 -185 -99 -207 111 23 -76 237 19 157 251 35 0 -126 -146 -226 -115 -31 -109 203
2559 203 260 -46 68 -88 6 176 -184 -113 -2 -146 -71 -62 -92 -38 -147 143 31 -16 153 -35 -71 -60 101 30
2583C0j02J5J13p9o9L00j56j26j36P8J47r5j1K2j8k0M76m96M67k28N3m37K51L8
2607A7k61J72r5j3K70m4K6L09m12K32j39k05J13L02n93J65L02k86K34K4P6j30
2629F4j32K2j61K03j74pJ76Nj27K39J80j47m3j28K41k46L92l69j32J22K3K9J63
2652A93j64%kM9p8J0o6P6k78K20oj32L95m4j99L04o2N6l04k87J65M2n1p4N0L08
2678A21R6q2K91l04j25L4k82L15r6J01j21K4J31M7J25l05J58k82L11j89j70O2
2700a40j18K47J98l61L51j03k00K59j32ml4K24k70L4pl45J99Q2M1M00l41o6J21
2723C5q3J99l29j32L82m9j6k2k54K87Q0L1j24L6l16KK95j18k3K39j7J5K07j77
2747A48j38q0J2l0k37J96J24L5J95j86J1j70L44k90J21R2k92J57m2M2o0k18J89
$$ plain form
2583 30 -72 -57 56 -23 -92 208 52 -74 -210 -132 15 -80 -91 -69 -87 -107 369 -127 340 112 165 -272 -21 17
2607 17 -244 -72 -167 -180 90 46 72 381 -31 201 62 -143 -30 272 -321 -156 146 -140 94 118 194 64
2629 64 -68 -46 -207 -4 -178 -185 -9 -4 -131 108 288 141 98 -30 211 -35 357 -12 -144 -22 1 30 193
2652 193 29 29 27 76 -2 8 -58 18 -260 -40 -46 -178 217 173 -26 278 216 272 -32 -319 -154 -112 -163 -237 -187 121
2678 121 217 135 426 122 -3 31 -251 64 -32 69 -52 -28 103 150 275 -30 128 -154 157 -32 -202 -140
2700 -140 -258 -11 187 -174 177 74 -126 133 1 -3 -37 187 -83 -49 -56 -401 -202 -120 -79 321 -20 -86 35
2723 35 -48 151 -178 -310 72 23 7 -15 -269 18 98 129 5 41 -275 -273 22 -96 -119 120 103 118 325 148
2747 148 10 -70 -58 -88 -325 -129 -5 30 225 39 50 -120 224 -66 55 147 -145 12 -30 12 -48 -266 -77
2770g7Q4O6m8m4k10K57j89J8K72j28l21J81J93k55k4L23j22J96j73L1l46P1J41
2793a04p4k69K29K93r4N1k4J8J03j69l6l8J13l31J55k1K91o5K55j9j05j87J71
2816A43j49J60p1l13P7J66O5j08K21k14M21p24L30o0N7J88j80l34K32K16j20K6
2838B9J52l02J63J32L2n20K97J20j67Q4j10J01L7K1j8J90k11k04M4J02J45j72
2860e5k21M36J01%k16J63j11O9k83M7r5q1K63J30r3L2N4J07m6l5J18l33k48J85
2884a12o6M5P9q3J17Q0j19J29J60k15RN1j03J58j32n5j56L6J14L28l83J30k5j60
2908a73L61l73K2Q6jJ27j67J21J47J20j37j12n7K32j98J7k04k94J83R5K81L03
2930C79k53R1j93J18j65l8L1LP6j56Q3M2r4K49M9k12J95r8j69l31J73l6p6M28
$$ plain form
2770 -77 7 73 25 -19 -229 28 -161 -143 129 1 -320 -139 54 -201 -225 98 -24 172 -1 30 -316 -245 -104
2793 -104 -178 -447 -218 75 -19 32 8 26 129 -40 -76 -114 -1 -332 -177 -198 93 28 283 264 159 -28 143
2816 143 -6 154 83 -230 -153 13 78 -30 191 -23 398 -326 4 -56 1 189 9 -325 -93 123 3 29
2838 29 181 -121 42 174 206 -314 -17 103 -64 20 -90 11 48 69 51 241 30 -174 -130 -28 117 -55
2860 -55 -276 160 261 261 45 208 97 166 -117 -70 -165 -246 17 147 54 86 140 247 201 166 284 -49 -297 -112
2884 -112 -178 -133 -54 -137 -20 60 -59 70 230 15 24 75 -28 130 -2 -57 -213 -177 -63 265 -118 12 -13 -173
2908 -173 188 -185 -163 -77 -78 49 -118 3 150 270 133 21 -36 196 -2 15 -189 -483 -300 -205 76 379
2930 379 126 217 24 142 -23 -61 -30 -27 49 -107 -24 18 -76 173 222 10 205 107 -62 -393 -220 -256 -332 96
2954I6LL06j52k55R8kO9o4j02l01L93j46l6K33j55l5q8J31K1J2l23m3O0J83K7
2979g0j92K24O6J65l12K10J02k17Jl6j39J99k2J4pK12L4o8j2k28J59K8k50j76
3003c15J59J97j34%Q1J13P3j25n1N9K5j21qq2M7j40K94j77J49o6N7K11l05r2R
3028a42J4j02Q2J21j31k1P9K17J36q3k90J74j44j00K26j01r4n0J59L4L5K09QR9
3052C35k07k07k52J50K60k06J22K1j39M08m8j17L9l83J19Lk66P4J50K3R3M3J48
3075A63Lk70K04j23j45%K11k7j19K28j77j44M72KP5k72k69K20n9m3j50O6J05J6
3099c3Q2P8j44K90k12R0l60L11j57k92K66j52N70j91k8J17m7j22J13l89L37k2
3121A05k79L3J61m71J24M62J24j70L0j90q4L4O4M2m14K02J9J75K24m07M15n1k57
$$ plain form
2954 96 99 405 253 -2 96 94 163 99 -3 -304 89 -57 -93 140 -15 -50 -138 -7 14 26 -297 -340 -280 -97 -70
2979 -70 -262 -38 28 193 -119 91 193 -24 -23 -59 -198 1 -21 -7 -14 198 232 164 152 -76 83 111 -139 -315
3003 -315 -156 41 -93 -93 -12 101 174 49 -2 57 82 -39 -47 -129 -82 -222 72 -105 44 -22 35 246 -59 -151 -142
3028 -142 -128 -230 -148 -27 -158 -179 -100 117 253 170 -120 54 -90 -190 36 -65 -159 -209 -50 -16 19 228 236 335
3052 335 128 -79 -331 -181 79 -127 -5 16 -123 285 237 120 159 -224 -105 -102 -368 -294 -144 -121 -28 15 163
3075 163 166 -104 100 -23 -168 -168 43 16 -103 125 -52 -196 276 278 353 81 -188 32 -27 -70 -220 -154 -49 -33
3099 -33 49 127 -17 273 61 151 -209 102 -55 -347 -81 -233 337 146 118 235 188 66 179 -210 127 105
3121 105 -174 -141 20 -451 -327 135 259 89 119 -71 -155 -121 -57 -15 -429 -227 -208 -33 191 -216 199 148 -109
3144a09J45j75M9lP0m2Q4m2K80m90M19J26k21M1j99p7k2P4n3M0nJ40n2j56L84
3169B06j4j3n6j48q4P9p1K90k26N1J18J5J66j7k41O5j60M1j24n02N94j49l1M54
3193B43j86Q3l92J75K09l91J84r6J1J15j32kr7J41K05J52nj31J2RK5l46K92k4
3217E4K4Q9l38J89J06Jj53J31M0J4l18R3K7j48L70J00l71J68l3k82K71k43m9K65
3241Gk36O2N9p5J73J12j46N5R3N0m02O2J41J98j34J09l3LP1Q2p9r6O3k14j79J77
3267g7n0k65M21o2K3L97m22M5m8K60l79L61j94m4o5J65j90P5l2J90j34n9J32J67
3291B15k80j49K06J18N2o1O4j51q9K47k90J37L7q4K2j23K09j34J65O0M9k12N0
3314E8j35j91J08R8J04J03k00k17K79R2Rp9R3j2K44l47p6P2j06K11K6k25J21l32
$$ plain form
3144 -109 36 -139 -90 -93 -23 -65 19 -23 257 -233 186 312 91 132 -67 -144 -166 -92 -145 -105 -110 30 -22 -178 206
3169 206 192 179 123 -25 -109 -30 -101 189 -37 14 132 147 313 296 55 120 -40 1 -123 -625 -31 -180 -211 243
3193 243 57 140 -252 -77 132 -259 -75 -171 -160 -45 -177 -179 -276 -135 70 222 217 86 98 107 132 -214 78 54
3217 54 78 167 -171 18 124 125 -28 103 143 157 -161 -68 -41 -189 181 281 -90 78 45 -237 34 -209 -258 7
3241 7 -229 -167 -108 -183 -10 102 -44 11 104 154 -248 -186 -45 153 19 128 95 98 169 251 172 76 139 -75 -254 -77
3267 -77 -127 -392 29 -33 -10 387 -35 10 -38 222 -157 204 10 -34 -99 66 -124 -49 -81 109 -25 -84 48 215
3291 215 -65 -214 -8 110 162 101 165 14 -75 172 -118 19 56 -28 -6 -129 80 -54 111 171 220 8 58
3314 58 -77 -268 -160 -62 42 145 -55 -272 7 99 108 29 122 110 354 7 -69 3 -103 108 134 -91 30 -302
3338c02M47n7k2o4L1j69K19n9j80K18p6J57k47N2J48O5j47r6J06l5j19Q0L5j89
3362b04J24j86N65j70K16k71R4l72J97M0n3j17m7N2Q7J15J79o2k66J69k67L78
3384B01j91k22L3l8L63j87N8j96K40Oj89J2k36M47l40J90R6k10L21j30J85j27
3406H6K31Ql66J81k02pJ42k93K13j28RL29pj8l90J73J21j43r3K47k30R8J50q7
3430B4L7n6J5j32K30k91l8K01r4q5K16k81K24L74l62L0j25M8J49k46J38J59j97
3453f2J3L1K23k31L26l31l7K77M3l93mL16m31J35j68J35N0M14k85j20K9K24l11
3476a57j99O23l31J05k21J31m5P7oo2J61n1k18l0j4K54K02m53J54N7o3P5M03k09
3500A83K11l78j25Q9j22J70J32m0j60Lk7K51q9j94K6K20m4q1j76K16j95j65J80
$$ plain form
3338 -302 145 88 66 2 33 -136 83 24 -156 62 -14 143 -104 -52 96 161 14 -82 24 -11 -130 -50 -15 -204
3362 -204 -80 -266 299 129 345 74 168 -204 -7 33 -20 -137 -184 -132 -45 70 249 187 -79 90 -177 201
3384 201 10 -212 -179 -217 146 -41 17 -179 61 67 -122 -110 -346 101 -239 -49 47 -163 158 28 213 86
3406 86 317 325 -41 140 -62 -69 73 -220 -7 -135 -126 203 196 178 -212 -39 82 -61 -154 93 -137 -39 111 24
3430 24 61 5 20 -112 118 -173 -211 -10 -104 -189 27 -254 -30 344 -18 12 -113 -65 84 -162 -24 135 -62
3453 -62 -49 -18 205 -26 300 -31 -68 209 252 -141 -145 171 -260 -125 -293 -158 -108 306 21 -99 -70 154 -157
3476 -157 -356 267 -64 41 -180 -49 -94 -17 -23 -85 76 25 -193 -223 -237 17 219 -234 -80 -23 -86 -11 392 183
3500 183 394 16 -109 -20 -142 28 160 120 -40 -37 -64 187 98 -96 -70 150 106 25 -151 65 -130 -295 -115
3523a15J64j60rJ19N9j50J71nj41j55J38J62k36J15Q1q6K30l77K75k58O6j19M2
3546a89K83J43l37Q0J61k52N5l0J97K2k90n8K3L67k8j90J16n6m9j47K51k03L35
3569B04m16K81m7j32P1Q0l8J65j33J73j72O7k06J28K1Pp8j85K46PK1M3j01J89
3593A95k99k8K13k29K63j77Q2j38J75o4J62l1n9N8n7R2M6n08M31l60K06K54k69
3616d2J91m50J5K35O7j70N6O2j86K4K77Pr9K08r6j80K34k24K64l73J95k0k48L37
3640H4k48K7K17m7J77l03L55k22j69o8J74P1k50K02M3J5N1j99J00J53m27K05J3
3663d6j30P3L8Q1P3j58K01j78J90M8l70J73k22K66k30M81q2m11k6J69K27j70J44
3686A41o6O8k35J38k9J90m39L35K8M7m02K87K50l14j16J4N9j2M5KQ4p1j22p2L0
$$ plain form
3523 -115 49 -111 -120 -1 58 -92 79 74 -67 -222 -84 78 -158 -43 38 -48 182 -195 80 -178 -112 -231 -189
3546 -189 94 237 -100 -20 141 -111 -56 -86 111 133 -157 -215 -192 175 147 -43 73 17 -32 -179 72 -131 204
3569 204 -212 69 22 -110 -39 41 3 168 35 208 36 103 -103 25 46 53 -25 -210 36 43 64 107 6 195
3593 195 -104 -132 81 -148 115 -62 20 -118 57 -7 155 124 65 123 66 158 204 -304 127 -233 -27 227 -42
3616 -42 149 -301 -286 -51 16 -154 -98 -36 -222 -198 79 86 -13 195 99 -81 153 -71 193 -180 15 -5 -253 84
3640 84 -164 -137 80 33 210 -93 262 40 -129 -197 -23 48 -202 0 43 58 109 -90 10 163 -264 -59 -46
3663 -46 -176 -103 -65 16 89 -69 132 -46 144 192 -178 -5 -227 39 -191 290 208 -203 -229 -60 167 -3 141
3686 141 75 143 -92 46 17 207 -232 103 131 178 -224 63 313 -1 -117 -103 -44 -56 -11 -9 75 4 -118 -190 -160
3711a60J67j63j01O5J90r3K5J73j01O7k63Q1M07l03j40j69L60j57J50j10l9K45
3733A31L6j49j87J94l37K77Q2q4j98p3K09k92K88K69k58J27j57L94l45O4q9K15
3755A17j70J16k4j8J7lk04J2Q9J95J42l63L21l98J5J72K8j15j41K47K9MJ12j35
3779D5l4o8l75M80N2k5k25K51p0k29O3J26o4J37j65J40m1j65R7r4K16K12j42k11
3803h9ko3J54J52j28j09k8K33j43O7j30O2p8Q2LJ9l29J33K60q5RJ31J12q7j43
3828Cl6J96j45j54l6j85M18j93O7O6j31J08J68N6m9k21K63m26L53n5j17L0%K7
3852Gj38K44j7m4j59L25k79J2o7j21L10j2J37m7k15P4r7mK36j41n4k8P2n3q5K80
3878A36j19j65J09P1J12l35J69L4j93J8J65K41o2k22O6J42P9l67K58J39j46k03
$$ plain form
3711 -160 7 -156 -257 -192 -2 -95 -70 103 2 69 -194 -113 294 -9 -149 -318 42 -115 35 -75 -114 131
3733 131 167 18 -169 25 -312 -35 47 -37 -235 -308 -99 -391 -103 166 -92 35 -122 272 -73 -9 -98 117
3755 117 -53 63 39 21 38 35 -169 -157 -68 127 269 -94 227 -171 -156 16 44 -71 -212 35 64 68 180 45
3779 45 11 -57 -432 48 100 75 -150 101 31 -198 -135 -9 -73 64 -101 39 -2 -167 -70 -164 52 264 122 -89
3803 -89 -91 -154 0 152 24 -85 -113 120 -23 44 -86 -24 -102 -20 -17 2 -327 -194 66 -19 -10 121 233 146 3
3828 3 -33 163 18 -136 -172 -357 61 -132 -65 1 -130 -22 146 202 153 -68 195 -231 122 67 -50 -20 -20 7
3852 7 -131 113 96 52 -107 218 -61 -49 -116 -237 73 61 198 151 -64 10 -87 -91 145 4 -50 -78 -6 -59 -144 136
3878 136 17 -148 -39 32 144 -191 -22 12 -181 -163 2 243 181 -41 25 167 246 -121 137 276 130 -73
3900g3j62J76K05j72k4L53m08J31K53n75K12K09l14O3M3K14k03J80r8J00J54l0
$$ plain form
3900 -73 -235 -59 146 -26 -50 303 -105 26 279 -296 -84 125 -189 -126 -83 131 -72 108 10 110 264 234
$$ [...]
8191A18
##END NTUPLES=NMR FID
##END=
