##TITLE=1H_UK_23_4-3
 CD2Cl2
 108 sc, 
 26.09.2022
##JCAMPDX= 6.0         $$ Bruker NMR JCAMP-DX V2.0
##DATA TYPE= NMR FID
##DATA CLASS= NTUPLES
##ORIGIN= UXNMR, Bruker Analytische Messtechnik GmbH
##OWNER= root
$$ XWIN-NMR		Version 3.5
$$ Mon Sep 26 14:20:13 2022 Russian Standard Time (UT+4h)  she@DPX200
##.OBSERVE FREQUENCY= 200.1313499994
##.OBSERVE NUCLEUS= ^1H
##.DELAY= (6, 6)
##.ACQUISITION MODE= SIMULTANEOUS
##.ACQUISITION SCHEME= undefined
##.AVERAGES= 108
##.DIGITISER RES= 18
##SPECTROMETER/DATA SYSTEM= spect
##.PULSE SEQUENCE= zg30
##.SOLVENT NAME= CDCl3
##.SHIFT REFERENCE= (INTERNAL, CDCl3, 0, 15.7039)
##AUDIT TRAIL= $$ (NUMBER, WHEN, WHO, WHERE, WHAT)
$$ ##TITLE= Audit trail, XWIN-NMR		Version 3.5
$$ ##JCAMPDX= 5.01
$$ ##ORIGIN= Bruker BioSpin GmbH
$$ ##OWNER= she
$$ F:/spectra/data/she/nmr/H-F/1/audita.txt
$$ ##AUDIT TRAIL=  $$ (NUMBER, WHEN, WHO, WHERE, WHAT)
(   1,<2022-09-26 14:19:01.18 +0400>,<she>,<DPX200>,
      <continue with go, POWCHK disabled, PULCHK disabled
       configuration hash MD5:
       00 E9 B6 7A A2 85 ED C7 34 08 36 98 17 FE 4E 26
       data hash MD5: 16K
       0A 87 D7 9D 62 87 F3 F9 85 13 92 74 B4 D6 08 EB>)
$$ ##END=
$$ 
$$ hash MD5
$$ 54 C9 DE 2D 81 E2 76 06 3E 1E EA 14 DC 2F F7 BC
##$RELAX= 
##$RELAX= 
##$RELAX= 
##$RELAX= 
##$RELAX= 
##$RELAX= 
$$ Bruker specific parameters
$$ --------------------------
##$DU= <F:/spectra>
##$EXPNO= 1
##$NAME= <H-F>
##$PROCNO= 1
##$TYPE= <nmr>
##$USER= <she>
##$AMP= (0..31)
100 100 100 100 100 100 100 100 100 100 100 100 100 100 100 100 100 100 
100 100 100 100 100 100 100 100 100 100 100 100 100 100 
##$AQSEQ= 0
##$AQ_mod= 1
##$AUNM= <au_zg>
##$AUTOPOS= <>
##$BF1= 200.13
##$BF2= 200.13
##$BF3= 200.13
##$BF4= 200.13
##$BF5= 200.13
##$BF6= 200.13
##$BF7= 200.13
##$BF8= 200.13
##$BYTORDA= 1
##$CFDGTYP= 0
##$CFRGTYP= 5
##$CHEMSTR= <none>
##$CNST= (0..31)
1 1 145 1 1 1 1 1 1 1 1 1 1 1 1 1 1 1 1 1 1 1 1 1 1 1 1 1 1 1 1 1 
##$CPDPRG= <>
##$CPDPRG1= <>
##$CPDPRG2= <>
##$CPDPRG3= <>
##$CPDPRG4= <mlev>
##$CPDPRG5= <mlev>
##$CPDPRG6= <mlev>
##$CPDPRG7= <mlev>
##$CPDPRG8= <mlev>
##$CPDPRGB= <>
##$CPDPRGT= <>
##$D= (0..31)
0 1.2 0 0 0 0 0 0 0 0.06 0 0.03 0 0 0 0 0.0002 0 0 0 0 0 0 0 0 0 0 0 0 
0 0 0 
##$DATE= 1664187145
##$DBL= (0..7)
120 120 120 120 120 120 120 120 
##$DBP= (0..7)
150 150 150 150 150 150 150 150 
##$DBP07= 0
##$DBPNAM0= <>
##$DBPNAM1= <>
##$DBPNAM2= <>
##$DBPNAM3= <>
##$DBPNAM4= <>
##$DBPNAM5= <>
##$DBPNAM6= <>
##$DBPNAM7= <>
##$DBPOAL= (0..7)
0.5 0.5 0.5 0.5 0.5 0.5 0.5 0.5 
##$DBPOFFS= (0..7)
0 0 0 0 0 0 0 0 
##$DE= 6
##$DECBNUC= <off>
##$DECIM= 32
##$DECNUC= <off>
##$DECSTAT= 4
##$DIGMOD= 1
##$DIGTYP= 9
##$DL= (0..7)
0 120 120 120 120 120 120 120 
##$DP= (0..7)
150 150 150 150 150 150 150 150 
##$DP07= 0
##$DPNAME0= <>
##$DPNAME1= <>
##$DPNAME2= <>
##$DPNAME3= <>
##$DPNAME4= <>
##$DPNAME5= <>
##$DPNAME6= <>
##$DPNAME7= <>
##$DPOAL= (0..7)
0.5 0.5 0.5 0.5 0.5 0.5 0.5 0.5 
##$DPOFFS= (0..7)
0 0 0 0 0 0 0 0 
##$DQDMODE= 0
##$DR= 18
##$DS= 0
$$ [...]
##$SUBNAM2= <"">
##$SUBNAM3= <"">
##$SUBNAM4= <"">
##$SUBNAM5= <"">
##$SUBNAM6= <"">
##$SUBNAM7= <"">
##$SUBNAM8= <"">
##$SUBNAM9= <"">
##$SW= 18.0517283424941
##$SWIBOX= (0..15)
0 0 2 0 0 0 0 0 0 0 0 0 0 0 0 0 
##$SW_h= 3612.71676300578
##$TD= 16384
##$TD0= 1
##$TE= 0
##$TE2= 300
##$TE3= 300
##$TEG= 300
##$TL= (0..7)
0 120 120 120 120 120 120 120 
##$TP= (0..7)
150 150 150 150 150 150 150 150 
##$TP07= 0
##$TPNAME0= <>
##$TPNAME1= <>
##$TPNAME2= <>
##$TPNAME3= <>
##$TPNAME4= <>
##$TPNAME5= <>
##$TPNAME6= <>
##$TPNAME7= <>
##$TPOAL= (0..7)
0.5 0.5 0.5 0.5 0.5 0.5 0.5 0.5 
##$TPOFFS= (0..7)
0 0 0 0 0 0 0 0 
##$TUNHIN= 0
##$TUNHOUT= 0
##$TUNXOUT= 0
##$USERA1= <user>
##$USERA2= <user>
##$USERA3= <user>
##$USERA4= <user>
##$USERA5= <user>
##$V9= 5
##$VALIST= <valist>
##$VCLIST= <CCCCCCCCCCCCCCC>
##$VD= 0
##$VDLIST= <DDDDDDDDDDDDDDD>
##$VPLIST= <PPPPPPPPPPPPPPP>
##$VTLIST= <TTTTTTTTTTTTTTT>
##$WBST= 1024
##$WBSW= 4
##$XGAIN= (0..3)
0 0 0 0 
##$XL= 0
##$YL= 0
##$YMAX_a= 406132
##$YMIN_a= -489631
##$ZGOPTNS= <>
##$ZL1= 120
##$ZL2= 120
##$ZL3= 120
##$ZL4= 120
##$ABSF1= 10
##$ABSF2= 0
##$ABSG= 5
##$ABSL= 3
##$ALPHA= 0
##$AQORDER= 0
##$ASSFAC= 0
##$ASSFACI= 0
##$ASSFACX= 0
##$ASSWID= 0
##$AUNMP= <proc_1d>
##$AZFE= 0.1
##$AZFW= 0.1
##$BCFW= 1
##$BC_mod= 2
##$BYTORDP= 1
##$COROFFS= 0
##$CY= 11.3945322036743
##$DATMOD= 1
##$DC= 2
##$DFILT= <>
##$DTYPP= 0
##$F1P= 2.36226072786647
##$F2P= -0.459571619588291
##$FCOR= 0.5
##$FTSIZE= 0
##$FT_mod= 4
##$GAMMA= 1
##$GB= 0.15
##$INTBC= 1
##$INTSCL= 1
##$ISEN= 128
##$LB= 0.24
##$LEV0= 0
##$LPBIN= 0
##$MAXI= 10000
##$MC2= 0
##$MEAN= 0
##$ME_mod= 0
##$MI= 1.114404
##$NCOEF= 0
##$NC_proc= 0
##$NLEV= 6
##$NOISF1= 3.799351
##$NOISF2= 2.8
##$NSP= 1
##$NTH_PI= 0
##$NZP= 0
##$OFFSET= 15.70392
##$PC= 1
##$PHC0= -18033.29
##$PHC1= 16.60069
##$PH_mod= 1
##$PKNL= yes
##$PPARMOD= 0
##$PSCAL= 0
##$PSIGN= 0
##$REVERSE= no
##$SF= 200.130013532006
##$SI= 16384
##$SIGF1= 3
##$SIGF2= 2
##$SINO= 400
##$SIOLD= 16384
##$SREGLST= <1H.CDCl3>
##$SSB= 0
##$STSI= 0
##$STSR= 0
##$SW_p= 3612.71676300578
##$SYMM= 0
##$S_DEV= 0
##$TDeff= 0
##$TDoff= 0
##$TI= <>
##$TILT= no
##$TM1= 0
##$TM2= 0
##$TOPLEV= 0
##$USERP1= <user>
##$USERP2= <user>
##$USERP3= <user>
##$USERP4= <user>
##$USERP5= <user>
##$WDW= 1
##$XDIM= 8192
##$YMAX_p= 0
##$YMIN_p= 0
$$ End of Bruker specific parameters
$$ ---------------------------------
##NTUPLES= NMR FID
##VAR_NAME=  TIME,          FID/REAL,        FID/IMAG
##SYMBOL=    X,             R,               I
##VAR_TYPE=  INDEPENDENT,   DEPENDENT,       DEPENDENT
##VAR_FORM=  AFFN,          ASDF,            ASDF
##VAR_DIM=   8192,          8192,            8192
##UNITS=     SECONDS,       ARBITRARY UNITS, ARBITRARY UNITS
##FACTOR=    0.0002768,     1,               1
##FIRST=     0,             0,               0
##LAST=      2.2672688,     0,               0
##MIN=       0,             -489631,         0
##MAX=       2.2672688,     406132,          0
$$ Real data points
##PAGE= N=1
##DATA TABLE= (X++(R..R)), XYDATA
0@%%%%%%%%%%%%%%%%%%l0J38k16K16k16K16k18L24m30M33n10O16o58P64q77R87
$$ 0 0 0 0 0 0 0 0 0 0 0 0 0 0 0 0 0 0 0 -30 108 -108 108 -108 108 -110 214 -216 217 -293 323 -335 429 -448 539
34E39j138J260j418J612j808K009k233K486k757L053l382L736m122M551n013N524
$$ 539 -599 661 -757 855 -953 1056 -1177 1309 -1448 1605 -1777 1959 -2163 2388 -2625 2899
50B899o084O693p380Q143q990R942j1019J2253j3682J5353j7335J9741k2742K6599
$$ 2899 -3185 3508 -3872 4271 -4719 5223 -5796 6457 -7225 8128 -9207 10534 -12208 14391
64A4391l1764L9099n0341P0081j15263M53285j398k60927K45204k84679k20671
$$ 14391 -17373 21726 -28615 41466 -73797 379488 378090 117163 362367 77688 -142983
75a42983J19862J3718k90250Q8658J28297j59883p2917J83567q0963j56195R1209
$$ -142983 -23121 -9403 -299653 -210995 -82698 -242581 -315498 -131931 -212894 -369089 -277880
86b77880P7781j41800N1869K07656L0408p135K14553J19553o5853O2944J34036
$$ -277880 -200099 -341899 -290030 -82374 -51966 -59101 155452 275005 209152 272096 406132
97D06132j00480r9479O3938n2487j57566L1804M8929j04181k2434O8673p1233
$$ 406132 305652 206173 270111 217624 60058 91862 140791 36610 14176 82849 11616
108A1616r4663Q501m2268j11638l6569l595l6154l907N9332P6021O2812N8469
$$ 11616 -83047 -74546 -116814 -228452 -265021 -268616 -304770 -308677 -249345 -173324 -110512 -52043
120e2043Q3658O7191l055Q833N3844k0781n4958M2376K8394n5234K7035Q6598
$$ -52043 31615 98806 95751 104584 158428 137647 82689 125065 153459 98225 125260 211858
132B11858l2138m6341M9080l4594j31082l1656m051j21652p7669N3157j4858p3104
$$ 211858 179720 133379 182459 147865 16783 -14873 -18924 -140576 -218245 -165088 -179946 -253050
144b53050Q0352J01773m6040O379J21131k2752r3406P8471N2884j03805L0677
$$ -253050 -172698 -70925 -116965 -110586 10545 -12207 -105613 -27142 25742 -78063 -47386
155d7386J40658l6990k4641J61127L6782j02329O4771O2053j56348o8281P4991
$$ -47386 93272 56282 31641 192768 229550 127221 191992 254045 97697 29416 104407
166A04407r4683j30338P8937K9791j16855L0231J11966o9920o1240R1955j7309
$$ 104407 9724 -120614 -41677 -11886 -128741 -98510 13456 -56464 -117704 -25749 -43058
177d3058j23558K9408O2980p9738l362J31197J8905l0471J15433Q2208o3193J5034
$$ -43058 -166616 -137208 -74228 -153966 -157328 -26131 -7226 -37697 77736 159944 96751 111785
189A11785P8008p0584q2072M8762q527r0823K4744O4531m8797k0503O2729j7646
$$ 111785 189793 119209 37137 85899 77372 -13451 11293 75824 27027 6524 69253 51607
201E1607p3339J555n905p9507m1225K0963j3725k1439M9450N8017R601K5850O1830
$$ 51607 -21732 -20177 -26082 -105589 -146814 -125851 -139576 -161015 -111565 -53548 -43947 -18097 43733
214D3733J4556k5307J3865J8912m0041k3390L6172J1165k1986L7582N4712j9966
$$ 43733 58289 32982 46847 65759 25718 2328 38500 49665 27679 65261 119973 100007
226A00007k0475L2060k3654q0487j7020l214p4038l9079M2258m161l3201N9027
$$ 100007 79532 111592 87938 7451 -9569 -12783 -86821 -125900 -83642 -87803 -121004 -61977
238f1977N5739l7522N153O5507l4944o0170M7280J8570o7797K6337Q8297j7727
$$ -61977 -6238 -43760 -38607 26900 -8044 -68214 -20934 -2364 -70161 -43824 44473 26746
250B6746j0978R8378K2641o5234K8683L2667r0688m8845M4298m6073p6398N1794
$$ 26746 15768 114146 136787 71553 100236 132903 42215 -6630 37668 -8405 -84803 -33009
262c3009L4011o1076K0515P8182m2782n2204N3969r368r1772J4636M8313n1892
$$ -33009 1002 -60074 -39559 38623 -4159 -56363 -2394 -11762 -103534 -88898 -40585 -92477
274i2477p647R1795K0856k6494P0552N3249m8937n138M3380m6456o0133L1452
$$ -92477 -100124 -8329 12527 -13967 56585 109834 60897 55759 99139 52683 -7450 24002
286B4002N226n5426J8979N5772k3052j8917M7922l557o1007o037P045n8820l4930
$$ 24002 29228 -26198 -7219 48553 25501 6584 54506 50949 -10058 -16095 -9050 -67870 -102800
299a02800K8015O10k0180L9097M9820p71R414M3362Q31l4136N898Q650l6532j4593
$$ -102800 -74785 -74175 -94355 -55258 -5438 -6209 3205 46567 47398 13262 19160 27810 -8722 -23315
313b3315L3126R231j3363L4813M0419j9140j2032K5106k1603o1269p909K421n1609
$$ -23315 9811 19042 5679 40492 80911 61771 49739 74845 53242 -8027 -15936 -13515 -65124
326f5124k0498M2481R38k1092M5920L9016l2516r70L9797l2568m6766L0121R214
$$ -65124 -85622 -43141 -42203 -63295 -17375 21641 -10875 -11845 27952 -4616 -51382 -21261 -12047
339a2047m7494K5189O2807j3315l684O9432J1317n1582J8176K0411o8415l6171
$$ -12047 -59541 -34352 28455 15140 11456 80888 92205 40623 58799 79210 10795 -25376
351b5376L6439k7548m9234M4525L4183m0680J5826N6747l3981m1334L5608j1222
$$ -25376 11063 -16485 -65719 -21194 12989 -27691 -11865 44882 10901 -30433 5175 -6047
363f047o8031J1797L5877l7198j296P0356J4581k2672M8579L5347m3864j2740
$$ -6047 -74078 -62281 -26404 -63602 -64898 5458 20039 -2633 45946 81293 37429 24689
375B4689K9586l3632m5546K3659J0932l4404J7004M4867j2231j1723L1510m529
$$ 24689 54275 20643 -24903 -1244 9688 -24716 -7712 37155 24924 13201 44711 40182
387D0182m8779n085N319m3118k2756K6599M997j3319L1328M0656n337N43K8247
$$ 40182 -8597 -13682 -8363 -51481 -74237 -47638 -42641 -55960 -24632 16024 10687 11230 39477
400C9477m255l2818k034O963k4449j1334K7738J2125p948K4902L0653j5181j3023
$$ 39477 35222 2404 370 7333 -17116 -28450 -712 11413 3465 28367 59020 43839 30816
413C0816J6357j7404m7358k878O063l6302j0191M0921N227j8476L7321L0181l1229
$$ 30816 47173 29769 -17589 -20467 -14404 -50706 -60897 -19976 -14749 -33225 4096 34277 3048
426C048p117K8893k7206m2100K2586J1104l4761J7749N1731r063o014N0537M521
$$ 3048 -4069 24824 -2382 -44482 -21896 -10792 -45553 -27804 23927 14864 8850 59387 63908
439F3908m4389J0220J6661n5881k5169L5384j5926l5152M0610L3688l4297J0496
$$ 63908 19519 29739 46400 -9481 -34650 734 -15192 -50344 -9734 23954 -10343 153
451A53M4513k8669l6277K5329p016n4588J1188L0513k7267N84N6538P670k1136
$$ 153 44666 15997 -20280 5049 -1967 -56555 -45367 -14854 -42121 -41537 15001 22671 1535
464A535L4779K0970m0508j1602K5095l1151l3808K5746J2518k4979J7258L9975
$$ 1535 36314 57284 16776 5174 30269 -882 -34690 -8944 3574 -21405 -4147 35828
476C5828j0586j2584K6129p874l9273l158L217l1158j2190K3090K719o328K7038
$$ 35828 25242 12658 38787 30913 -8360 -11518 -8301 -39459 -51649 -28559 -25840 -32168 -5130
489e130K5728p950n38J6499j0351k5393k095L769j5148n166K2723J2547k134J6668
$$ -5130 20598 12648 12110 28609 18258 -7135 -9230 -5461 -20609 -25775 -3052 9495 7361 24029
503B4029K0919r842j3098O711j2503l5000l234O925k0136n551L1469Q067j2594
$$ 24029 44948 35106 22008 28719 16216 -18784 -22018 -15093 -35229 -40780 -9311 -1244 -13838
516a3838K4523K1963k7660j0385K0256k1636l4331J9087J3983k5212J3502M4203
$$ -13838 10685 32648 4988 -5397 14859 -6777 -41108 -22021 -8038 -33250 -19748 24455
528B4455m930j1071L5899M602m0092M493J4558m1796j9884L1491o633k7510L4488
$$ 24455 19525 8454 44353 48955 8863 13356 27914 -13882 -33766 -2275 -8908 -36418 -1930
541a930K9126k9523M989L6990k6546l5826K2569j050m6981R462L2411j8747k512
$$ -1930 27196 -2327 2662 39652 13106 -22720 -151 -1201 -48182 -38720 -6309 -25056 -27568
554b7568M7211O769k2345K4248J5911l7565j1566K1614k4472k6885K7464J2546
$$ -27568 19643 26412 4067 28315 44226 6661 -4905 16709 -7763 -34648 -7184 5362
566E362k2810J7086L4507j4748j2872K2021p178l6291K89O789k4481o994K5825
$$ 5362 -17448 -362 34145 19397 6525 28546 21368 -14923 -14634 -7845 -32326 -39320 -13495
579a3495K884o620K4788J6523j1983M91J1033j5623k0037K411P87j2546K452J9764
$$ -13495 -10611 -17231 7557 24080 12097 12588 23621 7998 -12039 -9628 -8841 -21387 -18935 829
593H29N395R70J4667J2392j1623j1363L768j0876k3460j805Q028j0365j032K3711
$$ 829 6224 7194 21861 34253 22630 11267 15035 4159 -19301 -21106 -13078 -23443 -24475 -764
607g64P504p129J3411J3326k0276j0867J1852j5644k1967J2645J1855j5151R472
$$ -764 6740 -389 13022 26348 6072 -4795 7057 -8587 -30554 -17909 -6054 -21205 -11733
620a1733L2601k947j1093K3754L394l2421k104J3534k6393j8786K6737J522j9134
$$ -11733 20868 17921 6828 30582 33976 1555 -549 12985 -13408 -32194 -5457 -3935 -23069
633b3069K4027K6403k2663j744K7975k0119l1962J8107P71l4820O870L2377j5574
$$ -23069 958 27361 4698 2954 30929 10810 -21152 -3045 -2274 -37094 -30224 2153 -13421
646a3421o275L9722O451k4386J5663J3773l2002j2069J7475j2436k1026K1627
$$ -13421 -19696 20026 26477 2091 17754 31527 -475 -12544 4931 -7505 -28531 -6904
658f904J4239j6747J1865K7681j3620j3731J7130m947l2600K473J1299k0677n516
$$ -6904 7335 -9412 2453 30134 16514 2783 19913 14966 -17634 -15161 -3862 -24539 -30055
671c0055K5991M360r150J7930J4731j4843l593R450j2022j8137N619J205r628
$$ -30055 -4064 296 -8854 9076 23807 8964 5371 14821 2799 -15338 -9719 -8514 -18142
684a8142O053J7738L179j708J3037M821j2016o252J430j0847j6051L824O911q181
$$ -18142 -12089 5649 8828 7120 20157 24978 12962 6710 8140 -2707 -18758 -14934 -8023 -16204
698a6204K501J8718M242p304J1192O182j6477r793P052j0574j4260J1119Q982
$$ -16204 -13703 5015 9257 1953 13145 19327 2850 -6943 109 -10465 -24725 -13606 -4624
711d624q698J0736K2207m453q161J4347J601k6264j907J1268j9113j1612K1609
$$ -4624 -13322 -2586 19621 15168 7007 21354 22955 -3309 -5216 6052 -13061 -24673 -3064
724c064M432j4836J7058K0377j6638n488J8619j4374k4052J1628L196k4243O629
$$ -3064 1368 -13468 3590 23967 7329 1841 20460 6086 -17966 -6338 -3142 -27385 -20756
737b0756K5157r811m542K8441K436k0212J0206R071k3852j0827J6660p561j7735
$$ -20756 4401 -5410 -9952 18489 20925 713 10919 19990 -3862 -14689 1971 -5590 -23325
750b3325J8810J4837j3986O226K0268p855j5077J1407k615k3839P7J2590j3822
$$ -23325 -4515 10322 -3664 2562 22830 14975 -102 11305 8690 -15149 -15072 -2482 -16304
763a6304n216K3463M118j1019J5265J1194j5563o320J0487j0322j5263N325N270
$$ -16304 -21520 1943 6061 -4958 10307 21501 5938 -382 10105 -217 -15480 -10155 -4885
776d885p749L356J6961J658l972R584J828j0372n715K752q364j0774M914N261
$$ -4885 -12634 -9278 7683 9341 5369 14953 16781 6409 694 3446 -4918 -15692 -10778 -5517
790e517n405M563J5508r89o713R111L192j5583o090P466q878j0218J1313Q865
$$ -5517 -10922 -6359 9149 8160 1447 10558 13750 -1833 -7923 -457 -9335 -19553 -8240 625
804F25o341N261J7133m751p651R190o43j9056l23R187j4010o192J7799K988j1233
$$ 625 -5716 -455 16678 11927 4276 13466 12823 -6233 -6556 2631 -11379 -17571 228 3216 -8017
819h017J3480J4560j5548m850J4090j0827j9424J0149N022j7269N607J7831n524
$$ -8017 5463 20023 4475 -375 13715 2888 -16536 -6387 -1365 -18634 -13027 4804 -720
832g20m205J9510J932j7879O693P349j9509p484J4933m335j3442J4890J2867j2285
$$ -720 -4925 14585 16517 -1362 5331 12680 -6829 -14313 620 -3715 -17157 -2267 10600 -1685
846a685M108J6854q499j3872Q201L59j8210Q1J0464p161m333J6718L745p943Q450
$$ -1685 2423 19277 10778 -3094 5107 5466 -12744 -12663 -2199 -9360 -13693 3025 6770 -1173 7277
861G277P393j2405n122P807o882j1835O894P093q129K598J4113J141p377O645
$$ 7277 14670 2265 -2857 4950 -1932 -13767 -6873 220 -7909 -5311 8802 9943 2566 9211
875I211L485j0434m679L614o250p520M199P485m257K709J0233n13o385N216K548
$$ 9211 12696 2262 -2417 1197 -5053 -12573 -8374 -889 -5146 -2437 7796 7283 898 6114 8662
890H662j3628j791O347m998r121J0649P184p897M729J3525m247q848Q238j054
$$ 8662 -4966 -6757 -410 -5408 -14529 -3880 3304 -4593 136 13661 9414 566 8804 7750
904G750j4649J33P678r070l836J4395J378r203J1393Q574j3520l259J1909j0232
$$ 7750 -6899 -6766 912 -8158 -11994 2401 3779 -5424 5969 14543 1023 -2236 9673 -559
918e59j3735J0823N295j4800M900J6971o656n876J5055J158j5233L262P897j3351
$$ -559 -14294 -3471 1824 -12976 -8076 8895 2239 -3637 11418 12576 -2657 605 8502 -4849
932d849p099J3597l409r366J2415P482j0691L227J3515r503j0915R537j474j3199
$$ -4849 -11948 1649 -1760 -11126 1289 8771 -1920 1307 14822 5319 -5596 3941 2467 -10732
946a0732K215J0602p307m389J4435J620p772N350N411q989m003O106n161p957
$$ -10732 -8517 2085 -5222 -9611 4824 6444 -1328 4022 9433 444 -3559 2547 -2614 -10571
960a0571O737L913m552L228Q349j524m102M589J965q856k224L092k913n564M042
$$ -10571 -3834 79 -4473 -1245 7104 5580 1478 6067 8032 -824 -3048 44 -2869 -8433 -4391
975d391M899k776J281P299l14n870K721K259q047k666M878k813l845O440N178
$$ -4391 508 -2268 -987 6312 5998 128 2849 5108 -2939 -5605 -727 -3540 -7385 -945 4233
990D233o373K458J0378o716n677N885J048j2004Q32R956p446n691J3537J252r167
$$ 4233 -2140 318 10696 3980 -1697 4188 5236 -6768 -5936 4020 -3426 -9117 4420 5672 -3495
1005c495O417P561j0158m558R903n493j1312Q623O091j2416K991J4818o363o933
$$ -3495 2922 10483 325 -4233 5670 177 -11135 -2512 3579 -8837 -5846 8972 2609 -4324
1019d324J2138M13j2995L227Q372j2239m559J3162k069j0582J0850O870r388J105
$$ -4324 7814 8227 -4768 -1541 6831 -5408 -9967 3195 1126 -9456 1394 8264 -1124 -19
1033a9R061o968p427P370k2j1372M402Q065p005j553J1012K90r918O666M722r627
$$ -19 9042 2074 -5353 2017 1995 -9377 -4975 3090 -3915 -5468 5544 5834 -4084 2582 7304 -2323
1049b323k520P126k584n862M262L515l965J247O280j623l486L424J2o064p2L599
$$ -2323 -4843 2283 -301 -6163 -1901 1614 -2351 -1104 5176 3553 67 3491 3503 -2561 -2633 966
1065I66l166l509N125K483m549J217N950j097n319K367K228n780j402L398J30
$$ 966 -2200 -5709 -584 1899 -2650 -1433 4517 3420 -1899 468 2696 -3084 -4486 -1088 -958
1080i58l339L467M849m839K92O457l400m892N813J20q720J695P245n234n039R959
$$ -958 -4297 -830 4019 -820 -528 5929 2529 -2363 3450 3570 -5150 -3455 3790 -1444 -6483 3476
1096C476J672p864K537P438p711n778J0207k321r230O115O046r204N51J0625n446
$$ 3476 5148 -2716 -179 7259 -452 -6230 3977 1656 -7574 -1459 4587 -4617 -4066 6559 1113
1111A113n093P983L84j0734M370Q576q927l811J0911j418j0034P326O299r039
$$ 1113 -3980 4003 4387 -6347 -1977 6599 -2328 -6139 4772 3354 -6680 646 6945 -2094
1125b094o56R588m892p506P013J709q088J747P156n294l915Q048J059p584L840
$$ -2094 -2750 6838 1946 -5560 1453 3162 -4926 -3179 3977 -1317 -5232 2816 3875 -3709 131
1140A31M904p958q23O632k023o384N799M096p208L08P038l158l424L967P82n362
$$ 131 5035 -2923 -3746 2886 863 -5521 278 4374 -2834 -2526 4512 1354 -2070 1897 2679 -2683
1156b683J627L223k989k031L884J132l865Q87L520k457k037K549J684m175M6L948
$$ -2683 -1056 2167 -822 -2853 1031 2163 -1702 -815 2705 248 -1789 760 2444 -1731 -1685 2263
1172B263j931m609M593J952l604k92M255k268l235L969J644n186J385M431l363
$$ 2263 332 -4277 316 2268 -1336 -1628 2627 359 -2876 1093 2737 -2449 -1064 3367 4
1187Dm186O280O27o535L224O140p714j220P750k561o723N631M275p848j8P768
$$ 4 -4182 2098 2725 -3810 -586 5554 -2160 -3380 4370 1809 -4914 717 4992 -2856 -2874 4894
1203D894l787o297P030J226p281L068O678o768l147P992o09p595L781N987q820
$$ 4894 1107 -5190 1840 3066 -4215 -1147 5531 -1237 -4384 3608 2999 -4596 -815 5172 -3648
1218c648l6Q064l542n886P379K533p518J099O253n196m095P046J7p078L754M544
$$ -3648 -3684 4380 838 -5048 2331 4864 -2654 -1555 4698 -498 -4593 2453 2470 -4608 -854 3690
1234C690n638k46O287j590n513M289K242o212q2O182l918l476M477L073m591N
$$ 3690 -1948 -2194 4093 2503 -3010 1279 3521 -2691 -2773 3409 -509 -3985 492 3565 -1026 -1021
1250a021L968j615l250K585J205m514J570K068j642j871K879J469k860K029J754
$$ -1021 2947 1332 -1918 667 1872 -2642 -1072 996 -646 -2517 362 1831 -1029 1000 2754
1265B754l235j686L322R87n332nN080l424j214M931K154n366P05M266m262k761
$$ 2754 -481 -2167 1155 2142 -3190 -3195 1885 -1539 -2753 2178 4332 -1034 -329 3937 -325 -3086
1281c086L479Q92n839L105L535l273j191O151j225m897M386J894p004J0N744m429
$$ -3086 393 1285 -4554 -1449 2086 -1187 -2378 3773 2548 -2349 2037 3931 -3073 -3063 2681 -1748
1297a748l399O108J577n524L058M819m248l053N986j256p273M053L798p121N66
$$ -1748 -5147 961 2538 -2986 72 4891 643 -2410 3576 2320 -4953 -900 2898 -4223 -3657
1312c657P276l115l196N717J406o200N74L884l327l994N084J082n481J784N373
$$ -3657 3619 504 -2692 3025 4431 -1769 -1195 2689 -638 -4632 452 1534 -3947 -2163 3210
1327C210k747j824N575j929m925K858K321m999j305M967j876k883M542K212l286
$$ 3210 463 -1361 4214 2285 -2640 218 2539 -2460 -3765 1202 -674 -3557 985 3197 -89
1342h9Q32L707k973l324K917K95m912o17N244j604l97J566J704j946k71L295k029
$$ -89 743 4450 1477 -1847 1070 1365 -3547 -4164 1080 -524 -921 645 2349 403 132 3427 1398
1359A398l415J962J62m024J381L268k067j080M926J658m671J548L670m503l735
$$ 1398 -2017 -55 107 -3917 -2536 732 -1335 -2415 2511 4169 -502 1046 4716 213 -3522
1374c522K853N36m293K298M239k905m57L832L11l000J144K337o068k39M936m015
$$ -3522 -669 -133 -4426 -2128 2111 -794 -1251 2581 2892 -108 1036 3373 -2695 -2934 2002 -2013
1390b013k554N199J712l880K139N655n212l536N458k894m982K241L541l953M67
$$ -2013 -4567 632 2344 -1536 603 6258 1046 -2490 2968 74 -4908 -2667 874 -3079 -2612
1405b612M975j210l189N584J998o752R78K887m683k060L978J38l862L800L858
$$ -2612 2363 1153 -2036 3548 5546 -1206 -228 2659 -2024 -4084 -106 32 -3830 -30 3828
1420C828k549j495M754j574n339K387M55m277P8L442j388J03K204K158j987J190
$$ 3828 1279 -216 4538 2964 -2375 12 467 -3810 -3732 -290 -1678 -1575 629 2787 800 1990
1436A990K510l255l294K339n34l891J088L032r59o48M271J462l565J80Q71j156
$$ 1990 4500 1245 -2049 290 -244 -4135 -3047 -15 -974 -1622 2649 4111 546 726 1597 441
1452D41k854N96J51k023K036K252J089j881K476J112k971O64J818l888l419K916
$$ 441 -2413 -1817 -1666 -3689 -1653 599 1688 -193 2283 3395 424 1088 2906 -982 -4401 -1485
1468a485J514m142L055K781j658k92N190j298m272J969N84n223j828N071k407
$$ -1485 29 -4113 -1058 1723 65 -227 4963 3665 -607 1362 1946 -3277 -5105 -34 -2441
1483b441j421M695K791m085J967M663n414k777M655j768n956J602M139l724J010
$$ -2441 -3862 833 3624 -461 1506 6169 755 -2022 2633 865 -5091 -3489 650 -3074 -2064
1498b064O337p48m246M053J576n056j596K763l680j919L626L06k701M630M332
$$ -2064 4273 3525 -721 3332 4908 -148 -1744 1019 -2661 -4580 -954 -648 -3349 1281 5613
1513E613m548q55L152j452m600K444J038n218k51N648j272j392L487L240k689
$$ 5613 1065 210 3362 1910 -2690 -246 792 -4426 -4677 971 -301 -1693 1794 5034 2345
1528B345m89K009l370k694J408l54k926K339J905n52N61K952O56j913o97J86k290
$$ 2345 1856 3865 495 -2199 -791 -1145 -4071 -1732 173 -379 182 3134 3790 1877 1180 1366 -924
1545i24k394J442j26j758J002M271k29j010K489N50j733o75J128l493k526J483
$$ -924 -3318 -1876 -2002 -3760 -2758 1513 1284 274 2763 3313 1580 905 2033 -1460 -3986 -2503
1561b503J019k001K106M043j805J198K475j440l677M52J661m072j934L601m11
$$ -2503 -1484 -3485 -1379 2664 859 2057 4532 3092 -585 -133 1528 -2544 -4478 -877 -1288
1576a288k203L854M608l648J06K467k311k354O26q66m322K985K336j813L85M221
$$ -1288 -3491 363 4971 1323 1429 3896 1585 -769 -143 -1009 -5331 -2346 -10 -1823 -1438 2783
1592B783K80m154M611K36n494L60J892k192m288M468K468k484K098M155l416n58
$$ 2783 3063 -1091 3520 3756 -1738 -1378 514 -1678 -5966 -1498 970 -1514 584 4739 1323 765
1608G65K389j862l961J537N72m014L46M763k71p22L677J996l987l83K553k908
$$ 765 3154 1292 -2669 -1132 -560 -4574 -4228 535 264 -458 3219 5215 1228 845 3398 490
1624D90m230J889J036l015J137L284N90k20K158m56j198m47M67l278j752J810
$$ 490 -3740 -1851 -815 -3830 -2693 591 1181 961 3119 2663 1465 1018 1485 -1793 -3545 -1735
1640a735L6j542K386K863m24J79Q09J862m395K17k41l192M36J072R46j316K380
$$ -1735 -1699 -3241 -855 2008 1584 1763 2572 4434 39 256 15 -3177 -2741 -1669 -723 -2039 341
1657C41K573o57m00J792r43l314j21J134m527l21L946r5r97L656K128l201N82
$$ 341 2914 2257 1857 3649 2706 -608 -729 405 -4122 -4443 -497 -592 -1589 2067 4195 994 1576
1674A576K335k349l781J199m70l645J771L741j794J664L015M7k094J603L03l779
$$ 1576 3911 1562 -2219 -1020 -1490 -5135 -3364 377 -1417 247 3262 3309 1215 2818 3121 -658
1690f58j889J586j601k497M327J881j472J228L672k182j577J440j254m395J313
$$ -658 -2547 -961 -2562 -5059 -732 1149 -323 905 4577 2395 818 2258 1004 -3391 -2078
1705b078P23j645J354J940L75n06K366J331k520J83j20k217k877P94J498j806
$$ -2078 -1355 -3000 -1646 294 669 163 2529 3860 1340 1523 1403 -814 -3691 -2897 -1399 -3205
1721c205K442J677J664r85K276o26k482l62o97p20k519N48J601q64K061K699n86
$$ -3205 -763 914 2578 1593 3869 3243 761 399 -298 -1018 -3537 -2989 -1388 -2252 -191 2508 1922
1738A922P36j28L7l369O6J286m059o09L743j085r43K699K981j222j015J770j351
$$ 1922 2658 2530 2567 -802 -736 550 -3509 -4118 -375 -1460 -2403 296 3277 2055 1040 2810 1459
1755A459k630k25O61k713m93L843m73L81K692J486k977N03J265l708j720J893
$$ 1459 -1171 -1396 -735 -3448 -3941 -98 -571 -190 2502 3988 1011 1514 2779 -929 -2649 -756
1771g56l43k352R32L517j144J162K808k20k526J40J343m050m84Q39j181j055L930
$$ -756 -1099 -3451 -2519 998 -146 1016 3824 3604 1078 1218 2561 -1489 -1973 -1134 -2315 -3370 560
1788E60R85j435J661K061k606q53J425r00m365M24J712n68p93L285J584k115L270
$$ 560 1545 110 1771 3832 1226 373 1798 898 -3467 -3043 -1331 -1899 -2692 593 2177 62 3332
1805C332J83k584R7N35l254q72j56K024j792K788J910l81k45J171j41k200j235
$$ 3332 3515 931 1028 1563 -1691 -2563 -2719 -695 -2487 301 2211 1830 1585 2756 2615 415 -820
1822h20N35j309k279K456J51k53J449K489k25L75n09M6l274L06j00q84j010K459
$$ -820 -285 -1594 -3873 -1417 -1266 -1519 -70 2419 2194 2569 2060 2106 -1168 -862 -962 -1846 -2856 -397
1840c97j16p04L375J014r45o37M16r89m270J851K49k454J136J884P52j584M376
$$ -397 -513 -1217 2158 3172 2227 1590 2006 1017 -3253 -1402 -1153 -3607 -2471 -587 165 -1419 2957
1857B957j41k630j48K462l552l43K23j02k928M102K207q56K64J316k65k621J169
$$ 2957 2816 186 38 2500 -1052 -1395 -1172 -1274 -4202 -100 2107 1251 1515 2831 2566 -55 1114
1874A114m32l133m4J703n16o76K321J254j313J147J453k281m73K75r7l630K761
$$ 1114 682 -2451 -2495 -792 -1308 -1984 337 1591 278 1425 2878 597 124 399 302 -3328 -567
1891e67m72n25L38L989j094j430K129j13j623r69l14j227Q2j3Q96l94N84J828
$$ -567 -1039 -1564 -1226 2763 1669 239 2368 2255 632 -337 -651 -1878 -1796 -1809 -913 -1307 -723 1105
1909A105J282q28J181j357k166k07L61k195J283N21J29M16O28K261r28j129N96
$$ 1105 2387 1559 2740 1383 -783 -990 -629 -2824 -1541 -1020 -891 -475 153 2414 1486 357 953
1926I53k23k348o33R68k11j385K026J110K69J211J396n98k255M21j020k959J275
$$ 953 730 -1618 -2251 -1283 -1494 -2879 -853 257 526 1737 3133 2535 280 701 -319 -3278 -2003
1943b003Q95q63J69K822M36j398J714J405k720q71J566k210j318J435Q5j049J101
$$ -2003 -1108 -1971 -1802 1020 1456 58 1772 3177 457 -414 1152 -1058 -2376 -941 -856 -1905 -804
1960h04K239p48J40K370q22k265o16J026k778j032L851j320j655L099J803j903
$$ -804 1435 687 827 3197 2375 110 -506 520 -2258 -3290 561 -759 -2414 685 2488 585
1976E85R02J374j883q79R1j197j379J506J203j938J893K068q49p48J063l83k052
$$ 585 1487 2861 978 99 190 -1007 -2386 -880 323 -1615 278 2346 1497 749 1812 1429 -623
1993f23%J024k096j313K543Ok64P69J061l51o6L82p54o96O6Kk137P15J779j161
$$ -623 -623 401 -1695 -3008 -465 -459 -723 46 1107 756 690 1072 318 -378 -312 -310 -2447 -1732 47 -1114
2013a114J429P43J259j327m5K69j381j060o55J131j06j056K231l23J000j65L98
$$ -1114 315 1058 2317 990 945 1214 -167 -1227 -1882 -751 -857 -1913 318 -5 995 830 1228
2030A228k57q16p51p8q32Q52K5p00N71J420O60j163J563j070J49j172R50j147
$$ 1228 971 155 -596 -674 -1506 -654 -629 -1329 -758 662 1322 159 1722 652 801 -371 579 -568
2048e68j277Q11J112j278J455J642j304P4R6R13k816J073J10k047M0K143l10r91
$$ -568 -1845 -1034 78 -1200 255 1897 593 667 763 1676 -1140 -67 43 -2004 -1964 179 -131 -1122
2066a122J692J181j760N92J975k684q12J72R57k489P15J272O5m83J978L92q94
$$ -1122 570 1751 -9 583 2558 -126 -938 -766 191 -2298 -1583 -311 -246 -729 1249 1641 747
2083G47O90k99j016j128J22m68q03K201J080j430K72J767j457N0J239j097j157
$$ 747 1437 1138 122 -1006 -884 -1352 -2155 46 1126 -304 -32 1735 278 328 1567 470 -687
2100f87r54J681j016j161K529o2M2R0J281j156N48k88j368m95J084j42j788R00
$$ -687 -1641 40 -976 -2137 392 330 372 462 1743 587 1135 847 -521 -1016 68 -74 -1862 -962
2118i62P41P80j17K67R19k146K49N10j175j56m42J588r50K9J943j173R36L74K21
$$ -962 -221 559 442 709 1628 -518 -269 241 -934 -1090 -1532 56 -894 -865 1078 -95 841 1215 1436
2137A436j429l12P61q56r38J803j3k392K546Q77j410k71J018q8k313O83J865k321
$$ 1436 7 -305 456 -400 -1338 465 452 -1940 606 1483 73 -198 820 732 -1581 -898 967 -1354
2155a354K89K005M46j576J275M72q23L81L5r26j395J243R2j957J185K069j757
$$ -1354 -1065 940 1386 -190 1085 1557 734 1115 1150 224 -1171 72 164 -1793 -608 1461 -296
2172b96J10J027j33n11q96J176n00p32P16l77m70J968k12j460N30J668k613N19
$$ -296 -186 841 708 197 -699 477 -23 -755 -39 -416 -886 1082 870 -590 -60 1608 -1005 -486
2190d86N97Q46j616Q8P65l75k84m3J012l58M81L93j290j25J72j3K5m10O56o92
$$ -486 111 957 -659 -571 194 -181 -465 -508 504 146 627 1020 -270 -395 -223 -236 -211 -621 35 -657
2210f57K078o23j100k38J199N47j393L92q0j56j750K136n05j81q48J967q46p15
$$ -657 1421 798 -302 -540 659 1206 -187 205 125 -31 -1781 355 -150 -331 -1179 788 -58 -773
2228g73J678j321j34R74K54j333o79J068J58K6K03L23m35m07P12j3k163J834P88
$$ -773 905 -416 -550 424 678 -655 -1334 -266 -108 -82 121 444 9 -398 314 301 -1862 -28 760
2247G60j279K2L12q61j18J534Q87j377N60j06j164J049M24n42j68k66R99j235
$$ 760 -519 -497 -185 -1046 -1164 370 1257 -120 440 334 -830 219 643 101 -67 -333 666 -569
2265e69M56j7J172k019J235O64k705J016J281M06p99N95P4r94m80J33P72j68J426
$$ -569 -113 -130 1042 -977 258 922 -1783 -767 514 920 121 716 790 -204 -684 -551 221 53 1479
2284A479r53l89M18r99l33J004L01m02m26n44O74q04n45J856P56j756J32M67j24
$$ 1479 526 137 555 -444 -777 227 528 126 -300 -844 -170 -974 -1519 337 1093 -663 -531 -64 -188
2303a88j064R61L75l00l22J43k1j85J214m71o33J118p34l51o43J511m24m30l82
$$ -188 -1252 -291 84 -216 -538 -395 -416 -601 613 142 -491 627 -107 -458 -1101 410 -14 -444 -826
2322h26J596j468P02N94k92n44K82j49k96j9R58p34j475R30J058m94j68J072o47
$$ -826 770 -698 4 598 306 -238 44 -105 -401 -420 538 -196 -1671 -741 317 -177 -345 727 80
2341H0k74J579p63j670J186n85K61n62J457j06p29Q02O99j033J14o3j217J36J123
$$ 80 -194 1385 622 -1048 138 -447 -186 -748 709 603 -126 676 1375 342 456 393 -824 -688 435
2360D35l33q37M44R31m70O10o2k20r52K39L63j185O7O2O31O92l27J176k51K57
$$ 435 102 -735 -291 640 170 780 718 498 -454 -215 148 -1037 -970 -908 -277 415 88 1264 1013 1270
2380A270l52j019j058Q03K13j759P91J171J17l25P25o65M29K78L9j158o05J369
$$ 1270 918 -101 -1159 -356 -143 -1902 -1111 60 177 -148 577 -88 341 619 658 -500 -1105 264
2398B64r66n50J206J330j081QQ67m49K54k58L15k049q73J753l02m65R00O60j40
$$ 264 -702 -1252 -46 1284 203 211 1078 629 883 625 940 -1109 -1982 -229 -531 -996 -96 564 424
2417D24J6K47j036R22m56l6q28p34J282m69j29J889q3j145K031k94r72l36L88
$$ 424 440 687 -349 573 117 81 -747 -1481 -199 -668 -797 1092 1009 -136 1895 1601 629 293 681
2436F81j400j61M6O37j409N07K649j120L57R04M0j902l55N58r41q86J494K78o53
$$ 681 -719 -880 -834 -197 -1606 -1099 1550 430 787 1691 1731 -171 -526 32 -909 -1795 -301 -23 -676
2455f76J040J390j490L51N00j077m70J9m72n39N03K49j64O79J052N62j661J138
$$ -676 364 1754 264 615 1115 38 -432 -413 -885 -1424 -921 -672 -836 -157 895 1457 -204 934
2473I34K38j285N2O7k212J191P08O83p46J342J40N0l52J6k74n84j600N80o21O49
$$ 934 1172 -113 -61 6 -2206 -1015 -307 376 -370 972 1112 1162 810 826 552 -32 -1632 -1052 -1673 -1024
2493a024Q24J031k92K78P59j50j728R48j332M6m54j25J079k57p2J469N44n52l60
$$ -1024 -200 831 539 817 1576 1426 -302 646 -686 -640 -1094 -1219 -140 -397 -469 1000 1544 992 632
2512F32M58m30k85o19l41j195L33O00P22J25R58j95k1J682j618l63j200m9j425
$$ 632 1090 660 375 -244 -585 -1780 -1447 -847 -125 0 958 763 742 2424 806 443 -757 -806 -2231
2531b231Q39R03j252K016J504j140J200r77M97j252o22J78p06j000J580K79K66
$$ -2231 -1392 -489 -1741 275 1779 639 1839 862 1359 107 -515 -337 -1043 -2043 -463 -184 82
2548H2L48J391J008j651n70p12r77n2Rj059R55M70O04O94Q81J48l00l43j027P64
$$ 82 430 1821 2829 1178 608 -104 -1081 -1133 -1124 -2183 -1228 -758 -154 540 1421 1569 1269 926 -101 663
2568F63j760J001j488l30J667O44l88J138N81l60L67q47n61j638j12l27R93j019
$$ 663 -1097 -96 -1584 -1914 -247 397 9 1147 1728 1368 1735 888 327 -1311 -1423 -1750 -757 -1776
2586a776J868J54N25M33J001p41o98p71m48r84J72l64O04R28q0J082P52O41p06
$$ -1776 92 246 771 1204 2205 1464 766 -5 -453 -1437 -1265 -1629 -1025 -97 -177 905 1657 2298 1592
2605A592j148j151J103j053p78j76J15P27N77R49J895j328p14P39p40j748P05
$$ 1592 444 -707 396 -657 -1435 -1611 -1496 -769 -192 757 2652 1324 610 1349 609 -1139 -434
2622d34m49p54K35J183j30K87J774p87O7l40o15n16n01L95j176q01K159R34n39
$$ -434 -883 -1637 -1402 -219 -349 -62 1712 925 992 652 37 -479 -980 -585 -1761 -2562 -403 531 -8
2641hJ138P89k15o45j013K9j127r12J037r52Q45R87N32J012k77J456p60q96j140
$$ -8 1130 1919 1704 1059 46 75 -1052 -1964 -927 -1879 -1034 -47 485 1497 1220 2676 1916 1020 -120
2660a20j355L47j441J023j751K156J789N98L42O10j34j225r39o51o75n82j91J693
$$ -120 -1475 -1128 -2569 -1546 -3297 -1141 648 1246 1588 2198 2064 839 -100 -751 -1426 -2008 -2199 -506
2678e06o51J728J672n29j5j6l32K05k356p09q31Q74p96N18J282J683N84l04Q8
$$ -506 -1157 571 2243 1714 1699 1683 1351 1556 -800 -1509 -2340 -1466 -2262 -1744 -462 1221 1805 1501 1589
2697A589o5q74r14q71j296R13n20J177J310J89J045n80k31J163j476k086M89j46
$$ 1589 1524 650 -264 -1135 -2431 -1518 -2038 -861 449 638 1683 1103 872 2035 559 -1527 -1038 -1184
2715a184j618P16K45K100k6R57N33J021r63r89J45j364j522L41m93J523r2J536
$$ -1184 -2802 -2086 -1841 259 233 1190 1723 2744 1781 792 937 -427 -1949 -1608 -2101 -578 -670 866
2733H66k64J386l84k57k12p21o54j638o21O44P54j75J838N75k60R32k53j59j419
$$ 866 602 1988 1604 1347 1135 414 -240 -1878 -2499 -1855 -1101 -1276 562 1137 877 1809 1556 1397 -22
2752b2N56k530o67J07J662N40M91M18k16K029o94L82q33j471j699l63k17N09N24
$$ -22 534 -1996 -2663 -2556 -894 -354 137 555 339 2368 1674 2056 1223 -248 -1947 -2310 -2527 -2018 -1494
2771a494P86R16J373K3L15l17q03j593k67q93K54M30J80O42Q98j20K134p88j62
$$ -1494 -708 208 1581 1604 1919 1602 799 -794 -1061 -1954 -1700 -1270 -1090 -448 450 330 2464 1676 1514
2790A514L8q52j674P48p87p72P14L79J500L83J999J24j606n05o33j456L98j828
$$ 1514 1552 700 -974 -226 -1013 -1785 -1071 -692 808 1191 3190 3314 1708 1203 570 -886 -488 -2316
2808b316O47l61J280J176Q90Q1M20q82m93K95p42j239k55k6p89O75L128p47P67
$$ -2316 -1669 -2030 -750 426 1316 1397 1817 935 442 737 -5 -1244 -1499 -1525 -2314 -1639 1489 742 1509
2827A509P66R38j647q07j012m64j502R91j126J200J40J591J204K15q3o53j14k029
$$ 1509 2275 3213 1566 759 -253 -717 -2219 -1228 -2354 -1154 -1014 577 1781 1996 1913 1260 1146 -883
2845h83Q32k170p6O20m04J620J714O12L58l91N58j713j643J52nj203o86J455l82
$$ -883 -51 -2221 -2297 -1677 -2081 -461 1253 1865 2223 1832 2390 677 -966 -814 -819 -2022 -2708 -1253 -1635
2864a635J649O54J235K16K39j071p27j039m49j149O91j130J807J104n75J226J555
$$ -1635 14 668 1903 2119 2358 1287 560 -479 -928 -2077 -1386 -2516 -709 395 -180 1046 2601
2881B601r1j034j020o54q87j400J85O57L79J285J745L82L49m80q75n83m60p23
$$ 2601 2510 1476 456 -198 -1085 -2485 -2300 -1643 -1264 21 1766 2148 2497 2017 1142 559 99 -624
2899f24j511l48J19J330K64J334J657n26LJ44j454k52j895o61j37N00K15J152
$$ -624 -2135 -2483 -2364 -1034 -770 564 2221 1695 1698 1842 388 136 -1759 -2420 -2557 -2057 -1842 -690
2917f90K050N73m97J193m96j643n88r51n8j863R46N93K8J257J884l11M37o8j044
$$ -690 1360 1933 1436 2629 2133 490 -98 -1049 -1107 -2970 -2024 -1431 -1403 -146 1738 1427 1864 1796 752
2936G52K12q98j169M30j074k08J281Q77J123j57J208m52o54k101J040k057n36
$$ 752 964 66 -1103 -673 -1747 -1955 -674 203 1326 1169 2377 1925 1271 -830 210 -1847 -2383
2953b383M36j13J141Q20O32R62N01m13j91p87r57j021m43p4n97J190R00J399N42
$$ -2383 -1947 -2060 -919 -99 533 1495 1996 1583 1392 605 -352 -1373 -1816 -1890 -2487 -1297 -397 1002 1544
2972A544M52P59j459r60l07q08k343M59J783o89R01J282J83P69K96p76o84L90
$$ 1544 1996 2755 1296 336 29 -779 -3122 -2663 -880 -1569 -668 614 797 1566 1862 1086 402 792
2990G92j820n49j290J100J29J082J571J211K18j783J551o17k342J65L52k272j34
$$ 792 -1028 -1577 -2867 -1767 -1638 -556 1015 2226 2444 661 2212 1595 -747 -582 -230 -2502 -2636
3007b636J204K02J044J283J449j124R9J94r66j716M24k068J132J23P23l37K240
$$ -2636 -1432 -1230 -186 1097 2546 1422 1521 1715 749 -967 -543 -2611 -1479 -1356 -633 -970 1270
3024A270J142o03K47p53o84j164j424n37m0P83L47o69K485J041J606j261k70L68
$$ 1270 2412 1809 2056 1303 619 -545 -1969 -2506 -2546 -1763 -1416 -2085 400 1441 3047 1786 1516 1884
3042A884j916k271R63j10j121J527Q26J094L39J567j60j133K86j498q55j608m88
$$ 1884 -32 -2303 -1340 -1450 -2571 -1044 -218 876 1215 2782 2622 1489 1775 277 -578 -2186 -2674
3059b674L62J231M03K99J584R68M03j29j212j392K46j646j106m17J616Q73J222
$$ -2674 -2312 -1081 -678 -379 1205 2173 2576 2447 1235 -157 89 -1557 -2663 -3080 -1464 -591 631
3076F31O77N18o80O28j041J03k224k7q14o27O76J369Q74N65J155m82Q67o57r02
$$ 631 1308 1826 1146 1774 733 836 -1388 -1415 -2229 -2856 -2180 -811 63 628 1783 1301 2168 1511 609
3095F09j314r96K73q87L28N95J374R52P13J906j998j64j193l34j321j23n54N49
$$ 609 -705 -1701 -1428 -2315 -1987 -1392 -18 934 1647 3553 1555 1391 198 -136 -1457 -1580 -2134 -1585
3113a585PQ31J421M78P59J384r59j517r37j089j265J300q55k18J381J459J075
$$ -1585 -1578 -747 674 1152 1911 3295 2336 819 -118 -1207 -2472 -1172 -2027 -2245 -864 595 1670
3130A670k06R13M7j642r60Q4k173O33m65q2J895q1J320P49J036j388N7k87j144
$$ 1670 1464 2377 2424 782 -178 -94 -2267 -1634 -2099 -2181 -286 -367 953 1702 2738 1350 1407 1120 -24
3149b4j055j510M66K56J015k64J242J705J205p59m55j633m87p61j88j389K99J053
$$ -24 -1079 -2589 -2123 -1867 -852 -1116 126 1831 3036 2277 1822 189 -298 -1059 -1247 -2636 -2337 -1284
3167a284J068P18Q32j1N98M01j251j026k178K27L7J40Q37Q25J074J35J478m22
$$ -1284 -216 502 1334 1323 1921 2322 1071 45 -2133 -1906 -1869 -1729 -892 -67 1007 1142 2620 2198
3185B198n79q72p76r71k08O3o28M49O08J958k85R55M93j393o09j38r24j119m53
$$ 2198 1619 747 -29 -1000 -1208 -1145 -1773 -1324 -716 1242 957 1912 2405 1012 403 265 -659 -1778 -2231
3204b231L23J200k06J590R6J101n33J46q23j94j285q73l09j13J32J484M12J422
$$ -2231 -1908 -708 -914 676 772 1873 1340 1486 663 469 -816 -1689 -1998 -2111 -1979 -495 -83 1339
3222A339Q65Q2j29j033r35j081K1j552N38q5J322J180M26J368l29L04q28k75j216
$$ 1339 2204 2286 2157 1124 189 -892 -871 -2423 -1885 -1970 -648 532 958 2326 1997 2301 1473 1198 -18
3241a8j577j121J307j43M98Q59L88J761k68Q0j002M09m39j808q28J71m24Q69Q19
$$ -18 -1595 -2716 -1409 -1552 -1054 -195 193 1954 1686 1766 764 1173 734 -1074 -1902 -1731 -2155 -1286 -467
3260d67Q13R67J78O07q66k53j803l17%j070M54j84P90J883J03J690l79n76n84
$$ -467 346 1313 1491 2098 1232 979 -824 -1141 -1141 -2211 -1757 -1941 -1151 732 835 2525 2146 1570 986
3279I86j358k68r73L4r12J277j29J480K4K161o97l50Q6j065n10j536M41m78O73
$$ 986 -372 -640 -1613 -1579 -2491 -1214 -1343 137 161 2322 1625 1275 1361 296 -214 -1750 -1309 -1787 -1114
3298a114l20J879J598j389J735o9o88r00r64k38j242k30n86J418J743J14J148
$$ -1114 -1434 445 2043 654 2389 2320 1632 732 -232 -470 -1712 -1942 -2528 -1110 633 747 1895
3315A895k06K86J27r56j187j357J22j206P12L21R01Q21J646j89j07k87m5j313
$$ 1895 1689 1975 2102 1146 -41 -1398 -1276 -2482 -1770 -1449 -548 273 1919 1730 1623 1336 1291 -22
3333b2j87r46r86N84l79J522O67K89K86Q76N87j149n00k028Lj085M42R21N69M00
$$ -22 -209 -1155 -2141 -1557 -1936 -414 253 542 828 1704 2291 1142 642 -1386 -1383 -2468 -2026 -1105 -536 -136
3353a36R26M71J197k51k49r88j295j577N21p40K06J239N6J854j46K47J467j020
$$ -136 790 1261 2458 2207 1958 970 -325 -1902 -1381 -2121 -1915 -676 -620 1234 1088 1335 2802 1782
3371A782o36q92n13j530j204Q15J192O77R93M6j14J303p13p73j55p29j709j60
$$ 1782 1146 254 -259 -1789 -2993 -2178 -986 -309 684 730 616 1919 1206 433 278 -451 -2160 -2320
3389b320O18O56O19J180P44l59R27n84n67J50j389r32l81k71J091j32L19N99J429
$$ -2320 -1702 -1046 -427 753 1497 1138 2065 1481 914 1064 -325 -1257 -1638 -1909 -818 -950 -631 -32 1397
3408A397r32J469n87o52j632p41l44r2R02J193k30J315K90L45M40j206L55j883
$$ 1397 465 1934 1347 695 -937 -1678 -2022 -2114 -1212 -19 -249 1066 1356 1701 2141 935 1290 -593
3426e93M88j209L19N66m88P47N86J277o46j11K87p14j639N76j300J55j76Q31J556
$$ -593 -105 -1314 -995 -429 -917 -170 416 1693 1047 936 1223 509 -1130 -554 -1854 -1699 -1875 -1044 512
3445E12p4J68J194m47K9Qk397P86j531o62Q76J6Q85J633M24J25J64J07r23l4q33
$$ 512 438 606 1800 1353 1382 1390 -1007 -221 -1752 -2414 -1538 -1522 -637 996 1420 1545 1709 1816 893 859 26
3466B6j237j169J143n58J303m49K098L00P64L28j631j111n21l66P62j588J491
$$ 26 -1211 -2380 -1237 -1795 -492 -941 1157 1457 2221 2549 918 -193 -714 -1080 -318 -1906 -415
3483d15j04J49J021J006j01k50N27k562J32k36j41o14J138m57Q19N86O72p24J498
$$ -415 -519 -370 651 1657 1556 1306 1833 -729 -597 -833 -974 -1588 -450 -907 -88 498 1170 446 1944
3502A944k67r09j422o39K22q40J10L03J137Q40J38J035O60j676N02j069n21o08
$$ 1944 1677 768 -654 -1293 -1071 -1911 -1801 -1498 -361 479 617 1652 2312 636 1138 69 -452 -1060
3520a060m83K16p5J285R69l91J319m69j375K78N1o99n15j114Q01R84PP16k60O87
$$ -1060 -1543 -1327 -1402 -117 852 461 1780 1311 -64 214 265 -434 -949 -2063 -1262 -278 -271 445 185 872
3540H72Q36o55J50j331n88m99m31j326J647J282l49R57J426n52n58Q83j345o57
$$ 872 1708 1053 1203 -128 -716 -1215 -1646 -2972 -1325 -43 -392 565 1991 1439 881 1764 419 -238
3558b38k61q04l64j74J427J255n91R42L33Q6j599P91r34j413m16N11N1K367j136
$$ -238 -499 -1303 -1667 -1841 -414 841 250 1192 1525 1611 12 803 -131 -1544 -1960 -1449 -1398 969 -167
3577a67P73Q66q18J317r84K24r58j349L14p17n11J171J237j50m22K157m6p60q56
$$ -167 606 1472 654 1971 987 1211 253 -1096 -782 -1499 -2010 -839 398 248 -174 1983 1937 1177 321
3596C21l86K44j426p86J104O01r85J202R48J428P6j103n56j27k04j176R4j412
$$ 321 -65 179 -1247 -2033 -929 -328 -1313 -111 837 2265 2341 1238 682 555 351 -825 -731 -2143
3614b143J362J51Q85J29N78N83K2j668m4j008k74P07l27J287p04k72J115J146
$$ -2143 -781 -630 255 384 962 1545 1567 -101 -145 -1153 -1427 -720 -1047 240 -464 -736 379 1525
3632A525j76J23j21j318o41l74l72L77l99J360m99J24N33J068M35j050J81j483
$$ 1525 1349 1472 1351 33 -608 -982 -1354 -977 -1376 -16 -515 -391 142 1210 1645 595 776 -707
3650g07J39j283N15p83J259J037l63R80J052j042L82j11j435q32N06j378n5J545
$$ -707 -568 -1851 -1336 -2119 -860 177 -186 794 1846 804 1186 1075 -360 -1192 -686 -2064 -2119 -574
3668e74l74M64J671L41k60J11j374j57o2j277P66q93L9N82J180k45J302R68k61
$$ -574 -948 -484 1187 1528 1268 1379 5 -152 -214 -1491 -725 -1618 -1579 -997 183 -62 1240 2208 1947
3687A947q61p39j72j079j20K25J8n05J745K58J049p31J18k11k64p31j012k26N04
$$ 1947 1086 347 175 -904 -1024 -799 -781 -1286 459 717 1766 1035 1153 942 678 -53 -1065 -1291 -787
3706g87N6p26J535J185R9k60J29k77p27j87j129M77j333O99J566j98N86mL64R4
$$ -787 -731 -1457 78 1263 1362 1102 1231 954 227 40 -1089 -612 -1945 -1246 320 122 708 704 1068 1162
3726A162M63r11n98j820J501j074O35p79R36N45J094Jo35O10r85L60j634P77q95
$$ 1162 1625 714 116 -1704 -203 -1277 -642 -1421 -485 60 1154 1155 520 1130 145 505 -1129 -352 -1247
3745a247k66O56L2r9J940J54o04Q07j153m59M03o25l06q04P23N30q4P45Q39L1
$$ -1247 -1513 -857 -825 -924 1016 1170 566 1373 220 -239 164 -461 -767 -1571 -848 -318 -402 343 1182 1213
3765A213k27P02j557o86M13k92j651J909j584J497J116N20K54m86Q83j394q72
$$ 1213 986 1688 131 -555 -142 -434 -2085 -176 -1760 -263 853 1373 1627 1141 2024 630 -242
3782b42l29R3j031J240j170N24J303N40J47P1m77q75r32O93J62l81j211J126N98
$$ -242 -571 -478 -1509 -269 -1439 -915 388 928 1075 1146 669 -206 -1138 -445 -283 -664 -1875 -749 -151
3801a51P06m77N36P83l96m55r01m65k86J22o25O12O3M28J608j78j42n75L81on07
$$ -151 555 78 614 1397 1001 546 -355 -820 -1106 -984 -1609 -997 -934 -506 1102 924 782 207 588 582 75
3822G5r80Q07k98o02J099l08N28J28J597o83n53j085O56o39n83O9k50K55Q28Q82
$$ 75 -905 -98 -396 -998 101 -207 321 449 2046 1363 810 -275 381 -258 -841 -772 -1022 -767 61 943
3842I43k33jN74p62j133p49N44Nj57j46J96J562j41m74Q28m33Q40j274n21p88
$$ 943 710 709 1283 521 -612 -1361 -817 -812 -969 -1115 -919 643 502 28 856 423 1263 -11 -532 -1320
3862a320Q56K2l29Q06m25l50R77J178L01q42j173K02J98r33k68L38M81J68q75
$$ -1320 -464 -442 -771 35 -390 -740 237 1415 1716 874 -299 -97 101 -832 -1100 -762 -281 -113 -988
3881i88J349l69N40m91L26n21J46m31k58j357J280R87j42L12K67n6Q92p03m84
$$ -988 361 -8 532 41 367 -154 -8 -439 -697 -2054 -774 213 71 383 650 594 1486 783 299
3900B99O4j152l62P59l64R03k24J51R24l69J082j699p11J12J93o72M52o42N6J971
$$ 299 363 -789 -1151 -392 -756 147 -77 74 998 629 1711 12 -699 -587 -394 -1066 -614 -1256 -1200 771
3920G71N6K8p74N48M21r03Q61k538L87n35J320l00m92J167K8J136o56O45q73j12
$$ 771 827 855 81 629 1050 147 1008 -1530 -1143 -1678 -358 -658 -1150 17 45 1181 525 1170 297 185
3940A85p71n95r2O12L45P66m85L38J320l05k91q23j018J130j368J56J05M28M8
$$ 185 -586 -1181 -1273 -661 -316 450 -35 303 1623 1318 1027 204 -814 316 -1052 -896 -791 -363 -315
3959c15K97K51P59n05p2J55l07n31n16M14j136J472M84r32P14M64o20P70n5j66
$$ -315 -18 233 992 487 415 570 263 -268 -784 -370 -1506 -34 450 -482 232 696 76 846 791 625
3979F25j355N59q10L15p04J479l25L47R22o79L18o41p3Q34j464O22l17J93r8J70
$$ 625 -730 -171 -981 -666 -1370 109 -216 131 1053 374 692 51 -22 812 -652 -30 -347 -154 -252 -82
3999h2P65L37j61J74q91j87o29J85o7n11P59m55P16R1J03n72J253j2k39M74j380
$$ -82 683 1020 859 1033 142 -45 -674 -489 -556 -1067 -308 -763 -47 44 147 -425 828 816 577 1051 -329
4020c29L95P1n50N73k24r4k32P93O11n84N48M70j716l1L8P45o56l97M0K35Q03
$$ -329 66 137 -413 160 -64 -158 -390 403 1014 430 978 1448 -268 -299 -261 484 -172 -569 -529 -294 509
4041E09q18P64J02j587P24j74K99J141j491j38N38L98k25Q07l75q83J366j050
$$ 509 -309 455 557 -1030 -306 -480 -181 960 -531 -669 -131 267 42 849 474 -409 957 -93
4059i3n90r8K38j82K12L92l51Q10k49R9N69m64L02r92N30q71O68j69M44o11L22
$$ -93 -683 -781 -543 -725 -513 -121 -472 338 89 188 757 293 595 -397 133 -738 -70 -239 205 -406 -84
4080h4L16O07j12m5p03O56q73J7N7n97N31P42J92P1q31M73o65Q71n02p28p68R77
$$ -84 232 839 727 682 -21 635 -238 -221 -164 -761 -230 512 704 775 -56 417 -248 623 121 -607 -1375 -398
4102c98j96OR61r30N32j09P70j052O90j56m5j120P35J49j90P08Nn71J142j012
$$ -398 -594 -588 373 -557 -25 -134 636 -416 274 118 73 -1047 -312 -163 -353 355 360 -211 931 -81
4122h1O79o00K69j58j502J307k38j23n2j20P01j11O52q21O90l61p84J181j098
$$ -81 598 -2 267 109 -1393 -86 -324 -447 -499 -619 82 -29 623 -198 492 131 -653 528 -570
4141e70P07n89J001o92j24P73l38L90o02M10o30o70P47r08R08j205J917Q92j674
$$ -570 137 -452 549 -143 -267 506 168 558 -44 366 -264 -934 -187 -1095 -187 -1392 525 1417 -257
4160b57R76j820J698j002M51o16l93O83l43rJ176M48l42j78l95j85l24M58m31
$$ -257 719 -1101 597 -405 46 -570 -963 -280 -623 -632 544 992 650 472 77 -108 -432 26 -405
4179d05k70R9K75N32j15l75P38N78j235m62Q88L74r26J83m46k41J110k62k57L14
$$ -405 -675 -576 -301 231 116 -259 479 1057 -178 -640 248 622 -304 -121 -567 -808 302 40 -217 97
4199I7J68l08R92j102n09J00J734j233l27L54k27M97J6l97P93L10j330O40j044
$$ 97 265 -43 949 -153 -662 -562 1172 -61 -388 -34 -261 236 252 -145 648 958 -372 268 -776
4218g76Q15K22n25L62o01K67J674k014R91O46l84p6p54r56J000j271M04J016k39
$$ -776 39 261 -264 98 -503 -236 1438 -576 415 1061 677 601 -153 -1109 -109 -1380 -976 40 -199
4237a99k72L54P5J578j424K60k21j008O86q39J040k82N59j26p07J278j83J83p33
$$ -199 -471 -117 -42 1536 112 372 151 -857 -171 -1010 30 -252 307 181 -526 752 569 752 19
4256A9M17j098M34O51j402O54K39J19m95Q56n66P37r03Q69n68r02O47k29P19n67
$$ 19 436 -662 -228 423 -979 -325 -86 33 -462 394 -172 565 -338 531 -37 -939 -292 -521 198 -369
4276c69Q71j78r96J140k40n44L27L72q42j058K235n53p83j79J670J31l88m42k37
$$ -369 502 324 -672 468 228 -316 11 383 -459 -1517 718 165 -618 -797 873 1004 616 174 -63
4295f3N90l22J4k76R17j556Q78n95N22J80q68m69N12N52Q2j06k21j60O33o5j055
$$ -63 527 205 219 -57 860 -696 182 -413 109 289 -579 -1048 -536 16 98 -8 -229 -389 244 179 -876
4316h76L05o32J033J27L78o18R3r51N72P9l7N92l30K91m07j98j63K20O10O81l16
$$ -876 -571 -1203 -170 -43 335 -283 -190 -1141 -569 -490 -527 65 -265 26 -381 -579 -742 -522 88 769 453
4337D53K19p26J6L17M29j235R83L59j193J169q98j31L89O3K5j123J248J62o50
$$ 453 672 -54 -38 279 708 -527 456 815 -378 791 -107 -238 151 214 239 -884 364 526 -124
4356a24L79K0q40J092r05P40K03L68j891P11j34QL58L25p57J283M6j167N80m70
$$ -124 255 275 -565 527 -378 362 565 933 -958 -247 -381 -373 -15 310 -447 836 882 -285 295 -175
4376a75N71m99n75Q00j199P13M62k63K12K15o16P9O72q67N74k0K0N0n7N02m09
$$ -175 396 -103 -678 122 -1077 -364 98 -165 47 262 -354 -275 397 -470 104 84 104 154 97 599 190
4397A90o73p3J497r12Q3l02O4l66J394o61m67K80J070r86o38J218j226R3M36m39
$$ 190 -483 -556 941 29 112 -190 -126 -492 902 241 -226 54 1124 138 -500 718 -508 -415 21 -418
4417d18J21l2Q32k36j9l31p12R67j241J651q07J46K25k87k36L47J5N52n31N06
$$ -418 -297 -329 503 267 248 -83 -795 172 -1069 582 -225 -79 146 -141 -377 -30 -15 537 6 512
4437E12o68N38l73M19K7n41o35N87K4l78m13J090K11q59M18L5l50Q01N10j611
$$ 512 -156 382 9 428 455 -86 -721 -134 -110 -488 -901 189 400 -459 -41 -6 -356 445 955 -656
4457f56r5J398o45j12P5o8m09l67J653j426J060o31m55J262p86M20J36r70J209
$$ -656 -751 647 2 -110 -35 -103 -512 -879 774 -652 408 -223 -678 584 -202 218 354 -616 593
4476E93k86o87N05o09l25J054J058o15m25j85k8k50m64M91j463J429Q3j21l65
$$ 593 307 -380 125 -484 -809 245 1303 688 263 78 50 -200 -664 -173 -1636 -207 -124 -245 -610
4495f10J062r28J432j096J203j017j78m34O94m29K17M29K88q28l40J103m43m49
$$ -610 452 -476 956 -140 1063 46 -132 -566 128 -301 -84 345 633 -195 -535 568 125 -324
4513c24M87m27R38j154O19N12j173P85l83m04N91K44p26N99m17J373j739P34m2
$$ -324 163 -264 674 -480 139 651 -522 263 -120 -524 67 311 -415 184 -233 1140 -599 135 93
4532I3l13n2L83L20o75L05m99k9J146k76j25j72j098Q11L39k39J80j32j67Q22
$$ 93 -220 -272 111 431 -244 61 -438 -467 679 403 278 106 -992 -181 158 -81 99 -33 -200 622
4552F22n06r1l1N14q36m88R84j003J189M31r43m5J316j442K09J284j571M32L23
$$ 622 116 25 -6 508 -328 -816 168 -835 354 785 -158 -203 1113 -329 -120 1164 -407 25 348
4571C48o94L33N45l11m41l76R90o28N56k42J395j865k27J123O64j73p29j034N28
$$ 348 -346 -13 532 221 -220 -596 394 -234 322 80 1475 -390 -617 506 1170 997 268 -766 -238
4590b38j97M67m8O10j371J602l23q59R79m99n99N30J31o2N94k12R88j312n23P33
$$ -238 -435 32 -16 594 -777 825 502 -357 622 123 -476 54 185 123 717 505 1493 181 -342 391
4610C91l81M90k04L11p5m13J76J97N06j498p36N65L56N78n56m50P74O00j620J002
$$ 391 10 500 296 607 532 119 295 492 998 -500 -1236 -671 -315 263 -293 -743 31 631 -989 13
4630A3n57R29K48j053J122l49O25j453O41j425Q85Q37l12k50K29N81p56J31q39
$$ 13 -544 385 633 -420 702 353 978 -475 166 -1259 -374 463 151 -99 130 711 -45 86 -753
4649g53M72P34j77j109P89p0p59O91O96j595P16K46n55J557j284P97l77K63K9
$$ -753 -281 453 276 -833 -44 -114 -873 -182 514 -1081 -365 -119 -674 883 -401 396 19 282 311
4668C11p09J304j73l06n18R83q81m49P03J6O7M67j95j089J040R0r14L04O93J25
$$ 311 -398 906 733 427 -91 892 11 -438 265 281 348 815 620 -469 571 661 -253 51 744 869
4688H69j311o3J084l75p07J245k82j109J369j003M63J87J21l66o92M20m7Q89m99
$$ 869 -442 -505 579 204 -503 742 460 -649 720 -283 180 367 488 122 -570 -150 -197 692 193
4707A93l47j28K80p02J944n08r23L25K44j28j58j90N73r48J127l98J08q61K90
$$ 193 -154 -282 -2 -704 1240 732 -191 134 378 250 92 -98 475 -473 654 256 364 -497 -207
4726b07P09m58m4j38k01J79N88J033j435j37K07n90%J155j015M96k89n1O61p06
$$ -207 502 44 0 -138 -339 -160 428 1461 26 -111 96 -494 -494 661 -354 142 -147 -198 463 -243
4746b43P79j053J01l4M40j154M87q1J756j172m39P17m28O88L37r31O2K07J59m41
$$ -243 536 -517 -416 -450 -10 -1164 -677 -758 998 -174 -613 104 -324 364 701 -230 -168 39 198 -243
4766b43l90R19j115K90J75J29Q88K21n51j45m60kO92m23n21J14q3Q48m49K18J328
$$ -243 -633 286 -829 -539 -364 -235 653 874 323 178 -282 -284 408 -15 -536 -422 -505 343 -106 112 1440
4787A440j234m19m23J130n68l11M53J04L7k93R4J39M52J79j095Q37k77l90pq2
$$ 1440 206 -213 -636 494 -74 -385 68 172 209 -84 10 149 601 780 -315 522 245 -145 -152 -234
4807b34l75k65J158J09n12R22j94l82n13P41n75J70q90N27n73P72J017j395Q38
$$ -234 -609 -874 284 393 -119 803 609 227 -286 455 -120 50 -840 -313 -886 -114 903 -492 346
4826C46m48p12O82O91L18k68j463N87N67m48K35o96Q12p66J174n70K98j03j368
$$ 346 -102 -814 -132 559 877 609 -854 -267 300 -148 87 -609 203 -563 611 41 339 236 -1132
4845a132J089n90J92j4N5K88K0L64L8n63m03R22k49M82q2n36k0L18q56k40J200
$$ -1132 -43 -633 -441 -455 -400 -112 -92 272 310 -253 -656 266 17 499 417 -119 -139 179 -677 -917 283
4866B83o49O62r30J091l1j062J046m05k00J00j29N09k13P98n84Q59k29j269P25
$$ 283 -366 296 -634 457 426 -636 410 5 -195 -95 -224 285 72 870 286 1145 916 -353 372
4885C72j663J537M60j71k53j457R72J033j101J32j74P9o75R57L0r40Q50p5L34
$$ 372 -1291 246 706 535 282 -1175 -203 830 -271 -139 -313 -234 -909 48 78 -862 -12 -87 247
4904B47k25Q34r81K40rk90Q0M27k68o65O00o9L39r27p3P27M53p28O49o59l1m4
$$ 247 22 856 -125 115 106 -184 -104 323 55 -610 -10 -79 260 -667 -740 -13 440 -288 361 -298 -329 -373
4926c73p54J829r68K44j205J861l88n12l0J74L22n2N31q83J38mm57k43M93N99
$$ -373 -1127 702 -266 -22 -1227 634 246 -266 -296 -122 200 148 679 -204 -66 -70 -527 -770 -277 322
4946C22n71R26k5m14l46p12J063L18j141K0R59k23o1o80O38j31J82n2K60n72j15
$$ 322 -249 677 652 238 -108 -820 243 561 -580 -560 399 176 115 -565 73 -58 124 72 332 -240 -355
4967c55P06j233Q84j4R9N75Oj246J39o83J158L24N56j502P54J41j38L03o9k36
$$ -355 351 -882 2 -12 87 662 668 -578 -439 -1122 36 360 916 -586 168 309 171 474 405 169
4987A69l34L85O9j74p42J8R66Q23j342N64l71q02kO79j79O83q11P44j580J017
$$ 169 -165 220 289 115 -627 -609 357 1180 -162 402 31 -771 -773 -94 -273 410 -401 343 -1237 -220
5007b20n49J760j821J201L69j381P62O8m00K61l14K70P76p41o09N29N64r89J294
$$ -220 -769 991 -830 371 740 -641 121 189 -211 50 -264 6 782 41 -568 -39 525 -464 830
5026H30m22j20M9p76k36J70R1J052N99o04r6J22j195N54K68L47j867J585j012
$$ 830 408 288 337 -439 -675 -505 -414 638 1237 633 537 659 -536 18 286 633 -1234 351 -661
5045f61J066j272J002q98L45R87o23l4K44L42j337Q47l85P7R57l54j20q7k1j12
$$ -661 405 -867 135 -763 -418 569 -54 -88 156 498 -839 8 -377 -300 657 303 183 96 75 -37
5065c7k93M8k44k00N10K06Q5k74N21o3m90L69J26j02L38j33q70Q88k30k46J046
$$ -37 -330 -282 -526 -726 -216 -10 75 -199 322 259 -231 138 264 162 500 367 -503 385 155 -91 955
5086I55j336P88n54N46J2j150J431m19J8O83n91n80o08J82K33J00M46m96J044
$$ 955 -381 407 -147 399 411 -739 692 273 291 974 383 -197 -805 -623 -390 -290 156 -340 704
5105G04l80j086P66m82J05J032j117J157j034M69L29j009J464k50q04L11J1M60
$$ 704 324 -762 4 -478 -373 659 -458 699 -335 134 463 -546 918 668 -136 175 186 646
5123F46j111mP0l58Q51q66O20k00N23N9Q03r27o39P99o01O04k64l42J011j55n07
$$ 646 -465 -469 -399 -757 94 -772 -152 -352 171 230 1033 106 -533 266 -335 269 5 -337 674 519 12
5144A2K33j37j009J479P7q73K41k07Q50r3r50R86L9o45l75O64j219M28J213j105
$$ 12 245 108 -901 578 655 -218 23 -184 666 573 -377 609 648 3 -372 292 -927 -499 714 -391
5164c91n24J246L1j036P52o47Q57m42k09O52p28k87J65J05K24j6N33o44R8j91
$$ -391 -915 331 362 -674 78 -569 288 -154 -363 289 -439 -726 -561 -456 -232 -248 285 -359 -261 -452
5184d52L15R55j679R70k0q95J325l70Q82n30K35j119J071R3J04r01l78J15K86
$$ -452 -137 818 -861 109 89 -806 519 149 1031 501 736 -383 688 781 885 -16 -394 -279 7
5203Gj68k21K03j93l12J111O52o18p7p42N32r80P19j40Nn17J066L25p93K21M62
$$ 7 -161 -382 -179 -372 -684 427 1079 461 384 -358 174 -806 -87 -227 -222 -739 327 652 -141 80 542
5224E42j371P97O67q72m6R14r31J51p59J365k09l53r5M54p7l13M71m39l49M79
$$ 542 -829 -32 635 -237 -283 631 -300 -149 -908 457 248 -105 -200 254 177 -136 335 -104 -453 26
5244B6O39r57p3m15J271p68J257j71j550P06k87J37J74j05Q13j399M83K57k66
$$ 26 665 -292 -365 -780 491 -277 980 809 -741 -35 -322 -185 -11 -116 697 -702 -219 38 -228
5263b28Q01o05L93M2m30o3k71q77J515P25n2o00M84l42m40K35j061L2k30O2Q80
$$ -228 573 -32 361 403 -27 -90 -361 -1238 277 1002 950 350 834 492 52 287 -774 -742 -972 -910 -30
5284c0p49lR84M80p83J51o6o94L11Q70n87K37O03j023O03l74R00m28M55M6p06
$$ -30 -779 -782 202 682 -101 50 -16 -710 -399 471 -116 121 724 -299 304 -70 830 402 857 903 197
5305A97n65n82N11N19J24n06J40K11k6j003R97l75J80L50N29r64L82k91l51M19
$$ 197 -368 -950 -439 80 204 -302 -162 49 23 -980 17 -358 -178 172 701 -263 119 -172 -523 -104
5325a04J22K29l81M67l54nJ301j389m24J128r71O34l17r15J253p56M24O37o27
$$ -104 18 247 -134 333 -21 -26 1275 -114 -538 590 -381 253 -64 -979 274 -482 -58 579 -48
5344d8O2n21J253j3q63N42K34K68n51Q5j85o10r9j23o92J004j24j08p22J454q43
$$ -48 14 -507 746 733 -130 412 646 914 363 448 263 -347 -446 -569 -1261 -257 -381 -489 -1211 243 -600
5365f00M78K16o69J096r03J49J224j229O84j207O32l48q7M4r73J732m85j28m42
$$ -600 -122 94 -575 521 -382 -233 991 -238 446 -761 -129 -477 -564 -520 -1493 239 -246 -374 -816
5384h16Q21M62L36j649M62O22n53R67O0j104N18q13N77J042j249M06J28j07j99
$$ -816 5 467 803 -846 -384 238 -315 652 712 -392 126 -687 -110 932 -317 89 217 110 -89
5403h9R55j362J500r66M19o26n92L99M19r65J075Q0n32p05N32N26j19J27M84j63
$$ -89 866 -496 1004 38 457 -169 -761 -362 57 -908 167 247 -285 -990 -458 68 -51 76 560 397
5423C97j380K235j805j0O40n19L33J87N99k54L09j604O48L23O55j142p47J731
$$ 397 -983 1252 -553 -563 77 -442 -109 78 677 423 732 -872 -224 99 754 -388 -1135 596
5441E96j006J788n31r21L44m12K36J82L35o20K12p8l75n41J282Jj682J551l07
$$ 596 -410 1378 847 -74 270 -142 94 276 611 -9 203 125 -250 -791 491 492 -1190 361 54
5460E4M36p55j03L91j92j72m45J180l50Q8L30n48j8M50l27J25Lo7K61J5j388K71
$$ 54 490 -265 -368 23 -169 -341 -786 394 44 132 462 -86 -104 346 19 144 147 80 341 356 -1032 -761
5482g61J866j300Q98j252J38M04L22p62J93%M0N52k79o37R30j090O23J44O26J017
$$ -761 1105 -195 703 -549 -411 -7 315 -447 -254 -254 -214 338 59 -578 352 -738 -115 29 655 1672
5502A672k633J336N25n91p02n57M43P41n67O08o27M18J159j833J278l41p70M95
$$ 1672 -961 375 900 309 -393 -950 -507 234 -333 275 -352 66 1225 -608 670 329 -441 54
5520E4p62J151j108Q38n85l14L25l21J252l40r21N51P08j105J14K17k08m3M33
$$ 54 -708 443 -665 173 -412 -726 -401 -722 530 190 -731 -180 528 -577 -463 -246 -454 -497 -64
5539f4J03p40J101l19p99R66K65o31O63p97J066n18l09R83p67k6j05N85L36r10
$$ -64 39 -701 400 81 -718 248 513 -118 545 -252 814 296 -13 970 203 177 72 657 993 83
5559H3R92k21j942L79J722R1j371K88m5o4O54l51n4M49M14r27j01l82Q79p1J91
$$ 83 1075 854 -1088 -709 1013 1104 -267 21 -24 -88 566 215 161 610 1024 97 -4 -386 493 422 613
5580F13j043j14M57J24l27J65M31J33j117J177m53l7K59k69k12O4O48k1m66n05
$$ 613 -430 -544 -87 37 -290 -125 306 439 -678 499 46 9 268 -1 -213 -149 499 478 12 -493
5600d93J444o5Kj074o6N71l54j93K46m77Q00q37J006o65l02P53M19j675M32N97
$$ -493 951 886 888 -186 -252 319 -35 -228 18 -459 341 -496 510 -155 -457 296 715 -960 -528 69
5620F9k52K93J05o33O11r1n61N59L56j273P81n31J278r81n2k50R43n02J25K43
$$ 69 -183 110 215 -418 193 102 -459 100 456 -817 -36 -567 711 -270 -322 -572 371 -131 -6 237
5640B37j442O14L22l3m58J723k94j042k41O42Q23l01K15p80J66J20q29J108o81
$$ 237 -1205 -591 -269 -302 -760 963 669 -373 -614 28 851 550 765 -15 151 271 -558 550 -131
5659a31J174m60j121J289j711O22j89J064n45M15o49N72j269J21n6R29J92k86
$$ -131 1043 583 -538 751 -960 -338 -527 537 -8 407 -242 330 -939 -818 -874 55 247 -39
5677c9J181p03q14j92M24PO87p32j311J807r44R10k83N96j54m40m33M50l53O60
$$ -39 1142 439 -375 -567 -143 -136 551 -181 -1492 315 -629 281 -2 594 440 0 -433 17 -336 324
5697C24n04J04J285o83J43j185L81P62K57j452L20M79Kl79k7J39j44J58k72l7
$$ 324 -180 -76 1209 526 669 -516 -135 627 884 -568 -248 231 233 -146 -173 -34 -178 -20 -292 -329
5717c29M19m96Q13j51j221J454j066P56l05p9O11j249J447j107J134K18n68m44
$$ -329 90 -406 407 256 -965 489 -577 179 -126 -205 406 -843 604 -503 631 849 281 -163
5735a63l76R25K20j155J078m43N22q18M33k1k58K76k94L91K16p44L2O16o81P30
$$ -163 -539 386 606 -549 529 86 608 -210 223 202 -56 220 -74 317 533 -211 -179 437 -244 486
5755D86k06k36m08j18J475j430N14L91q40J21R94j174N67L80o58N8J368l69j186
$$ 486 280 44 -364 -482 993 -437 77 468 -372 -251 743 -431 136 516 -142 -84 1284 915 -271
5774b71j97Q07n39j36J360p73m72J334j108J13k72P66k75o45l98J021j36j125
$$ -271 -468 339 -200 -336 1024 251 -221 1113 5 118 -154 612 337 -308 -706 315 179 -946
5792i46N16J51P07k83l69N59Q73j196l88q92Q06m3m41R35j96O99O1j049J544p95
$$ -946 -430 -279 428 145 -224 335 1208 12 -376 -1268 -462 -505 -946 -11 -207 492 553 -496 1048 253
5812B53N8Q90j926P95k64M7m53J278l63j72J42n71L37L31m48j50L85j818J717
$$ 253 311 1201 -725 70 -194 -147 -600 678 315 143 285 -286 51 382 -66 -216 169 -1649 68
5831F8n54k32k0O03M00j85Q66j839J111L1k44l02K53K94o98O78o23O79n19J158
$$ 68 -486 -718 -738 -135 265 80 946 -893 218 249 5 -297 -44 250 -448 230 -393 286 -233 925
5851I25q84N1o31M13N15j317J332q07L23K8j16Q47q6p20k10P21m55K01l75O81
$$ 925 41 92 -539 -126 389 -928 404 -403 -80 -52 -168 679 593 -127 -337 384 -71 130 -245 436
5871D36q78K85N37m18m80J977j133p84M62L13m75k47J155l06j67o40M0K87l67
$$ 436 -442 -157 380 -38 -518 1459 326 -458 4 317 -158 -405 750 444 277 -363 -323 -36 -403
5890d03K38J182m71j4p97m28N39K66j01L63N07m72p2J90r35L59j6K11k07L74q65
$$ -403 -165 1017 546 532 -265 -693 -154 112 11 374 881 409 337 527 -408 -49 -65 146 -61 313 -552
5911e52j46N70J99J44j60j25O40p15O78j04j071O02n46J42l91Q90j55N59k39m85
$$ -552 -698 -128 71 215 55 -70 570 -145 533 429 -642 -40 -586 -444 -835 55 -100 459 220 -265
5931b65k32J20O74r00K79k95k41J147K49m98m73K50N63n12n37N39p94N89N90j358
$$ -265 -497 -377 297 -603 -324 -619 -860 287 536 38 -435 -185 378 -134 -671 -132 -926 -337 253 -1105
5951a105J302K67j094M83M24K95p80N75l07j223J383r60J90qK52l69J149m10N72
$$ -1105 197 464 -630 -147 277 572 -208 367 60 -1163 220 -740 -550 -558 -306 -675 474 64 636
5970F36j00n34M71n6j377J022j90K1N14j6j68K27j21J57O4o97k46J83l02%M16
$$ 636 536 2 473 417 -960 62 -128 -107 407 391 223 450 329 486 550 -147 -393 -210 -512 -512 -96
5991i6n79K30N84M66q95K58o75N78l2q1L31j104J501k78q30K36M13Q64o72k47
$$ -96 -675 -445 139 605 -290 -32 -707 -129 -161 -242 89 -1015 486 208 -622 -386 27 891 219 -28
6011b8N01o34q9O16p94J144q56l28N27k63J289q15r18J054j511l05J885j407N26
$$ -28 473 -161 -250 366 -428 716 -140 -468 59 -204 1085 270 -648 406 -1105 -1410 475 -932 -406
6030d06K45o53M12K94N53j075M68K34q96J029l13L05J1r95R14J80n89K09L71P7
$$ -406 -161 -814 -402 -108 445 -630 -162 72 -824 205 -108 197 208 -787 127 307 -282 -73 298 375
6050C75L67j218Q56j543N91O09K74R1J12K23o14P17j165M16m40M14j40l10K16
$$ 375 742 -476 380 -1163 -572 37 311 402 514 737 123 840 -325 91 -349 65 -75 -385 -169
6069a69L43K83l01R2n88Q15j54j15p99M43l0k98N23j010J986j506J027j090M95
$$ -169 174 457 156 248 -340 475 321 206 -593 -150 -180 -478 45 -965 1021 -485 542 -548 -53
6088e3l51R79M35j644P19o61N85L20k99N55q7j77L37l65j56N42j645O16k93J83
$$ -53 -404 575 1010 -634 85 -576 9 329 30 585 498 321 658 293 137 679 -966 -350 -643 -460
6108d60K15L99qP51p96l18M27k77k50J43N92j280J799j678O7J079l83P62j6j498
$$ -460 -245 154 146 897 101 -217 210 -67 -317 -174 418 -862 937 -741 -674 405 22 784 768 -730
6128g30O58p82K87k22k74J299j260M70N62P39p89qO69p96M72o90Q6L21J83j228
$$ -730 -72 -854 -567 -789 -1063 236 -1024 -554 8 747 -42 -50 619 -177 295 -395 -309 12 195 -1033
6148a033Q84P08J48r98K25M60M02m09j16j14k23l55k18J312j345N12J155j216
$$ -1033 -149 559 707 -291 -66 394 796 387 271 157 -66 -421 -639 673 -672 -160 995 -221
6166b21O34L46M17p39l49L11p07q70J984m81K60r29O96P07j56m74j722J130q5
$$ -221 413 759 1176 437 88 399 -308 -1178 806 325 585 -344 352 1059 903 429 -1293 -163 -248
6185b48k23N87m54K37k57J835o91j13n70n95Qm29L43l46L78m53L1N68L06M32l50
$$ -248 -471 116 -338 -101 -358 1477 786 673 103 -492 -484 -913 -570 -916 -538 -991 -960 -392 -86 346 -4
6206dL2J10L88J16m75j114J496j674J704j052Q91j82oP37q65P57p11n53l58O58
$$ -4 28 138 526 642 167 -947 549 -1125 579 -473 418 236 230 967 102 859 148 -405 -763 -105
6226a05l63M23L4O20m95J19J86m46K47k95J59k16Q9j32l90j121Q35J117K49O74
$$ -105 -468 -45 -11 609 114 233 419 -27 220 -75 84 -132 -43 -175 -565 -1686 -851 266 515 1189
6246A189j202L06j3q6q06L1J66M49q38O98m43K44L71R9J30m37k30J8qL93k37R18
$$ 1189 -13 293 280 194 -612 -581 -415 34 -804 -106 -549 -305 66 165 295 -142 -372 -354 -362 31 -206 712
6268G12j100J034o64N3N24l47q76M36l29PM71m54n6Q40J33NQ5m17P49q09K84m94
$$ 712 -388 646 -18 35 559 212 -664 -228 -557 -550 -79 -533 -589 251 384 389 474 57 806 -3 281 -213
6290b13j049P94j76O71J208j672j96J976j620J33j95N19j536L77J703j103p54
$$ -213 -1262 -468 -644 27 1235 -437 -633 1343 -277 -144 -339 180 -1356 -979 724 -379 -1133
6307a133O72N9M91L0J014j275L38l0j241J135k7j014K49P00m99j80K034p69L3
$$ -1133 -461 -402 89 119 1133 -142 196 166 -1075 60 33 -981 -732 -32 -531 -711 1323 554 587
6326E87o80O43j144L01J73q45J095j402J353p41J014N86O25l94j213P03q95K10
$$ 587 -93 550 -594 -293 -120 -965 130 -1272 81 -660 354 940 1565 1171 -42 661 -234 -24
6344b4j83n97J234J30l48L52p68O12j61M03j465M75J49q06M21N63k2j80M83P16
$$ -24 -207 -804 430 560 212 564 -204 408 247 650 -815 -340 -191 -997 -576 -13 -35 -215 268 984
6364I84k48j66o89J29l28J77N0j60L16l6L20q33J403n64m82K61O99r91N00j44
$$ 984 736 570 -119 10 -318 -141 -91 -251 65 29 349 -484 919 355 -127 134 833 -158 342 198
6384A98p30o40J230L3J96o6q72J078o19J143q33o54M9J22k46L41P2L67J090j285
$$ 198 -532 -1172 58 91 287 221 -651 427 -192 951 118 -536 -487 -365 -611 -270 -198 169 1259 -26
6404b6M24K55j518m05j62J047l67J470r71k33l35R84N55j45L57l49k26n29j196
$$ -26 398 653 -865 -1270 -1432 -385 -752 718 -253 -486 -821 163 718 573 930 581 355 -174 -1370
6423a370K82m00J275P67j036P36J128q02n58Q90n63o37K85r24O06K97m3M25k30
$$ -1370 -1088 -1488 -213 554 -482 254 1382 580 22 912 349 -288 -3 -927 -321 -24 -67 358 128
6442A28o69J478k50l49o83M1l31n3J1K19O67M4P26j242L58l40K69L42l88o65L38
$$ 128 -541 937 687 338 -345 -304 -635 -688 -677 -458 209 253 979 -263 95 -245 24 366 -22 -687 -349
6463c49K22o59j29P31K31m88Q88J026j367R3R75j322J23j460J322j82K35L65m93
$$ -349 -127 -786 -915 -184 47 -441 447 1473 106 199 1174 -148 -25 -1485 -163 -345 -110 255 -238
6482b38O2R35m66p9l87q84J360j76n94j60M69j07J00L85P15j124J010j184L35
$$ -238 -176 759 293 214 -173 -1057 303 127 -467 -627 -158 -265 -165 220 935 -189 821 -363 -28
6501b8j25l7n92Q16j023Q92l09J585n50m28O30j279M03l26P79l66l43j85N46J52
$$ -28 -153 -190 -782 34 -989 -97 -406 1179 629 201 831 -448 -45 -371 408 42 -301 -486 60 212
6521B12J64n95Q41N20n39j340Q03p29K58M56j80K5N95n09N48j233KP11K18n62
$$ 212 376 -219 622 1142 603 -737 66 -663 -405 51 -129 -104 491 -18 530 -703 -701 10 228 -334
6541c34m47L66m30L82Q3J63o0O40k05O25q48J193j518R34o77J02l76P38N60p36
$$ -334 -781 -415 -845 -463 -380 -217 -277 363 158 783 -65 1128 -390 544 -133 -31 -407 331 891 155
6561A55m62J954j658m45R74m80R36l78j833K36K72P71k23J58J074O2l90j410o0
$$ 155 -307 1647 -11 -456 518 38 974 596 -1237 -1001 -729 42 -181 -23 1051 1113 723 -687 -747
6580g47K35o30L98J57R68l00n73O06LQ52n34J156j286j65k31m51J0R63j082N89
$$ -747 -512 -1142 -744 -587 381 81 -492 114 117 969 435 1591 305 140 -91 -542 -532 431 -651 -62
6600f2N22qR80r72j121O14l16k3L42k96m7K96k99N35Q5P05j080R3L46p93J145
$$ -62 460 452 1432 460 -661 -47 -363 -386 -44 -340 -387 -91 -390 145 230 935 -145 -52 294 -499 646
6621F46j607O18O41m79m54J16J595n85R59m27m93m42n91m2o3J091q71K57R44p76
$$ 646 -961 -343 298 -181 -635 -519 1076 491 1450 1023 530 88 -503 -545 -608 483 -388 -131 813 37
6641C7J010p60l50J083j159o21Q41k41q14N58p19R47O75j38l57N25j85K54k08
$$ 37 1047 287 -63 1020 -139 -760 81 -160 -974 -416 -1135 -188 487 349 -8 517 332 586 378
6660C78j594J760l95p1RJ36M7k41K89J49n64M74r10L98jJ326q71l76J15K98p58
$$ 378 -1216 544 149 78 87 223 270 29 318 467 -97 377 -533 -135 -136 1190 319 -57 58 356 -402
6681d02J084j16k7o27N20q48k34l61N23N83J521j813P43L42j127R39r91J91m15
$$ -402 682 566 539 -88 432 -416 -650 -1011 -488 95 1616 -197 546 888 -239 700 -291 -100 -515
6700e15P69p59L75O86r92L41J48L85L79J94r35J114j822R09l44j13J296k278J351
$$ -515 254 -505 -130 556 -436 -95 53 438 817 1011 76 1190 -632 277 -67 -180 1116 -1162 189
6719A89N12n47J39K24k90m01N86q03O54M49l74l86m5N92k56N5p02O94n49j79j21
$$ 189 701 154 293 517 227 -174 412 -391 263 712 338 -48 -93 499 243 298 -404 290 -259 -438 -559
6740e59J30m01M10J12J320j139O51l09m56M24q29K84k07J06N21j271P34Q72k19
$$ -559 -429 -830 -420 -308 1012 -127 524 215 -241 183 -646 -362 -569 -463 58 -1213 -479 393 174
6759A74J56K89L25l97L31j342J79N94QR3j382O74J433o09j195M64O58j097P28
$$ 174 330 619 944 547 878 -464 -285 309 317 410 -972 -298 1135 526 -669 -205 453 -644 84
6778H4q45O38q09n00J299N47k82L05k98M74m27K6k60L91r64j27O60o80P47n03
$$ 84 -761 -123 -932 -1432 -133 414 132 437 139 613 186 212 -48 343 -621 -748 -88 -768 -21 -524
6798e24N87J103O35r75j71l0o88J14q72n06Q70L80K95k89P55l52k96j84M17L74
$$ -524 63 1166 1801 826 655 625 -63 51 -821 -1327 -457 -77 218 -71 684 332 36 -148 269 643
6818F43r16L95k81r61J049q79R62J036M29j294J21N00j889J118n86J407q57K0
$$ 643 -273 122 -159 -1120 -71 -950 12 1048 1477 183 304 804 -1085 33 -553 854 -3 17
6836A7j17Q1L45n0j28lk91LM24j440J20M06J82J309l78j48J46k62k36j2P30o61
$$ 17 -100 -19 326 276 148 145 -146 -143 281 -1159 -1039 -633 -451 858 480 332 478 216 -20 -32 698 37
6858C7q95K73J091n39K28L82R5L10j80n61m12j99O99q62m2K0M00j92J57L06NQ25
$$ 37 -858 -585 506 -33 195 577 672 982 802 241 -171 -370 329 -533 -575 -555 -155 -347 -190 116 121 946
6880I46p00Q65j421P3M64K78o89o60J194q54Q96l80L19L07j457R89l50m18l1L87
$$ 946 246 1111 -310 -237 227 505 -184 -844 350 -504 392 12 331 638 -819 170 -180 -598 -629 -242
6900b42QK78P5L54p5l83Q57J8J61j848M77o12J95m55Q67J073o05l90P77n8J68
$$ -242 -234 44 119 473 398 15 872 890 1051 -797 -320 -932 -737 -1192 -325 748 143 -247 530 472 640
6921F40j676J723r19k19j92k62Q35n63k38J129n85J357k58J73j892P06K8m65Q05
$$ 640 -1036 687 -232 -451 -643 -905 -70 -633 -871 258 -327 1030 772 945 -947 -241 -213 -678 127
6940A27m30L40j8N07m45J106p65l19m33k9m51L84K64l83J208j021J388p46n20
$$ 127 -303 37 19 526 81 1187 422 103 -330 -359 -810 -426 -162 -545 663 -358 1030 284 -236
6959b36J441p91K32p84m13N05j66N96qj195M74N65J52p41k22R59m22k25K94n04
$$ -236 1205 414 646 -138 -551 -46 -212 384 376 -819 -345 220 372 -369 -591 368 -54 -279 15 -489
6979d89K1JR32n46j47P06j77P20j426N12L21m81p90M13J87N57l55k32P15Q77k92
$$ -489 -468 -467 465 -81 -228 478 301 1021 -405 107 428 -53 -843 -430 -243 314 -41 -273 442 1319 1027
7000A027q12M15j337M21L75n6p23N61k77M34J07l80P51J74m4q61j00n99J87O02
$$ 1027 215 630 -707 -286 89 33 -690 -129 -406 28 135 -245 506 680 636 -225 -325 -924 -737 -135
7020a35N38N98j434N98K54j24J06K06R3q44n27L14M43p35J35R56m98o83P59j705
$$ -135 403 1001 -433 165 419 295 401 607 700 -144 -671 -357 86 -649 -514 442 -56 -739 20 -1685
7040a685K544n75o84n15J033k59K19M8l09O41o22J015o18n67R24j189J539j070
$$ -1685 859 284 -400 -915 118 -141 78 126 -183 458 -164 851 233 -334 590 -599 940 -130
7058a30o04J177q11K22P1R17j26l93n01j90P44J26n54n17l52J348l82Q84m61o68
$$ -130 -734 443 -368 -146 -75 842 716 323 -178 -368 376 502 -52 -569 -921 427 45 929 468 -200
7078b00P73n97l62K15L7m59J508j220n47J232Q7k45J46Q7J70m8o42k5k87k59M15
$$ -200 573 -24 -386 -171 -134 -593 915 -305 -852 380 467 222 368 455 625 577 -65 -90 -377 -636 -221
7099b21L39l5j64P29r06O10L88l55o79O31q98M03l32O35Q79N62p15J00l88j78
$$ -221 118 83 -81 648 -258 352 740 385 -294 337 -561 -158 -490 145 1024 1586 871 971 583 405
7119D05j25j93o0L7p24L29O10n81J47k41N05m94P48o82M44o61R57j274P22J031
$$ 405 280 87 27 64 -660 -331 279 -302 -155 -396 109 -385 363 -319 125 -536 421 -853 -131 900
7139I00n12O40j253N42l42M47j28o72O37M30n69j709N94Q94M50O89j229j9P77
$$ 900 388 1028 -225 317 -25 422 294 -378 259 689 120 -1589 -995 -101 349 1038 -191 -210 567
7158E67L27q43l84l67N54M77j733J684P66l95l18m60l75m08l50J370o70O52j54
$$ 567 894 51 -333 -700 -146 331 -1402 282 1048 653 335 -125 -500 -908 -1258 112 -558 94 -60
7177f0N30l04n24M35J10O5n46J401j033m76L58j94k76K87q54J491k60P41r94K38
$$ -60 470 166 -358 77 187 252 -294 1107 74 -402 -44 -238 -514 -227 -1081 410 150 891 -103 135
7197A35P0p99J033Po08m35R73J99j008R63j75K48k02Pm04j85N71k65j90k86M12
$$ 135 205 -594 439 446 -162 -597 376 575 -433 530 355 603 401 408 4 -181 390 125 -65 -351 61
7218F1m7L26p87P45P22k08o82l06o10J99k6Q09M19k01j095N80j26J002m55j0L29
$$ 61 14 340 -447 298 1020 812 130 -176 -786 -587 -613 196 615 414 -681 -101 -227 775 320 310 639
7239F39j472O8J851j89l00k49q52k45M89P99j683J333o12Q62J46j262R52n70N68
$$ 639 -833 -765 1086 897 597 348 -504 -749 -260 539 -1144 189 -423 439 585 -677 275 -295 273
7258B73o9j58K31Q78j964R21O24j219M12J3j3J36l43R47j380N00J040p57M08m70
$$ 273 204 46 277 1155 -809 112 736 -483 -71 -58 -71 65 -278 669 -711 -211 829 72 480 10
7278A0n08M29k29q03J362K59r54O62O70m59k39j146Q39L18o75OO18k23m6N7O86
$$ 10 -498 -69 -298 -1101 261 520 -434 228 898 439 200 -946 -107 211 -464 -458 160 -63 -109 -52 634
7299F34k58l28k71j9K47N10p24m3p3m19J43R59p80M64K88p63O55k90L6P59k98
$$ 634 376 48 -223 -242 5 515 -209 -252 -325 -744 -601 358 -422 42 330 -433 222 -68 -32 727 429
7320D29o84J165j338k1J263o06j16p0P66p33p33J206r46Q17p10R11r06O77R10
$$ 429 -255 910 -428 -449 814 208 92 22 788 55 -678 528 -418 399 -311 600 -306 371 1281
7339A281o91J23j012J472j396K70n43R92l03j001m35P37L90j14J242j701K50k3
$$ 1281 590 713 -299 1173 -223 47 -496 496 193 -808 -1243 -506 -116 -230 1012 -689 -439 -462
7357d62J433q78J63m04m34N32j527J596L91L2N12r04r87Q59J68k26K29j06j49
$$ -462 971 93 256 -148 -582 -50 -1577 19 410 442 954 50 -937 -78 90 -136 93 -13 -162
7376a62k03J077j536J770j042N39M01j044m67J304j571OR67p3O58J56j159L64
$$ -162 -365 712 -824 946 -96 443 844 -200 -667 637 -934 -928 39 -34 624 780 -379 -15
7394a5P42n27N42q37M42o95l69L41L43l91lM19J70R8k81l67O77L71p93n3M02m70
$$ -15 727 200 742 -95 347 -348 -717 -376 -33 -424 -427 -8 162 260 -21 -388 289 660 -133 -186 216 -254
7416b54M06j90Q02o44K06k72O31o76j93O81K62K25j046r91Q88N49j332J384M3
$$ -254 152 -38 764 120 326 54 685 9 -184 497 759 984 -62 -1053 -165 384 -948 436 479
7435D79j004J118K62o76m19l41o87J612lq53Q1J94M17o43j58o06R01K37M83M9
$$ 479 -525 593 855 179 -240 -581 -1268 344 341 -512 -431 -237 180 -463 -621 -1227 -326 -89 394 443
7455D43p78q1L89m30K77O32j186J023k61Q32q04K7m21Q08l41l90P62n24m62J222
$$ 443 -335 -416 -27 -457 -180 452 -734 289 28 860 56 83 -338 470 129 -261 501 -23 -485 737
7475G37n41pn34R96j105m99N48N67l94J83K31n03L87j36J65L36n26o40J576o48
$$ 737 196 189 -345 651 -454 -953 -405 162 -232 -49 182 -321 66 -70 95 431 -95 -735 841 193
7495A93o25m30O99K032j967J015r39M05j30p18L28mL92L51r89P30N01j153K54
$$ 193 -432 -862 -163 1869 -98 917 -22 383 253 -465 -137 -141 251 602 -387 343 844 -309 -55
7514e5K99j20O56m19k54m92J52l82L28o0j20M80K65n45l15J065o89O89m03j12
$$ -55 244 124 780 361 107 -385 -233 -615 -287 -347 -467 13 278 -267 -582 483 -206 483 80 -32
7534c2N29k85o16Q92m07R57j880N76k47J50m90J075o82J191p04l65N59o28J157
$$ -32 497 212 -404 488 81 1038 -842 -266 -513 -363 -853 222 -460 731 27 -338 221 -407 750
7553G50n77L0J56m36o22j01J203m4j08L19n91r27N86p75q6J502q0n07L6N25o77
$$ 750 173 203 359 -77 -699 -800 403 359 251 570 -21 -948 -362 -1137 -1223 279 199 -308 -272 253 -424
7574d24J199k55k86o50R40o80M10o28K97l05J83J30R18q24o7J67L54l39n61J217
$$ -424 775 520 234 -416 524 -156 254 -374 -77 -382 -199 -69 849 25 -42 125 479 140 -421 796
7594G96p29rn56J341r32J65K69m96Q73K6j454j56K289j510j052N93N17j12Q76
$$ 796 67 58 -498 843 -89 76 345 -151 722 748 -706 -862 1427 -83 -1135 -542 -25 -137 739
7613G39q47J614j298j09M35j70J84k14l68p5L93n89l67Q53l93o13R33J29j80l46
$$ 739 -108 1506 208 99 534 364 548 334 -34 -109 284 -305 -672 181 -212 -825 108 237 57 -289
7633b89N98O1k39l48l16J043p18j5L21O91r07P62o23O92j23r09J769p60j067M91
$$ -289 309 370 131 -217 -533 510 -208 -223 98 789 -118 644 21 713 590 -319 1450 690 -377 114
7653A14J89J74J26j86P50k745J655K78k47K44N55o81p4k06L18p55K05j9j10J4
$$ 114 303 477 603 417 1167 -1578 77 355 108 352 907 226 152 -54 264 -491 -286 -305 -415 -401
7673d01Q09j08o9M48j322R31r10J375n17M75n09o62L20N26p37M61N03l73j15R26
$$ -401 408 300 231 679 -643 288 -622 753 236 711 202 -460 -140 386 -351 110 613 240 125 1051
7693A051q56M4l84Q65j822L67R01r53J016P3L1o15m0P1J70N12o93k66m46J185
$$ 1051 195 239 -145 720 -1102 -735 166 -787 229 302 333 -282 -322 -251 -81 431 -262 -528 -974 211
7713B11l45Mq95O89K92k59j4j40R18p14K69q33O04L40K18k85K45n86P78k77l01
$$ 211 -134 -130 -1025 -336 -44 -303 -317 -457 461 -253 16 -817 -213 127 345 60 305 -281 497 220 -81
7734h1M52m58n85M02K97L22q26k14L37N10j5k2l20K48P03m57K83l88o30P43p72
$$ -81 371 -87 -672 -270 27 349 -477 -691 -354 156 141 119 -201 47 750 293 576 188 -442 301 -471
7755d71R7J96L78l54J097o18o43P14j144Q22l52l5M04q04M94l40Q73o15o30J676
$$ -471 -374 -178 200 -154 943 325 -318 396 -748 74 -278 -313 91 -713 -219 -559 314 -301 -931 745
7775G45l65j01K08j106Q56p65o3j32J152m4l60R45l55J38M7p42M0j87N3j90L00
$$ 745 380 279 487 -619 237 -528 -591 -723 429 385 25 970 615 753 800 58 98 -89 -36 -226 74
7796G4K58n4l98Q6n35J127q4L1j289N86O9Q4m06R0K46k17N34k57M82p66M21L51
$$ 74 332 278 -120 -34 -569 558 474 505 -784 -198 -129 -45 -451 -361 -115 -332 202 -55 427 -339 82 433
7818D33m24N57m49j54O31o54O14K61o09J48m15J79K29N98n49p64J617p04K45o08
$$ 433 9 566 117 -37 594 -60 554 815 206 354 -61 118 347 945 396 -368 1249 545 790 182
7838A82L40J21r43J70k11N13n57j35M99Q58q42J031j288Q73k24L20j385J008j80
$$ 182 522 643 -300 -130 -341 172 -385 -520 -21 837 -5 1026 -262 611 387 707 -678 330 150
7857A50M7l61Q59k81j744J026J1k27M57J162j396K41N07m9O47j704P41j50m17
$$ 150 197 -164 695 414 -1330 -304 -293 -520 -63 1099 -297 -56 451 402 1049 -655 86 -64 -481
7876d81K16L50M41o79o01J926j510R96j434N47R72q54m16n0M91n30J786j460o0
$$ -481 -265 85 526 -153 -754 1172 -338 658 -776 -229 743 -111 -527 -577 -86 -616 1170 -290 -350
7895c50J79Q41l37l21l95J26J209j113L67N16m12R66j287k48l83R58j08L58k51
$$ -350 -171 670 333 12 -383 -257 952 -161 206 722 310 1276 -11 -259 -642 316 208 566 315
7914C15J47j20p24l62N05k70J7q3P66j126R5L82M27r51R52m83J128m79j95K20
$$ 315 462 342 -382 -744 -239 -509 -492 -575 191 -935 -840 -458 -31 -982 -30 -513 615 136 -59 161
7934A61j74K87N18q51m58J849j101j02o6L39k80o56J437q08K4P56p30m44J371
$$ 161 -13 274 792 -59 -517 1332 231 129 63 402 122 -534 903 95 119 875 145 -299 1072
7953A072q78k08O94j378J076j228K23J634j165k30n4J078j805J348J44K79J66
$$ 1072 194 -14 680 -698 378 -850 -627 1007 -158 -388 -442 636 -1169 179 323 602 768
7970G68o54m77J908j264o26K09J65j40m14l76J952j660L19m58R02K1k07M67p2
$$ 768 114 -363 1545 281 -345 -136 29 -111 -525 -901 1051 -609 -290 -748 154 175 -32 435 363
7989C63j39P02j226M83j32j89J363q80n7K57j67m54K81r06R55l87k20K41J50J
$$ 363 224 926 -300 183 51 -138 1225 345 288 545 378 -76 205 -701 254 -133 -353 -112 38 39
8009C9m88L47m25N76n71P87R19k064J048l81J37R0k76J95m19M74O64l96j440O08
$$ 39 -449 -102 -527 49 -522 265 1184 -880 168 -213 -76 14 -262 -67 -486 -12 652 256 -1184 -576
8029e76J39J288J61l11m45Q40j343M24p86Q35j4r4K7j83k1J79m3m06O6j36J194
$$ -576 -437 851 1012 701 256 1096 -247 177 -609 226 212 118 145 -38 -59 120 77 -329 -263 -399 795
8050G95m35j392R99n66M50k50k09R30K09p57L76q12J252L36j366L02K16rO75j243
$$ 795 360 -1032 -33 -599 -149 -399 -608 322 531 -226 150 -662 590 926 -440 -138 78 69 744 -499
8070d99R46j40R38j550K62k37n41K8J387o07r91O74Q90j03l10N77j184L77O78
$$ -499 447 307 1245 -305 -43 -280 -821 -793 594 -13 -1004 -330 560 457 147 724 -460 -83 595
8089E95o76N80n3j90R71j981L56J42O66m56o72N37j4j25M56k5k43L56k17k99P81
$$ 595 -81 499 446 256 1227 -754 -398 -256 410 -46 -718 -181 -195 -320 136 111 -132 224 7 -292 489
8110D89m53j3l55R68m36k54L07j360J538j29j03n90m6K72m39J066Q7q80O56J189
$$ 489 36 23 -332 636 200 -54 253 -1107 431 302 199 -391 -437 -165 -604 462 549 -331 325 1514
8130A514j715m38J101j12L02j428N08L27R4Q50j947J271N1K54m95r12L18K2Q32
$$ 1514 -201 -639 462 350 652 -776 -268 59 153 1003 -944 327 378 632 137 -775 -457 -435 397
8149C97k70j211J275K30j280N03Q39o83k9N70k82O95o36J53p0n23N49N3K61p46
$$ 397 127 -1084 191 421 -859 -356 483 -200 -229 341 59 754 118 271 201 -322 227 280 541 -205
8169b05n12R17n26P1k58M42J63J018q25l67k9O75p33P40o67Q63p18j08J26j156
$$ -205 -717 200 -326 -255 -513 -71 92 1110 285 -82 -111 564 -169 571 -96 767 49 -59 67 -1089
8189a089J386j208
$$ -1089 297 -911
8191i11
$$ Imaginary data points
##PAGE= N=2
##DATA TABLE= (X++(I..I)), XYDATA
0@%%%%%%%%%%%%%%%%%%%%%%%n8J52k02K16k16K16k16K29l05L89m20M42n08N90
$$ 0 0 0 0 0 0 0 0 0 0 0 0 0 0 0 0 0 0 0 0 0 0 0 0 -58 94 -108 108 -108 108 -108 121 -184 205 -215 227 -281 309
37C09o41P22q16R05j007J117j242J370j513J673j847K035k243K471k708K981l305
$$ 309 -332 390 -426 479 -528 589 -653 717 -796 877 -970 1065 -1178 1293 -1415 1566 -1739
54a739L653m042M483m991N587o282P119q143R427j1103J3393j6716K1980l1602
$$ -1739 1914 -2128 2355 -2636 2951 -3331 3788 -4355 5072 -6031 7362 -9354 12626 -18976
68a8976N4894k04515k83417K86718j06466k17869J92595J60485j88089R9760K43352
$$ -18976 35918 -168597 -452014 -165296 -271762 -489631 -297036 -136551 -324640 -224880 18472
79A8472j00248r8234J90752J594j44748J20057J59488q9999K3037K06238K1219
$$ 18472 -81776 -180010 10742 12336 -132412 -12355 147133 57134 80171 286409 307628
90C07628q5857J11298N8221j71786p8693N1769j35862j59134N4281K933j34493
$$ 307628 221771 333069 391290 219504 140811 192580 56718 -102416 -48135 -45202 -179695
101a79695K9147R3281p8643l9598Q9149l4158r8906K3638J4165o1488K7803R1876
$$ -179695 -150548 -57267 -135910 -175508 -86359 -120517 -219423 -195785 -181620 -243108 -215305 -123429
113a23429M4330N0876R4065P9420L9385K1061K7741J0337n3648n2875N251l2615
$$ -123429 -79099 -28223 65842 145262 184647 205708 233449 243786 190138 137263 142514 109899
125A09899o9106K7830L8683n9058j7916N0723n7238r6426Q260k7560j25505k8785
$$ 109899 40793 68623 107306 48248 30332 81055 23817 -72609 -64349 -91909 -217414 -246199
137b46199M9965m7790k3222J22265P0534k6602Q2143J17094m2102l1578R9944
$$ -246199 -196234 -244024 -267246 -144981 -74447 -101049 -18906 98188 56086 24508 124452
148A24452l651j07509N5638Q0013q3841NJ41967k3582q8705Q7887O576j70183
$$ 124452 120801 13292 68930 148943 65102 65107 207074 183492 94787 182674 189250 19067
160A9067k2741M8708j49993r7785R5542k6739j09376J00731J01987q5660J7689
$$ 19067 -3674 45034 -104959 -202744 -107202 -133941 -243317 -142586 -40599 -126259 -108570
171a08570J29132m6149q4700Q8856L1850r8792L9755J14355l3148q484J33264
$$ -108570 20562 -25587 -110287 -21431 10419 -88373 -48618 65737 32589 24105 157369
182A57369L4994p2434N0801M5874j16237o1621M5465p0953j04764M7463K4972
$$ 157369 192363 119929 170730 216604 100367 38746 84211 13258 -91506 -44043 -19071
193a9071p8305J7052Q1663l7910m4483N2144j1137q1390K657L2296l7108j879
$$ -19071 -97376 -80324 1339 -36571 -81054 -28910 -40047 -121437 -118780 -86484 -123592 -125471
205a25471P3138L6430O702N9401O3066k640n910K5794j5248n7531j5186J0983
$$ -125471 -52333 -15903 -9201 50200 113266 110626 104716 130510 115262 57731 42545 53528
217E3528l3603k5725L8684J8266l1545R312L0854m0936n3922O740k4233p5271
$$ 53528 19925 -5800 32884 51150 19605 28917 59771 18835 -35087 -28347 -52580 -127851
229a27851r591L5144k1546m664P7952L9296j8738M9651N7828m1155k4521N0890
$$ -127851 -137442 -102298 -123844 -128508 -50556 -11260 -29998 19653 77481 36326 11805 62695
241F2695k2049o8020M2393M7378n0153J5130R0076j7848n2816N4313M362j02241
$$ 62695 40646 -27374 15019 62397 12244 27374 117450 99602 46786 101099 105461 3220
253C220k0182L0987q2943n7241O1319J595n5826O1069O9566n0901j952P5629l2846
$$ 3220 -16962 14025 -68918 -126159 -64840 -63245 -119071 -58002 11564 -39337 -41289 34340 1494
266A494o8942M6647K2036p2763J9728Q6175j7302j1571R0502K7527n7018K2641
$$ 1494 -67448 -20801 1235 -71528 -51800 34375 17073 5502 96004 123531 66513 89154
278H9154L0947p5575m8322L2170l4839o3098L5020L1914m1274J1300O0763k3400
$$ 89154 120101 44526 -3796 28374 -6465 -69563 -34543 -2629 -43903 -32603 28160 4760
290D760m2017L0301l167o5692o947L2953k4106j4080N9599L6326p245L6424M9228
$$ 4760 -37257 -6956 -10123 -75815 -82762 -49809 -73915 -87995 -28396 7930 685 37109 86337
303H6337j3688k0741J8735j5580m8863n518J5886k2558j0762M0370J5853k1252
$$ 86337 72649 51908 70643 55063 6200 682 16568 -5990 -16752 23618 39471 18219
315A8219J3790K2610l8094m0122P019j8642n6200K036L4283j5676l15O1544K5199
$$ 18219 32009 54619 16525 -23597 -16578 -35220 -91420 -89384 -55101 -70777 -71092 -9548 15651
328A5651k0315K9671L5193m0169k4199L2414k0562m6352L5352L5009l1970J7382
$$ 15651 -4664 25007 60200 20031 -4168 28246 7684 -38668 -3316 31693 -277 17105
340A7105O3347j4643l5551L8400k304p7789j1594K4999n6866l6163N4397R517
$$ 17105 80452 65809 30258 68658 66354 -11435 -23029 1970 -54896 -91059 -36662 -27145
352b7145l7601M5983N0351l7794r107M8273k8737n5106K9859J3209m9368J7408
$$ -27145 -64746 -18763 31588 -6206 -15313 32960 4223 -50883 -21024 -7815 -57183 -39775
364c9775O4254j3461p074O4930J4905m7368J2543K2449n7794l5376K6356j8515
$$ -39775 24479 11018 3944 68874 83779 36411 48954 71403 13609 -21767 4589 -13926
376a3926m1170L1244L1549k4261Q507M2681j6703l3793J6224l795n0319m441K2992
$$ -13926 -55096 -23852 7697 -16564 -8057 34624 17921 -15872 352 -3443 -53762 -58203 -35211
389c5211j4609o860M6048K6974q650K2888L3732j7563k3737J1626j1167l7289
$$ -35211 -49820 -56680 -10632 16342 7692 30580 64312 46749 23012 34638 23471 -13818
401a3818l542J8462r114n308L2235J7160j4136M620J6181k8410l3965O159j2426
$$ -13818 -17360 1102 -8012 -13320 18915 36075 21939 26559 42740 14330 -19635 -13476 -25902
414b5902l9457O179L0506j3254K408M8909J6217k3037J9090K3414l8933k3469
$$ -25902 -65359 -59180 -28674 -41928 -39520 9389 25606 2569 21659 45073 6140 -17329
426a7329K6595j3945l5454K8680L3217k0691J0771N0662j1976l0747K6438m605
$$ -17329 9266 -4679 -40133 -11453 21764 1073 11844 62506 50530 19783 46221 41616
438D1616o0042p519K3322m0980k2728M7968J1443l1129L6509M1157l7605j2803
$$ 41616 -18426 -25945 -2623 -43603 -66331 -18363 -6920 -38049 -1540 39617 2012 -10791
450a0791L7724k5064m8770K6520J3265l7863J6574N1419j0815o524M9783N299
$$ -10791 26933 1869 -46901 -20381 -7116 -44979 -28405 23014 12199 5675 55458 60757
462F0757m0883R748J4547n0038k3427K6729j3539k8906L2614K8049k1066O364
$$ 60757 19874 29622 44169 -5869 -29296 -2567 -16106 -45012 -12398 15651 -5415 949
474I49L4372j6328l1893J2323m071l8635p73K1581j1618L95L7604J5210o913J7976
$$ 949 35321 18993 -12900 -577 -4648 -43283 -44056 -22475 -34093 -33698 3906 19116 12203 30179
488C0179J7763j9219j9142O722j2049k5883J974J5220l974n33K5094J2620j0031
$$ 30179 47942 28723 9581 16303 4254 -21629 -19655 -4435 -8409 -8942 16152 28772 18741
501A8741J3R570j9923k6921K270o248k2671M177K4478j020Q29L4019J2052k0065
$$ 18741 18754 28324 8401 -18520 -16250 -22498 -45169 -40992 -16514 -17534 -16705 17314 29366 9301
515I301P236J5535l1727k1738K1265r265k6213K2757L0834j5804M655L9340p105
$$ 9301 16537 32072 345 -21393 -128 -9393 -35606 -12849 17985 2181 6836 46176 39071
528C9071l1784J6245L059m7744p087K3457k3733j8829M2848J0798k3970K5748
$$ 39071 7287 23532 26591 -21153 -28240 -4783 -28516 -47345 -4497 6301 -17669 8079
540H079L2454l3994j5540K8917k0776m2213K2692J7501l3043J0982M8062o719
$$ 8079 40533 6539 -9001 19916 -860 -43073 -20381 -2880 -35923 -24941 23121 16402
552A6402j4210L8062O331l8464M604J3065l9231j8389K7036o084k2041L1138K5539
$$ 16402 2192 40254 46585 8121 12725 25790 -13441 -31830 -4794 -10878 -32919 -1781 23758
565B3758k2551M307K9268j8954k9232J2587k021l4904J840K4209r684j698L1958
$$ 23758 1207 5514 34782 15828 -13404 -817 -2838 -37742 -35902 -11693 -21377 -23075 8883
578H883J1926j0803J2905J2365k2033j3785O598j1321j8328R021J3005n029O116
$$ 8883 20809 10006 22911 35276 13243 -542 6056 -5265 -23593 -14572 -1567 -6596 -480
591d80K2276K958q823J991J857j8630j8747L022m532j5584O836K0305K362J071
$$ -480 21796 24754 15931 17922 19779 1149 -17598 -14576 -19108 -34692 -27856 -7551 -5189 -4118
605d118K0342Q401j5413k06P630k1941j5780J5001l359j6089J8879K3511j0599
$$ -4118 16224 24625 9212 9006 16636 -5305 -21085 -6084 -9443 -25532 -6653 16858 6259
618F259L083K7147q029k5483R583K363l4250q128K2206j2360j3437L0384J4968
$$ 6259 9342 36489 28460 2977 12560 14923 -19327 -27455 -5249 -17609 -31046 -662 14306
631A4306j9966J3588K4248k5608j6469K1120j3838l3544J7932J8052k3636Q050
$$ 14306 -5660 7928 32176 6568 -9901 11219 -2619 -36163 -18231 -179 -23815 -15765
643a5765L9840p126j4776K8056M880l5790j34J5546k7976j7109K5438Q26j7967
$$ -15765 24075 16949 2173 30229 35109 -681 -815 14731 -13245 -30354 -4916 -4090 -22057
656b2057K1844K3765j8889k77K1629j5054k5642J1253R94k9007M220K4158p523
$$ -22057 -213 23552 4663 4386 26015 10961 -14681 -3428 -2434 -31441 -27221 -3063 -10586
669a0586l969K8095R247j6076Q214J0765k1087j3070Q498p222j4204J0178J1304
$$ -10586 -14555 13540 22787 6711 14925 25690 4603 -8467 31 -7191 -21395 -11217 87
682H7k872O375J6090p52q398K914k195j6802j0085M404m666p669Q763J5392j017
$$ 87 -2785 3590 19680 18928 10530 13444 11249 -5553 -15638 -11234 -15900 -23569 -14806 586 -431
697d31J469J5937K764j4989J004L661j6598j1456J0338p40p521J4454J6011o465
$$ -431 1038 16975 19739 4750 5754 9415 -7183 -18639 -8301 -9041 -16562 -2108 13903 7438
711G438J792J5661n852j8551N493L06k4342m192J9037q799q463K4190J1747j6945
$$ 7438 9230 24891 19039 488 5981 6287 -18055 -22247 -3210 -12009 -20472 3718 15465 -1480
725a480Q162J7757j9627j6994J6858p990k4721J3992J6367j5679M735K8618n100
$$ -1480 6682 24439 4812 -12182 4676 -3314 -28035 -14043 2324 -13355 -8620 19998 14898
738A4898j3122J9064K390k8530Q96J2493k0262j3483K2904L934j4532J5279J9407
$$ 14898 1776 20840 23230 -5300 -4404 8089 -12173 -25656 -2752 1182 -13350 1929 21336
751B1336j4894m466J6277j0482k2134P114M358j9424L014K1105n753l669K1616
$$ 21336 6442 1976 18253 7771 -14363 -7249 -2891 -22315 -19301 1804 -3949 -7618 13998
764A3998O488j7120N239R470j8724j1610J0885l505j3032R677J2772l897J876
$$ 13998 20486 3366 8605 18075 -649 -12259 -1374 -4879 -17911 -8234 4538 641 2517
777B517J3348j462r628J348O60j4165o852O255k126n450Q887J1085l152K610J1153
$$ 2517 15865 14403 4775 6123 6783 -7382 -14234 -7979 -10105 -15555 -6668 4417 1265 3875 15028
792A5028j755j3119K306J988j5184m110J0122M61p690J2839J2237o884l83J1615
$$ 15028 13273 154 2460 4448 -10736 -14846 -4724 -4263 -11953 886 13123 6239 5856 17471
806A7471n946j4634M529K74j6901K53J3479m483n170J8800N538j3828O736J2460
$$ 17471 11525 -3109 1420 1694 -15207 -14954 -1475 -5958 -11128 7672 13210 -618 6118 18578
820A8578j7106j2720J3049n743j7927J2226J3832j1254L297K0117l286j3167J2761
$$ 18578 1472 -11248 1801 -3942 -21869 -9643 4189 -7065 -3768 16349 13063 -104 12657
833A2657K483k1749M20R528j4314o455J7940L322j2305J2917J2908j2363n755
$$ 12657 15140 -6609 -6189 3339 -10975 -17430 510 3832 -8473 4444 17352 4989 -766
846g66J2749p971j6797N603O180j4014J532J6886k324n751J4969M308j1935J383
$$ -766 11983 4012 -12785 -7182 -1002 -15016 -13484 3402 1078 -4673 10296 14604 2669 4052
860D052O264j2326q862Q204j594q147Q631J1052n156j94J0557n67j1632J736K344
$$ 4052 10316 -2010 -10872 -2668 -4262 -12409 -3778 7274 2118 1924 12481 11914 282 2018 4362
875D362j1303m889O019L96m122O994Q373k606j305Q819l242j0157K040K881j0858
$$ 4362 -6941 -11830 -5811 -5415 -9537 -2543 5830 3224 1919 10738 7496 -2661 -621 2260 -8598
890h598k804J0042o56n041J0426R092q054k145J0694o087j3070N689K388j4705
$$ -8598 -11402 -1360 -2016 -7057 3369 12461 4407 2262 12956 6869 -6201 -512 1876 -12829
904a2829K420J1606l789m498J3733M465j2597L626J0416j4946p774J1612l631
$$ -12829 -10409 1197 -2592 -7090 6643 11108 -1489 2137 12553 -2393 -10167 1445 -2186
917b186j3149R957J1803j1118J335J7623m938j2419J0875K584j8779J059J1261
$$ -2186 -15335 -5378 6425 -4693 -3358 14265 9327 -3092 7783 10367 -8412 -7353 3908
930C908j0903m773J4382J956j0107R964Q726j1900l592J0491o699j3759Q789M733
$$ 3908 -6995 -11768 2614 4570 -5537 4427 13153 1253 -2339 8152 1453 -12306 -3517 1216
944A216j1351K517J3416m996m379J0905J872r494P03N996j0150m569O890o72n705
$$ 1216 -10135 -7618 5798 802 -3577 7328 9200 -294 409 6405 -3745 -8314 -1424 -2096 -7801
959g801O689P554l933j556P983k490r050K712J535p503k951O590j038k525N134
$$ -7801 -1112 6442 2509 953 8936 6446 -2604 108 1643 -5860 -8811 -2221 -3259 -5784 -650
974f50P304k015l234M010L08q444L27L624n835k292O051J654n506O893P268p794
$$ -650 6654 4639 1405 5415 5723 -2721 -2394 1230 -4605 -6897 -846 808 -4698 2195 9463 1669
990A669j046P660m764j0514N370L717j1128J569J1574l367o413J1529M309j2631
$$ 1669 623 8283 3519 -6995 -1625 2092 -9036 -7467 4107 740 -5673 5856 10165 -2466
1004b466J362Q607r914n999R167j195r882Q111Q703q571m99J2901m128j0945R964
$$ -2466 -1104 7503 -2411 -8410 757 -438 -10320 -2209 6494 -2077 -2576 10325 6197 -4748 5216
1019E216K733j6330K395J1055q030o313J3934Q24j0107P246O932j0325k166Q815
$$ 5216 7949 -8381 -5986 5069 -2961 -9274 4660 5484 -4623 2623 9555 -770 -2936 5879
1033E879m937j1125Q358M631j0754L675J0685n531m641J0236J316j1573L294N666
$$ 5879 942 -10183 -1825 2806 -7948 -4273 6412 881 -3760 6476 7792 -3781 -487 5179
1047E179q299l521P596p50n612N401O214o583l93O702m675l613L014R9m457m0
$$ 5179 -3120 -6641 955 205 -5407 -6 6208 -375 -768 5934 1259 -2354 660 759 -3698 -3738
1063c738M253j069l112M326L765m486r36N187j440n420J063L157m356j443N370
$$ -3738 515 -554 -3666 660 4425 -61 -997 4190 2750 -2670 -1607 1550 -2806 -4249 1121
1078A121L70l963L477M899n275k617N531j820o502L689L359p152J114P751l270
$$ 1121 1491 -2472 1005 5904 629 -1988 3543 1723 -4779 -1090 2269 -4883 -3769 3982 712
1093G12n481P912L329r307m48Q225n462o969Q910J171r387N301Q845q766k103
$$ 712 -4769 3143 6472 -2835 -3283 4942 -520 -7489 1421 2592 -6795 -1494 7351 -1415 -3518
1108c518R496k798q917P751K582r006O19R297p032o383J0982J995j0450N655P943
$$ -3518 5978 3180 -5737 2014 4596 -4410 -3791 5506 -1526 -7909 3073 5068 -5382 273 8216
1123H216j0217k818R010l185q702P159L773o937O21Q145m173m688O157J613p971
$$ 8216 -2001 -4819 4191 1006 -7696 -537 3236 -3701 -3080 5065 892 -3796 2361 3974 -3997
1138c997L031O065p364k554P573n5q301M668N690n686j024N372j044n704L204
$$ -3997 -966 5099 -2265 -4819 2754 2699 -5602 -934 4756 -930 -1954 3418 2374 -3330 -126
1153a26K703n104R21K837j299k631L342K210m255J74K770r45l434K434K402l782
$$ -126 2577 -2527 -1606 1231 -68 -2699 643 2853 -1402 -1228 1542 597 -2837 -403 1999 -1783
1169a783j302N361p97n437L460L932m660p76M552j926m085K558M638o013P35M626
$$ -1783 -3085 2276 1479 -3958 -498 3434 -1226 -2002 2550 624 -3461 -903 3735 -2278 -1543 3083
1185C083k862m046M799J662n822J557N651m757l330P514Q62q496K574P549q039
$$ 3083 221 -3825 974 2636 -3186 -1629 4022 -735 -4065 3449 4311 -4185 -1611 5938 -2101
1200b101k661Q056m28q552O143N217p979m3P910o154m116P382O46q732L880O533
$$ -2101 -4762 3294 2866 -5686 457 5674 -2305 -2348 5562 -592 -4708 2674 3320 -5412 -1532 5001
1216E001p073k572Q901j267p677N573L773p502j034Q392l660n874N132K773o223
$$ 5001 -2072 -4644 4257 2990 -4687 886 4659 -2843 -3877 4515 855 -5019 113 2886 -3337
1231c337K178O515n347l648N848K16o526L676L121l897k348N974j902l868M141
$$ -3337 -1159 5356 9 -3639 2209 2425 -4101 -425 2696 -1201 -3549 2425 523 -3345 796
1246G96K959m879n27L360k27m426K798Q06k278R0K155J65j438K328J345l618J65
$$ 796 3755 -1124 -1651 1709 1482 -2944 -146 660 -1618 -1528 627 792 -646 1682 3027 -591 -426
1263d26J888j895k478K396J771l916k3N778j666l658M209K234o026N2M331l465
$$ -426 1462 -433 -2911 -515 1256 -2660 -2683 3095 1429 -2229 1980 4214 -1812 -1760 2571 -894
1279h94l445L678J377l810J536N129l778j933M806L1n164J528K938m976n58N410
$$ -894 -4339 -661 716 -3094 -1558 3571 -207 -2140 2666 2697 -2467 -939 1999 -2977 -3535 1875
1295A875J47o233N921L104n977m00O315m754l744M642Q81o574K377N470m223j710
$$ 1875 2022 -4211 1710 4814 -1163 -1563 4752 -2 -3746 896 1777 -4797 -2420 3050 -1173 -2883
1311b883O816q60n322M300K105n823j256N055l452m318N284K891m988J640O555
$$ -2883 3933 3073 -2249 2051 4156 -1667 -2923 2132 -1320 -5638 -354 2537 -2451 -811 5744
1326E744m861k063L893q73n150J781K853k903j732M810m85k703K742L928m433
$$ 5744 883 -1180 2713 1840 -3310 -1529 1324 -1579 -3311 1499 1014 -1689 1053 4981 548
1341E48n46K720l119l525K578J845l354Q44L672O55l219K057K983k855k629L437
$$ 548 2 2722 -397 -3922 -1344 501 -2853 -2009 1663 2318 -901 1156 4139 1284 -1345 2092
1357B092k570l637K921P24r91M47L599l98j639K337J044n247p71L707l411k978
$$ 2092 -478 -4115 -1194 -470 -1461 -1014 2585 2187 548 2885 3929 -1318 -2089 1618 -1793 -4771
1373d771M195K619m383K715M015k046m181O284j658n314Q39K520m264o73N891
$$ -4771 -576 2043 -2340 375 4390 2344 -1837 4447 2789 -2525 -1686 834 -3430 -4103 1788
1388A788p65l996O271K466m779q66N349n033l839K827J450n865K625O195m159
$$ 1788 1023 -2973 3298 5764 985 119 5468 435 -3404 -577 873 -4992 -2367 3828 -331
1403c31j867O504n32n182L215Q03m943j508M491l073k274M907K232l687K490L943
$$ -331 -2198 4306 3774 -1408 1807 2610 -2333 -3841 650 -2423 -4697 210 2442 -1245 1245 5188
1419E188k670l174L317j326n723J596L485m101P70M858j373q29K299J782m481
$$ 5188 2518 -656 2661 1335 -4388 -2792 693 -3408 -2638 2220 847 18 2317 4099 -382
1434c82K58M30k149j738J691R04j567R34L383N33j297K332j95k890j611J340j200
$$ -382 -124 306 -1843 -3581 -1890 -986 -2553 -1619 1764 2297 1000 3332 3137 247 -1364 -24 -1224
1451a224k596J072K810j290N29M333K3l034N05J902l726j482J662k161j752K890
$$ -1224 -3820 -2748 62 -1228 -699 3634 3657 623 1128 3030 -696 -2178 -516 -2677 -4429 -1539
1467a539J906k402K089N000k762j205L331k225n590Q95K209l041k62M533M11k431
$$ -1539 367 -2035 54 5054 2292 1087 4418 2193 -3397 -2502 -293 -3334 -3596 937 1348 -1083
1483a083L821J503l256j089L706n144k872K781J324n515L724M818k349o92N704
$$ -1083 2738 4241 985 -104 3602 -1542 -4414 -1633 -309 -5824 -2100 2718 369 -323 5381
1498E381q31n192R72L070o150j518L966j518k109L733L008k638J240M035k448
$$ 5381 4550 -642 330 3400 -2750 -4268 -302 -1820 -3929 -196 2812 174 1414 5449 3001
1513C001m255L411l196l887J316M893n047J016M948k88q76J429O59l631n4M51
$$ 3001 -1254 2157 -1039 -4926 -3610 1283 -3764 -2748 2200 1912 1036 2465 3124 -507 -561 -110
1529a10j984j631J282K126j116L29M373j244n4J669j446l123l42J00j191j892
$$ -110 -2094 -3725 -2443 -317 -1433 -1104 3269 2025 1971 3640 2194 -929 -1271 -1171 -2362 -4254
1545d254J776K201p76J092L766l34k956J508O19l508l036K965q13k360K663K909
$$ -4254 -2478 -277 -1053 39 3805 3471 515 2023 2642 -866 -3902 -937 -1750 -4110 -1447 1462
1561A462j034J440K583j683k191J428j355m106K95K376k271j906O813L97k011
$$ 1462 428 1868 4451 2768 577 2005 650 -3456 -3161 -785 -3056 -4962 1851 2248 237
1576B37K192L195l983k132K704l112l151J827J645k881J890M365q45j597M539
$$ 237 2429 5624 1641 -491 2213 -899 -4050 -2223 -578 -3459 -1569 2796 1951 354 4893
1591D893j783m556J727J553n730j080M432j113j358M604K832m046P65L758l486
$$ 4893 3110 -1446 281 1834 -3896 -4976 -544 -1657 -3015 1589 4421 375 1140 4898 1412
1606A412l028K106j849k747J468K284j282J32N220j126j120J549J892n564j572
$$ 1412 -1616 490 -1359 -4106 -2638 -354 -1636 -1504 3716 2590 1470 3019 4911 -653 -2225
1621b225K310k548j792L079J153q75J116L550k97M7k461M18k849j219J34o88p84
$$ -2225 85 -2463 -4255 -1176 -23 -898 218 3768 3471 3518 1057 1475 -1374 -2593 -2459 -3147 -3931
1638c931J994K850o01J980J156j247j292R49j433k518q91J524q94k34K325K160
$$ -3931 -1937 913 312 2292 3448 2201 909 1858 425 -2093 -2984 -1460 -2354 -2588 -263 1897
$$ [...]
8191d5
##END NTUPLES=NMR FID
##END=
