##TITLE=1H_UK_23_4-2
 CD2Cl2
 108 sc, 
 20.09.2022
##JCAMPDX= 6.0         $$ Bruker NMR JCAMP-DX V2.0
##DATA TYPE= NMR FID
##DATA CLASS= NTUPLES
##ORIGIN= UXNMR, Bruker Analytische Messtechnik GmbH
##OWNER= root
$$ XWIN-NMR		Version 3.5
$$ Tue Sep 20 13:01:46 2022 Russian Standard Time (UT+4h)  she@DPX200
##.OBSERVE FREQUENCY= 200.1313499994
##.OBSERVE NUCLEUS= ^1H
##.DELAY= (6, 6)
##.ACQUISITION MODE= SIMULTANEOUS
##.ACQUISITION SCHEME= undefined
##.AVERAGES= 108
##.DIGITISER RES= 18
##SPECTROMETER/DATA SYSTEM= spect
##.PULSE SEQUENCE= zg30
##.SOLVENT NAME= CD2Cl2
##.SHIFT REFERENCE= (INTERNAL, CD2Cl2, 0, 15.7039)
##AUDIT TRAIL= $$ (NUMBER, WHEN, WHO, WHERE, WHAT)
$$ ##TITLE= Audit trail, XWIN-NMR		Version 3.5
$$ ##JCAMPDX= 5.01
$$ ##ORIGIN= Bruker BioSpin GmbH
$$ ##OWNER= she
$$ F:/spectra/data/she/nmr/H-F/1/audita.txt
$$ ##AUDIT TRAIL=  $$ (NUMBER, WHEN, WHO, WHERE, WHAT)
(   1,<2022-09-20 13:00:55.76 +0400>,<she>,<DPX200>,
      <continue with go, POWCHK disabled, PULCHK disabled
       configuration hash MD5:
       00 E9 B6 7A A2 85 ED C7 34 08 36 98 17 FE 4E 26
       data hash MD5: 16K
       D3 F9 AB 6F CD 4E FB 59 9A 1C F2 0E E6 78 6E D5>)
$$ ##END=
$$ 
$$ hash MD5
$$ 77 76 81 42 A7 23 73 5B 62 F4 AB CA 01 33 14 AC
##$RELAX= 
##$RELAX= 
##$RELAX= 
##$RELAX= 
##$RELAX= 
##$RELAX= 
$$ Bruker specific parameters
$$ --------------------------
##$DU= <F:/spectra>
##$EXPNO= 1
##$NAME= <H-F>
##$PROCNO= 1
##$TYPE= <nmr>
##$USER= <she>
##$AMP= (0..31)
100 100 100 100 100 100 100 100 100 100 100 100 100 100 100 100 100 100 
100 100 100 100 100 100 100 100 100 100 100 100 100 100 
##$AQSEQ= 0
##$AQ_mod= 1
##$AUNM= <au_zg>
##$AUTOPOS= <>
##$BF1= 200.13
##$BF2= 200.13
##$BF3= 200.13
##$BF4= 200.13
##$BF5= 200.13
##$BF6= 200.13
##$BF7= 200.13
##$BF8= 200.13
##$BYTORDA= 1
##$CFDGTYP= 0
##$CFRGTYP= 5
##$CHEMSTR= <none>
##$CNST= (0..31)
1 1 145 1 1 1 1 1 1 1 1 1 1 1 1 1 1 1 1 1 1 1 1 1 1 1 1 1 1 1 1 1 
##$CPDPRG= <>
##$CPDPRG1= <>
##$CPDPRG2= <>
##$CPDPRG3= <>
##$CPDPRG4= <mlev>
##$CPDPRG5= <mlev>
##$CPDPRG6= <mlev>
##$CPDPRG7= <mlev>
##$CPDPRG8= <mlev>
##$CPDPRGB= <>
##$CPDPRGT= <>
##$D= (0..31)
0 1.2 0 0 0 0 0 0 0 0.06 0 0.03 0 0 0 0 0.0002 0 0 0 0 0 0 0 0 0 0 0 0 
0 0 0 
##$DATE= 1663664059
##$DBL= (0..7)
120 120 120 120 120 120 120 120 
##$DBP= (0..7)
150 150 150 150 150 150 150 150 
##$DBP07= 0
##$DBPNAM0= <>
##$DBPNAM1= <>
##$DBPNAM2= <>
##$DBPNAM3= <>
##$DBPNAM4= <>
##$DBPNAM5= <>
##$DBPNAM6= <>
##$DBPNAM7= <>
##$DBPOAL= (0..7)
0.5 0.5 0.5 0.5 0.5 0.5 0.5 0.5 
##$DBPOFFS= (0..7)
0 0 0 0 0 0 0 0 
##$DE= 6
##$DECBNUC= <off>
##$DECIM= 32
##$DECNUC= <off>
##$DECSTAT= 4
##$DIGMOD= 1
##$DIGTYP= 9
##$DL= (0..7)
0 120 120 120 120 120 120 120 
##$DP= (0..7)
150 150 150 150 150 150 150 150 
##$DP07= 0
##$DPNAME0= <>
##$DPNAME1= <>
##$DPNAME2= <>
##$DPNAME3= <>
##$DPNAME4= <>
##$DPNAME5= <>
##$DPNAME6= <>
##$DPNAME7= <>
##$DPOAL= (0..7)
0.5 0.5 0.5 0.5 0.5 0.5 0.5 0.5 
##$DPOFFS= (0..7)
0 0 0 0 0 0 0 0 
##$DQDMODE= 0
##$DR= 18
##$DS= 0
$$ [...]
##$SUBNAM2= <"">
##$SUBNAM3= <"">
##$SUBNAM4= <"">
##$SUBNAM5= <"">
##$SUBNAM6= <"">
##$SUBNAM7= <"">
##$SUBNAM8= <"">
##$SUBNAM9= <"">
##$SW= 18.0517283424941
##$SWIBOX= (0..15)
0 0 2 0 0 0 0 0 0 0 0 0 0 0 0 0 
##$SW_h= 3612.71676300578
##$TD= 16384
##$TD0= 1
##$TE= 0
##$TE2= 300
##$TE3= 300
##$TEG= 300
##$TL= (0..7)
0 120 120 120 120 120 120 120 
##$TP= (0..7)
150 150 150 150 150 150 150 150 
##$TP07= 0
##$TPNAME0= <>
##$TPNAME1= <>
##$TPNAME2= <>
##$TPNAME3= <>
##$TPNAME4= <>
##$TPNAME5= <>
##$TPNAME6= <>
##$TPNAME7= <>
##$TPOAL= (0..7)
0.5 0.5 0.5 0.5 0.5 0.5 0.5 0.5 
##$TPOFFS= (0..7)
0 0 0 0 0 0 0 0 
##$TUNHIN= 0
##$TUNHOUT= 0
##$TUNXOUT= 0
##$USERA1= <user>
##$USERA2= <user>
##$USERA3= <user>
##$USERA4= <user>
##$USERA5= <user>
##$V9= 5
##$VALIST= <valist>
##$VCLIST= <CCCCCCCCCCCCCCC>
##$VD= 0
##$VDLIST= <DDDDDDDDDDDDDDD>
##$VPLIST= <PPPPPPPPPPPPPPP>
##$VTLIST= <TTTTTTTTTTTTTTT>
##$WBST= 1024
##$WBSW= 4
##$XGAIN= (0..3)
0 0 0 0 
##$XL= 0
##$YL= 0
##$YMAX_a= 362634
##$YMIN_a= -340585
##$ZGOPTNS= <>
##$ZL1= 120
##$ZL2= 120
##$ZL3= 120
##$ZL4= 120
##$ABSF1= 10
##$ABSF2= 0
##$ABSG= 5
##$ABSL= 3
##$ALPHA= 0
##$AQORDER= 0
##$ASSFAC= 0
##$ASSFACI= 0
##$ASSFACX= 0
##$ASSWID= 0
##$AUNMP= <proc_1d>
##$AZFE= 0.1
##$AZFW= 0.1
##$BCFW= 1
##$BC_mod= 2
##$BYTORDP= 1
##$COROFFS= 0
##$CY= 11.3945322036743
##$DATMOD= 1
##$DC= 2
##$DFILT= <>
##$DTYPP= 0
##$F1P= 2.36226072786647
##$F2P= -0.459571619588291
##$FCOR= 0.5
##$FTSIZE= 0
##$FT_mod= 4
##$GAMMA= 1
##$GB= 0.15
##$INTBC= 1
##$INTSCL= 1
##$ISEN= 128
##$LB= 0.24
##$LEV0= 0
##$LPBIN= 0
##$MAXI= 10000
##$MC2= 0
##$MEAN= 0
##$ME_mod= 0
##$MI= 1.114404
##$NCOEF= 0
##$NC_proc= 0
##$NLEV= 6
##$NOISF1= 3.799351
##$NOISF2= 2.8
##$NSP= 1
##$NTH_PI= 0
##$NZP= 0
##$OFFSET= 15.70392
##$PC= 1
##$PHC0= -18039.35
##$PHC1= 20.40069
##$PH_mod= 1
##$PKNL= yes
##$PPARMOD= 0
##$PSCAL= 0
##$PSIGN= 0
##$REVERSE= no
##$SF= 200.130013532006
##$SI= 16384
##$SIGF1= 3
##$SIGF2= 2
##$SINO= 400
##$SIOLD= 16384
##$SREGLST= <1H.CDCl3>
##$SSB= 0
##$STSI= 0
##$STSR= 0
##$SW_p= 3612.71676300578
##$SYMM= 0
##$S_DEV= 0
##$TDeff= 0
##$TDoff= 0
##$TI= <>
##$TILT= no
##$TM1= 0
##$TM2= 0
##$TOPLEV= 0
##$USERP1= <user>
##$USERP2= <user>
##$USERP3= <user>
##$USERP4= <user>
##$USERP5= <user>
##$WDW= 1
##$XDIM= 8192
##$YMAX_p= 0
##$YMIN_p= 0
$$ End of Bruker specific parameters
$$ ---------------------------------
##NTUPLES= NMR FID
##VAR_NAME=  TIME,          FID/REAL,        FID/IMAG
##SYMBOL=    X,             R,               I
##VAR_TYPE=  INDEPENDENT,   DEPENDENT,       DEPENDENT
##VAR_FORM=  AFFN,          ASDF,            ASDF
##VAR_DIM=   8192,          8192,            8192
##UNITS=     SECONDS,       ARBITRARY UNITS, ARBITRARY UNITS
##FACTOR=    0.0002768,     1,               1
##FIRST=     0,             0,               0
##LAST=      2.2672688,     0,               0
##MIN=       0,             -340585,         0
##MAX=       2.2672688,     362634,          0
$$ Real data points
##PAGE= N=1
##DATA TABLE= (X++(R..R)), XYDATA
0 0 0 0 0 0 0 0 0 0 0 0 0 0 0 0 0 0 0 0 0 88 -108 108 -108 108 -108 119 -216 216 -216 287 -324 334 -431 443 -536
35 -536 580 -655 748 -825 917 -1021 1136 -1262 1393 -1548 1704 -1884 2076 -2288 2519 -2776
51 -2776 3060 -3371 3717 -4115 4545 -5048 5618 -6289 7072 -8009 9171 -10618 12516 -15094
65 -15094 18852 -24792 35866 -63645 346856 281916 93067 345457 57012 -159974 -35798
76 -35798 -42663 -321173 -203757 -41023 -157689 -163368 86172 67275 -35683 92756 177171
87 177171 17641 13971 135517 64648 -55135 37658 51694 -98815 -101686 -3554 -99077 -166352
99 -166352 -43197 -17556 -87244 24364 146047 105655 119131 209249 156290 54888 40381
110 40381 -16000 -134056 -184119 -187090 -199667 -183253 -114610 -17309 60106 113639 183415 229748
122 229748 181082 125690 116011 26845 -99401 -111141 -115906 -195791 -172219 -58048 -47921 -42040
134 -42040 79146 128450 63780 87011 138434 48540 -24480 28099 4624 -98558 -60097 13976
146 13976 -61120 -84777 24363 6922 -87314 -4517 58058 -43037 -23768 107080 54678
157 54678 -8754 112977 121735 -20640 7489 60749 -84903 -149343 -46048 -87290 -170019
168 -170019 -47341 45581 -14707 46208 180653 132051 62971 128085 94973 -54549 -70196
179 -70196 -39890 -139157 -177354 -70251 -48198 -79164 24508 115352 69316 74111 143484 85728
191 85728 -4950 18694 4073 -89287 -84327 -31965 -59644 -67684 2879 24160 -5480 20421
203 20421 50736 16495 -4435 21002 18886 -7921 3437 32129 20589 54 16631 16303 -29226
216 -29226 -46681 -28310 -48686 -75337 -34801 5487 -4127 26009 91294 85224 51478 76000
228 76000 64018 -19422 -50518 -35346 -89190 -127753 -66073 -31547 -53992 8424 93763 68570
240 68570 56045 115436 85335 -7531 -171 6871 -83333 -101597 -30118 -50351 -79666 8480
252 8480 54204 316 30163 92374 29547 -17465 36395 15640 -59934 -21595 23694 -32571
264 -32571 -33389 41634 18890 -34854 13542 25332 -47059 -40903 13621 -19849 -39221 32086 51349
277 51349 9539 41804 77710 19678 -13217 10863 -24707 -83743 -60729 -35504 -61334 -38680
289 -38680 29559 40588 35520 76081 86853 40685 21927 20057 -24875 -67509 -59302 -51771 -65719
302 -65719 -43853 3782 19850 24803 55335 67169 38155 19442 21428 -5514 -43423 -34087 -19506
315 -19506 -37840 -31317 13596 16884 -1616 22759 36330 -3889 -16173 12060 -11052 -39345
327 -39345 -175 21033 -8129 9971 52350 21340 -9319 21777 5962 -53795 -40266 -11788
339 -11788 -48437 -46300 20678 25937 4269 54342 79328 25265 13832 39636 -13936 -66951
351 -66951 -34200 -35268 -77740 -41267 16772 282 7100 70088 64298 17791 37617 41009 -25147
364 -25147 -42226 -12153 -40576 -63421 -15003 8941 -14353 12322 50594 24781 4463 28021
376 28021 12029 -27623 -18158 -878 -24747 -22132 14864 16617 1508 20515 28354 -1350 -14073
389 -14073 -4382 -19685 -39324 -20756 -3566 -6283 6573 34479 39219 25979 28396 23441 -5285
402 -5285 -27456 -26257 -35423 -52674 -34196 -5593 -2556 8451 45180 49673 27871 33280 33280 -7171
416 -7171 -30276 -16799 -34399 -57161 -26229 1084 -13417 5489 46444 33688 11170 32604
428 32604 26050 -20822 -20602 -589 -30053 -40648 3577 10088 -13574 17648 42549 4378 -4352
441 -4352 23065 -4025 -39458 -11112 788 -30507 -9936 31976 13830 3132 40725 30210
453 30210 -12536 -4256 3886 -38033 -44350 -11768 -15724 -25866 14226 37282 16731 27943 48800
466 48800 20433 -8428 523 -13368 -46011 -37078 -17386 -25531 -17135 18358 27140 18769 33275
479 33275 37592 11698 -2064 -1900 -17453 -34562 -25476 -14627 -15008 -5576 15602 21977 16461 18892
493 18892 19835 3628 -12412 -10397 -11182 -22732 -16432 3726 6134 4018 23308 26816 6177 4373
507 4373 9142 -14658 -31488 -13753 -13678 -27690 -3925 22551 11732 13570 39305 26923 -3525
520 -3525 4420 1678 -33048 -36583 -12038 -23212 -28070 10253 25985 7169 25369 45516 14669
533 14669 -3825 13803 -7081 -41529 -22934 -7200 -31311 -17204 22118 13924 2934 32404
545 32404 31539 -3652 -232 10425 -21290 -31527 -4996 -6992 -20918 7053 24525 6301 9860
558 9860 27138 8566 -13581 -3647 -7176 -28066 -19380 1126 -4498 -2563 22663 25024 11453
571 11453 15742 15439 -4519 -16705 -12817 -19435 -26489 -14873 -1882 1928 11972 25260 26951 17619
585 17619 13957 8785 -5717 -20198 -20521 -19892 -23263 -15915 2310 9840 9727 21428 27732 12016
599 12016 4029 8047 -8832 -25222 -14955 -10373 -21163 -7790 14023 7956 5526 24769 18819
612 18819 -4546 -163 4312 -19678 -23508 -2535 -6898 -15124 9116 22913 5307 9419 25636
625 25636 3451 -15231 -543 -6990 -31887 -16597 3445 -10596 -4986 26789 22065 5010 21248
638 21248 20501 -11484 -12936 -1892 -21742 -31667 -6715 -1596 -10859 10490 27347 12801 10060
651 10060 22476 8352 -13647 -7607 -8212 -24344 -19412 -1738 -3234 -3069 15974 19429 8957 9999
665 9999 13167 -2741 -12184 -7408 -12597 -17300 -8633 1733 2302 7642 16454 15067 6872 3961 -636
680 -636 -8181 -14581 -13411 -9776 -9868 -4180 8458 12802 10203 15594 17338 2818 -5138 -2162 -12163
695 -12163 -22381 -12424 -4069 -9895 -382 18167 14232 9037 19119 15327 -5227 -6501 -2268 -17057
709 -17057 -23291 -4936 -3291 -9950 7569 21059 8136 7604 20083 5915 -12766 -2952 -4388
722 -4388 -22041 -13360 4660 -4800 -5344 17936 15598 23 11008 13382 -9411 -11791 -290 -12241
736 -12241 -19443 -736 6308 -3586 7533 19829 8117 1512 10854 1114 -13934 -9924 -6611 -14932
750 -14932 -11088 4237 5711 2960 14784 17359 6725 3284 6161 -6863 -14793 -9566 -8977 -13562
764 -13562 -4631 3695 6242 9437 14383 12037 5320 2818 -1533 -7908 -13249 -11335 -7643 -6375 -2758
779 -2758 5557 11601 6673 9574 11387 1669 -5650 -3314 -7075 -14372 -7599 1067 -3971 1547 13205
794 13205 9633 3098 8894 7213 -6775 -8721 -1677 -10478 -15348 -696 3753 -2595 7374 16815
808 16815 6463 2329 9322 1616 -13981 -5912 -3899 -14882 -10080 6494 2429 -1011 15044 14344
822 14344 13 4932 8610 -8640 -12465 -2834 -8833 -15531 -1091 6683 -970 5092 15660 7576
836 7576 -184 5900 1143 -10908 -7984 -2500 -8609 -7523 4869 4683 1857 7914 11406 1959 -274
851 -274 1449 -5240 -9897 -6466 -3755 -5365 -808 5723 6163 5391 7396 6150 -696 -1966 -4058 -6583
867 -6583 -9205 -6829 -2575 -1860 1418 6953 9287 4778 5516 6153 -1036 -7420 -4148 -5365 -9454 -5785
883 -5785 1898 -4 177 10635 10167 275 5134 5801 -5960 -8099 -1848 -6758 -9792 245 4473
898 4473 -1114 4992 11610 4005 -1008 4901 185 -10967 -4415 -595 -9191 -6089 6011 3523 -1456
913 -1456 9201 9363 -1698 -798 4358 -5853 -10544 -1003 -2814 -7969 1768 8277 1620 2561 10178
928 10178 3459 -3662 1345 -860 -10102 -7356 -1565 -4918 -4295 4324 5716 2174 6267 7531 288
943 288 -1442 -87 -4388 -7169 -3789 -1319 -2266 1267 4427 5531 4013 4607 4017 -819 -2282 -2846
959 -2846 -4118 -5913 -4481 8 686 1184 4681 6102 2437 1877 2317 -830 -6251 -3342 -1765 -5364
975 -5364 -2271 4082 988 3 7534 5287 -1317 891 3543 -4826 -6944 -339 -2521 -5942 2384
990 2384 5095 -737 3079 7928 1685 -3283 1777 740 -8903 -3493 1288 -5221 -4356 5559 3364
1005 3364 -2104 5518 6916 -3080 -1725 3734 -4557 -7200 245 431 -5638 1526 6097 -162 1133
1020 1133 6265 2208 -3676 1245 618 -6127 -3005 353 -1249 -1298 4038 3412 402 2122 3084 -1851
1036 -1851 -2731 51 -2115 -3457 -1484 1019 329 852 3441 2675 1128 2706 1192 -1220 -2432 -2243
1052 -2243 -2474 -1710 -1459 846 960 1845 2233 3756 1666 410 850 -1361 -4104 -2611 -227 -2291 -2187
1069 -2187 3276 1926 -1863 3865 3243 -1347 -1592 1983 -2654 -4051 1265 -519 -5090 149 4202
1084 4202 -34 -127 5002 1185 -4293 1228 1175 -4847 -1405 3122 -1849 -2728 4186 2162 -2570 2170
1100 2170 4576 -2168 -2061 3234 -773 -4699 1733 2114 -3530 -245 4195 -152 -1738 3906 1126
1115 1126 -3943 52 611 -3699 -2115 2367 -621 -1706 2621 1512 -505 1188 1980 -900 -1083 1097
1131 1097 -1157 -1610 -662 677 -786 -576 2008 1057 302 843 892 -1379 -659 -598 -717 -1795 -1216 755
1149 755 1316 478 617 1270 490 -1174 560 392 -2035 264 1550 -1029 -1090 3565 492 -2547 509
1166 509 2932 -2203 -1176 2107 -990 -1886 387 1748 -3016 -412 3792 -1763 -2086 2843 114 -2829
1182 -2829 1533 2142 -2780 -940 3129 -745 -2118 1795 1530 -2554 106 3171 -1870 -2676 2966 464
1198 464 -3503 1881 1976 -2461 -931 2673 -1783 -3044 2011 1672 -2729 723 2265 -1330 53 1994
1214 1994 510 -1183 888 125 -2289 -1089 1257 -484 -1682 1250 1842 -950 -89 953 -475 -1449
1230 -1449 -53 -444 -618 1091 897 -74 -237 1440 427 817 -309 -1180 -366 -1396 -867 225 417
1247 417 -196 646 938 -718 475 1500 -182 -1875 313 454 -2369 -831 1200 -1104 -857 2716
1263 2716 748 -753 1590 1079 -2304 -1308 1745 -1701 -1634 2103 706 -1221 1212 2818 109 -1676
1279 -1676 2156 -601 -2857 -123 811 -3062 -783 2870 -799 -741 2763 1436 -1403 948 2370 -2598
1295 -2598 -1575 1246 -1117 -2134 2296 1754 -284 766 3082 -485 -643 1935 -496 -2614 -270
1310 -270 40 -1939 -599 1445 582 737 1656 1206 339 956 -67 -2075 -2121 -375 -91 -490 565 1555
1328 1555 1273 1061 1347 1495 -39 -1226 -1411 -1349 -1028 -1496 -744 -86 -100 1354 2254 898 620 1724 -585
1347 -585 -2567 -1262 -1255 -2889 -835 2198 397 752 3651 1893 -206 1281 615 -3270 -2228 -1323 -1964
1364 -1964 -2291 1838 886 -10 1283 3371 220 -417 1386 -655 -3957 -1658 92 -2374 -1004 2750
1380 2750 716 349 3717 2407 -413 486 544 -3037 -3690 250 -940 -1865 1682 2415 850 1323 3297
1397 3297 142 -1150 1132 -1200 -3762 -1913 -956 -1264 -1036 2099 1078 1628 2113 2901 303 -1439
1413 -1439 -616 -2096 -2168 -939 161 769 1450 2155 2560 2664 1933 1341 -1202 -1140 -889 -1447 -2684 -2147 -882
1432 -882 1117 1497 1297 2788 2226 -509 243 -1780 -3267 -1936 -1401 -2213 -397 1120 1138 994 3359
1449 3359 3101 -579 172 95 -3175 -3588 -521 -1393 -2400 1616 1686 249 3017 3181 1064 -462 459
1466 459 -1280 -4566 -1811 158 -1689 204 3706 1180 1071 2638 2053 -481 -331 -69 -3090 -2565
1482 -2565 89 -628 -854 2065 2818 820 2258 3205 160 -1057 146 -2182 -3196 -3328 -357 -1220
1498 -1220 1521 2890 2118 2590 2002 1835 -1470 -1855 -2208 -2298 -1988 -985 -774 1742 2040 2307 2276 2426 1847
1517 1847 147 -1602 -1849 -2676 -1817 -740 -920 728 2404 2459 2549 2360 1123 -51 -873 -1398 -3829 -1640
1535 -1640 -1163 -1725 -249 2738 2532 1205 2546 2153 -666 -876 -636 -3358 -3432 -596 -644 -1828 1400
1552 1400 3147 1929 2199 3313 393 -1410 102 -2139 -3396 -1466 845 -450 307 2260 2125 707
1568 707 2538 2362 -1720 -1347 -515 -2765 -3250 -519 341 -824 2022 2811 2075 1813 2066 173 -2768
1585 -2768 -1172 -2224 -3931 -2337 -555 423 1958 2905 2906 1392 1837 858 -1873 -2602 -2410 -2625 -1328
1602 -1328 -1200 573 1535 1692 2181 2038 1373 804 -1598 -1819 -2911 -2514 -2257 -248 -83 1429 3033 2447
1620 2447 2436 1965 576 -1525 -461 -2247 -3788 -2079 -461 -634 -205 2820 2054 1456 3056 1876 13
1637 13 -1446 -1511 -3557 -2113 -25 685 283 2158 3173 2000 1860 1724 -1024 -1564 -1415 -1295 -4187 -1344
1655 -1344 -282 -60 859 3947 2465 1174 1908 1657 -989 -2921 -1357 -3616 -3304 340 246 45 2162
1672 2162 3177 1312 1298 966 -1094 -2974 -1902 -1845 -1863 -1491 474 692 2201 2030 1640 1564 357 7
1690 7 -1769 -2278 -2252 -1783 -1637 -732 1632 2009 2735 2753 1236 1871 613 -1585 -1912 -3300 -2566 -1860 -93
1709 -93 715 2089 2059 1024 1822 1782 -220 -1221 -1424 -1923 -3561 -1336 -184 816 1858 2245 1817 777
1727 777 1692 471 -2067 -1504 -1444 -3338 -2980 -624 376 808 3191 2916 1499 986 948 -254 -2215 -2510
1745 -2510 -1126 -2412 -1348 426 -177 372 3483 1755 439 1304 334 -2298 -2232 -822 -2375 -2437 7
1762 7 748 856 2229 2775 330 228 -230 -1333 -2060 -1651 -1070 -1551 -791 887 1265 1985 1338 2080 96
1781 96 -229 -923 -2548 -1469 -1259 -1142 -209 497 1647 1993 2285 2252 356 -593 -643 -1687 -1524 -2785 -2410
1800 -2410 -987 -726 -263 2051 2240 1240 2124 236 276 -1667 -1769 -1593 -2291 -1251 -288 1028 1239 2860
1818 2860 1950 405 817 -208 -1596 -2240 -1152 -1605 -1842 34 1211 1386 1379 2782 1005 648 63 -1028
1836 -1028 -2287 -788 -1493 -1768 -1283 1425 738 925 2558 2190 937 -915 -636 -2077 -1341 -1941 -1439
1853 -1439 -721 112 1711 270 2057 1452 1260 156 -158 -1717 -2818 -1965 -1642 -1127 -575 2919 1186
1870 1186 1692 2441 1093 -364 -404 -843 -1835 -2324 -1298 -991 778 708 981 2497 1875 1582 -92 -387
1888 -387 -1329 -1683 -1276 -206 -510 427 1035 1827 984 2048 1220 -271 332 -779 -992 -1237 -1245 -1809 141
1907 141 722 232 1674 989 1826 -482 -504 636 -915 -1703 -660 -953 -591 1056 1632 355 1317 1666
1925 1666 1178 -768 -403 -1419 -2178 -1157 -538 -580 1241 2092 1215 1772 2604 556 -434 -924 -843 -1049 -1668
1944 -1668 -1249 -1334 -434 1334 1829 1618 982 1047 -52 -385 -363 -467 -2427 -1057 -836 -202 54 1932 1624
1963 1624 1479 580 324 237 -1766 -1562 -1518 -427 -572 613 -1190 1189 1300 1839 1194 336 -712 -1561
1981 -1561 -1116 -1388 -1108 70 -742 218 773 474 1447 596 1136 -1023 -304 -839 -1071 -1494 -339 -1153 683
2000 683 427 1073 990 1234 1690 1195 -34 -960 -1168 -1257 -338 -953 -12 1170 2567 440 767 1222 294
2019 294 -636 -405 292 -1098 -8 244 557 930 2345 263 977 1618 274 -1266 -126 -660 -1221 -753
2037 -753 -505 -691 -802 1491 1444 1533 497 1181 -628 -1100 -711 -304 -1239 -205 -487 286 318 1373 1365 696
2057 696 1306 156 -322 -164 -1393 -1400 -938 230 12 -504 404 1807 794 1033 -502 -470 -1470 -52
2075 -52 -456 -572 -367 382 364 1498 1390 208 589 392 -1751 -102 -495 -894 -945 637 289 465 139
2094 139 575 913 149 294 27 -1183 20 -1099 -35 -41 -369 402 567 216 -258 1886 933 -513 -730
2113 -730 -1454 -870 -860 -1068 984 -54 381 1003 564 175 585 539 518 196 -1273 -63 -111 -252 282 1336
2133 1336 -105 762 194 763 -82 -259 -1081 -367 -228 -551 -847 -148 627 -529 502 230 85 -360 -783
2152 -783 -735 -272 -563 -472 202 105 1268 326 98 453 -799 416 -28 41 -1 -468 -461 -209 -222 -448 932
2173 932 544 1055 845 -219 -939 -310 -554 206 -886 104 -75 451 -164 1029 545 52 313 -162 -734
2192 -734 -86 31 -270 -102 -582 -292 -269 1196 323 223 85 1012 -152 -495 -780 -928 -993 -293 -596 -499
2212 -499 238 86 610 253 142 49 -1204 -348 -29 -521 -207 -79 -385 -667 552 268 254 -795 -287 -378
2232 -378 -115 489 -828 80 -307 -298 -304 -485 0 112 -672 -650 -1182 -345 392 223 -1277 -24 884 -745
2252 -745 -414 207 -96 -477 -344 -424 145 -281 -68 -449 187 246 -367 257 291 377 273 -311 447 -654 78
2273 78 885 -297 29 -146 123 307 457 380 719 -452 -208 -1346 193 293 -110 -203 33 -437 729
2292 729 -221 123 430 1455 249 117 493 -207 -515 -106 476 706 -872 -122 -719 261 -234 226 424
2311 424 -1254 247 408 486 -126 -65 -467 66 -187 -17 -264 -285 1167 739 1441 1525 587 -1176 -786 -438
2331 -438 -494 51 400 566 -696 -10 1033 468 1052 447 -49 -470 196 -153 -470 -383 -183 -498 -122 -507
2351 -507 564 726 17 -87 -510 435 -668 -543 -234 402 439 106 -8 -230 615 574 303 -144 -1142 -1277
2371 -1277 -287 593 -406 -1004 237 1084 1469 777 660 493 204 662 -128 -458 -492 -455 -801 216 563 -255
2391 -255 1052 405 317 370 -817 295 -635 -371 -43 -549 -517 -130 920 814 510 554 287 -159 -177 -578
2411 -578 -1242 -382 117 -433 507 -173 192 381 385 -101 -231 369 -937 -304 -1009 380 -377 -581 227 731
2431 731 964 602 135 67 544 -1175 66 60 -632 -864 -156 350 1277 108 654 189 -364 -516 -373 -495
2451 -495 -1151 -1151 -886 -611 141 874 741 1112 215 366 -326 -156 -595 -1355 -1306 199 426 -41 1268 1075
2471 1075 586 -255 395 -1312 -681 -1313 -921 132 85 -240 -166 696 426 135 -345 496 -544 97 -1206
2490 -1206 -1166 -1606 -1277 453 -234 252 1224 400 775 653 -235 -837 -372 345 -646 -704 -306 274 217 290 643
2511 643 508 544 761 -222 -1383 -304 -638 -635 76 142 921 1052 489 743 842 178 45 -190 -544 -827 -465
2532 -465 -108 530 -56 73 1192 688 1065 23 -533 -369 -1745 -1242 -702 -111 515 649 1762 571
2550 571 1554 337 -103 -213 -313 -529 -640 -983 -1167 -44 1154 414 1143 1200 1098 443 -373 217 -182
2569 -182 -565 -696 -47 -171 456 132 662 898 669 392 717 -857 -108 -921 -1044 -198 -550 69 -80 564
2589 564 1787 545 1023 -559 -344 -415 -910 -261 -1234 -274 277 467 647 1103 1213 204 930 -30 -743
2608 -743 -409 -1399 -1093 -277 -206 -73 417 1447 1527 801 723 -828 232 -690 -235 -1297 -405 -577 -55 1004
2628 1004 320 1192 789 466 239 -485 -1123 -2056 -2186 -1621 -544 -52 1218 1207 738 171 1031 -45 -1440
2647 -1440 -657 -587 -1243 -954 -267 262 41 11 647 230 -125 351 -1034 -1335 -404 -1381 256 -669 1174
2666 1174 890 389 1397 1166 900 290 -200 -1314 -1156 -368 -868 -1145 -444 1167 1309 817 946 1340 13
2685 13 15 91 -838 -760 -575 -573 457 431 287 498 1479 -183 272 -526 -1283 -765 -1603 -1003 -986 -207 -14 981
2707 981 622 358 927 1119 541 145 -1587 -1086 -1012 -869 -90 -415 1162 729 671 1477 485 -88 -407 -516
2727 -516 -1916 -1308 -753 149 118 1053 1423 1398 1267 596 -622 -115 -1119 -1379 -1276 -1120 -1029 246 94 1267
2747 1267 2225 1209 600 322 -571 -1093 -314 -1387 -1275 -37 196 1565 1940 937 1087 951 69 -587
2765 -587 343 -1160 -1557 -651 -467 -1121 -741 416 1367 1235 1114 464 109 -1347 -724 -1044 -1259 -901 62
2784 62 163 1042 848 1274 158 586 311 -1033 -38 -1890 -994 -1522 -456 -240 791 1323 681 1439 1469
2803 1469 -298 -214 -619 -1081 -1007 -545 -1057 325 698 1337 1212 856 626 216 -706 -667 -451 -1174 -1779 -193
2823 -193 -44 1040 1237 1352 1096 1017 150 -1003 -1103 -1534 -1776 -1261 32 -873 105 1159 652 308 580
2842 580 288 70 -1687 -505 -1015 -1268 -471 941 709 1620 722 902 1868 1219 -330 -332 -486 -784 -1011
2861 -1011 -1247 -247 -448 528 1538 1277 913 272 -650 -946 -536 -904 -1017 -1959 204 103 464 1413 2010
2880 2010 1369 724 -778 -939 -1777 -1522 -455 -719 -392 0 1182 1464 1359 1512 1342 -335 -181 -461
2898 -461 -1426 -1883 -1143 -292 -504 512 1193 1399 1157 865 282 127 -753 -868 -1253 -761 -583 -318 515 707
2918 707 1218 31 444 1508 -429 -1523 -1338 -871 -1697 -528 -125 543 1122 1226 774 1372 396 -300
2936 -300 -1994 -1328 -1391 -1694 -1059 156 951 286 416 1005 1112 106 126 -478 -1330 -1645 -1666 -1362 -77 25
2956 25 636 583 1395 980 398 -112 -797 -1760 -675 -1280 -932 -825 -274 878 1177 1258 1513 1359 910 -206
2976 -206 -1310 -627 -1650 -1214 -497 43 624 1356 1530 775 319 -126 -784 -459 -1283 -1316 -1577 -55 -228
2995 -228 428 998 1068 1946 692 825 341 -1043 -640 -1495 -1134 -1271 -608 986 993 206 1385 1373 1242 -576
3015 -576 -381 -1389 -1722 -1078 92 -481 175 -305 1535 2069 750 970 -84 -31 -820 -747 -684 -922 -684
3034 -684 26 593 179 1633 960 -126 -11 -670 -464 -2055 -81 -1115 -1320 -113 618 1216 697 1333
3052 1333 415 -252 -3 -133 -1086 -1438 -563 -113 197 827 1262 453 1863 1302 671 -666 -786 -549 -1097
3071 -1097 -890 -632 -692 120 660 1618 2136 1686 106 -778 -642 -1405 -1230 -923 -915 -646 599 1476 1193 1463
3091 1463 637 -550 306 -867 -593 -1574 -702 -1064 -644 -851 1758 1559 1434 572 407 -650 -739 -767 -670
3110 -670 -2071 -940 156 -12 790 1387 1834 1070 1091 311 -843 -882 -917 168 -948 -1066 15 503 1744
3129 1744 1045 803 1072 270 417 -969 -872 -625 -247 -644 319 1223 1296 2413 1978 889 1306 -275 -745
3148 -745 -1644 -787 491 -1001 -479 568 1741 968 641 880 1076 269 -521 -978 -1150 -1872 -1474 141
3166 141 529 1051 1152 829 1152 1254 250 -496 -1513 -1075 -2023 -511 -993 -343 548 1291 1940 671 -16
3185 -16 977 -447 -1510 -931 -1502 -100 -191 -470 700 781 1757 1249 -85 1335 -954 -1096 -1092 -1644 -1578 45
3205 45 -42 1209 1398 611 457 1002 -215 -998 -235 -1353 -1797 -394 -230 -670 149 1438 1352 993 572
3224 572 311 -129 -1400 -865 -608 -1293 159 -296 -549 717 746 1302 1324 348 -453 -819 -1267 -853 -954 624
3244 624 -564 132 1514 836 801 1261 1215 479 -742 -1949 -511 -2025 -632 -351 111 -62 1077 888
3262 888 690 1085 23 -243 -962 -725 -1177 -769 -748 147 794 1794 1307 495 455 -81 265 11 -846 -1433
3282 -1433 -1334 -476 -27 518 1351 1092 755 912 375 -312 -360 -1497 -465 -474 288 -52 311 465 509 773 825
3303 825 1139 -485 -1502 -293 -874 -716 -235 618 695 204 1435 310 842 -378 466 46 -901 -1146
3321 -1146 -1109 -200 788 820 1250 1508 2078 649 246 -298 -246 -1781 -1522 -1007 -766 709 486 1333 1230 176
3341 176 -159 478 683 33 -511 -1221 -1021 -1238 -823 734 540 -45 1474 866 803 448 -597 -1237 8
3360 8 -1939 -879 -1044 -831 801 799 1113 682 1350 833 75 -1074 -1996 -1790 -1087 -439 544 153 1554 1371
3380 1371 446 50 -773 -157 -502 -979 -1691 -858 -435 -276 384 542 1380 306 666 102 143 -228 -1371
3399 -1371 -672 -1747 -641 573 399 1140 703 1242 1313 389 -2 -463 -1348 -456 -524 -582 394 -282 1247
3418 1247 1473 2154 140 824 829 -970 -794 -1059 -725 -622 -546 354 843 646 878 1177 1380 -318 -78 -636
3438 -636 -1012 -769 -1337 -7 -438 707 1766 1669 718 1236 -85 -175 -373 -676 -1430 -1197 -530 115 864
3457 864 906 1012 1379 1062 1036 -763 -406 -1258 -1254 -441 -678 -340 243 729 690 474 1189 202 267 -880 -313
3478 -313 -998 -1114 -1233 -260 1221 619 2135 1484 1546 568 37 -1039 -1549 -797 -823 -702 -210 -144 2011 495
3498 495 1673 1663 402 -102 -538 -519 -595 -932 -745 -830 611 1416 984 1325 1095 260 508 -25 10 -1001
3518 -1001 -1066 -513 383 193 189 529 727 972 1113 150 -380 -927 -1586 -927 -471 -964 -74 -192 177 1262
3538 1262 1232 986 -271 325 -480 -2024 -1148 -384 -725 -543 283 494 847 1422 989 328 338 -625 -1077 -553
3558 -553 -1497 48 308 27 1449 948 1047 1632 251 -226 -130 -944 -1310 -808 -70 66 414 830 1268 736
3578 736 512 379 -311 -709 -1190 -1438 -124 -1119 -16 527 -382 481 889 -20 539 -611 423 -1116
3596 -1116 -1047 -1206 -613 -678 -1099 511 613 1004 232 1016 -29 94 -495 -642 -1608 -396 -135 -585 81
3615 81 1410 1009 955 634 -182 -297 -686 -1221 -372 -303 -72 -139 -25 1331 1110 652 794 75 659 -455
3635 -455 -29 -706 -1637 -1647 105 491 317 429 577 1526 168 -1332 -250 -910 -2017 -244 -1115 -710
3653 -710 259 133 1106 1291 868 938 181 -250 -1372 -1153 -1110 -603 -1539 569 1057 93 1224 976 561 -81
3673 -81 -414 -1348 416 -767 -890 -932 -839 156 1443 1314 340 436 214 -224 -640 -1395 -997 -837 -578 228
3693 228 -150 -202 997 376 384 375 289 -198 -757 109 -372 -178 643 58 653 2 731 655 266 -1152 -408 -797
3715 -797 -936 -376 -724 -440 430 180 386 682 1456 481 -34 -102 -1269 -1219 -852 -900 -802 -416 -126 301 58
3736 58 1429 766 68 492 -446 -488 241 -102 -487 725 154 -147 1079 724 1332 -106 62 -1248 -557
3755 -557 -643 -729 -584 673 -672 663 664 1034 1127 -570 -473 -75 -547 -838 -739 -1302 -232 290 979 166 -296
3776 -296 -121 644 -604 -248 450 -967 -1194 -1045 555 142 1503 570 482 916 -18 -156 -152 -363 -312 -1305
3796 -1305 -827 -354 -844 36 343 692 1358 883 991 700 -1284 -694 -593 -258 -1034 344 509 1122 1108
3815 1108 147 567 628 -726 -867 -880 -147 -552 52 -635 308 331 912 691 177 485 -35 -739 -859 -86
3835 -86 -784 237 -465 1227 1203 426 704 0 -286 416 -1115 -1042 -380 -219 108 -1070 871 150 880
3854 880 750 343 720 726 -1120 -1461 -738 5 -375 -458 789 -170 344 -44 1060 308 -122 -553 482 -1090
3874 -1090 -843 -731 558 -47 266 589 1425 38 877 157 -504 -469 245 -1036 -1006 17 113 339 240 736
3894 736 1006 552 -138 -352 -630 -1033 -372 -1146 -744 285 543 1032 431 -2 227 734 94 -106 -415 -804
3914 -804 -416 -631 77 252 -287 -284 635 977 292 -995 -635 -38 454 30 39 -206 706 244 473 323 -235
3935 -235 455 -228 -392 -337 77 -489 -636 -958 313 1064 -162 1074 1238 -30 568 426 -946 -302 -464
3954 -464 257 671 -192 224 842 1326 368 488 282 -978 -82 -262 -518 54 -968 -261 248 855 1324
3973 1324 929 506 608 -502 -31 -378 -1225 -1254 -393 195 -541 212 -726 463 1569 0 -48 -246 1007
3992 1007 16 -635 375 -449 388 -151 869 407 479 102 -650 61 -416 -1058 -1545 -986 261 -214 705
4011 705 600 1087 -312 186 -169 -363 -930 342 -250 527 91 717 626 980 -204 58 772 76 158 -593
4031 -593 -1320 372 288 249 -618 -572 558 1570 226 -466 -229 -573 -1112 313 -92 15 -383 476 -290
4050 -290 541 124 127 1083 1000 38 32 174 -459 -1061 -492 149 -268 131 266 196 -629 -747 22 374 -911 -452
4072 -452 -267 -87 -193 -277 307 -12 158 -29 -898 -334 4 -368 324 -164 -217 394 603 573 659 -114 601
4093 601 -7 -573 259 635 -1067 -242 -860 -693 266 -524 255 613 757 -35 -227 -270 -275 -78 5 -587 -460
4114 -460 -249 -116 -170 903 709 1135 -273 171 -469 -161 -415 -205 -288 52 -64 -741 -154 183 -176 907
4134 907 341 -460 23 687 279 -685 240 145 225 -319 1348 -697 -185 273 -121 -204 -965 -526 125 103 -20
4155 -20 -239 675 707 129 -267 817 192 153 -537 -352 -229 -247 -245 -957 740 472 456 -732 195 456 -172
4176 -172 -433 61 58 -110 -550 -127 -420 443 -195 -569 -159 554 311 83 371 -603 5 -574 -277 812
4196 812 -196 747 -68 -330 146 291 566 183 -40 -446 -21 27 263 663 186 778 -40 -384 -137 -358
4216 -358 334 1273 13 -410 34 -263 -248 706 -444 230 -1463 542 -642 -142 -322 -361 -198 65 -458
4235 -458 92 -1230 1381 691 -237 -53 -646 -265 -129 206 613 626 -372 24 703 201 12 -359 -427 73
4255 73 -703 136 -61 142 -245 461 -28 398 -571 406 -667 146 394 -1125 -338 -189 130 53 102 -190
4275 -190 741 3 522 -586 61 267 -428 -474 -665 293 -874 325 196 600 -402 761 466 448 18
4294 18 -802 -302 444 -852 -27 677 25 -45 269 -627 580 -283 -841 384 -476 396 -365 683 -301
4313 -301 946 666 395 804 -637 32 -521 -479 -447 740 -439 -493 -137 132 82 820 -679 -296 517 -158
4333 -158 -528 38 338 40 756 -594 47 -546 -107 -71 625 951 -721 627 -680 -415 107 433 -386
4352 -386 402 252 -676 547 194 759 -74 302 705 501 77 663 -127 275 -181 -141 -220 -235 -521 272 -104
4373 -104 935 -68 47 188 -613 898 222 596 -507 96 -339 -564 -643 -964 317 -60 537 -80 -224
4392 -224 68 38 493 683 559 -756 1230 359 374 346 -1059 -360 -262 -505 -1410 -1262 500 -182 113 213
4412 213 -572 37 -262 504 -678 -419 -898 -520 419 265 -417 -110 -809 -641 -145 -63 486 626 465 46
4432 46 787 -94 374 -406 170 -536 -315 -187 476 -297 -1084 -361 460 98 -303 155 -287 -106 841 920 450
4453 450 -259 1121 454 34 -261 -366 967 393 -1010 -140 186 313 -638 -366 236 54 543 -24 248
4472 248 404 435 124 -408 947 -306 351 570 -148 114 -299 -70 -193 -938 236 199 24 160 315 -824
4492 -824 140 860 125 -745 -58 48 81 800 -164 -714 -1086 353 -293 507 -220 510 504 -69 539 176 171
4513 171 185 154 -412 -366 -153 494 -533 81 -962 637 601 386 528 211 -534 -84 49 594 633 426 -398
4534 -398 593 -402 -208 -3 209 -457 32 884 -188 -994 261 686 -161 -120 439 -316 -510 -330 331 -621
4554 -621 375 -264 -416 -683 90 719 143 349 141 1129 341 185 -341 276 109 -104 -611 606 -341 -280
4574 -280 91 1141 -208 -355 -55 -337 -1125 132 157 -210 25 -298 -920 128 959 790 -680 -353 -365
4593 -365 222 66 -423 -57 -712 301 -724 -77 303 736 -690 503 60 412 -57 417 -391 -248 208
4612 208 547 502 226 118 -407 0 26 204 439 1 875 -312 -276 -941 -340 490 168 -206 592 337 435
4633 435 -132 -58 404 -137 616 18 -410 -339 -362 -923 193 81 -309 451 637 -68 769 -76 -111 186 -322
4654 -322 -830 -107 267 -281 301 -994 951 41 617 -158 -36 125 -28 1042 -82 -336 -552 -342 -178
4673 -178 -335 228 597 623 710 -87 936 -516 181 279 68 221 -266 -376 -526 -234 -117 447 -667 -210
4693 -210 157 -627 334 -138 -463 -211 -444 631 -318 690 -402 -557 -39 -361 -390 -581 -511 -293 -191 -453
4713 -453 -130 -98 411 255 -221 -701 -266 -910 -84 -109 -370 -22 12 -782 330 436 15 -29 181 801 654
4734 654 -448 517 -149 160 -444 -175 -347 507 553 555 16 263 328 741 -1021 -313 229 -561 -60 235 -125
4755 -125 225 1149 -376 132 -40 735 -918 -454 -731 -123 375 570 293 -242 69 256 1121 -89 16
4774 16 -661 -264 -1133 -123 -238 -103 -540 -169 -93 263 461 157 -403 -94 121 -43 -1104 -869 -193 -233
4794 -233 767 -35 16 -181 -149 -409 -352 -143 102 -1149 269 1346 -391 193 -254 73 -385 321 -50
4813 -50 359 -608 -342 -625 -197 -431 26 -136 181 74 336 258 173 -458 185 157 -514 114 -930 264 1185
4834 1185 -273 -267 569 289 892 382 -706 -180 -176 -743 -259 -597 -543 -79 49 -434 430 -858 332 211
4854 211 -406 0 406 827 -221 647 -871 234 1028 1123 377 -229 -82 -1082 -967 119 498 306 -931
4873 -931 824 604 817 690 1577 335 -509 131 -283 -833 -935 542 -257 -431 200 -780 400 428 774
4892 774 93 527 -300 130 -1178 -658 259 -122 464 -407 30 287 -376 900 -238 -518 967 -952
4910 -952 -111 380 4 401 -78 1040 -229 1067 68 224 257 -505 -181 6 -289 281 819 119 679
4929 679 -203 -39 -173 -515 -702 115 985 -1360 -599 -165 26 -193 -8 483 1208 -192 522 -196 -610
4948 -610 559 -735 -46 -299 156 -520 887 310 312 919 -353 41 25 -708 362 -105 -17 -98 337 410
4968 410 42 -886 -682 -367 -105 -711 959 -680 -722 437 16 -957 163 -513 -358 -33 582 44 -214
4987 -214 -502 -580 -651 274 655 -630 190 1262 490 665 -1 1246 -1 171 -346 529 -719 154 -557
5006 -557 -8 629 947 397 -100 771 80 -77 472 -673 -1265 -287 658 173 356 -52 -396 792 -224
5025 -224 -466 306 89 -154 277 -178 -116 -531 273 -81 321 16 -586 318 -1100 -177 -751 516 1105 -439
5045 -439 -558 -190 -92 364 -104 389 -151 -489 -640 710 -65 -957 112 -60 671 722 -249 639 -590 -1008
5065 -1008 -178 -370 -84 1207 -169 284 154 -631 518 453 115 -584 874 -549 -338 -675 -825 45
5083 45 -215 -104 336 408 -495 -654 -215 -116 244 -462 -406 -607 93 -162 -201 132 -171 -242 221 -394 374 -341
5105 -341 -452 -99 -581 7 -33 -592 813 748 -494 511 -227 -971 326 -806 -1256 -301 -740 779 166
5124 166 -322 -195 601 -264 289 -68 -338 -53 40 -252 906 -18 -74 727 -247 -21 -203 -611 690 153
5144 153 -939 -760 -235 698 -418 -31 -438 -415 -367 -33 1079 660 367 -475 -4 64 -606 -772 -701 538
5164 538 804 396 -333 -121 786 119 139 330 167 161 -450 155 -343 465 -920 368 -558 -187 -372 -283 696
5185 696 979 -647 -225 -97 300 -199 230 -348 -722 385 562 32 -711 929 -590 -600 -868 421 392
5204 392 565 1029 1242 81 -30 -56 122 59 -450 -868 -331 186 -209 103 -541 50 638 -582 -396 -692
5224 -692 -707 -50 -70 -534 -193 -81 -477 252 -670 333 291 -331 -78 -188 193 565 278 -344 -374 425 237
5245 237 258 41 445 -552 -534 -577 -343 196 -308 150 -413 962 1124 -318 211 -86 -850 567 -669 642
5265 642 -127 -128 -436 -655 445 -390 79 -172 -935 -274 526 444 -606 -92 -883 -97 -529 572 -88 -102
5285 -102 318 -140 21 -172 -742 -660 602 764 324 -536 -694 420 49 -90 -82 355 -164 -435 656 296
5305 296 -469 -1052 -1101 -515 -319 -348 -179 161 34 -294 -366 -283 -1058 -133 66 -549 -958 746 52 -936 749
5326 749 23 99 211 963 263 -549 627 -140 170 559 418 691 -841 -262 682 -302 19 -419 950
5345 950 250 52 -1273 -670 613 160 1 97 -50 283 -128 544 348 65 273 -326 93 19 236 -613
5365 -613 67 -155 -282 17 289 204 1020 102 -1354 265 -150 1017 -644 -499 -255 843 -247 118
5383 118 885 121 -407 202 -201 87 -238 299 -23 -1005 427 208 -123 -434 41 797 66 -393 498 208
5403 208 630 -412 137 -100 -172 24 100 -701 224 862 -3 68 -75 -62 194 88 714 559 -227 -622 23
5424 23 -161 -284 77 -221 -220 -5 -377 769 314 -159 -66 241 -79 -829 87 -216 -550 1210 1037 -539
5444 -539 534 554 476 -527 311 530 -929 -649 -245 -423 -247 -437 381 515 421 790 -512 18 277 -815
5464 -815 -1543 -47 201 152 440 -255 -602 642 473 -410 224 -1661 409 182 -1196 -73 -380 -300 540
5483 540 896 349 1020 735 687 178 55 -42 -572 306 -529 -411 -374 -247 -704 -328 189 -32 -321 -476 -715
5504 -715 234 454 342 280 800 740 935 -693 112 252 -343 710 43 232 348 -138 -633 361 -577 274
5524 274 -735 -736 -272 -408 -269 17 -67 93 685 221 157 956 439 292 407 307 11 23 -154 459 -266
5545 -266 -527 82 -919 -307 -79 -105 89 -612 110 539 122 336 706 -20 756 -1077 652 543 -629
5564 -629 -842 -366 330 90 650 749 191 -200 -636 -662 262 541 156 246 -259 -375 331 425 303 77 -188
5585 -188 827 -178 -4 529 -612 -543 432 -17 626 -173 472 670 -358 132 210 17 -529 305 -239
5604 -239 120 87 211 -366 -84 305 306 -231 281 -511 -1271 -308 -700 -231 405 295 1308 -429 585 579 -416
5625 -416 -372 -339 -340 81 174 529 658 -181 454 -180 393 159 -293 224 70 -499 -252 -13 579 -397 -121 118
5647 118 -698 385 -31 -197 -394 -337 -537 43 -860 656 759 -382 586 -69 724 192 560 -64 580
5666 580 -242 140 95 -317 -172 317 1024 -85 223 606 5 -469 -752 -396 -67 -38 534 389 594 319
5686 319 700 -362 -218 521 -594 -340 -118 -128 -514 -101 -763 317 158 677 637 -66 289 140 -191 261
5706 261 191 -157 -617 559 333 696 -58 221 -402 -295 -579 -394 117 131 -518 -62 -33 -230 -325 126 92
5727 92 645 -560 91 475 -762 -279 -437 -835 -158 -174 3 1301 -98 139 752 222 342 460 435 -17
5747 -17 336 269 106 106 267 457 47 1102 -776 -1036 -606 -499 157 -26 154 331 -574 114 1055 955 301
5768 301 -479 -776 -566 58 -820 2 769 340 -898 -453 650 480 -101 -655 -754 506 -618 249 -1206
5787 -1206 -162 104 -360 -39 -217 -473 -70 344 518 435 82 1 400 -1002 -1673 -237 -152 223 -559 92
5807 92 -430 829 299 -498 -225 -161 201 -1341 -1034 -456 -399 315 858 -60 -119 50 -30 -798 285 -386 -54
5828 -54 -352 -984 302 -215 -332 337 -110 -49 99 -414 -113 -225 226 147 -602 -233 -333 24 -281 906
5848 906 380 1060 161 -1178 330 -570 -93 510 203 -188 -394 407 -774 599 -93 608 -254 -601 -1037
5867 -1037 -371 -605 -638 951 511 151 -284 -331 -87 -58 586 36 -580 -10 -190 -189 -666 -169 -475 1143 -397
5888 -397 96 -117 -1231 301 -616 11 -664 -272 230 -307 771 -460 942 632 -407 25 -1167 -464
5906 -464 -503 -123 73 -616 110 1010 328 -585 -32 497 -156 -805 -327 -120 -386 99 105 -505 -651 423 413
5927 413 -54 333 -324 -1234 -659 -449 437 78 -40 601 435 -443 -438 307 516 -1346 -619 -219 -368 -302 -164
5948 -164 16 -126 678 336 640 124 80 -341 224 -550 346 -293 226 1138 469 -276 -548 1033 286 -28
5968 -28 199 -425 -823 -465 159 598 226 175 476 -5 -398 972 1306 39 77 181 -268 363 343 319 715
5989 715 -455 1229 -952 828 68 -288 -173 238 -100 -731 -180 -310 539 932 -192 294 -213 426
6007 426 735 -1126 435 84 144 -157 407 -401 -185 -321 -287 -204 -349 -279 -219 305 307 -897 91 806 -113
6028 -113 326 -674 400 284 1220 -333 -132 -22 -1393 -350 -18 -1689 -585 -307 916 -337 -259
6045 -259 369 526 661 556 -203 -437 -227 -70 -387 353 -173 -38 692 812 266 -314 191 -523 538 -940
6065 -940 -899 255 300 219 566 351 -522 801 481 5 1162 -467 -1649 -112 33 -253 -108 -1082 98
6084 98 2 1331 796 -273 -168 -840 -626 -1007 -717 454 -446 995 429 -85 315 197 -881 -398 -603
6103 -603 -118 289 230 921 -249 768 273 -441 741 695 -281 502 -677 -395 -419 -1017 -555 -367 950
6122 950 1022 524 -442 521 -228 -1090 499 -606 -1496 935 -938 -400 319 307 272 385 -83 631 576 -1546
6142 -1546 102 -485 -484 -416 -1199 -621 -428 331 -30 105 861 -533 -523 703 -613 -707 37 -853 504 391
6162 391 320 -218 537 -270 -341 -429 -348 -190 121 -177 -85 245 77 176 1058 513 -343 177 303 -532 -552 -642 120
6185 120 -235 -539 16 177 70 318 43 510 396 326 -387 -723 -296 58 172 155 -528 126 255 -66 -304
6206 -304 515 -1122 -326 -784 -730 95 723 -32 180 631 -331 -80 -347 203 -765 1118 467 -820 -395
6225 -395 134 1143 14 904 -332 -94 -341 -1198 267 -668 626 -802 -436 676 501 407 293 589
6243 589 1322 348 562 -99 -607 -168 -845 -447 -442 103 -164 312 -103 10 -71 -11 -629 371 -134 -217 567
6264 567 -539 -571 271 -294 350 -169 -572 24 979 -83 517 263 589 -64 516 295 -273 590 340 328
6284 328 -616 679 -360 -907 -159 -74 -944 393 -290 1042 -501 391 84 -514 -822 -258 -1231 -650 -355
6303 -355 -608 -109 57 846 774 21 193 -127 -320 4 364 -617 -608 762 -377 -7 2004 588 -605
6322 -605 626 337 1083 599 -725 -42 69 -140 -447 -560 378 145 742 -68 573 134 -344 -135 -152 -325
6342 -325 -546 -161 -1204 -157 -43 295 455 -407 -312 -174 -275 -699 -8 -10 -110 -213 -416 440 242 880
6362 880 480 256 313 -422 -519 -580 -590 -50 -1157 433 -302 209 915 329 -12 -657 102 76 82 84 -669 -990
6384 -990 422 299 -90 880 1254 849 39 -503 -546 5 -597 -300 -415 -220 33 399 438 318 599 -27
6404 -27 -458 64 -83 -782 -1310 60 172 -414 212 914 -95 -150 165 -924 -247 -226 -261 340 -1047 -65
6424 -65 328 -57 844 -429 641 -57 275 578 -178 -610 -242 -870 -22 653 -1036 -92 198 1187 -30
6443 -30 337 -122 -926 -362 82 1109 540 -406 -125 835 1004 1118 873 224 103 -411 -232 -214 -868 470
6463 470 286 583 259 291 94 742 -413 -430 -348 -740 -761 -1643 95 62 -568 668 1079 -536 550 -1
6483 -1 -678 -689 717 -1649 -349 133 751 868 596 129 537 847 -988 668 -421 -689 126 -195 -1066
6502 -1066 288 -40 -213 707 722 249 45 -191 348 -790 -886 -845 -532 828 -50 -668 23 331 245 13
6522 13 -77 432 -1092 205 -891 -635 -412 168 333 -303 197 553 -371 -896 -789 -721 -76 -150 -287 -1001
6542 -1001 -445 -166 149 -65 196 471 90 -21 -719 -687 -441 -506 58 669 439 -75 475 1002 118 14
6562 14 -276 219 -546 -1439 -621 -1177 98 -915 399 676 209 262 -238 -938 -580 -684 -901 -631 -353 -26
6582 -26 465 14 -319 872 350 1189 391 -967 1002 -468 510 -99 -142 -603 248 631 -91 1272 540
6601 540 -114 -52 381 -82 -660 -863 396 963 902 782 43 -548 -348 261 -756 -6 -837 -1017 86 -1086
6621 -1086 21 -506 433 203 -381 -66 -400 -522 -1037 -383 -973 -468 640 -110 -44 -536 -520 337 114 -182
6641 -182 -420 -1455 -60 -465 -221 -616 688 17 157 353 791 50 -124 76 -893 112 -1198 -280
6659 -280 -402 -621 -217 217 343 162 137 -704 -140 175 288 -190 -848 -760 142 338 -426 -299 769 40
6679 40 97 126 -290 -252 -516 -397 -101 -338 786 570 25 881 -545 269 408 -197 -1035 -932 -39 1008
6699 1008 -756 -574 -174 705 322 14 -122 447 -211 -899 -934 -40 -1081 252 -935 -630 -46 219 1193
6718 1193 530 774 -482 -15 -514 -717 74 -199 -85 -1043 224 428 -663 1122 630 1134 -488 -210
6736 -210 37 -939 -764 -743 347 791 508 -283 558 -85 243 1 213 -363 -843 412 7 624 123 -84
6756 -84 -117 -136 189 162 -778 -400 -441 95 -385 -1548 -194 -437 727 435 599 545 355 484 -270 -1032 -942
6777 -942 -438 -903 -314 79 594 -119 -24 1043 38 -400 -348 733 -422 -552 -642 -550 -630 421 626 1423
6797 1423 17 759 4 42 -292 615 -8 168 -429 -166 -91 813 539 -844 86 -552 -456 181 -943 -864
6817 -864 -103 -423 28 250 1113 580 1076 749 406 -566 -2 395 -661 -386 -1306 108 280 -135 660
6836 660 481 -664 -1193 191 -14 -150 -276 -1237 265 -591 162 635 1604 -113 817 249 -155 -82 -134
6855 -134 -346 40 -268 203 -110 645 452 58 743 71 64 10 -541 -367 760 -111 134 101 -946 399
6875 399 153 -80 -592 -586 550 -308 59 369 -1180 -370 490 591 82 314 715 -297 -128 -29 -67 -290
6895 -290 -39 288 -465 -612 -278 626 549 -394 22 -569 -249 -444 -161 -1110 184 -223 -297 -715 -42 10 17
6916 17 -147 851 -287 -553 -314 -444 -687 -487 -735 -379 40 -618 187 -285 -1589 383 -3 49 -294 -521
6936 -521 -302 -682 149 165 356 655 509 982 -17 -410 -369 -498 377 -223 -790 -917 987 -10 755 379
6956 379 26 -393 398 -680 76 -1004 -1348 -523 -64 -67 321 1248 533 605 -745 646 698 -1 -1185 -670
6976 -670 -432 -433 -267 208 926 636 1000 -329 580 268 -891 -157 162 -340 428 804 -308 343 261 23
6996 23 331 63 295 74 -819 -11 -839 262 -185 -55 -164 986 -768 254 98 -786 235 144 -862
7015 -862 140 -641 -544 -275 82 14 -456 427 -667 -657 -88 309 574 -757 -358 433 492 218 -206 -185 50
7036 50 -242 699 -308 -760 682 -553 -680 148 130 -239 883 384 20 1183 90 -169 -762 -516 -534
7055 -534 -308 779 -173 234 1140 948 -509 1209 -20 -239 -412 -4 -513 215 -308 -829 1324 338
7073 338 -118 110 915 698 -203 78 -207 -58 374 -522 41 752 -407 747 -207 47 801 426 -211
7092 -211 989 -543 -170 -326 -637 460 615 157 740 81 516 377 -150 -520 285 -704 -760 -414 629
7111 629 -261 -423 -423 1170 211 25 -890 -535 -73 -119 142 180 177 -405 -30 -255 -201 -95 -521 -673 69 -89
7133 -89 84 -1416 -337 -493 365 1097 -357 -511 267 -842 581 -159 -260 26 339 485 -122 -144 -153 468
7153 468 295 -241 370 -218 101 689 628 136 -210 -161 -32 -112 -180 399 -351 -1065 -69 421 -653 74 -466
7174 -466 -154 5 -724 782 -806 -78 1430 15 -248 -684 -705 -241 -242 -611 694 18 808 -731 -441
7193 -441 730 421 -610 -62 -151 13 2 -597 -331 -157 319 -257 -141 539 685 -380 456 363 -467 -20
7213 -20 -576 225 -10 202 -954 129 868 681 631 132 -683 -118 -85 -946 -73 466 -1036 -154 587 547
7233 547 -228 -149 1343 579 -707 281 -513 232 211 312 189 -215 -452 -113 53 -100 -627 -16 -844 -615
7253 -615 -18 58 658 347 355 1166 55 337 -144 197 -304 181 534 -87 546 -485 426 115 -696 299
7273 299 191 -409 -123 -36 -720 -447 -610 -502 -814 345 83 225 -238 167 -109 22 -37 -392 362 -96
7293 -96 -108 -263 -312 116 -248 270 -70 212 409 189 -218 87 -267 338 -521 -158 973 178 -89 -316 -1223
7314 -1223 316 -433 -1122 -441 -289 -662 -540 222 -299 396 -141 723 140 819 -802 -299 45 15 812
7333 812 386 -451 -693 -164 -522 -289 869 -649 -853 -713 -612 -654 -796 -449 909 332 -251 -5 -28 525
7353 525 -876 279 -296 798 -364 246 663 -153 538 -761 -368 -316 -738 -372 -239 -98 81 40 -1047
7372 -1047 461 260 472 -691 -493 -268 584 -113 247 -15 102 375 -436 -579 -410 546 547 -898 953
7391 953 -295 -530 219 477 -419 -90 -288 370 373 -465 -802 -680 441 -479 -163 -289 -308 -608 80 -222
7411 -222 -141 -136 -41 289 893 -143 371 -416 -659 -17 1093 1190 -13 902 -412 271 599 670 332 548 86
7432 86 143 629 376 -166 15 140 -1018 270 -194 -31 -191 40 -501 514 197 192 83 696 -87 -283
7452 -283 -696 307 961 -481 47 -476 108 436 -226 -210 89 -132 -1040 -155 -130 -6 406 -351 -588 1233
7472 1233 773 325 -533 27 474 597 -683 -210 211 242 960 -451 627 -372 155 -94 534 120 -268
7491 -268 480 -544 7 420 812 -412 459 -698 -218 55 -141 127 83 175 1028 -110 41 430 259
7510 259 -169 -293 698 -883 446 544 -486 -430 -644 -67 119 -793 129 -519 330 -249 500 -426 7 -83
7530 -83 -172 -251 632 -158 -527 134 -307 804 -172 -547 475 588 1253 -278 103 -214 475 379 -439 -423 1014
7551 1014 719 250 95 290 -239 384 944 427 -266 186 -223 413 -204 -67 78 20 693 -690 -1032 -296
7571 -296 387 -250 1217 -226 3 7 -42 -543 593 33 -609 112 -615 287 -280 -429 234 237 -571 -555 -4
7592 -4 -576 -115 -331 -259 -13 -715 -701 -171 -338 -221 -403 -518 -791 886 -507 667 -401 305 344 -301
7612 -301 1204 44 99 -860 374 515 -250 -304 999 -508 -519 473 -196 1191 -897 490 81 -356
7630 -356 -190 -1037 461 305 -44 -51 -478 528 -125 -123 502 161 -156 425 -110 -577 6 66 40 -484 -1031
7651 -1031 -390 491 970 -505 388 -339 -302 -136 -409 258 72 -160 952 -332 54 -669 -812 327 -570
7670 -570 -328 -76 -28 -136 -177 -58 193 33 -245 863 -606 -707 438 386 229 -778 -29 -405 -6 -20
7690 -20 14 196 -361 572 569 488 -242 463 -489 -406 310 37 557 -538 330 -122 -276 14 -13 -38 577 -212
7712 -212 37 11 -1003 604 488 -237 -889 65 604 -48 139 60 -343 -154 -251 274 -594 -430 -591 647
7732 647 -77 145 249 -146 507 -465 645 40 -76 -588 480 640 -340 1264 583 283 55 168 -445
7751 -445 1005 687 -103 -549 -312 -241 535 416 -335 11 -234 -459 721 9 137 -31 176 -155 -434 -273
7771 -273 532 109 357 -84 -1234 -173 244 801 375 -240 746 -119 464 -504 781 75 -672 -257 -326
7790 -326 252 -449 -358 -103 -406 -22 -65 -231 -79 443 -359 322 46 1020 -647 823 -795 34 -297 182
7810 182 987 -419 -196 742 507 586 613 -290 -824 207 470 338 -398 727 -303 -189 -178 -1165 586
7829 586 389 1074 -15 680 2 -315 588 1193 516 321 -529 -409 1027 -108 1164 226 -339 -109 -243
7848 -243 -458 48 -230 330 479 -140 -520 208 447 -477 826 -724 -27 837 -284 286 136 -289 41
7867 41 -245 252 498 -105 -705 291 -228 -98 -182 214 -506 -261 428 -432 -468 -412 570 -167 -378 -42 -149
7888 -149 -236 965 -166 -81 116 -430 170 313 89 780 441 -48 -226 275 259 -266 -4 82 20 891 639
7909 639 1421 -392 583 -606 1546 479 650 32 81 -317 719 -96 -130 -830 -374 331 132 704 771
7928 771 725 33 -293 145 70 307 -293 -561 707 795 11 366 854 642 -112 -206 -375 482 1932 -14
7948 -14 -672 -287 404 35 -171 -928 -92 540 727 797 680 265 1150 189 -167 -724 321 -762 251 -137
7968 -137 -193 -977 -800 468 84 751 144 -53 -297 8 217 -555 403 171 332 228 -230 53 -580 -736
7988 -736 -695 164 -404 -901 -94 -237 -307 -234 1228 135 -738 242 240 286 -953 -694 -170 111 -1429 273
8008 273 -792 -563 1010 666 -479 -495 293 334 -387 -53 -234 -470 -632 335 -136 416 -895 692 57
8027 57 -53 830 -1011 487 -861 -718 -101 -91 126 707 1234 145 -340 633 -540 -79 1221 -610
8045 -610 -629 193 196 -30 -769 -61 -90 200 517 101 1068 716 -466 -41 -470 -866 274 -286 406 242 -502
8066 -502 -104 458 95 454 856 121 -1166 -517 -414 375 -1247 -4 -990 19 -126 357 638 -253 920
8085 920 -717 993 1052 -317 314 -737 -903 -369 685 334 -346 -294 951 -1237 626 -131 -161 156
8103 156 -232 181 -1086 540 253 1424 440 879 381 -42 -435 779 -263 -584 -162 373 671 -549
8121 -549 507 193 -384 -202 751 218 -286 561 768 -343 4 -995 323 -1258 -343 317 332 -695 302
8140 302 -358 341 -253 -351 -77 248 492 -509 -57 467 496 554 -426 49 882 112 563 -499 582 74
8160 74 -663 -764 -219 310 -232 -286 -161 -337 -326 -1380 291 -563 136 524 170 341 -397 253 499 -73
8180 -73 -184 -672 -160 157 728 -75 -135 -94 502 -303 721
8191G21
$$ Imaginary data points
##PAGE= N=2
##DATA TABLE= (X++(I..I)), XYDATA
0 0 0 0 0 0 0 0 0 0 0 0 0 0 0 0 0 0 0 0 0 0 0 0 2 -61 108 -108 108 -108 108 -108 128 -191 216 -216 235 -291 322
37 322 -345 400 -438 492 -543 605 -671 740 -816 899 -998 1096 -1206 1330 -1468 1617 -1777
54 -1777 1970 -2179 2426 -2708 3029 -3411 3884 -4461 5200 -6167 7508 -9501 12750 -18995
68 -18995 35261 -162361 -297589 122009 102457 -29583 215468 362634 128292 167681 308910
79 308910 86958 -123093 -33313 -126851 -340585 -260588 -115065 -194262 -144872 95003 155829
90 155829 104356 234374 303883 139801 54338 92374 -53912 -220140 -164756 -143836 -242632
101 -242632 -162840 -6045 -11225 15459 161899 182529 114605 137638 135422 38546 -10825 -10235
113 -10235 -51442 -89246 -86179 -70059 -68535 -73714 -51596 -14615 -26769 -32711 30989 52924 18651
126 18651 73364 134855 76848 54131 104376 42930 -64988 -51289 -56686 -163326 -163917 -70509
138 -70509 -79854 -84349 51450 130626 86848 131720 212589 117908 14055 46152 -12744 -172483
150 -172483 -157304 -88731 -171212 -159161 13333 37490 -5783 131950 199686 72233 70827
161 70827 144455 12954 -95822 -12047 -38836 -161205 -85783 10278 -68713 -58458 71812
172 71812 46904 -29372 52666 85010 -19608 -9816 73526 15499 -38200 45682 52627 -41404
184 -41404 -19572 28139 -57397 -99705 -26356 -38440 -91773 -15970 54672 21118 48924 128833
196 128833 100821 44292 63734 36379 -57011 -85086 -73436 -110012 -122300 -66080 -18227 -2213
208 -2213 43914 103581 109347 85763 85225 69526 2235 -46277 -46359 -73812 -109514 -76289 -28762
221 -28762 -32818 -9017 55913 64725 30371 55361 66636 3154 -20318 15129 -14213 -57214
233 -57214 -9487 19609 -29714 -16622 38898 -1862 -48057 4706 7468 -59620 -24233 40628
245 40628 603 -5957 77583 71057 3788 40729 56760 -40069 -65533 -16956 -66317 -113834
257 -113834 -35414 3326 -35262 20722 106235 68158 42851 98195 63326 -30636 -23075 -14523
269 -14523 -94170 -104575 -34590 -41524 -56605 24395 68830 29346 49930 92138 39232 -10024
281 -10024 16449 -4383 -65179 -46264 -10620 -36722 -33828 22101 23145 -4888 20188 35798
293 35798 -6394 -19371 6420 -5691 -26039 1758 25592 11432 13432 36861 24725 -9062
305 -9062 -10497 -12787 -44877 -56379 -29643 -20161 -22977 11786 52574 47395 42701 65334 48825
318 48825 -4008 -13093 -15073 -63392 -79331 -40574 -35596 -45887 7306 54257 33462 42080 80147
331 80147 47469 -3192 11154 186 -62264 -57715 -16385 -40322 -46885 19201 33056 -1190
343 -1190 31989 60783 6515 -14192 22790 -5952 -51082 -9681 15443 -25547 -8517 44093
355 44093 16367 -13896 25993 17075 -41889 -26598 2268 -34972 -37934 20076 21771 -29 40404
368 40404 61225 15456 6499 24054 -15899 -55985 -34669 -30963 -56141 -29220 15393 13277 19051
381 19051 58551 58552 26885 24197 20713 -20073 -44144 -33475 -38856 -50536 -25491 4544 8235 18350
395 18350 42902 43012 21214 15528 13087 -12801 -31691 -21440 -17474 -27327 -12523 16582 12589
408 12589 6187 25378 23820 -7506 -8924 2279 -22501 -32804 -1565 5829 -10440 15954 43551
421 43551 17438 5598 28109 4246 -35367 -22444 -13957 -46778 -36018 9342 5258 -827 43862
434 43862 53873 15640 21477 35611 -13352 -42130 -15935 -29127 -60310 -23553 8298 -10738
446 -10738 6763 53052 38145 11636 34405 26676 -23880 -24312 -4207 -35542 -44693 -1187 4031
459 4031 -11961 17758 40566 12575 4053 23960 -12 -30029 -11989 -5512 -27544 -13939 16869
472 16869 11050 5991 27418 25721 -1826 -3729 178 -22304 -32419 -16023 -12175 -13655 5470
485 5470 25431 23834 22566 29926 20250 -2027 -12668 -16707 -29226 -37342 -24884 -10257 -7353 6690
499 6690 30875 32246 22777 28343 25166 -5503 -17691 -11471 -28680 -40921 -16797 -2904 -11042
512 -11042 8191 36101 21824 10663 27155 15365 -19372 -14044 -4285 -28249 -29072 5497 4319
525 4319 -9242 20970 32864 1742 873 20394 -9134 -31817 -6489 -6188 -31108 -5526 23698
538 23698 5615 5340 37709 23029 -7306 6088 5668 -33298 -31677 -6640 -21529 -24591 12380
551 12380 23460 7095 25400 40333 11229 -2525 7449 -10649 -36439 -22868 -12240 -24367
563 -24367 -12436 16532 15113 11446 28893 28788 5402 835 615 -16805 -26688 -15336 -12976 -14295
577 -14295 37 14175 13585 12870 18673 12509 -783 -7432 -8547 -16140 -18722 -11038 -964 1871
591 1871 7516 19576 20696 9177 6442 6933 -11636 -21177 -12735 -16464 -22291 -3289 12579 6250
605 6250 13743 31322 18383 1551 8763 1149 -25172 -23366 -9035 -21899 -22360 7956 13854 3379
619 3379 20941 33305 8712 1125 12297 -7424 -30340 -13320 -8253 -24839 -10035 17164 7114
632 7114 4103 28495 21062 -6068 2283 7918 -20373 -24714 -917 -9913 -17587 8583 19333 3844
646 3844 12369 24927 3354 -9323 516 -7966 -25490 -12213 -1233 -8337 -2118 18285 16044
659 16044 8642 16305 15390 -5172 -10704 -7235 -18265 -22590 -9055 -2867 -3051 8332 19877 17686
673 17686 13143 13891 6904 -6154 -11915 -12949 -16887 -17800 -10342 -562 4083 8865 16333 18377 8916
688 8916 5770 5186 -8215 -16878 -10181 -9682 -15544 -2846 9519 4459 6522 20479 13144 -2646
702 -2646 3477 533 -16741 -15537 -2389 -9674 -12367 9052 14694 3576 11902 20434 2826 -8513
716 -8513 1487 -7632 -25312 -11570 928 -11563 -2624 20478 13369 4054 19018 15506 -8404
729 -8404 -5289 1139 -19212 -22161 -2919 -3799 -10344 9337 18867 6248 8699 19087 3775 -8424
743 -8424 -2655 -6654 -19649 -13777 -1133 -4404 -1253 13749 13239 4963 10086 11252 -4604 -9905
757 -9905 -4080 -10463 -14413 -4061 1222 -294 6641 13191 10109 5334 6143 1549 -7099 -9371 -8769
772 -8769 -9701 -7925 -2569 4857 7117 8212 12761 11161 2514 -1097 -915 -9321 -14655 -7810 -5120 -7776
788 -7776 575 11991 9424 7020 14690 9145 -2972 -1889 -1732 -14155 -14016 -2530 -4319 -7703 6800
803 6800 13194 3693 7455 14715 2177 -8181 134 -4094 -17938 -8790 2396 -6001 -2952 13046
817 13046 9896 -474 9520 8944 -8213 -7481 654 -11797 -15664 962 2674 -4090 6018 15475
831 15475 4104 1935 8482 -61 -12023 -4123 -4817 -13727 -7199 3380 890 1561 13635 11924
845 11924 2935 4343 5647 -5620 -9780 -4912 -7636 -10484 -1686 3241 1861 5597 11346 8440 3306
860 3306 2839 -242 -6638 -7745 -6945 -6541 -5874 -614 4082 5205 6162 7726 6446 1013 -3297 -1990
876 -1990 -6283 -9577 -4658 -1151 -3981 387 8973 5413 3031 8109 4703 -6233 -4262 -1721 -9284
891 -9284 -9543 857 575 -3101 5914 10766 2910 3423 8153 -1179 -8945 -1745 -2692 -12219 -5414 4140
907 4140 -1789 -606 11384 7947 -1132 5371 6372 -6559 -7212 -837 -7318 -10642 2376 3842 -2480
922 -2480 4197 10926 2145 234 6602 268 -8477 -2699 -1342 -8546 -4180 4190 1758 -943 7368
937 7368 6862 636 675 2731 -4332 -7286 -2234 -3859 -4686 644 3729 3088 3726 6956 3680 -306 -451
954 -451 -2315 -5405 -5411 -4214 -2307 -1562 1511 3592 5251 3322 4066 3187 -1364 -3876 -2338 -3707 -7316
971 -7316 -3848 1414 -867 920 6983 4614 754 4568 3927 -4434 -3800 1012 -5641 -6677 1801 1680
987 1680 -2344 3501 8065 575 213 5691 -983 -6905 -1370 -917 -7286 -2616 4899 349 -1285 7488
1003 7488 4652 -2424 1571 4602 -5904 -6365 1987 -1962 -6362 2148 5300 -1270 2128 7944 1096
1018 1096 -2422 2661 -80 -7270 -2327 888 -5472 -1947 3742 1421 -247 5736 4281 -754 -540
1033 -540 1335 -3273 -5098 -1921 -796 -2088 488 4088 846 1752 3650 1937 -1128 -478 -1292 -2571
1049 -2571 -2794 -687 -1251 214 1467 2465 2058 1117 901 2212 -1183 -3100 -812 -576 -3989 -1533 2641
1066 2641 -276 -276 3630 2871 -1581 1563 965 -4537 -3516 964 -2306 -3973 2623 2090 -2039 1545
1082 1545 6086 204 -1549 3287 346 -4711 -648 2275 -4184 -1971 4120 423 -2267 3609 4614
1097 4614 -2893 -319 4320 -2626 -3470 1964 506 -5400 1911 3689 -2387 220 4983 -144 -3411
1112 -3411 2420 907 -4790 -475 1737 -1992 -2077 3471 643 -1243 1781 2771 -1484 -1365 1409 -832
1128 -832 -2214 410 1068 -2008 1031 2387 411 -249 1190 1185 -1599 -704 -913 -1682 -485 142 255 -1032
1146 -1032 277 572 967 376 262 862 633 -1614 211 374 -1410 -830 1419 73 -1222 2368 2002
1163 2002 -1274 92 2792 -1397 -1374 1436 -213 -2098 1590 1577 -2340 -114 3193 -1288 -1995 2946
1179 2946 1238 -3398 59 3408 -1389 -1939 3236 201 -3506 1101 1889 -3150 -1423 3371 -957
1194 -957 -2193 3348 1136 -3473 667 2758 -2512 -454 1657 942 -2167 1428 2249 -2722 -208 2359
1210 2359 -658 -2683 1259 252 -1422 493 1709 -1114 -878 2412 -24 -1266 708 567 -2137
1225 -2137 -786 381 -1242 -840 1345 387 -844 1540 -117 468 243 629 396 -833 -242 -531 -296
1242 -296 171 -1682 1596 1119 400 1359 1739 633 -722 48 -1433 -2182 474 14 -2118 124 2027
1259 2027 710 -154 2713 525 -1863 331 1308 -2707 -1470 929 -342 -2175 2007 2562 -1966 816
1275 816 2536 -526 -2661 479 -1043 -3439 -632 2710 -2061 -818 2945 -122 -925 1607 2083 -3621
1291 -3621 -933 1304 -3286 -2433 1549 12 -1565 2076 3632 -565 128 2152 -1006 -3210 978
1306 978 -689 -3797 -1041 424 609 465 3299 926 101 1301 387 -2116 -1146 -634 -1442 -786 229
1323 229 692 1177 1072 1616 1392 893 -188 -550 -2339 -1063 -1232 -1005 883 19 1408 1491 1481 1423 2274
1342 2274 -839 -1698 -306 -1377 -3182 -1626 573 -239 543 3713 461 -525 2591 403 -2589 -1443
1358 -1443 -724 -3247 -2202 1037 890 -1601 2576 3535 36 1510 1805 -1234 -2675 -727 -1265 -3486
1374 -3486 -692 1648 -427 821 4171 2144 -150 1880 812 -4000 -2540 -122 -3299 -2542 1649
1389 1649 750 -269 2935 3225 576 1184 1686 -2127 -3082 -650 -421 -3315 -986 2450 226 1786
1405 1786 2913 1391 -538 581 -745 -1804 -2126 -1868 -1643 -946 1339 1523 2418 2022 1644 743 -1098
1422 -1098 -1347 -753 -1935 -1570 -1787 -621 -566 56 1838 2051 1626 1389 1163 -929 -1336 -1967 -1406 -2499
1440 -2499 -1209 987 -498 1776 3383 2481 -193 1086 228 -2543 -1933 -1101 -3012 -1757 1844 1124
1456 1124 -1024 2614 3159 1063 -242 1730 -1093 -3913 -627 -1257 -2934 -246 2376 1151 1613 4155
1472 4155 1895 -547 1312 761 -3075 -2667 -965 -2600 -2665 226 2098 185 3600 3444 865 -215
1488 -215 -256 -1904 -3227 -2362 -959 -1685 659 3105 1507 1941 3165 2177 167 -1402 -368 -3517 -3590
1505 -3590 -1038 -1251 767 458 1510 2309 3006 2115 491 -271 -1002 -2415 -2118 -2445 -1512 -518 1983 1025
1523 1025 1621 3470 1344 816 1330 -1780 -1760 -1730 -1847 -2043 -439 1063 1238 1768 3491 2954 392 745
1541 745 -712 -2908 -2705 -1490 -2651 -1050 1088 2393 715 2714 3905 651 -41 315 -1626 -4167
1557 -4167 -2446 -1065 -2276 431 2635 1844 1714 2459 1745 -228 -1031 -1042 -4221 -3117 -114 -1979 -1906
1574 -1906 2343 2877 1538 2851 2922 247 -1446 -640 -2091 -4023 -1976 -1052 -876 985 1352 2327 1460
1591 1460 3342 678 -828 -943 -928 -1822 -2474 -1775 -308 581 1640 1910 2065 1644 1471 582 -530 -1863
1609 -1863 -2663 -2051 -1360 -745 228 2479 3456 3070 1998 1974 223 -1055 -2334 -2566 -1375 -660 -1378 440
1627 440 2039 1610 2106 3339 1406 87 -240 -812 -1677 -2994 -1862 -2145 -1178 1922 2007 1674 2182 3077
1645 3077 386 -1491 248 -2808 -3091 -2109 -120 -1899 559 2958 2418 2352 3096 515 -2204 -2302 -945
1662 -945 -2685 -2430 -96 -469 -362 1567 2742 943 1767 2185 164 -1875 -973 -2092 -2824 -936 -60
1679 -60 -471 1101 2154 2121 2104 1472 -94 -1465 -2273 -2249 -2972 -2559 -489 390 496 1965 2704 1729 128
1698 128 -123 -1240 -1487 -3296 -1477 -981 -1341 285 773 1608 2252 1738 2814 705 -701 -1158 -1549 -3385
1716 -3385 -1666 -1008 -702 94 2266 1571 556 2529 965 -1065 -10 -1315 -2210 -2646 -748 353
1732 353 -431 2306 2931 1794 2415 1752 -247 -1500 -1115 -2465 -2968 -946 -488 -7 658 3256 1942
1749 1942 1573 942 -77 -2065 -1678 -809 -2637 -1833 219 492 726 1820 3383 1856 2243 234 165
1766 165 -2005 -1423 -1358 -1345 -1329 482 553 1595 2868 1647 1019 787 188 -2840 -1631 -2338 -1826 -988 112
1785 112 613 1609 1721 2403 1549 169 -825 -1676 -2160 -2439 -2256 -991 676 566 1557 1887 1616 1698 1849
1804 1849 -66 -972 -1929 -1449 -1782 -598 -155 833 1268 2135 2464 1831 2476 552 -1754 -1432 -701 -2114
1822 -2114 -1535 -258 -21 538 1804 2426 787 702 1191 -1068 -2606 -2042 -2122 -1960 -850 704 481 1228
1840 1228 2989 1609 497 1126 759 -1927 -1981 -1682 -1903 -2403 1134 1126 923 1733 2227 950 1044 963 -1433
1859 -1433 -2895 -2117 -1213 -1630 -8 143 -303 2553 2642 1541 -97 523 -879 -2241 -975 -1111 -1476
1876 -1476 -1368 -116 1928 2818 2521 902 -119 214 -220 -1937 -1568 -1339 -1211 -441 -496 362 1496 1445
1894 1445 1995 1266 120 -909 -1456 -1484 -1673 -1363 -1192 -496 830 1230 1491 1603 589 44 -353 -1687
1912 -1687 -2320 -829 -1972 -817 1006 1293 938 1209 2168 732 -445 928 -1341 -2549 -1072 -653
1928 -653 -839 -264 958 112 2345 1911 864 405 -5 -1429 -2395 -1343 -862 -805 -740 728 1072 289 1571
1947 1571 1937 1130 -471 -410 -1674 -1397 -561 -117 -169 277 218 1009 1731 1320 627 -117 71 -679 -1469 -1430
1967 -1430 -1185 -459 -331 725 1543 971 1966 1603 39 -738 -1073 -849 -2204 -724 -25 -35 1318 738
1985 738 1330 824 808 373 117 -846 -1008 -731 -2034 -1246 373 975 1808 1181 1786 1363 -376 -218 -1319
2004 -1319 -2198 -1298 -1062 -702 -1069 607 1439 678 1436 2722 241 -351 -826 -925 -1226 -1529 -580 -897 702
2023 702 1642 184 649 848 1287 -229 136 -400 -1457 -356 -354 -881 -831 493 1795 892 930 572 -122
2042 -122 -477 -760 -460 -2879 -504 -141 -863 139 1393 939 1173 680 775 324 -443 -116 -753 -1203 -292
2061 -292 -400 149 438 1258 1207 564 887 154 -965 -1686 -554 -915 -204 -434 492 1183 128 538 1066
2080 1066 614 559 176 -151 -1178 181 -637 -953 -11 542 1633 -297 1354 267 -274 -246 -538 -380
2098 -380 -470 234 -402 -202 999 1088 824 -203 803 816 -972 -681 -265 -947 -331 112 -93 163 227 381
2118 381 949 1267 492 321 -910 -327 -479 -1273 271 -36 574 449 503 76 753 -304 -198 424 -378
2137 -378 -108 -390 272 95 152 -382 1124 748 -646 160 530 -103 -1016 -79 -556 -318 -327 92 398 646
2157 646 292 669 833 1 47 -942 900 226 -123 -104 239 367 825 548 -1016 694 637 483 -901 494
2177 494 -245 176 628 833 -461 -316 264 116 -21 538 -619 -1 52 76 -868 -686 414 316 -25 136
2197 136 429 669 382 -150 501 24 135 -1134 -189 412 -278 554 1035 -1487 -119 309 370 -859 187
2216 187 -343 -855 77 -272 114 269 198 1061 16 372 -213 -276 809 -513 -576 -1140 -247 449 -268 -35
2236 -35 57 -275 61 -117 -473 -413 359 383 -175 558 300 -344 392 247 -339 330 -464 -360 -301 -309 1174 92
2258 92 -969 -454 -341 115 136 -192 -427 -720 -521 -589 -131 542 -429 -474 712 -287 -266 -764 934 681 216
2279 216 663 -153 499 157 465 423 237 -62 -654 381 155 -893 -113 138 -203 -286 -94 194 808 243
2299 243 405 -736 -1081 -360 -154 -507 -660 159 -61 -17 341 979 106 -644 -318 173 45 88 -647 -566 -212
2320 -212 64 212 -123 184 332 345 105 -27 321 -937 -213 -321 802 -443 -382 70 437 -259 -607 1212
2340 1212 220 -639 -394 -657 -346 553 -25 -149 1026 491 477 593 -25 -435 -597 -913 -155 -94 155 878
2360 878 350 -171 174 -309 -229 13 224 54 -707 -520 -1150 270 0 -242 273 -203 -101 89 -158 -225
2380 -225 -113 -123 -83 -303 -356 627 -173 695 -303 377 392 -196 -58 -987 -833 112 -338 28 275 334 415 937
2402 937 969 301 40 -484 37 -1033 269 -589 -300 47 816 641 114 893 1394 -1062 -419 -549 -1248
2421 -1248 -811 -1073 -4 -65 300 1031 1301 85 139 -265 -185 317 -332 -37 -874 -1384 -487 -56 774 643
2441 643 1445 537 608 -416 -105 -610 -1090 -428 -344 581 182 221 106 198 884 218 -105 -92 85 -1536 -1281
2462 -1281 -105 450 -179 398 337 298 787 244 -49 -92 -760 -994 -636 -646 -214 -366 373 872 574 1381 1449
2483 1449 405 438 114 -1344 -983 -181 -773 213 542 1556 804 845 612 -251 33 -81 -1137 -466 -562
2502 -562 -372 -220 -801 598 674 530 136 798 -240 -878 -466 -1432 -725 -523 -245 142 188 1091 1281 784
2522 784 1272 -459 -603 -621 -900 -1336 123 575 500 330 678 302 199 402 126 -123 -926 162 -1187
2541 -1187 -1141 -526 -917 729 400 1030 341 493 -75 -1112 -683 -543 -498 -1143 594 -1030 158 1635
2559 1635 833 991 1256 -473 346 -197 -879 -1719 -1064 -548 -100 296 441 -110 1476 878 881 613 170 123
2579 123 -463 -1029 -378 -528 -81 546 1423 1250 1018 -20 156 -987 -989 -847 -923 -843 553 611 1119 1302 928
2600 928 833 -175 -224 -576 -968 -838 -999 -761 -236 -409 433 915 630 927 -296 436 -662 -2140 -716
2619 -716 -1124 -759 -661 106 654 593 716 1189 1027 1092 219 -458 -1599 -761 -786 -278 -10 275 1253 893 1272
2640 1272 1415 318 -135 -582 -840 -2144 -1514 -812 -574 1065 1045 231 1320 680 18 -1208 -1124 -1783 -1436
2659 -1436 -712 -570 -96 517 490 1533 880 197 325 -66 338 -1426 -1193 -1580 -1208 -589 -393 257 660
2678 660 560 1934 1074 619 -518 -1437 -933 -1691 -1249 -764 -565 915 222 843 1409 957 1570 -1060 -621
2697 -621 -1360 -976 -1139 -325 -407 697 1418 970 1715 1680 839 382 -802 -1252 -1207 -324 204 -918 693 649
2717 649 1894 2141 822 134 362 -860 -570 -2094 -523 -681 -170 145 902 1440 1223 407 862 -207
2735 -207 -836 -367 -1238 -920 -662 -66 1153 753 544 834 1069 324 237 -448 -743 -1648 -859 -377 -718 322
2755 322 411 1654 1687 2083 322 315 -258 -899 -1154 -975 -1188 309 143 681 1491 1918 1135 577 637 -488
2775 -488 -822 -2330 -2238 -646 -60 169 1552 59 1213 848 868 116 -79 -1253 -1173 -431 -1861 -689
2793 -689 841 289 43 796 1023 892 -6 115 -801 -967 -875 -1458 -871 -66 -423 1716 1441 145 789
2812 789 1287 258 -536 -699 -1302 -834 -993 -998 188 1094 1318 1739 1551 1264 374 -937 -345 -2128 -1992
2831 -1992 -1313 -339 625 27 818 834 1820 394 56 893 -465 -815 -1066 -658 -196 86 695 1702 1385
2850 1385 1365 1305 171 -740 -333 -1016 -1122 -1193 2 -80 951 1610 2004 635 1077 1239 -1172 -974 -966 -1274
2870 -1274 -388 -964 147 698 989 1726 1418 274 1295 282 -275 -539 -1438 -1471 -933 -1008 -908 599 499
2889 499 1781 1987 914 289 -593 -1026 -1445 -1959 36 -1691 718 1059 1476 1233 919 815 466 -395
2907 -395 -1379 -1474 -925 -1210 -480 -19 1063 1128 2395 726 1455 1058 -459 -1270 -1354 -777 -316 121 -528 105
2927 105 1298 1679 1224 1566 -228 382 -742 -533 -1582 -1494 -247 554 -146 1753 2253 1660 939 113
2945 113 387 -573 -708 -1110 -1326 -1611 -527 1230 754 1967 1511 1011 1025 -245 -488 -1857 -2073 -1609 -1282
2964 -1282 744 -87 350 1273 1824 1455 561 381 -117 -535 -1868 -2334 -1474 236 -27 588 1109 1496 462
2983 462 35 896 -255 -1473 -1411 -1090 -1254 -700 -621 728 1302 404 427 471 21 -429 -1238 -1300 -1192 -1227 -17
3004 -17 642 -210 1175 1288 1323 890 -851 775 -1204 -1515 -1709 -2290 -1170 -499 372 1340 962 1164 732
3023 732 545 252 -1306 -1496 -1186 -1588 -1248 -100 431 1415 1181 1583 1085 765 -266 -602 -1518 -1255 -978
3042 -978 -288 -34 571 392 972 1482 1378 455 -144 -97 -848 -723 -1058 -889 164 438 1146 -72 1904
3061 1904 857 219 248 -174 -438 -722 -946 -735 -573 -48 652 -81 1249 1120 1049 920 -1218 -340 -2220
3080 -2220 -759 -800 -875 25 1028 1685 313 1760 1819 1087 -592 -1420 -1276 -1859 -656 -587 -948 1538 1582
3099 1582 1459 2143 1605 891 -164 -582 -1013 -593 -1586 -576 -356 399 2140 1799 1183 1463 77 321
3117 321 -388 -1875 -848 -996 -1241 76 650 329 181 1099 1080 666 -336 -1111 -601 -1443 -1389 -693 -572
3136 -572 546 -617 1678 859 -114 333 -345 229 -412 -1134 -1729 -1980 -101 468 89 433 1425 1580 861
3155 861 186 389 -830 -1393 -934 -807 -807 -230 436 854 557 1208 1075 1143 623 -409 -872 -712 -854 -1004
3175 -1004 49 4 1750 1746 452 2012 219 -576 -1125 -979 412 -1103 -1002 -5 589 902 753 1225
3193 1225 1024 1085 -92 159 -1000 -1342 -1370 -753 -828 473 1190 1109 1314 1915 539 -274 -507 -708 -479 -1918
3213 -1918 -107 -597 538 522 1146 1656 1510 714 -699 -905 -1112 -1170 -949 -1038 -859 638 748 1499 1162
3232 1162 1544 1281 -246 -566 -527 -394 -1393 -605 54 -417 703 976 1149 1240 1372 958 -426 -881 -1278
3251 -1278 -1448 -582 -256 -8 -74 740 1789 1014 689 245 -329 -1920 -1267 -1206 -659 -641 371 533 763 1139
3271 1139 290 622 -109 -152 -1355 -946 -898 -1799 -501 150 264 303 789 557 369 516 -689 -1342 -582 -444
3291 -444 -80 -1158 -1466 679 125 1454 1061 923 -70 -25 -332 -1268 -227 -1803 -294 322 261 286 596
3310 596 824 1341 485 1064 448 -764 -846 -1633 -591 262 208 247 1409 1630 679 446 -220 628 -1871 -951
3330 -951 -874 -952 -560 233 89 976 756 1345 1122 -466 -142 -1080 -651 -1021 -780 -292 -337 23 888 1341 189
3351 189 707 1155 454 424 -1235 -1049 -1869 -300 248 -415 392 1279 1362 1299 272 879 -422 -1275 -867 -1399
3371 -1399 -469 -290 453 1216 1251 308 1148 1206 723 73 -771 -995 -254 298 -50 106 850 922 1019 1075 1272
3392 1272 -171 38 -887 -1078 -933 -379 9 -438 -166 1311 871 859 199 222 -564 -120 -495 -251 -92 -37
3412 -37 24 1320 95 815 1151 1117 192 148 -1327 -682 -1513 -1450 -566 -854 1184 131 1803 1758 437 710
3432 710 -320 195 -1409 -1699 -1389 -1192 -956 -139 1264 1265 982 1182 336 -813 -552 -468 -1872 -373 -646
3451 -646 884 711 348 495 1913 575 1363 -342 -765 -1656 90 -831 -609 -52 -492 1163 1016 31
3469 31 1270 1756 376 26 -1405 -715 -984 -925 365 647 -195 -62 689 1157 1265 717 -502 4 -928
3488 -928 -213 -951 465 -809 691 656 1218 659 838 765 220 -1989 184 -780 -1564 -110 -146 2223 415
3507 415 438 458 557 155 1133 -829 -1984 -973 -207 -921 -389 -222 1639 1386 956 677 776 329 -591 -1356
3527 -1356 -440 -1534 -1751 -169 -545 777 982 1016 1092 200 964 -267 -990 -537 -1634 -1168 -323 207 679
3546 679 1085 1183 897 426 272 -309 -765 -882 -1840 -1214 -505 -62 796 1193 815 1172 -138 1026 -803
3565 -803 -294 -383 -671 -396 -529 -536 551 1670 1373 977 444 621 -315 -187 -816 -1977 -1021 -1265 -1221 258
3585 258 -5 206 951 643 685 -89 482 -1407 -1539 -1414 -701 -1124 -425 1470 445 785 303 661 158
3604 158 -127 -601 -519 -548 138 -806 61 636 803 775 447 400 1558 -233 -253 -1087 -1727 -682 -346 354 -565
3625 -565 -343 868 1185 -390 106 68 -832 -1131 -705 -588 484 381 287 655 648 1624 425 343 -193 -628
3645 -628 -300 -1038 -857 117 395 -593 1389 129 322 474 134 -59 -726 -1128 -1144 -1431 -391 -1374 -155
3664 -155 1042 1029 1017 -552 151 -298 134 -989 -43 -684 -1307 -204 -206 106 138 510 589 439 108 -1261
3684 -1261 -134 -1253 -1140 -643 -139 -216 -14 -298 1429 697 1089 564 151 -140 -501 -1212 -429 -754 -112
3703 -112 826 -42 1161 1251 112 -218 -915 -1001 -1240 -758 -842 -301 -307 -292 693 553 -593 682 267 -270 377
3724 377 -985 20 -821 -824 -611 612 746 776 1328 672 212 -880 -228 -801 -478 -982 -626 -861 234
3743 234 193 579 1270 186 231 555 630 -356 -924 -1309 -594 -789 493 -114 738 422 879 1719 837 164
3763 164 -39 -290 -1016 -746 184 -115 -309 1074 968 468 239 719 -755 -115 -710 -98 -577 716 -695
3782 -695 723 279 553 390 827 -999 -733 -817 176 -657 -1987 -427 -803 336 490 1367 502 226 447
3801 447 -469 7 -1256 -1111 -1200 -788 -1009 544 799 371 1276 1042 349 -141 442 -518 -1578 434 -1409
3820 -1409 205 -114 988 17 115 542 -627 -538 -426 -240 -717 -1088 -529 -361 -843 636 74 1278 224
3839 224 149 13 -634 -525 -898 -205 -249 73 -4 795 979 254 517 814 303 322 -272 229 -889 -1479 -135
3860 -135 -540 1003 775 305 199 368 323 493 -1313 -855 -589 -318 511 501 547 -89 211 459 49 470
3880 470 -287 -325 -1021 -262 -175 -513 -40 537 1065 542 1579 528 375 447 869 -468 -581 -164 -636 32
3900 32 -303 -126 798 242 -174 931 -301 -340 -593 -1199 -122 -664 -1206 -509 526 716 661 1117 253 -642
3920 -642 166 -320 128 -935 -1183 529 1231 197 1105 14 86 194 -126 -910 405 -292 -559 -1102 -82
3939 -82 -432 -351 458 1559 1211 549 183 98 -533 -120 -1237 -484 -1039 -1027 597 477 675 218 1378 558
3959 558 -35 -608 -1212 -2140 -300 -1095 461 83 914 -142 166 11 295 -1055 -124 -292 -858 -1358 -804
3978 -804 -36 -138 -347 -126 473 210 644 409 334 -159 -717 -435 -412 227 26 1031 696 520 857 63
3998 63 810 494 -446 19 -57 -576 158 -200 514 299 691 -9 179 118 483 -170 -586 -173 -442 524 -66
4019 -66 477 593 1220 432 -126 -228 360 -69 66 -313 -1308 138 182 12 -407 -528 548 1130 -240 41
4039 41 415 -253 -302 -352 -246 -296 -434 380 851 78 382 206 216 726 448 -143 -350 -698 -667 -59 507 1106
4061 1106 609 163 866 116 573 104 -1520 -868 -647 -1084 26 1861 -778 404 420 274 -845 -331
4079 -331 -1253 620 -340 575 38 -132 113 497 219 -294 381 -679 453 -54 389 -692 -847 548
4097 548 -151 375 -162 23 1091 93 -243 -206 -61 -55 -521 -427 797 10 -66 -186 -457 257 749 593 -55
4118 -55 -267 -578 -961 -454 -713 -67 398 -329 391 72 124 111 296 -590 -744 -745 -511 -461 56 -697 708 -273
4140 -273 545 561 -536 -623 -597 -242 -139 -139 -29 -237 94 1038 36 348 -158 -489 1666 708 226 95 -295
4161 -295 -363 -159 857 -279 209 230 335 708 383 -201 205 -481 66 -1227 645 606 -180 619 925 604
4181 604 84 -998 485 318 -136 196 763 -508 -274 -682 364 -209 104 842 667 197 -17 -194 389
4200 389 698 599 -389 108 -650 233 809 968 529 280 90 146 425 -554 -759 -1572 768 -480 341 482
4220 482 183 -84 230 84 714 -1011 325 -77 -374 -130 1078 -133 457 485 927 -176 429 -113 -771
4239 -771 -623 852 714 -365 120 379 564 244 1273 519 -852 -548 -47 -697 847 -252 901 1034
4257 1034 -331 -394 403 633 249 952 -24 -21 -422 99 -510 -421 61 -84 -235 166 -249 498 -115 -345 269
4278 269 594 -337 -130 -539 -224 53 1040 537 -133 725 227 131 -322 -361 -828 140 570 -663 6 -518
4298 -518 1056 600 -286 502 51 -442 -808 210 1144 1017 -530 21 627 547 0 -558 -564 244 81 -291
4318 -291 -209 69 -615 327 357 1412 922 946 816 -141 465 -286 -662 -338 -29 -219 -12 -344 88 1650
4338 1650 -361 90 390 144 -358 -213 -178 282 -301 -13 118 -55 80 64 -226 -76 773 -547 837
4357 837 -357 -186 -421 -234 519 609 424 -223 -269 83 -45 76 360 672 -5 -21 1111 195 -896 268
4377 268 -491 -187 523 -961 -503 120 -146 -1239 -419 -237 -232 -92 -342 307 229 -447 -535 840 927 -100
4397 -100 -133 -302 143 -752 -243 841 549 -304 185 913 321 245 -534 -303 -986 -813 407 -908 868
4416 868 -221 159 6 -186 177 423 -362 -17 -455 -339 126 -714 52 -120 -462 537 -222 468 258 182
4436 182 -35 -533 1022 54 -393 298 -789 -702 -575 -49 -1073 -214 90 14 -51 -231 -470 -387 -833 441
4456 441 483 23 -208 -316 -152 387 125 181 663 -444 227 6 129 -179 360 -394 736 187 241 -365
4476 -365 -420 -651 515 225 358 254 -189 988 -546 -701 573 82 -331 208 -341 -794 -293 215 -47
4495 -47 102 -93 -754 -113 -268 212 -611 -146 -98 -464 390 -7 -674 125 58 821 -708 570 -445 730
4515 730 920 -535 -272 -101 -960 -415 -487 475 -586 204 -832 -8 -384 -697 438 218 -50 48 170
4534 170 -195 385 -856 -176 -1100 387 -545 653 0 1321 484 -209 -469 -202 -467 210 -268 -642 -325
4553 -325 -103 964 -800 601 -1164 -361 286 -317 293 484 -289 -183 -269 -305 -58 -440 -706 -452 588
4572 588 -643 515 549 -308 -848 -231 -201 -8 -144 -435 235 39 191 -333 394 671 624 -270 -603 296
4592 296 203 676 -370 123 -755 -234 1231 480 333 -131 -171 244 372 149 -238 -300 447 58 667 -506
4612 -506 537 -679 73 83 -398 -638 771 626 -377 -209 -85 -107 -200 592 961 19 308 -245 -664 978
4632 978 416 367 66 182 139 -618 519 -772 312 -483 -652 -160 -183 -404 -703 -249 -345 463 -525 13
4652 13 -487 98 -282 3 -225 323 -919 -267 -320 905 -159 525 91 -646 501 -160 107 -82 206
4671 206 -493 1096 615 -744 1259 480 -1009 588 -403 70 425 129 325 -386 273 -326 -107 1021
4689 1021 -33 -644 83 -132 -488 -615 -189 35 556 -66 557 426 184 539 -14 135 -266 -2 -575
4708 -575 20 11 -126 -331 -190 285 352 -298 193 158 -748 673 -492 -18 102 -947 -58 -528 831 438
4728 438 482 -139 1142 1237 890 -120 -330 -380 92 106 636 -1257 -564 930 55 577 -172 413 516 32
4748 32 88 -614 -1131 76 389 -674 182 -569 -126 64 416 78 -149 -130 -571 752 -51 145 594 1219
4768 1219 633 729 296 -109 860 -243 663 329 -149 117 0 219 -10 832 130 362 158 -325 273 109
4788 109 203 6 -70 478 -74 670 -543 -237 -114 -316 -155 943 41 -1325 23 134 -76 254 731
4807 731 726 594 -556 352 1718 476 -74 -328 27 -371 -284 942 351 -356 959 408 -189 -55 211
4826 211 -66 240 280 -67 3 -16 -51 808 -175 46 783 410 -393 2 -82 -564 447 451 -643 671 -81
4847 -81 -59 287 474 -848 728 -27 -146 -292 -230 785 181 122 608 850 404 -409 105 -226 36 389
4867 389 -280 -432 -163 725 -549 570 178 -402 12 256 -45 -15 128 -318 -14 -429 127 -291 725
4886 725 594 489 -301 390 -435 -131 4 -215 11 -274 550 723 721 -274 646 316 -491 131 15 -870 -635
4907 -635 235 -350 448 -936 -10 180 383 -163 -404 -1013 -278 -574 1043 -30 410 -552 -124 -427 868
4926 868 13 -84 927 232 -694 553 -1293 -836 -500 -866 746 -632 637 -313 68 -226 -324 139 105
4945 105 -156 -293 -217 -554 769 786 -242 117 -783 -18 -45 410 451 -162 -198 220 393 106 699 696 1094 254
4967 254 -59 -60 -471 -168 411 -151 -501 143 85 696 771 234 1209 523 -864 -114 513 93 -571 -546 -1140
4988 -1140 205 -397 -40 574 938 255 -860 -54 806 147 100 88 -208 580 15 580 314 340 300 -330
5008 -330 -486 141 -1019 361 69 -510 -301 -133 -605 985 257 -54 -592 -171 1118 -71 -120 703 -814
5027 -814 578 -824 -205 -203 -636 392 -140 -142 -427 131 -315 -46 -283 11 -199 160 280 740 36 -455
5047 -455 570 182 -220 -229 329 -123 -426 865 630 -1081 -723 48 180 1274 -688 -16 -34 -286 -740
5066 -740 -535 -228 300 -22 584 860 -1024 -724 27 -28 -55 -840 -576 -4 -136 -70 170 408 655 171 -45
5087 -45 482 -329 389 545 -418 -228 386 255 410 327 -330 -89 145 -579 227 -408 -472 278 -459 654 -352
5108 -352 384 -340 1198 76 531 -389 -56 -308 830 47 457 -680 -576 432 -145 639 -637 369
5126 369 -661 112 -48 -467 245 270 -137 -217 -826 -37 253 229 471 53 -931 386 -522 -113 -707 72
5146 72 143 297 928 493 495 305 434 87 -1276 89 -190 -789 -225 -58 636 -13 769 1474 282 20
5166 20 178 -178 -202 -33 -135 -353 -572 218 -887 -268 320 1449 -405 45 752 -1125 513 -536 -793
5185 -793 -331 380 -645 197 883 118 1040 484 -32 -1025 -247 -621 264 -497 783 287 72 88 -46 -714
5205 -714 109 -464 486 -199 -345 50 -444 345 -94 -767 681 200 -99 -388 512 -581 230 -400 -178
5224 -178 161 175 998 388 455 -12 302 -171 -441 123 -133 358 -1164 749 -204 -6 1185 184 1417
5243 1417 -638 -304 416 40 -343 51 -814 -61 -682 -369 1051 -322 19 -742 1048 425 159 395
5261 395 -337 -649 -237 -420 348 -50 -274 176 407 -146 119 -281 840 -965 -213 143 -112 -108 706 151
5281 151 227 218 493 149 602 -20 -74 176 369 -538 486 -827 -172 -150 1003 -97 -1241 -712 -374 893
5301 893 -123 -118 -206 -243 349 -85 -204 -321 -927 567 17 46 -183 -3 -610 -153 -361 -3 355 204 28
5322 28 -448 -12 -128 449 227 -196 464 -197 14 14 -671 537 -189 16 -276 125 -424 -293 -925 -173 272
5343 272 -569 -818 -28 16 380 -434 -1113 -121 540 -144 -390 -298 900 -128 589 -3 130 37 1477 652
5363 652 205 -227 -44 317 -687 -192 -324 47 -42 -80 -131 1000 -365 174 -156 -132 -159 -26 -126 -571 7
5384 7 367 335 -708 591 551 608 -336 328 629 -204 -76 -224 -613 150 -84 -66 583 -490 554 -653
5404 -653 -98 54 -190 -215 -153 -673 -169 324 -454 362 62 122 1089 -14 381 -491 -803 104 650 -544
5424 -544 -884 -269 204 0 -510 -127 -100 -619 380 -288 -165 -633 -108 493 -109 1208 487 -121 -782 -82
5444 -82 8 -45 -70 134 492 -253 148 62 -131 379 36 -402 587 -105 286 -9 349 -23 -203 18 334 -148
5466 -148 -229 -415 -1109 172 -370 -667 -208 -95 -48 -699 -208 1053 813 80 -437 -430 334 -139 870 468
5486 468 -142 -928 185 691 497 -180 -1150 -434 275 -274 145 385 284 -206 21 140 429 142 -350 370
5506 370 -15 699 -205 -60 242 -191 -116 706 724 -227 236 729 207 639 1501 -490 417 770 220 493
5526 493 414 -212 344 -368 -140 -167 213 171 118 426 -41 196 623 46 176 170 -39 55 -560 983 153 1
5548 1 -326 119 100 -411 528 1141 -802 766 447 156 74 749 -223 174 937 -129 363 445 -492 -775 -928
5569 -928 278 104 677 -195 133 531 -609 55 126 -189 553 198 554 445 464 -77 192 -439 -201 685
5589 685 -1187 268 -560 -354 -215 466 639 -921 -80 -79 -893 413 214 616 708 45 -297 655 -208 -482
5609 -482 -90 -368 311 -219 -151 191 786 699 1085 294 74 146 -613 -43 1012 -461 -1021 -220 310 583
5629 583 213 -78 -183 483 163 -180 -796 592 413 -60 416 -395 276 362 278 -1163 -43 7 -914 -717
5649 -717 620 36 -1039 -242 463 87 -34 -950 -577 861 -150 758 21 -342 -312 66 333 94 146
5668 146 -357 178 995 -751 -2 34 -526 -359 513 -41 -91 552 -111 599 636 -181 -390 320 -634 -329 -78
5689 -78 -368 -775 -55 -657 301 -108 -837 220 908 585 -420 224 517 -1045 -461 674 -817 918
5707 918 -79 239 122 -129 51 66 294 -573 -312 -294 -632 -251 131 -696 61 -430 -539 153 753 776 185
5728 185 568 431 -992 -448 52 -296 945 831 692 173 406 -125 -369 617 -138 638 -392 -717 663
5747 663 -201 601 743 -23 -1275 568 251 -849 -527 -152 440 694 530 249 -544 7 384 171 309
5766 309 -691 -74 -429 708 214 -369 -276 268 -74 431 -174 -137 -558 290 -89 224 629 366 -354 -339
5786 -339 -858 605 191 -42 313 197 -5 -930 -455 -346 -1569 -600 -395 -252 -158 -31 174 377 279 59
5806 59 -978 -20 72 -801 1265 -445 457 520 238 334 16 396 441 8 1112 -352 450 -34 784 -341
5826 -341 371 515 1195 77 -183 616 262 450 251 114 60 71 -312 93 622 648 500 332 -178 -296 617
5847 617 97 -289 7 -1606 434 41 -196 836 55 391 -680 453 -586 821 -58 415 -759
5864 -759 875 -669 339 -106 -569 978 -889 681 -549 -609 749 20 -672 351 -65 -142 -3 160
5882 160 63 96 691 -40 -201 245 -716 -221 -745 243 -458 -1022 280 705 88 -403 -20 251 -226 -59
5902 -59 13 864 -858 301 -263 91 -137 731 180 275 196 676 503 769 -28 75 166 -691 587 1090 720
5923 720 209 232 -110 377 423 -108 -698 90 -1128 -106 269 -295 609 -90 405 774 -197 -210 -342 -293 -393
5944 -393 -425 -510 223 376 472 -91 277 269 -277 -90 655 -941 -443 -229 213 -314 -852 106 104 -108 -899 -240
5966 -240 443 231 -736 -352 211 -52 -199 833 839 411 -215 -67 -420 -1528 -996 -186 414 -301 -149 23
5986 23 -1193 -406 1052 748 576 212 74 -81 -201 -604 -733 746 133 -15 -453 619 824 -123 853
6005 853 -824 238 -1370 752 -727 -426 -102 90 -134 944 -385 -232 960 -552 245 -718 -650
6022 -650 -1065 97 -333 641 129 -100 271 -43 431 862 716 -669 -319 -235 448 21 322 847 1223 227
6042 227 286 -158 -639 -1086 -197 -169 -329 334 181 471 460 661 -608 408 1337 407 -27 -1031 -428 -1185
6062 -1185 -983 813 847 731 225 291 7 197 228 -253 -476 -372 -634 -243 -266 671 -382 964 286 373
6082 373 797 412 719 -858 -271 -767 -762 -98 260 102 -14 302 430 662 353 215 -318 -530 -148 -82 -599
6103 -599 231 561 -13 287 661 146 -310 171 -540 -675 -150 -704 -438 252 -201 -72 -287 877 -228
6122 -228 459 97 -862 -464 -1118 -72 -842 213 -373 563 -27 239 -287 18 622 -252 -297 -1494 1001
6141 1001 -643 -406 99 144 520 -167 235 13 -106 1 -152 -748 -309 -108 64 -524 735 1266 73
6160 73 -110 217 189 -1401 -446 -678 -480 -547 472 -60 -17 1001 233 193 -406 -530 -537 -252 191 -593 -359
6181 -359 -720 194 624 86 384 269 538 452 -32 -1025 -94 -141 46 -471 170 -376 414 1030 775 519 -93
6202 -93 -252 -636 -997 -664 -773 -45 348 -271 246 -410 -127 706 -645 497 -471 285 -912 452 -700
6221 -700 -578 296 -290 1443 -23 900 -347 -370 -11 -405 -584 -312 536 -167 76 967 -369 -176 -276
6240 -276 -256 291 -242 88 -512 -480 -1047 -136 -700 -78 -8 1345 509 551 727 -138 -1385 328 91 -769
6260 -769 656 -612 309 -53 235 288 471 60 -1312 -907 -923 -152 -367 431 -179 -1625 1158 -235 -272
6279 -272 -107 417 217 496 -565 -500 -646 -316 -339 -187 185 -97 364 -154 143 -25 706 -693 -110 -200
6299 -200 -614 -544 -2 -404 -2 -550 32 146 -637 -665 273 156 -360 -480 467 158 257 515 914 853 964
6320 964 30 -189 339 -575 -333 -99 573 453 -242 441 400 278 1120 414 -360 537 -224 -51 -793 -1322
6340 -1322 -433 -386 -497 107 990 653 363 424 125 -1410 -874 -161 15 -1279 -377 -14 1113 309 374 -277
6360 -277 -556 627 -41 -667 -1540 518 482 -6 -458 948 280 -325 1022 986 -548 -637 -986 323 306
6379 306 -581 -409 -150 463 -267 618 -631 184 374 -30 -294 -568 -510 -417 -917 -595 1195 477 8 297
6399 297 544 42 -456 -828 -984 82 -192 -1025 923 484 743 1054 1328 689 -84 -798 -378 -283 -283 -812
6419 -812 -680 -653 1084 716 -2 -12 46 -10 351 -221 -1505 -866 -438 -543 -148 308 -78 1412 1587 -484
6439 -484 1539 686 -295 395 -970 139 -1380 -114 269 527 638 802 904 -247 167 -664 -709 120
6457 120 -735 -572 -86 -265 17 110 125 18 -40 -86 -486 -1052 -229 -762 430 11 1259 1183 624 384 179
6478 179 -280 358 -15 363 -672 -495 -244 -130 -380 275 696 671 279 -79 -122 38 -1199 -442 -56 135
6498 135 239 34 -492 308 1001 240 569 -405 -976 189 -43 -562 -645 -26 145 -335 133 -350 218 55
6518 55 -394 -250 -265 -554 -359 -977 -631 676 519 15 -315 927 355 -259 608 4 -298 53 -351 -11
6538 -11 -440 -185 -527 74 -1156 191 -53 409 -218 27 -637 -794 -1082 792 -527 -8 528 940 -195
6557 -195 -115 -147 521 101 -955 -54 -679 -115 -286 1062 1213 853 -16 -788 177 349 391 -517 -484 361 -77
6578 -77 -29 911 760 380 -283 59 1346 -385 -596 -302 -118 -452 18 -435 147 187 21 -496 852 8
6598 8 97 -802 -1128 -593 -710 261 347 -235 508 568 678 1073 337 629 32 -625 170 -206 111 -38 -76 865
6620 865 408 834 263 923 -339 -391 -50 -527 -35 -638 -199 -394 179 -522 153 -652 -91 -413 119 -164
6640 -164 34 -282 432 237 -714 -359 50 172 -1 687 -343 -389 -40 -13 -438 -107 -807 -541 -582 303 395
6661 395 1 392 965 -829 -1485 -1148 -176 -674 -880 -499 -193 -50 452 886 -643 -40 -941 295 -374
6680 -374 -385 -1039 -1292 -956 -559 -68 903 947 940 912 418 29 -781 350 556 -236 -215 -1025 -40 1079 363
6701 363 -323 -1 430 506 -293 -612 -528 557 289 -209 82 549 -360 1249 -392 -536 134 -433 330 -947
6721 -947 377 211 543 52 822 506 502 927 986 318 214 151 -1089 78 106 594 281 247 -90 234 693
6742 693 -288 593 -73 336 -794 -1279 -185 -113 -550 1045 636 824 348 700 1357 -4 -455 -543 -553 -187
6762 -187 -970 -1103 545 -166 575 249 567 897 -281 390 -1335 -446 -1060 -618 307 459 -20 304 -322
6781 -322 1678 -102 -65 -256 -783 -388 -590 -1024 -212 293 -33 416 69 243 16 -296 -401 227 -480 -287
6801 -287 -869 -777 170 -631 906 1253 -13 -86 -31 -504 -935 -781 -811 -910 94 130 772 1130 234 -101 283
6822 283 27 -512 -377 -502 -1094 -136 -963 -288 -512 217 857 575 -382 -352 -290 3 -37 -154 -659 320 1051
6843 1051 -629 782 908 790 58 -110 -189 -542 369 -403 324 -184 -761 672 514 772 -566 327 -65
6862 -65 -95 -668 -121 -437 -604 -289 -929 -65 -150 46 -29 -337 791 17 72 -101 -813 201 -359 -589 455
6883 455 658 842 -242 -180 392 261 -163 467 -361 476 -856 386 -227 730 -136 469 -195 -205 365 23
6903 23 56 -531 400 -282 -57 -19 -652 -224 358 319 940 -505 -820 -269 221 -1496 -261 -349 -87 -671 272
6924 272 868 845 67 245 719 409 381 -756 -691 -597 477 189 -288 287 -554 -568 -681 889 -124 -1599
6944 -1599 459 123 -177 -720 212 331 109 911 601 96 -450 286 -1321 212 -243 91 7 -425 579
6963 579 318 106 766 966 -235 -159 991 -278 -614 -488 131 -1003 -486 -366 606 155 -366 -34 -602
6982 -602 -246 264 -477 -731 85 -576 470 425 -483 929 1356 654 357 -212 65 109 -468 142 198 -535
7002 -535 576 298 888 94 -209 -591 184 522 -278 -680 329 1110 -965 633 559 530 246 131 -678
7021 -678 -925 544 -900 -359 -738 433 -353 -79 32 -355 -75 -191 -320 9 -390 -928 181 -76 -108
7040 -108 -427 -1331 388 -420 -64 329 356 311 305 -191 -1303 -1111 594 373 -618 -524 195 507 711 -66 -1223
7061 -1223 -697 -4 -818 145 -1024 -308 -15 323 161 114 544 798 -320 491 -281 450 122 -737 413
7080 413 1 1715 449 -77 1078 382 734 914 -69 181 738 -888 -439 -164 433 567 384 753 -434
7099 -434 277 174 -246 -172 -407 98 70 -8 -120 242 168 119 563 213 -273 -765 -390 55 -693 -404 361 409
7121 409 -358 163 373 520 575 236 -1156 -27 569 661 -420 601 -441 329 261 389 658 -212 -461
7140 -461 -985 69 -236 -558 337 -656 163 311 217 239 457 176 619 -377 46 -86 -740 -1174 102 -107
7160 -107 410 -1378 17 153 -541 99 -39 577 -847 403 116 -595 399 172 411 -627 632 -370
7178 -370 -837 462 99 143 441 -938 -1065 43 -38 486 501 -178 37 -13 653 -306 -1613 363 192 -21
7198 -21 -143 -212 -445 -628 921 -336 1346 552 121 -704 82 -491 -642 -120 -479 196 396 133 708 561
7218 561 648 163 -823 -270 56 -388 -711 -46 932 346 -68 596 267 -462 1426 122 -311 -653 -719 -73
7238 -73 799 -158 293 1094 57 -205 -1303 -619 419 -561 475 238 -152 -560 -212 610 -307 898 -182
7257 -182 924 -615 -98 -207 463 -72 -896 302 299 538 214 -32 586 439 154 -138 171 -43 -202 -147
7277 -147 146 -249 -200 1000 46 187 1225 85 -97 197 951 -174 -632 -335 919 -370 612 308
7295 308 -289 395 -526 721 -123 -335 -223 273 -84 1130 -702 -511 271 211 164 -323 -29 474 -824
7314 -824 -4 192 -163 -42 145 60 -998 1055 -392 229 135 -72 -1376 -165 809 371 -314 -589 418
7333 418 800 -188 104 930 178 -110 -344 23 -565 -185 -331 580 -585 504 26 105 560 -652 364
7352 364 406 -4 -218 731 769 -158 566 -486 566 -358 615 449 1202 -461 -28 421 -425 331 319 96
7372 96 301 325 500 289 290 9 258 14 814 113 -160 -544 678 632 110 -1117 300 610 -90 -583 -984
7393 -984 249 -861 407 -525 -768 -21 -208 571 -164 -176 -422 636 -1297 -364 568 -409 -591 131 28
7412 28 -140 -633 -307 315 200 -78 -1287 -1129 -344 572 -960 579 567 98 -59 -83 226 -225 -210 -1034
7432 -1034 398 -466 -1001 -431 -291 421 168 -676 54 -84 -233 -879 642 131 412 254 341 -42 -358
7451 -358 910 -572 -507 1226 -925 -491 418 -337 -397 -971 -206 185 722 -88 441 138 30 -981 747
7470 747 86 18 -44 -312 -345 -755 -597 -441 -547 648 -270 363 705 -611 -322 -487 107 283 46 180
7490 180 377 -198 -794 -271 384 815 3 885 467 -283 -917 407 -193 325 -426 -551 -457 -48 368 60
7510 60 462 297 -577 -153 -1050 294 476 49 320 893 1201 -253 197 -143 266 -638 16 -827 224
7529 224 394 -901 155 339 -301 -280 943 -832 115 -201 -183 -214 463 -127 -41 552 -148 -480 -594 112
7549 112 181 177 -62 -599 355 26 -57 831 392 -94 967 -168 -57 303 -812 48 277 864 679 568
7569 568 -378 337 -608 1365 -337 309 -610 -72 469 -46 496 125 102 -43 -337 378 372 757 133 -731
7589 -731 -198 -366 864 193 -1067 520 93 194 -563 -235 -156 -747 -130 -699 -176 -217 580 148 721 369
7609 369 -143 156 -284 -76 -258 -81 -504 218 -818 -1144 77 -621 -255 737 -396 -327 468 -184 -360
7628 -360 212 -352 -30 1057 -717 -244 41 266 -142 229 -451 -74 391 -622 -368 -234 -269 -94 -737
7647 -737 668 1872 -6 230 749 267 374 -786 -48 -1041 594 153 -107 -431 -317 191 433 -245
7665 -245 -7 22 149 174 -263 4 261 -168 -206 -214 -497 941 75 783 268 -728 346 588 -38 -416 227
7686 227 -516 -452 -651 -602 -467 364 -310 -60 89 -53 -1206 163 99 226 174 -870 519 -142 641 -709
7706 -709 -902 -176 761 595 -593 1269 -141 18 54 324 1634 -331 296 -342 514 551 -447 281 257
7725 257 -369 79 266 -195 396 420 -200 -612 -802 420 530 -627 -722 37 -280 194 -304 14 235 -28
7745 -28 4 -102 -196 -148 263 300 289 440 -412 357 636 -396 -618 -120 -255 149 -410 128 -613 -54 -909 464
7767 464 683 327 985 202 -767 657 -32 -527 -450 69 -274 -369 260 -142 6 309 460 -460 616 -427
7787 -427 -73 -492 105 240 -310 529 289 -722 677 -309 432 -221 452 -59 -170 -359 -985 1272 431
7806 431 36 736 -384 507 -90 407 -31 717 -507 -411 156 -432 -476 158 303 217 215 23 -448 -283 -240
7827 -240 -556 -229 25 -290 290 -151 69 -359 -346 -77 604 -625 -34 1650 -192 -406 -165 -147 278 395
7847 395 -22 335 -1074 -372 561 -428 -1229 241 -351 -871 -257 -344 -610 218 217 151 -80 -56 48 773 248
7868 248 -594 427 -279 195 -698 92 380 -386 -265 145 194 746 497 27 -15 305 -124 8 159 256 623
7889 623 -863 -54 -434 387 873 -972 -274 273 946 -507 -473 -888 513 1059 72 273 643 -693 -1085
7908 -1085 160 -551 -186 43 -77 -543 -932 158 -1472 -206 -450 634 -472 112 -2 -319 323 525
7926 525 523 -370 -355 234 -206 -430 811 -482 -101 -75 -364 -1240 -104 -175 -430 200 376 34 129 87 -611
7947 -611 -812 -202 333 363 535 233 227 -642 771 -629 -833 438 759 260 -293 -533 -461 222 206 460 181
7968 181 -999 280 -486 338 -259 350 503 -445 133 -265 163 172 453 503 202 -266 75 -622 -588 595
7988 595 -171 -45 865 225 -476 37 -281 47 -278 4 -1218 797 -122 513 -536 331 -113 163 -466
8007 -466 229 113 -185 -875 269 -38 17 329 -285 -431 -880 512 1359 1104 -141 311 150 717 -281
8026 -281 -483 289 -647 526 283 -526 360 -1020 -1154 605 -976 -283 -388 -248 118 446 -1092 -164
8044 -164 -314 -413 76 -133 -51 776 -497 467 -372 -570 -208 -149 -908 604 -214 -398 1178 -452 -200 276
8064 276 -483 -460 309 -110 -635 36 500 438 297 -171 287 -407 -142 -940 904 623 -61 -314 -603 236
8084 236 -145 262 536 179 407 476 169 -413 -793 -394 -194 -21 -544 172 -744 11 234 248 269 227 -805
8105 -805 -483 561 1212 594 272 -107 -573 164 -317 -278 -366 -51 405 -465 1010 33 -227 726 -315 -1108
8125 -1108 244 313 138 -1236 441 1170 -2 -74 -475 -462 363 657 -609 272 172 270 268 242 -562 303
8145 303 360 807 -501 -496 -630 -699 -508 -447 520 507 -128 36 -1048 -329 -416 675 44 -448 -275 -171 -634
8166 -634 -198 995 -110 -975 -157 -254 666 1425 -422 -85 -137 285 122 306 -194 204 31 70 -608 -168
8186 -168 -574 -301 1000 -540 623
8191F23
##END NTUPLES=NMR FID
##END=
