##TITLE=1H_UK_23_3_2
 CD2Cl2
 8 sc, 
 29.07.2022
##JCAMPDX= 6.0         $$ Bruker NMR JCAMP-DX V2.0
##DATA TYPE= NMR FID
##DATA CLASS= NTUPLES
##ORIGIN= UXNMR, Bruker Analytische Messtechnik GmbH
##OWNER= root
$$ XWIN-NMR		Version 3.5
$$ Fri Jul 29 09:13:31 2022 Russian Standard Time (UT+4h)  she@DPX200
##.OBSERVE FREQUENCY= 200.1313499994
##.OBSERVE NUCLEUS= ^1H
##.DELAY= (6, 6)
##.ACQUISITION MODE= SIMULTANEOUS
##.ACQUISITION SCHEME= undefined
##.AVERAGES= 8
##.DIGITISER RES= 18
##SPECTROMETER/DATA SYSTEM= spect
##.PULSE SEQUENCE= zg30
##.SOLVENT NAME= CDCl3
##.SHIFT REFERENCE= (INTERNAL, CDCl3, 0, 15.7039)
##AUDIT TRAIL= $$ (NUMBER, WHEN, WHO, WHERE, WHAT)
$$ ##TITLE= Audit trail, XWIN-NMR		Version 3.5
$$ ##JCAMPDX= 5.01
$$ ##ORIGIN= Bruker BioSpin GmbH
$$ ##OWNER= she
$$ F:/spectra/data/she/nmr/H-F/1/audita.txt
$$ ##AUDIT TRAIL=  $$ (NUMBER, WHEN, WHO, WHERE, WHAT)
(   1,<2022-07-29 09:12:21.51 +0400>,<she>,<DPX200>,
      <created by zg, POWCHK disabled, PULCHK disabled
       configuration hash MD5:
       00 E9 B6 7A A2 85 ED C7 34 08 36 98 17 FE 4E 26
       data hash MD5: 16K
       99 B6 F6 9E A7 5B 8F A8 12 C5 AD 89 E7 A3 97 80>)
$$ ##END=
$$ 
$$ hash MD5
$$ 69 F5 44 B1 8D A1 39 57 4B 41 D9 5E CE 8D 8A B8
##$RELAX= 
##$RELAX= 
##$RELAX= 
##$RELAX= 
##$RELAX= 
##$RELAX= 
$$ Bruker specific parameters
$$ --------------------------
##$DU= <F:/spectra>
##$EXPNO= 1
##$NAME= <H-F>
##$PROCNO= 1
##$TYPE= <nmr>
##$USER= <she>
##$AMP= (0..31)
100 100 100 100 100 100 100 100 100 100 100 100 100 100 100 100 100 100 
100 100 100 100 100 100 100 100 100 100 100 100 100 100 
##$AQSEQ= 0
##$AQ_mod= 1
##$AUNM= <au_zg>
##$AUTOPOS= <>
##$BF1= 200.13
##$BF2= 200.13
##$BF3= 200.13
##$BF4= 200.13
##$BF5= 200.13
##$BF6= 200.13
##$BF7= 200.13
##$BF8= 200.13
##$BYTORDA= 1
##$CFDGTYP= 0
##$CFRGTYP= 5
##$CHEMSTR= <none>
##$CNST= (0..31)
1 1 145 1 1 1 1 1 1 1 1 1 1 1 1 1 1 1 1 1 1 1 1 1 1 1 1 1 1 1 1 1 
##$CPDPRG= <>
##$CPDPRG1= <>
##$CPDPRG2= <>
##$CPDPRG3= <>
##$CPDPRG4= <mlev>
##$CPDPRG5= <mlev>
##$CPDPRG6= <mlev>
##$CPDPRG7= <mlev>
##$CPDPRG8= <mlev>
##$CPDPRGB= <>
##$CPDPRGT= <>
##$D= (0..31)
0 1.2 0 0 0 0 0 0 0 0.06 0 0.03 0 0 0 0 0.0002 0 0 0 0 0 0 0 0 0 0 0 0 
0 0 0 
##$DATE= 1659071540
##$DBL= (0..7)
120 120 120 120 120 120 120 120 
##$DBP= (0..7)
150 150 150 150 150 150 150 150 
##$DBP07= 0
##$DBPNAM0= <>
##$DBPNAM1= <>
##$DBPNAM2= <>
##$DBPNAM3= <>
##$DBPNAM4= <>
##$DBPNAM5= <>
##$DBPNAM6= <>
##$DBPNAM7= <>
##$DBPOAL= (0..7)
0.5 0.5 0.5 0.5 0.5 0.5 0.5 0.5 
##$DBPOFFS= (0..7)
0 0 0 0 0 0 0 0 
##$DE= 6
##$DECBNUC= <off>
##$DECIM= 32
##$DECNUC= <off>
##$DECSTAT= 4
##$DIGMOD= 1
##$DIGTYP= 9
##$DL= (0..7)
0 120 120 120 120 120 120 120 
##$DP= (0..7)
150 150 150 150 150 150 150 150 
##$DP07= 0
##$DPNAME0= <>
##$DPNAME1= <>
##$DPNAME2= <>
##$DPNAME3= <>
##$DPNAME4= <>
##$DPNAME5= <>
##$DPNAME6= <>
##$DPNAME7= <>
##$DPOAL= (0..7)
0.5 0.5 0.5 0.5 0.5 0.5 0.5 0.5 
##$DPOFFS= (0..7)
0 0 0 0 0 0 0 0 
##$DQDMODE= 0
##$DR= 18
##$DS= 0
##$DSLIST= <SSSSSSSSSSSSSSS>
$$ [...]
##$SUBNAM2= <"">
##$SUBNAM3= <"">
##$SUBNAM4= <"">
##$SUBNAM5= <"">
##$SUBNAM6= <"">
##$SUBNAM7= <"">
##$SUBNAM8= <"">
##$SUBNAM9= <"">
##$SW= 18.0517283424941
##$SWIBOX= (0..15)
0 0 2 0 0 0 0 0 0 0 0 0 0 0 0 0 
##$SW_h= 3612.71676300578
##$TD= 16384
##$TD0= 1
##$TE= 0
##$TE2= 300
##$TE3= 300
##$TEG= 300
##$TL= (0..7)
0 120 120 120 120 120 120 120 
##$TP= (0..7)
150 150 150 150 150 150 150 150 
##$TP07= 0
##$TPNAME0= <>
##$TPNAME1= <>
##$TPNAME2= <>
##$TPNAME3= <>
##$TPNAME4= <>
##$TPNAME5= <>
##$TPNAME6= <>
##$TPNAME7= <>
##$TPOAL= (0..7)
0.5 0.5 0.5 0.5 0.5 0.5 0.5 0.5 
##$TPOFFS= (0..7)
0 0 0 0 0 0 0 0 
##$TUNHIN= 0
##$TUNHOUT= 0
##$TUNXOUT= 0
##$USERA1= <user>
##$USERA2= <user>
##$USERA3= <user>
##$USERA4= <user>
##$USERA5= <user>
##$V9= 5
##$VALIST= <valist>
##$VCLIST= <CCCCCCCCCCCCCCC>
##$VD= 0
##$VDLIST= <DDDDDDDDDDDDDDD>
##$VPLIST= <PPPPPPPPPPPPPPP>
##$VTLIST= <TTTTTTTTTTTTTTT>
##$WBST= 1024
##$WBSW= 4
##$XGAIN= (0..3)
0 0 0 0 
##$XL= 0
##$YL= 0
##$YMAX_a= 60183
##$YMIN_a= -60674
##$ZGOPTNS= <>
##$ZL1= 120
##$ZL2= 120
##$ZL3= 120
##$ZL4= 120
##$ABSF1= 10
##$ABSF2= 0
##$ABSG= 5
##$ABSL= 3
##$ALPHA= 0
##$AQORDER= 0
##$ASSFAC= 0
##$ASSFACI= 0
##$ASSFACX= 0
##$ASSWID= 0
##$AUNMP= <proc_1d>
##$AZFE= 0.1
##$AZFW= 0.1
##$BCFW= 1
##$BC_mod= 2
##$BYTORDP= 1
##$COROFFS= 0
##$CY= 11.3945322036743
##$DATMOD= 1
##$DC= 2
##$DFILT= <>
##$DTYPP= 0
##$F1P= 2.36226072786647
##$F2P= -0.459571619588291
##$FCOR= 0.5
##$FTSIZE= 0
##$FT_mod= 4
##$GAMMA= 1
##$GB= 0.15
##$INTBC= 1
##$INTSCL= 1
##$ISEN= 128
##$LB= 0.24
##$LEV0= 0
##$LPBIN= 0
##$MAXI= 10000
##$MC2= 0
##$MEAN= 0
##$ME_mod= 0
##$MI= 1.114404
##$NCOEF= 0
##$NC_proc= 0
##$NLEV= 6
##$NOISF1= 3.799351
##$NOISF2= 2.8
##$NSP= 1
##$NTH_PI= 0
##$NZP= 0
##$OFFSET= 15.70392
##$PC= 1
##$PHC0= -18040.76
##$PHC1= 13.80068
##$PH_mod= 1
##$PKNL= yes
##$PPARMOD= 0
##$PSCAL= 0
##$PSIGN= 0
##$REVERSE= no
##$SF= 200.130013532006
##$SI= 16384
##$SIGF1= 3
##$SIGF2= 2
##$SINO= 400
##$SIOLD= 16384
##$SREGLST= <1H.CDCl3>
##$SSB= 0
##$STSI= 0
##$STSR= 0
##$SW_p= 3612.71676300578
##$SYMM= 0
##$S_DEV= 0
##$TDeff= 0
##$TDoff= 0
##$TI= <>
##$TILT= no
##$TM1= 0
##$TM2= 0
##$TOPLEV= 0
##$USERP1= <user>
##$USERP2= <user>
##$USERP3= <user>
##$USERP4= <user>
##$USERP5= <user>
##$WDW= 1
##$XDIM= 8192
##$YMAX_p= 0
##$YMIN_p= 0
$$ End of Bruker specific parameters
$$ ---------------------------------
##NTUPLES= NMR FID
##VAR_NAME=  TIME,          FID/REAL,        FID/IMAG
##SYMBOL=    X,             R,               I
##VAR_TYPE=  INDEPENDENT,   DEPENDENT,       DEPENDENT
##VAR_FORM=  AFFN,          ASDF,            ASDF
##VAR_DIM=   8192,          8192,            8192
##UNITS=     SECONDS,       ARBITRARY UNITS, ARBITRARY UNITS
##FACTOR=    0.0002768,     1,               1
##FIRST=     0,             0,               0
##LAST=      2.2672688,     0,               0
##MIN=       0,             -60674,          0
##MAX=       2.2672688,     60183,           0
$$ Real data points
##PAGE= N=1
##DATA TABLE= (X++(R..R)), XYDATA
$$ [...]
1837a12R75j234p70J627K65q32m35Q92R6l01n56J80M74n2m43o19J137M13j082
$$ -112 863 -371 -1141 486 751 -81 -516 376 472 171 -385 -205 269 217 -226 -845 292 705 -377
1856c77l06J532k64j263N5J426o06j174O33Q12k07m26j52M17M24j86p95M1R96
$$ -377 -683 849 585 -678 -623 803 197 -977 -344 468 261 -165 -317 100 524 338 -457 -416 580
1875E80l34j438P73J449j147q62R71R36q20m64M68K11n08k99L63L15J79n27n68
$$ 580 246 -1192 -419 1030 -117 -979 -8 928 108 -356 112 323 -185 -484 -121 194 373 -154 -722
1894g22J274N83j256p23J558K03j364m44J233J16j039m19J210J51o02j32L33N10
$$ -722 552 1135 -121 -844 714 917 -447 -891 342 458 -581 -1000 210 361 -241 -373 -40 470
1912D70j01o67k48R94j46j227K09J598j90j308O34P94k86j195L17O66j92p39J30
$$ 470 369 -298 -546 448 302 -925 -716 882 692 -616 18 812 526 -669 -352 314 122 -617 -487
1931d87N51M19n93n04Q58L92n84p81O25P84m20j292R51O71q76m73P77P03o83k98
$$ -487 64 483 -110 -614 244 636 52 -729 -104 680 260 -1032 -81 590 -286 -759 18 721 38 -260
1951b60O77N9l39m90o4N67K49o49o82J576K19j427k39J537j05j299J91R14k07
$$ -260 417 476 137 -353 -417 150 399 -250 -932 644 863 -564 -803 734 629 -670 -479 435 228
1970B28o22Q0K46M57J28p98J71O90j86j032K15R35k00j531Q87J048n12o74O51
$$ 228 -394 -314 -68 389 517 -281 -110 580 394 -638 -423 512 312 -1219 -332 716 204 -470 181
1989A81N61n04q37N54K03j0l43n93R71L25n47o22O15J036j081o54J131K73q13
$$ 181 742 238 -599 -45 158 148 -195 -788 183 508 -39 -661 -46 990 -91 -745 386 659 -154
2008a54n55R30M7n73J31K96K35k68m32l6P56k8o58m06J205k3j050j24J319P9j129
$$ -154 -709 221 268 -305 -174 122 357 89 -343 -379 377 349 -309 -715 490 467 -583 -707 612 691 -438
2029d38J36R21k96o68J89N06l51k77j10K97P13o33o18P48N64m55r81M18J009p07
$$ -438 -302 619 323 -345 -156 350 -1 -278 -388 -91 622 -11 -629 119 683 228 -753 -335 674 -33
2049c3q60Q25N86n33m16K61P20o78k27M44P3L03o23o44J114M08j302J79R67J09
$$ -33 -893 -68 518 -15 -431 -170 550 -128 -355 89 162 465 -158 -802 312 720 -582 -403 564 673
2069F73j199J19O96M2o30k15P43m0j16p11N65M34J35p86MQ47l76j110O92Q85j09
$$ 673 -526 -407 289 331 -299 -514 229 189 73 -638 -73 361 496 -290 -286 561 185 -925 -233 652 543
2090E43j247N30J007n74p34M24L53o8j25o26M56K24k3q49Q22M02m44p38R12M33
$$ 543 -704 -174 833 259 -475 -51 302 234 109 -517 -61 163 140 -709 113 515 71 -667 245 678
2110F78o61p16P93M78o40n00Q66J58k62l64J87L59j00o02J3N58L92q48m86J124
$$ 678 17 -699 94 572 -68 -568 298 456 194 -170 17 376 276 -326 -313 245 637 -211 -697 427
2130D27j68p02q9J194k92j027M63O36k61l67k38N22J14k89o5L6N82l12p12K77
$$ 427 259 -443 -532 662 370 -657 -194 442 181 -186 -424 98 212 -77 -142 -106 476 164 -548 -271
2150b71J047n36j040O88Q01o17o78N16M48j38k86j79J73M08m58j59J44M79o04
$$ -271 776 240 -800 -112 689 72 -606 -90 358 220 -66 -245 -72 336 -122 -281 -137 342 -262
2169b62l66P39M79p13n99J218K42q23m1M81j09k36j72L12p5j15k78Q6N00Ko67
$$ -262 -628 111 590 -123 -722 496 738 -85 -126 355 246 10 -162 150 75 -40 -318 -232 268 270 -397
2190c97J37O98m6p40l12J085j82o93K89O42l15l02j70N28j9k14l45M51L48k83
$$ -397 -260 438 392 -348 -660 425 243 -450 -161 481 166 -136 -306 222 203 -11 -356 95 443 160
2210A60m97M16P27j111j44N58O68o66p27O64N18n00o25O51K16m17L7p2M19j06
$$ 160 -337 79 806 -305 -449 109 777 111 -616 48 566 66 -559 92 308 -109 -72 -144 275 169
2230A69m45k60O78M85j083j12Q22J99r67L6Q12K4q87J04M22L34l04l50K61M55
$$ 169 -276 -536 142 627 -456 -568 254 453 -514 -478 334 358 -529 -425 -3 331 27 -323 -62 393
2250C93k90q53L58R78o14n83N59N06n49p41P39M88r0o74J34N97j71m16nL18M43
$$ 393 103 -750 -392 586 -28 -611 -52 454 -95 -836 -97 391 301 -373 -239 358 187 -229 -234 84 527
2271E27o48k27M21M76n24m52M08L69m42m90R02J0n48k25M22J53j59m95L13N28
$$ 527 -121 -348 73 549 25 -427 -19 350 -92 -582 320 330 -218 -443 -21 132 -27 -522 -209 319
2291C19p0o93K59K34J87n87K7J018j39r59Q5M29J32o75O3P45j59l87M6K42J30
$$ 319 249 -444 -185 49 236 -351 -324 694 555 -404 -319 110 242 -433 -370 375 216 -171 -125 117 247
2312B47j80m95K04N68j09p43M45M12m63n00N89L35k72l68M02L82m50l52K36K41
$$ 247 67 -428 -224 344 235 -508 -63 349 -114 -614 -25 310 38 -330 72 454 4 -348 -112 129
2332A29M6n04J95K57M43n15n29O89K3n25P8O05K34r20J2K20L60k47k52M85l9l2
$$ 129 175 -329 -134 123 566 51 -478 211 234 -291 -213 392 626 -294 -282 -62 298 51 -201 284 245 213
2354B13o20p7Q43l03n48J6R21l19p04J95R28l58o55L22N86l04l93L57J02n9m11
$$ 213 -407 -484 359 56 -492 -476 445 126 -578 -383 545 187 -468 -146 440 136 -257 100 202 143 -268
2375b68j90M84M28k25o54L37N79o99j28L83M80p60n5M91L82n17n10L39M17k64
$$ -268 -458 26 454 229 -425 -88 491 -208 -336 47 527 -233 -288 203 585 68 -442 -103 314 50
2395E0k12j5M16o2o18R1O94J65n83k27O25J28o68k82R75j35m79M1L13M8m02R4
$$ 50 -162 -177 239 177 -441 -350 344 509 -74 -301 324 452 -216 -498 477 342 -137 -96 217 265 -137 -43
2417d3lO43n14m98L89M78m87m11K42N92O4j105M18P66l98k91K24J25k91j48k90
$$ -43 -46 597 83 -415 -26 452 -35 -446 -204 388 452 -653 -235 531 133 -158 66 191 -100 -248 -538
2438e38O68J45l39j83K50M05l98k78N01K39n35k85L26M95o21q5K79J87P5o50L88
$$ -538 130 275 -64 -247 3 408 10 -268 233 472 -63 -348 -22 473 -148 -233 46 233 308 -342 46
2459D6L40p7l42j84O30Q3q49K03O22j78j44o9J53J09p03J29M20q5k72r4L80J92
$$ 46 386 309 -33 -217 413 496 -353 -150 472 294 150 81 234 343 -360 -231 189 104 -168 -262 118 310
2481C10n29k80M13N34l11n98N94O4k22n03L67L10k34l71M51K99j52l79J60M17
$$ 310 -219 -499 -86 448 137 -461 133 197 -25 -528 -161 149 -85 -456 -5 294 142 -237 -77 340
2501C40j57m06m0K47J42l95r7M11N43o37R9J51M0n09k92Q78j16o2o05N79J48n
$$ 340 183 -223 -263 -16 126 -269 -366 45 588 -49 50 201 241 -268 -560 318 202 140 -465 114 262 257
2523B57l68O1L47j23k88j6L13L22j078L55M26k7n81M73L79m91j56k71M92K13l69
$$ 257 -111 -50 297 174 -114 -130 183 505 -573 -218 208 181 -400 73 452 -39 -195 -466 26 239 -130
2544a30l86L85O92m66l73L59J86k95k49K21N7n7m39P01l2j54k33K41J47Jm53J52
$$ -130 -516 -131 561 95 -278 81 267 -28 -277 -56 1 -56 -495 206 174 20 -213 28 175 176 -277 -125
2566a25N95k95n03J79M18l3m37j9O44j43m31L33L49l88n19j5L98J55k03j95K90
$$ -125 470 175 -328 -149 269 236 -201 -220 424 281 -150 183 532 144 -375 -390 8 163 -40 -235 55
2587E5L65m45q4K26M56o79k86J32N46l41l40K70M07k50j68M34n2Om02j86P4M70
$$ 55 420 -25 -109 117 573 -106 -392 -260 286 -55 -395 -125 282 32 -136 298 246 252 -150 -336 -262 208
2609B08m19m1K39O1l22Q2M37J30l69l42N76l3j55l64L02J25j72l34J16N95j13
$$ 208 -211 -252 -13 48 -274 -192 245 375 6 -336 240 207 52 -312 -10 115 -57 -391 -275 320 207
2630B07l04M2M32k38k83j13N74l21n2M1L60j22m71J53L7J82j93k0j00M07j27l71
$$ 207 -97 -55 377 139 -144 -257 317 -4 -56 -15 345 223 -248 -95 -58 124 -69 -89 -189 218 91 -280
2652b80Q3O85l34k37K19J52k10n58P52N6m77l99N35J96j1l16L27J13j78j95j94
$$ -280 -197 488 154 -83 136 288 78 -480 272 328 -149 -548 -13 183 172 -144 183 296 118 -77 -271
2673b71J78Qj15j72O88J98n88j64N90O8l65j05J52m9r9j78k51O64j82l85M33J19
$$ -271 -93 -85 -200 -372 316 514 -74 -238 352 420 55 -50 102 53 -46 -224 -475 189 7 -378 55 174
2695A74l2k73J23K77k44k71k25Q35m24k08J87P04j94n12o4L76j40k32j27J39L65
$$ 174 142 -131 -8 269 25 -246 -471 364 -60 -268 -81 623 429 -83 -147 229 89 -143 -270 -131 234
2716B34l68j72N48J38n97J9O21L5l02n92M30K60l35q0n9N50l33J8r7M23k04n05
$$ 234 -134 -306 242 380 -217 -198 423 458 156 -436 -6 254 -81 -161 -220 330 -3 15 -82 341 137 -368
2738c68Q1L38n8n92J85P41k34k69P7K28p7n3j25L12j06j54k58M69J28l46j43N1
$$ -368 -287 51 -7 -599 -414 327 93 -176 -99 129 52 -1 -126 186 80 -74 -332 137 265 -81 -224 -173
2760a73M89k25m10K42M10m22k64K08K48o6m67M93L22r1l24J27L8K03k92k69L19
$$ -173 316 91 -319 -77 333 -89 -353 -145 103 37 -430 63 385 294 -30 97 135 338 46 -223 96
2781I6O8o91K71J73M09o85K04M20k38j2j23L1o1o0k49M63L3J38m32J56L14Q3n85
$$ 96 164 -527 -256 -83 326 -359 -155 265 27 15 -108 -77 -138 -198 -447 16 49 187 -245 -89 225 308 -277
2804b77M2L48j52k71j6O22m2k29m7M20j41p5j87J91j09k01l43J82M97j27k67K67
$$ -277 -235 113 -39 -310 -326 296 254 25 -22 398 257 182 -5 186 77 -124 -467 -285 212 85 -182 85
2826H5J84j7k01j21K33o4o8n3k1M7r1K14K53j75k07k20K15L07o48j53M73P4l01
$$ 85 269 252 51 -70 163 99 31 -22 -43 4 -87 127 380 205 -2 -222 -7 300 -348 -501 -28 46 -255
2849b55k2K27K46l13k6O35k99k55k6q6L88l43j27L05l1J86m32Q5L40j7m35K42
$$ -255 -277 -50 196 -117 -143 492 193 -62 -88 -174 214 -129 -256 49 18 204 -228 -143 197 180 -255 -13
2871a3L29l42l54M50J19k51j54M5L99L3l66j3o6K04k03l47N16L91m60M9J76J78
$$ -13 316 -26 -380 70 189 -62 -216 -171 228 261 -105 -118 -184 20 -183 -530 -14 377 -83 -34 142 320
2893C20m19l22L51K03q8k17j30K99j55n6p3N95N3l00r6M01l48k99J8M94j95k77
$$ 320 -99 -421 -70 133 45 -172 -302 -3 -158 -214 -287 308 361 61 -35 366 18 -281 -263 231 36 -241
2915b41o6L68M9j76j09J21K35n15j01M07O8k01j17K23K71j74j19M51o7j66k37
$$ -241 -307 61 110 -66 -175 -54 181 -334 -435 -28 40 -161 -278 -55 216 42 -77 374 307 141 -96
2936i6L38j60j80j2P6K06n4k21J5M03J03k33m21K51P9l09k90M23J58j67m1K09
$$ -96 242 82 -98 -110 -34 172 118 -103 -88 315 418 185 -236 15 94 -215 -505 -82 76 -91 -132 77
2958G7J63l52R0J23q6p9j65PK73j26j93l3N98R2j49k77K33j23l91Q8K55J55j12
$$ 77 240 -112 -22 101 15 -64 -229 -222 51 -75 -268 -301 297 389 240 -37 196 73 -318 -230 25 180 68
2981F8m12M87j33j44j15J94L31k56n8j45M44k65m10R1M12k51N2J15M49m80k29
$$ 68 -344 143 10 -134 -249 -55 276 20 -38 -183 261 -4 -414 -323 89 -162 -110 5 454 -26 -255
3002b55M71Kk07k39l31P16j57j30J05K69K25r69O04L46k00m96jL35J11k88O8J08
$$ -255 216 218 11 -228 -559 157 0 -130 -25 244 469 -500 104 450 250 -246 -247 88 199 -89 -21 87
3024H7%j27J70l29O21m59J21l61L94n6l30N22q8%m21P2L37L2m50KJ96N6l32J76
$$ 87 87 -40 130 -199 422 -37 84 -277 117 61 -269 253 165 165 -256 -184 153 185 -265 -263 -67 -11 -343 -167
3048a67K62K33m91O7J08J58j79l6J06q5r9j88M63K2k03L0J10JQ3k48k35J90P9
$$ -167 95 328 -163 -96 12 170 -9 -45 61 -24 -123 -311 152 174 -29 1 111 112 195 -53 -288 -98 -19
3071a9j49J62J35Mk52M9K86J10k64o2P9l9m07L38P5L1n9L1K23J58j99j79o5K01
$$ -19 -168 -6 129 133 -119 -70 216 326 62 0 79 40 -367 -29 46 77 18 49 272 430 231 52 -13 188
3095A88m4j86m9J98l09K7J19J62o3n7j84J61J44p8r5R8J99m07j27M79K9j90R3
$$ 188 144 -42 -91 107 -202 -175 -56 106 43 -14 -198 -37 107 29 -66 32 231 -176 -303 176 205 15 108
3118A08J59N2n06q5M78P4o65K51N27P3p10L40rP6P3j47J00j34K8n60j5Q04k35
$$ 108 267 319 -187 -272 206 280 -385 -134 393 466 -244 96 87 163 236 89 189 55 83 -477 -492 312 77
3141G7j75J23K62J16m02R1Q8m6j25J22Mk7n7j06L51j86M4l1k97L50k74J00j31
$$ 77 -98 25 287 403 1 92 180 134 9 131 135 108 51 -55 296 110 154 123 -174 176 -98 2 -129
3164a29J45j78j49K44L63k45OkJ59l32M7n4R0k4k05q5K97K36k57J41l0J14l43
$$ -129 16 -162 -311 -67 296 51 57 55 214 -118 -71 -125 -35 -59 -264 -349 -52 184 -73 68 38 152 -191
3187a91n3K73o1q1p8M06j81K24m22K86K69m27p4q4L98k93j97L01K0p0oJ69J97
$$ -191 -244 29 -32 -113 -191 215 34 258 -164 122 391 -36 -110 -194 204 -89 -286 15 35 -35 -41 128 325
3210C25j31j73j52L78k34k08p5J67K33j92o4J28K97j53k28J64K9k86j74K20K12
$$ 325 194 21 -131 247 13 -195 -270 -103 130 -62 -126 2 299 146 -82 82 111 -175 -349 -129 83
3231H3k28j01Q6K87J75l84Q1K67k41j98LK07M6j95M6J20M1j28k59P33n05m6J83
$$ 83 -145 -246 -160 127 302 -82 -1 266 25 -173 -170 37 83 -112 -66 54 95 -33 -292 441 -64 -110 73
3254G3q7L7l45R7J67O6J59k36L41l04K5j68J50k4j64j02O9M5J94k93N71k9j55
$$ 73 -14 23 -322 -225 -58 8 167 -69 272 -32 -7 -175 -25 -49 -213 -315 -246 -201 -7 -300 271 242 87
3277H7l2k32K7L52l27r1K01Q6j40J05j4R9n7J38J00l86j19m8J23r1R0P7J01L8
$$ 87 55 -177 -150 202 -125 -216 -15 71 -69 36 22 121 64 202 302 -84 -203 -251 -128 -219 -129 -52 49 87
3301H7P2J2j08j84K76l07k16L88j19j82L98K32j45k73K58J2j97n91L39M93k57
$$ 87 159 171 63 -121 155 -152 -368 20 -99 -281 117 349 204 -69 189 201 4 -587 -248 245 -12
3322a2m25J25K63J44j36M9J65Q8j68k07J0L99n19PM77j78j86J93j21M9J05n7N8
$$ -12 -437 -312 -49 95 -41 8 173 261 93 -114 -104 295 -224 -217 260 82 -104 89 -32 17 122 65 123
3345A23j99K22k22r3j39J35j61J27N39q0l24K25Q3l48j75qK69J0n1o6K02O1m8
$$ 123 -76 146 -76 -169 -308 -173 -334 -207 332 252 -72 153 236 -112 -287 -295 -26 -16 -67 -133 69 130 82
3368H2M6K1n8o9j76J55q9l48M73j51J42j5%M1j2M22o95O4P8j08J17j2k9L00j58
$$ 82 128 149 91 22 -154 1 -88 -436 37 -114 28 13 13 54 42 464 -231 -167 -89 -197 -80 -92 -121 179 21
3393B1K5J92j93N5k32L76l04O5k89M37r5k05P3K63k7J36m28mK33m92K96j90M30
$$ 21 46 238 45 100 -132 244 -60 5 -284 153 58 -147 -74 189 162 298 -130 -134 99 -393 -97 -287 143
3416A43r8l02K26O7K7J11j90J86j85q2j72L00R9l72J72K04J9r1k34K87M0r9K14
$$ 143 45 -257 -31 36 63 174 -16 170 -15 -97 -269 31 130 -242 -70 134 153 62 -172 115 155 56 270
3439B70k88Pj75p7L04j78O2J71l29J05J13K76l86R7J49k00j36J58J18j03j81M39
$$ 270 -18 -11 -186 -263 41 -137 -75 96 -233 -128 -15 261 -125 -28 121 -79 -215 -57 61 -42 -223 216
3461B16K14l08j21l5Ol8k41K23Q2J4o2L1J15k25oN5J45k54j25J36J69j66j08J52
$$ 216 430 122 1 -34 -28 -66 -307 -84 -2 12 -50 -19 96 -129 -135 -80 65 -189 -314 -178 -9 -175 -283 -131
3485a31J32ol12K14K68n0l40J59J47l3j78K9K33L7J16j40j80L31m35J08O5j74
$$ -131 1 -5 -317 -103 165 115 -225 -66 81 48 -130 -101 132 169 285 145 -35 296 -139 -31 34 -140
3507a40J72k04L28j87K14q3K07k15k20OQ3J07M0l73K53J51k49l8r9K57J66k20
$$ -140 32 -172 156 -31 183 100 307 92 -128 -122 -39 68 108 -265 -12 139 -110 -148 -247 10 176 -44
3529d4j13K97j50J34j67L4N8j06J03m9j94L47r8j00L7J7K8POK60l22P8L62n17
$$ -44 -157 140 -10 124 -43 -9 49 -57 46 -3 -197 150 52 -48 -11 6 34 41 47 307 -15 63 425 -92
3553i2Q6J14j62k5J28l22K19L7j47K62j84oK04J25K4o7l42K85n1J42k03o6j27
$$ -92 -6 108 -54 -79 49 -273 -54 -17 -164 98 -86 -92 112 237 261 194 -148 137 86 228 25 -41 -168
3576a68K52J9j5k14L17L6k09k19J06K50k70R5J06j39j93K10J47j07j94J62J78
$$ -168 84 103 88 -126 191 227 18 -201 -95 155 -115 -20 86 -53 -246 -36 111 4 -190 -28 150
3597A50k33j0K10j92L46j97k15J01Q9j63L07R7j42k80J49l5J37l27j72J55K44
$$ 150 -83 -93 117 -75 271 74 -141 -40 49 -114 193 290 148 -132 17 -18 119 -208 -380 -225 19
3618A9K95l86O0J60q4j52o0Q3l2k0R2j37K46J21k15K59l8k02n4J88K16n58j21
$$ 19 314 -72 -12 148 64 -88 -148 -65 -97 -117 -25 -162 84 205 -10 249 211 9 -45 143 359 -199 -320
3641c20J96M4l7J83r6J16K00n02P5J48r4j17O0k07K47L4L4L90m54K09j00K0k3
$$ -320 -124 -80 -117 66 -30 86 286 -216 -141 7 -87 -204 -144 -351 -104 -70 -36 354 -100 109 9 29 6
3664Fj09J07k1L5l9p4K8K10j10K55l48j46J55k72K98l7oJ83j15M5M24p42K51N1
$$ 6 -103 4 -17 18 -21 -95 -67 143 33 288 -60 -206 -51 -323 -25 -62 -68 115 0 45 469 -273 -22 29
3688B9m3j76k4K8J55m0n5J38J07j70m0J05J88l03r2L34j53k48K48Q2J22j56l18
$$ 29 -14 -190 -214 -186 -31 -71 -126 12 119 -51 -91 14 202 -101 -193 141 -12 -260 -12 70 192 36 -282
3711b82M14J01k36L8K22k23k55Q8j7J93K05j04m7Mj8K22m40J98n9k92L79K32n05
$$ -282 132 233 -3 35 257 34 -221 -133 -150 43 248 144 97 101 83 305 -135 63 4 -288 91 323 -182
3734a82L05j40%K13r9P0j83J19l06J02q0Q8j12L16k70K94j26M8NK2l08K81J3N9
$$ -182 123 -17 -17 196 97 167 -16 103 -203 -101 -181 -93 -205 111 -159 135 9 57 62 84 -224 57 70 129
3758A29j61k06L90k99K00K68k55J49j46j95j16R9K73j9m1J5P6Lk81R4j26K46j18
$$ 129 -32 -238 152 -147 53 321 66 215 69 -126 -242 -143 130 111 70 85 161 164 -117 -23 -149 97 -21
3781b1j67K11j1o5M4J05k27j16J91q8J26k20K08K78j33k79M3J01J29Nk10J72r2
$$ -21 -188 23 12 -53 -9 96 -131 -247 -56 -144 -18 -238 -30 248 115 -164 -121 -20 109 114 -96 76 -16
3804a6r7K11k4L8j64n8n1OK4J7l5J08N4%Q4k7j01j44J58Q9J58l18p7QJ57j60M1
$$ -16 -113 98 74 112 -52 -110 -161 -155 -131 -114 -149 -41 13 13 97 70 -31 -175 -17 72 230 -88 -165 -157 0 -160 -119
3831a19K60J10j76j83K53Mm90J12L29m6j52K24o3o7m8J12j91K54o0O0l93M55l58
$$ -119 141 251 75 -108 145 149 -341 -229 100 54 -98 126 63 -4 -52 60 -131 123 63 123 -270 185 -173
3854a73J33P6J55Q3j56r8n5K3k1j22K19l20K30j15L45j11Q3q1j8J07j33k14M28
$$ -173 -40 36 191 274 118 20 -35 -12 -33 -155 64 -256 -26 -141 204 93 176 95 77 184 51 -163 265
3877B65j49qm37K50J05J62k97J68J54l24M12n39N53k31K7j15J73j71n6l0K15J21
$$ 265 116 108 -329 -79 26 188 -109 59 213 -111 301 -238 315 84 111 -4 169 -2 -58 -88 127 248
3899B48l29J94P8j88j23J00J13j12J09L9L5k03J79k10J14K0K58n17n2K43K54j08
$$ 248 -81 113 191 3 -120 -20 93 -19 90 129 164 -39 140 -70 44 64 322 -195 -247 -4 250 142
3921A42k53k3lm9J08K15n4j22L4J1k6J07j41RJ7Q7j63N71l85P6k60J57j69J28
$$ 142 -111 -134 -137 -186 -78 137 83 -39 -5 6 -20 87 -54 -45 -28 59 -104 467 82 158 -102 55 -114 14
3945A4j44J89R7K4p8j04L0j13P7o9J35j63j75L80j43L1k7L25k02J10j65j52J62
$$ 14 -130 59 156 180 102 -2 28 -85 -8 -77 58 -105 -280 100 -43 -12 -39 286 84 194 29 -123 39
3968C9Q0l07J41Q0l60M65O0k15J92j28j07J66k0j20j46J48J30p8O1j63j63K26
$$ 39 119 -188 -47 33 -327 138 198 -17 175 47 -60 106 86 -34 -180 -32 98 20 81 -82 -245 -19
3990a9p9J15K2k70K43j04L46j26k84Q5K11k49J41J89l85J84K0j71L5K59k19J83
$$ -19 -98 17 39 -231 12 -92 254 128 -156 -71 140 -109 32 221 -164 20 40 -131 -96 163 -56 127
4012A27l08K05j13J74J04l6j43J08l48M19o1j42oL45j11m50J69J39j97K68k40
$$ 127 -181 24 -89 85 189 153 10 118 -230 189 128 -14 -20 325 214 -236 -67 72 -125 143 -97
4033i7J8K78j73L2k40K40j12j07L79j98l3N0r8K2r3j6j11L26n3o7L6J25j53mN2
$$ -97 -79 199 26 58 -182 58 -54 -161 218 20 -13 37 -61 -39 -132 -148 -259 67 14 -53 -17 108 -45 -49 3
4058CN1J99l88J96l4J43l00J57J5J21o6k63K46j1k83J31M9O7k95M11k29N9O8j15
$$ 3 54 253 -135 61 27 170 -130 27 42 163 97 -166 80 69 -214 -83 -34 33 -262 149 -80 -21 47 -68
4082f8K13k7n7m3J5J75l18l5J92K8M0k85L08L7j88J06k75K89j77L9k35OL32j30
$$ -68 145 118 61 18 33 208 -110 -145 47 75 115 -170 138 175 -13 93 -182 107 -70 -31 -266 -260 72 -58
4106e8P3J69j7l62J85j33L18l36J57o6P3k4j8K8r3J21j36J20K35j99M7j57j06
$$ -58 15 184 167 -195 -10 -143 175 -161 -4 -70 3 -21 -39 -11 -104 17 -119 1 236 37 84 -73 -179
4129a79Q0K12P6l15L9J02J83P6j30l51J32Q8r5J43j00L2J87q7j47J43P7J07l90
$$ -179 -99 113 189 -126 -87 15 198 274 144 -207 -75 13 -82 61 -39 -7 180 93 -54 89 166 273 -117
4152a17J27n1j48L4K78m6o2j89L46j13Q0r2J61k59n4M7l1J28J06k59J18K55j72
$$ -117 10 -41 -189 -155 123 77 15 -174 172 59 139 47 208 -51 -105 -58 -89 39 145 -114 4 259 87
4175H7k32J93j51J01j08L23l46Q4Q8J00k19l3J93j03N7j75P2L37k60J16P9j18
$$ 87 -145 48 -103 -2 -110 213 -133 -49 39 139 -80 -113 80 -23 34 -141 -69 268 8 124 203 85
4197H5P0j10L3m0r3L0J66k42J62j16r8q7J85k2m1J43lJ71k43j53J67J15j96L2
$$ 85 155 45 78 38 -55 -25 141 -101 61 -55 -153 -240 -55 -77 -118 25 22 193 -50 -203 -36 79 -117 -85
4221h5K86j48J04k21J00O9j42J8K47n75L95K8r9o0p6J95j79%J66J21J2j5l76K15
$$ -85 201 53 157 -64 36 105 -37 -19 228 -347 48 76 -23 -83 -159 36 -143 -143 23 144 156 141 -235 -20
4245b0N6j99J59m9k35K52n9J66j98N5Q1r3J03M2pj6j69K47j46j78l4L79j3P0j67
$$ -20 36 -163 -4 -53 -288 -36 -95 71 -127 -72 9 -84 19 61 54 38 -131 116 -30 -208 -242 137 124 194 27
4270B7j65J1j03K39k37J24K00K44k97m4J57j76J6m1j21K96r7j44J92j48L32m83
$$ 27 -138 -127 -230 9 -228 -104 96 340 43 -1 156 -20 -4 -45 -166 130 33 -111 81 -67 265 -218
4292b18K42k79L43j14k8J9L2l38J15M94l35m4J13lj5m5l9N3R8K33l85L4o1N5n3
$$ -218 24 -255 88 -26 -54 -35 -3 -341 -226 268 -67 -111 2 -1 -16 -61 -100 -47 51 284 -101 -67 -128 -73 -126
4317a26O1L3J42m8J08k10p7K30p1n4J33l14k23L29J7j71P7J79J12k74J79l01K15
$$ -126 -65 -32 110 62 170 -40 -117 113 42 -12 121 -193 -416 -87 -70 -241 -164 15 127 -147 32 -269 -54
4340e4M8R5q5k68J12K35k47K16k1J2J11j08M9k29K93j40JJ04M8k48M07m68M7J19
$$ -54 -6 89 4 -264 -152 83 -164 52 31 43 154 46 95 -134 159 19 20 124 172 -76 331 -137 -90 29
4364B9LN5j13Jj14P3J96J1m26K42R4K03l18N6r0K33J08k58j15j0J36J62q3O7l37
$$ 29 32 87 -26 -25 -139 -66 130 141 -285 -43 51 254 -64 -8 -98 135 243 -15 -130 -140 -4 158 75 142 -195
4389a95K59o9k1k7%k92K83R4J01L2k13K56j81j3j03P8J46k20J75K63l42j21J97
$$ -195 64 -5 -26 -53 -53 -345 -62 32 133 165 -48 208 27 14 -89 -11 135 -85 90 353 11 -110 87
4412H7l45K05j02L14k52J21l6J08j99J5J45k12K90o2nj64j06J31k3l9K18j34j7
$$ 87 -258 -53 -155 159 -93 28 -8 100 -99 -84 61 -151 139 77 72 -92 -198 -67 -90 -129 89 -45 -62
4435f2Q1j57Q8M5j35Q6J4J32o6J37k50J81j42Q6J6j63RJ05R4k6k8q4L00J1j28
$$ -62 19 -138 -50 -5 -140 -54 -40 92 26 163 -87 94 -48 38 54 -109 -100 5 99 73 45 -39 261 272 144
4460A44j14q6k1K14j51k79J30J32P7n3J63j82J14l2j5m8R6j18lJ72j65K02j49
$$ 144 30 -56 -77 137 -14 -293 -163 -31 46 -7 156 -26 88 56 41 -7 89 -29 -32 140 -25 177 28
4483B8m8J99j61o5J19j69k5L82l2k35J70k52O1m1J8K7J28j53Q4l2p9J17j86J66
$$ 28 -20 179 18 -47 72 -97 -122 260 228 -7 163 -89 -28 -69 -51 -24 104 -49 35 3 -76 41 -145 21
4507B1k7J67k2k33J00P8o6N8k07N6J71j84K76j22Q0k8j29K1J69k68J34k2OJ45
$$ 21 -6 161 139 -94 6 84 18 76 -131 -75 96 -88 188 66 146 118 -11 10 179 -89 45 23 29 174
4531A74k98L11j05L2j14P7j61M8j5P2j47P5K03k3j58j27L18l42J81J35j42J76
$$ 174 -124 187 82 114 0 77 -84 -36 -51 21 -126 -51 152 129 -29 -156 162 -180 1 136 -6 170
4553A70j20q1K32l50M16m09L63j21J7kk07O0Q3k59L69j03o7j88J30K9K73j09J5
$$ 170 50 -31 201 -149 267 -142 221 100 117 115 -92 -32 51 -208 161 58 -9 -197 -67 -38 235 126 141
4576A41O9q4k17o1K84l28M44l66J07K6j00J95l26M87j86n8Oj20M20m16K59m30
$$ 141 210 126 -91 -152 132 -196 248 -118 -11 15 -85 110 -216 271 85 27 33 -87 333 -83 176 -254
4598b54L62p4j41J20j90J19M4M2j60Q3J55l33K65J44k14r8K95j45M4o7j74L11
$$ -254 108 34 -107 13 -177 -58 -14 28 -132 -49 106 -227 38 182 -32 -130 165 20 64 -3 -177 134
4620A34j54q4J52m5j17n9K8M02j78j11m5k8J45j78N6M3%J91k46J48j35J90j42
$$ 134 -20 -104 48 3 -114 -173 -145 257 79 -32 -77 -105 40 -138 -82 -39 -39 152 -94 54 -81 109 -33
4643c3K07j76Q0K66k91j79K71o7k08o5L13j8M8j51n8J20j92J65J43j82k04K85
$$ -33 174 -2 78 344 53 -126 145 78 -130 -195 118 100 148 -3 -61 59 -133 32 175 -7 -211 74
4665G4j60K06k68Q9J31K67l66LN3j37J7R2P7j36J78p4J49m52J49J22mn9O5J88
$$ 74 -86 120 -148 -59 72 339 -27 -24 29 -108 -91 1 78 -58 120 46 195 -257 -108 14 10 -49 16 204
4689B04m05R6J37N5j89M23m59M26k43j25N5J28q3l0L2K97m36P9KJ22j58J4K09
$$ 204 -201 -105 32 87 -102 321 -138 288 45 -80 -25 103 20 -10 22 319 -117 -38 -36 86 -72 -58 151
4712A51r4p5N8k5r6J96o3J85J9l28l1J71j95K67k21NJ96j49R9K4o8o4j18K76j7
$$ 151 57 -18 40 15 -81 115 52 237 256 -72 -103 68 -127 140 -81 -76 120 -29 70 94 26 -38 -156 120 103
4737A03k99J99l93K60J26O0L7R0j07M8l4J82k08m9M0k80L13RK5J7k48J52K5R6
$$ 103 -196 3 -390 -130 -4 56 93 183 76 124 90 272 64 15 55 -225 88 97 122 139 -109 43 68 164
4761A64r6J12k22J42o6j98J70j08J35j54J71K67l35jL33m12L80p8k07m0M1J0j9
$$ 164 68 180 -42 100 34 -164 6 -102 33 -121 50 317 -18 -19 314 -98 282 204 -3 -43 -2 8 -11
4784a1O2R9k5j33K28q7j74Q0N0J02o2l85K10k9K8P2j92k2L60j55j23K58o0l2j60
$$ -11 51 150 125 -8 220 133 -41 39 89 191 129 -256 -46 -75 -47 25 -167 -189 171 16 -107 151 91 59 -101
4809a01J88k84J33J00j55K0K32j90J95N1k73J11N6k43O5J69K29k19m62N02j70
$$ -101 87 -197 -64 36 -119 -99 133 -57 138 189 -84 27 83 -160 -95 74 303 84 -378 124 -46
4830d6K86l16R2m2J4m5k95M96j06N5k26J92k30K14Kj01K10ql52K71j86J13J01
$$ -46 240 -76 16 -26 -12 -57 -352 144 38 93 -133 59 -171 43 45 -56 154 146 -206 65 -121 -8 93
4853I3k65p7L24r2l4J29n3J06q0k5R7l17K95j23p4L30q7k33J03J94k31q8J74j05
$$ 93 -172 -249 75 -17 -51 78 25 131 51 26 123 -194 101 -22 -96 234 147 -86 17 211 -20 -108 66 -39
4877c9j1L7KO0m2q5Pl4J1O2j3J43Mj49J76p0J45l26q5L76k50K15l05k24N35m9
$$ -39 -50 -13 -11 49 7 -78 -71 -105 -94 -32 -45 98 102 -47 129 59 204 -122 -207 169 -81 134 -171 -395 140 91
4903I1k20K79k80J04Pj26J25K5r3n4J41K26p1j13O3Q7k63p6J48k2J31j01j2J34
$$ 91 -129 150 -130 -26 -19 -145 -20 5 -88 -142 -1 225 154 41 104 191 -72 -148 0 -22 109 8 -4 130
4927A30j32j87M90l38K7K1PL0K6J65k47L9Q4j10L72m30k27K26J0j95M91j78J8
$$ 130 -2 -189 301 -37 -10 11 18 48 74 239 -8 31 115 5 377 -53 -280 -54 -44 -239 252 74 92
4950I2j20K05j35N2r5M4j60J51J00l89M92l30J66k24M58k59%m9m2O1L8k9j4j00
$$ 92 -28 177 42 94 -1 43 -117 34 134 -255 237 -93 73 -151 307 48 48 -1 -43 18 56 27 13 -87
4974h7J83n0k21O1k8J04K75k79k4J7J58Q7m75L27K1k88j3K11j27L33o8J28l12
$$ -87 96 46 -175 -114 -142 -38 237 -42 -66 -49 109 196 -279 48 69 -219 -232 -21 -148 185 117 245 -67
4997f7M5J16p4k36O1P4r7M25j81lqK3Mj45J39L03k57k39J92l1J92l18K3O6M6J04
$$ -67 -22 94 20 -216 -155 -81 -178 247 66 63 55 78 82 -63 76 379 122 -117 75 44 236 -82 -59 7 53 157
5023A57j3r3k3K3j29n8L01k95N1M37k12k58J01Q2j25L56m11K6J87k78K7K25j84
$$ 157 144 51 28 51 -78 -136 165 -130 -79 358 146 -112 -11 71 -54 302 -109 -83 104 -174 -147 78 -106
5046a06J31M6l26L5M86l62J57O7k79M13k27k4L4q4m3k1J21k9j9K14l33K24K0P3
$$ -106 25 71 -255 -220 266 -96 61 128 -151 262 35 11 45 -39 -82 -103 18 -11 -30 184 -149 75 95 168
5070A68n2P5M7l41R6j17J94r4p3K10l3j9n2j78J29j3P9K09rm79L07N8K4l50%L02
$$ 168 116 191 238 -103 -7 -124 70 -24 -97 113 80 61 9 -169 -40 -53 26 235 226 -253 54 112 136 -214 -214 88
5096H8J11K7j86J82j96q8K01l15L55l44K62m6o4K29l23M6lj70o8L17j7K72j91
$$ 88 199 226 40 222 26 -62 139 -176 179 -165 97 51 -13 216 -107 -61 -64 -234 -302 15 -2 270 79
5119G9o6l9k82M37Kk03K18l02m1K48r8P1o0L3n4J12j31L3J42l61J49L17l48J17
$$ 79 13 -26 -308 129 131 -72 146 -156 -197 51 -47 24 -36 -3 -57 55 -76 -43 99 -262 -113 204 -144 -27
5143b7J2M9m6O7k17L48k25Rn6N4J43J4j75k30L69l33J13L62j30l65J83K29o6L15
$$ -27 -15 34 -12 55 -162 186 -39 -30 -86 -32 111 125 -50 -280 89 -244 -131 231 101 -264 -81 148 82 397
5167C97o43J96K38r8p8mj70K65Jk3K8k4j95j06K33o1j34j44L32j37Q0J27K9j57
$$ 397 -246 -50 188 90 12 8 -162 103 104 81 109 85 -110 -216 17 -44 -178 -322 10 -127 -47 80 109 -48
5191d8M3N9J19q6n1Q1o6j45Q4j61J90l5J07K0j91o7K92J3l6k13lJ91l97K77J53
$$ -48 -5 54 173 87 36 117 51 -94 -10 -171 19 -16 91 111 -80 -147 145 158 122 -91 -94 97 -300 -23 130
5216A30j19K8M5J51M0j17r3j34J23j19j33J76O7j11qj0j66L49j6p8K2j49J06j73
$$ 130 11 39 84 235 275 158 65 -69 54 -65 -198 -22 45 -66 -74 -84 -250 99 83 5 27 -122 -16 -189
5240a89L48q8j49J83R7k18k3j73O4K87l05M9L03n2k1k45l3J35q6J38K72j86k75
$$ -189 159 71 -78 105 202 -16 -39 -212 -148 139 -166 -117 186 134 113 -132 -165 -30 -116 22 294 108 -167
5263a67K37m4K04j19j2j57M02l33k2L12k09j89qj8N3Q9l0L03k88J35k38j07L63
$$ -167 70 26 230 111 99 -58 344 11 -11 301 92 -97 -105 -123 -70 19 -11 292 4 139 -99 -206 157
5286A57k52N1O6L6j54n3k2J40K58r2j64M6j7pR5P2k7k68r9K67J49l77L45k64K4
$$ 157 -95 -44 22 58 -96 -149 -171 -31 227 135 -29 17 0 -7 88 160 133 -135 -234 33 182 -195 150 -114 -90
5311i0J14K34j48j69J89K07n28J87J2J10j19m1j25J90j83J28K6k95N99l47k1n8
$$ -90 24 258 110 -59 130 337 -191 -4 8 118 -1 -42 -167 23 -160 -32 -6 -301 298 -49 -70 -128
5333a28N8N2j7J81K66l34j23r9K39L1l7j63L12l61O9KK70l87L88j6k89O4J04j92
$$ -128 -70 -18 -35 146 412 78 -45 -144 95 126 89 -74 238 -123 -54 -52 218 -169 219 203 -86 -22 82 -110
5357a10M4J39J15l94J91O3K6k05J76k6n2K84l05j1jk9K21l0j58J85k01J69r7J6
$$ -110 -66 73 188 -206 -15 48 74 -131 45 19 -33 251 -54 -65 -66 -95 126 96 -62 123 -78 91 -6 10
5381A0mk2l9K8m1k0L32J6k01q6J31j37K8M9k99K44j71J68J8NM1j20nQ5J73k39
$$ 10 6 -16 -55 -27 -68 -88 244 260 59 -27 104 -33 -5 44 -255 -11 -182 -14 4 9 50 -70 -75 10 183 -56
5407e6R0j4qk6k2k3j09J23j13J57l6n4K92k8j81l08L16rJ5R4l24J64k7r7K94j89
$$ -56 34 20 12 -14 -36 -59 -168 -45 -158 -1 -37 -91 201 173 -8 -316 0 -9 6 100 -224 -60 -87 -184 110 -79
5433g9j7k28J78L90k22j42KK9O9J27k50q0J14j68J86M5K63l43MJ61j81M04j84
$$ -79 -96 -324 -146 244 22 -120 -118 -89 -20 107 -143 -223 -109 -277 -91 -46 217 -126 -122 39 -142 262 78
5456G8J17k6L9M2r5k71Q9J05j93j28K88j2L9o1j14K48j19N2Lj5k9j99J85RnO3
$$ 78 195 169 208 250 155 -116 -27 78 -115 -243 45 33 72 11 -103 145 26 78 81 66 37 -162 23 32 27 90
5482I0j92L31n07K63QL6p3Q2P5o3%k27rM8M77m83J18p1J10k09Q3j08M10r3l55
$$ 90 -102 229 -278 -15 -7 29 -44 38 113 50 50 -177 -186 -138 339 -144 -26 -97 13 -196 -113 -221 189 96 -259
5507b59O5J09J27j08M00j80j95J62k88M46k72J49l53J01J57ML2j25k4r9K82r2
$$ -259 -194 -85 42 -66 334 154 -41 121 -167 279 7 156 -197 -96 61 65 97 -28 -52 -151 131 39
5529C9Kj69N9L8L09k19j48K35k38J2P6J16Q4m71L62j43n7K47j69N2Q2k08K39m30
$$ 39 41 -128 -69 -31 278 59 -89 146 -92 -80 -4 112 196 -275 87 -56 -113 134 -35 17 99 -109 130 -300
5553c00N68l13r9r9O5K03j35L54m11K54o5O6K3m4k3l9P9j08j26K21K3j17kJ62
$$ -300 268 -45 -144 -243 -178 25 -110 244 -167 87 22 88 111 67 44 5 84 -24 -150 71 94 -23 -25 137
5577A37p5K27k86m5K73j87k7j2j5l6j5k9j01K65j51m8K11mj30j0j67L12k69J80
$$ 137 62 289 3 -42 231 44 17 5 -10 -46 -61 -90 -191 74 -77 -125 86 82 -48 -58 -225 87 -182 -2
5601bK23j86j57J36l1j18M6K15k32J30jm8j66K06n6m4K31j64lQ3k8NN2j11J47
$$ -2 221 35 -122 14 -17 -135 -89 126 -106 24 23 -25 -191 15 -41 -85 146 -18 -21 62 34 39 91 -20 127
5626A27k1m5j8M8k11L13q2k55K56j42J02j44J25j06K96l53J14J53k26N0N9M9j08
$$ 127 106 61 43 91 -120 193 111 -144 112 -30 72 -72 53 -53 243 -110 4 157 -69 -19 40 89 -19
5649a9r9q1R0J62j39K67k10N8n0n0O7N6l0j17L9M2nQ6K8J37l72j5O2L9K74l59
$$ -19 -118 -199 -109 53 -86 181 -29 29 -21 -71 -4 52 22 -95 -56 -14 -19 67 95 232 -140 -155 -93 -54 220 -139
5675a39K35P6j09k40J84O3p4M4j43J26q9o8j0K23p6R0M2J17j45r9o2K57k56K58
$$ -139 96 172 63 -177 7 70 -4 40 -103 23 -66 -134 -144 79 3 93 135 252 107 8 -54 203 -53 205
5699B05q8k07q0J72k15K45j33O2n4%J15J62k78Q6J9k18j31M16j83J98J40l79R3
$$ 205 117 -90 -170 2 -213 32 -101 -39 -93 -93 22 184 -94 -8 11 -207 -338 78 -105 93 233 -146 -53
5722e3j41O0p5K06J60o6K0k4k04L18l20n4Q3K05j30q3J77j44l9L14j30j56L6P8
$$ -53 -194 -134 -209 -3 157 91 111 87 -117 201 -119 -173 -90 115 -15 -98 79 -65 -104 210 80 -76 -40 38
5746C8L6J8N6j6j31N4k53K16n3J64j29j8j70L27j95k26K73k09M14m15J56J91l10
$$ 38 74 92 148 132 1 55 -198 18 -35 129 0 -18 -188 139 -56 -282 -9 -218 196 -219 -63 128 -182
5769a82J71K12j98o6J20p2J81N6k06k47M52k43L8j16K44j67m7QN6J98j24L9O6
$$ -182 -11 201 3 -63 57 -15 166 222 16 -231 221 -22 16 -100 144 -23 -70 -62 -6 192 68 107 173
5792A73q3K1j12J12L1k5j87J53j15j22l0J03J84o5J6M7r8J74l51L73k57%J15j08
$$ 173 90 111 -1 111 142 117 -70 83 -32 -154 -184 -81 103 38 54 101 3 177 -174 199 -58 -58 57 -51
5816e1o0J42j59j2N39l50r4J39j83J88ol03L48j89J28k79J15J38R4l57L32j88
$$ -51 -111 31 -128 -140 399 49 -45 94 -89 99 93 -210 138 -51 77 -202 -87 51 145 -212 120 -68
5838f8J97Lj53M5Q1j71J12J73l69R4j03L17j89M8p4J84k2r8lno2J43l74M45k2
$$ -68 129 132 -21 24 105 -66 46 219 -150 -56 -159 158 -31 17 -57 127 105 7 4 -1 -63 80 -294 151 129
5863A29l78N4K54j7Q5k77j30K72M0J52j5j53k26K18L22m58K61j36MQ0K04l90J60
$$ 129 -249 -195 59 42 127 -150 -280 -8 32 184 169 16 -210 8 330 -128 133 -3 1 81 285 -105 55
5886E5n9k63K38k03L03J29j98m1J07oJ87j10j75J52J14l74M39j29l14K73m12K63
$$ 55 -4 -267 -29 -232 71 200 2 -39 68 62 249 139 -36 116 230 -144 295 166 -148 125 -287 -24
5908b4r4K8M7j10L9o1K18K49l41o7j78M28J00k72R7O3k06J57j57J51R9j68R3k06
$$ -24 -118 -90 -43 -153 -114 -175 43 292 -49 -116 -294 134 234 -38 59 122 -84 73 -84 67 166 -2 91 -115
5932a15j01J77J46J28j97j16j41L05k7k45J42r4K24m7l3kj26K05J5j04J4J82j68
$$ -115 -216 -39 107 235 38 -78 -219 86 59 -186 -44 -138 86 39 6 4 -122 83 98 -6 8 190 22
5955B2j82Q0n4L63k25q0j16L4J26j18M20l75J2L03j87j71J27P3K41l85M0rj12
$$ 22 -160 -80 -134 229 4 -76 -192 -158 -32 -150 270 -105 -93 210 23 -148 -21 52 293 -92 -52 -61 -173
5978a73K66k99K28j87N1L01m0o1j26J03j8l5P6m06K19J72k03J72rn8q4J9j09J33
$$ -173 93 -206 22 -165 -114 187 147 86 -40 63 45 10 86 -320 -101 71 -132 40 31 -27 -111 -92 -201 -68
6002f8J30r8Q7J8m9Q4oj6N9k8l66M20k75M83k44k29L17k59P7k20J87k0k3O8Q2
$$ -68 62 -36 51 69 20 104 98 82 141 113 -253 167 -108 375 131 -98 219 -40 37 -183 4 -16 -39 29 111
6027A11j5l97L35j64K86o5k14J75j64j2mL27j48p8j0J47j71J9J39j38j21K72j85
$$ 111 96 -301 34 -130 156 91 -123 52 -112 -124 -128 199 51 -27 -37 110 -61 -42 97 -41 -162 110 -75
6050g5J72j16P3k54M24j08J66j61l17L43j87J1J07J62k06r0j66k04O87l63j72
$$ -75 97 -19 54 -200 224 116 282 121 -196 147 -40 -29 78 240 34 -56 -222 -426 261 -102 -274
6071b74L68l24L77l93M29j57J9m8k8l8K28j59J24j25j20j7J52K1J17j51M5j63
$$ -274 94 -230 147 -246 183 26 45 -3 -31 -69 159 0 124 -1 -121 -138 14 35 152 1 46 -117
6093a17L85j97j31K00k34j31K49L2q6J14l2nN8k08J48j67p6J11J3J22Q3O5l77
$$ -117 268 71 -60 140 -94 -225 24 56 -30 84 52 47 105 -103 45 -122 -198 -87 -74 48 131 196 -181
6116a81K82l7j8l06J30N6L5M3J3p7m6K25k77O8J45j24k39K72J01qJ02j73J69j65
$$ -181 101 64 46 -260 -130 -74 -39 4 17 -60 -106 119 -158 -90 55 -69 -308 -36 65 57 159 -14 155 -10
6140a0j21K33l5k22r1J43K35n4n2P9p9J53Q1N8k70k01K3j03L96l20L37o0j14j32
$$ -10 -131 102 67 -155 -246 -103 132 78 26 105 26 179 260 318 48 -153 -130 -233 163 -157 180 120 6 -126
6164a26K25j42P8J4m1j90J80J7j57M53n45L15Nq0m4O4Oj74K32j33J62pp2K69m02
$$ -126 99 -43 35 49 8 -182 -2 15 -142 311 -234 81 86 6 -38 26 32 -142 90 -43 119 112 40 309 -93
6189i3L3J25r9J25m1J11j45J7J1J3%j9J2j06J91j23j5oj22m3J86J21j57M7m36
$$ -93 -60 65 -34 91 50 161 16 33 44 57 57 38 50 -56 135 12 -3 -9 -131 -174 12 133 -24 23 -413
6214d13K71K33j05J61n9r7J26j7l89L70K6p9ol1R6k04K72k56o0R7j23L54l1j63
$$ -413 -142 91 -14 147 88 -9 117 100 -289 81 107 28 22 -9 87 -117 155 -101 -161 -64 -187 167 136 -27
6238b7m8K73l61Q4L7J59O7J7j76j35N0K31l82K59Q4ol15L37r0j24K30l05K26j30
$$ -27 -75 198 -163 -79 -42 117 184 201 25 -110 -60 171 -211 48 132 126 -189 148 58 -66 164 -141 85 -45
6262d5RRl8J30p1r0p2K65p5J90l11J11j3Rl9j01K46j76J89j2N9r8p4j61J73K3
$$ -45 -36 -27 -65 65 -6 -96 -168 97 22 212 -99 12 -1 8 -31 -132 114 -62 127 115 174 76 2 -159 14 37
6288C7j45M4K0J41k44J51J32j0j45J5O3M5N9j72p5K7K79j90K58k34Q9j73K42j92
$$ 37 -108 -64 -44 97 -147 4 136 126 -19 -4 59 104 163 -9 -84 -57 222 32 290 56 145 -28 214 22
6312B2J0k02K99J10k29Pj71L05L5j31o5Q8k47K80p0l12m2L24l68L68R6R0k76N7
$$ 22 32 -170 129 239 10 17 -154 151 186 55 -10 78 -169 111 41 -271 -313 11 -357 11 107 197 -79 -22
6336b2P0J17j15R1pl3O4%j33K99l54p4r2K53J41p3n3j66J49q9j27n6LJ21J2L42
$$ -22 48 165 50 141 134 101 165 165 32 331 -23 -97 -189 64 205 132 79 -87 62 -27 -154 -210 -207 -86 -74 268
6362B68n53L47J02k83J21J49j63J86j34r4Q9j07M5R6k40j12L96k31r7K63n6j24
$$ 268 -285 62 164 -119 2 151 -12 174 40 -54 35 -72 -27 69 -171 -283 113 -118 -215 48 -8 -132
6384a32J58Q1J91j30j60m6L72l70n1j33L97k32j10J41J19k84k9N5J99LM9j75J47
$$ -132 26 107 298 168 8 -38 334 -36 -87 -220 177 -55 -165 -24 95 -189 -218 -163 36 39 88 -87 60
6407F0m8n5r5J65L71n25J83k4L08m38J6J22J13Qn11M78k50JJ2M16k51l41k9N50
$$ 60 12 -43 -138 27 398 -127 56 32 340 -98 -82 40 153 161 -350 128 -122 -121 -109 307 56 -285 -314 236
6431B36j57j17Q4l2P5L2l73J33K32M2J4l60M33j56K9o4k33K02M2qJ3l03J34K37
$$ 236 79 -38 46 14 89 121 -252 -119 113 155 169 -191 242 86 115 51 -182 20 62 54 67 -236 -102 135
6455A35J1Ql10J19OK6K8j43O0M18j79j42l0M1l12M4J73l69L99j92J77K84k29n1
$$ 135 146 154 -156 -37 -31 -5 23 -120 -60 358 179 37 7 48 -264 -220 -47 -416 -17 -209 -32 252 23 -28
6479b8k14N47l65J04j05k3J72k94K61j59J96k49K66P8k93rK01k31P8M3m4J45j1
$$ -28 -242 305 -60 44 -61 -84 88 -206 55 -104 92 -157 109 187 -106 -115 86 -145 -67 -24 -68 77 66
6502F6j59J60M1j41L43m65K09P4N7k43L8K8O2m2k97pO07k45J6O0n0m9j71L55l76
$$ 66 -93 67 108 -33 310 -155 54 128 185 -58 -20 8 70 28 -269 -276 331 86 102 162 112 63 -108 247 -129
6527a29R7p8mp3J30k5P3K1J9j16J30J36k73K11j37j26N4R3J7k07L30k78K78r4
$$ -129 -32 -110 -114 -187 -57 -82 -9 12 31 -85 45 181 -92 119 -18 -144 -90 3 20 -187 143 -135 143 49
6551D9j96O1j26M68j38j18j03P0J63L1k75J12n2J26k05J71J03k5k21P5J07k20
$$ 49 -147 -86 -212 256 118 0 -103 -33 130 161 -114 -2 -54 72 -133 38 141 116 -105 -30 77 -143
6573a43J62p0N6K53k07n8mpM2r2qJ24j28J86j49m7J37M1j62J54j66K07j44j8J22
$$ -143 19 -51 5 258 51 -7 -11 -18 24 -68 -76 48 -80 106 -43 -90 47 88 -74 80 -86 121 -23 -41 81
6598H1j53l9K39j14Pl4J07k59J23k64L83q0k40K41J85j86o2J94q2J12k23P6J19
$$ 81 -72 -111 128 14 21 -13 94 -165 -42 -306 77 -3 -243 -2 183 -3 -65 129 47 159 -64 12 131
6621A31k76K15j69J10N9j39m3ln8J18L19j26M6j85P8J04K3r5j25m5P4M4r8j54
$$ 131 -145 70 -99 11 70 -69 -112 -115 -173 -55 264 138 184 -1 77 181 204 109 -16 -61 13 57 -41 -195
6645a95K90J84m81J50L6J72j91j52K22j18K2K27j5j37k86K14K24j00j87J76j21
$$ -195 95 279 -202 -52 -16 156 -35 -187 35 -83 -61 166 151 14 -272 -58 166 66 -121 55 -66
6666f6J75k36J55j2J26k46L52n24M16l79M61j27k60J57k19L79j84L40o21L05L68
$$ -66 109 -127 28 16 142 -104 248 -276 140 -239 222 95 -165 -8 -227 152 -32 308 -313 -8 360
6687C60l41j72K24k6L8j65O3NJ88k33J64p9jj4j21K00Q7l47K75K3j62L4J00k8
$$ 360 19 -153 71 45 83 -82 -19 -14 174 -59 105 26 25 11 -110 90 177 -170 105 128 -34 0 100 72
6711G2pJ09o2L4m3j57R4j79j6j09L0L67R4j19P9l06j36J70K02j03Q9J93l62R2
$$ 72 65 174 112 146 103 -54 40 -139 -155 -264 -234 133 227 108 187 -119 -255 -85 117 14 103 296 -66 26
6735B6M4q1J79l16K57k45J70j9k42L48k26j1nN16n03M4l0P9j8J43q9M7n7R1k17
$$ 26 70 -11 168 -148 109 -136 34 15 -227 121 -105 -116 -121 395 -108 -64 -94 -15 -33 110 21 68 11 102 -115
6760a15Q4J31l05J88k56J94MJ73m4k16M35m34O3M18k86j50nk0j0L20r1j07J02
$$ -115 -31 100 -205 -17 -273 -79 -75 98 54 -162 273 -161 -98 320 34 -116 -121 -141 -151 169 78 -29 73
6783G3j56L05k12nk75L40J51k66j41k3R5KJ10q1J87o8j79K08m6K87k34j01J15
$$ 73 -83 222 10 5 -270 70 221 -45 -186 -209 -114 -112 -2 -83 104 36 -143 65 19 306 72 -29 86
6806H6J89j02k28J22m9j05j6J14M9P8k17P7r0J59l35J7L28k12M0r6K85m0j45P0
$$ 86 275 173 -55 67 18 -87 -103 11 60 138 -79 -2 -92 67 -268 -251 77 -135 -95 -191 94 54 -91 -21
6830b1K39k74J92K2j10K31j56j24J22j66J27j51J66J66l24J15j41m3L36k17j97
$$ -21 218 -56 136 158 48 279 123 -1 121 -45 82 -69 97 263 -61 54 -87 -130 206 -11 -208
6851b08L06j66O4k42L61M7k54K5R5J17j29l1p5J50L4k58J27NJ15r7q6m9K97ml91
$$ -208 98 -68 -4 -246 115 162 -92 -67 28 145 16 -15 -90 60 94 -164 -37 -32 83 -14 -100 -149 148 144 -247
6876b47J91K66r8j16Jn9n2j61K42%k78R1L87j23j78J06R5k44K29o6j49M03k81
$$ -247 -56 210 112 -4 -3 -62 -114 -275 -33 -33 -311 -220 167 44 -134 -28 67 -177 52 -14 -163 240 -41
6899d1p5R9j27L24j91Q5k67J67MN9o8O0K4J28k7l34L52r6J14m4l20K23m2N7k75
$$ -41 -116 -17 -144 180 -11 74 -193 -26 -22 37 -31 29 53 181 154 -180 172 76 190 146 -174 49 7 64 -211
6924b11J41L40l94J90J5j22n3J3L01k55Q5k05J62k3R7j55j67J10N1K27k61Q5K70
$$ -211 -70 270 -124 66 81 -41 -94 -81 220 -35 50 -155 7 -16 81 -74 -241 -131 -80 147 -114 -29 241
6947B41l43M3j0j25L81M5k32J46j08j45J17j29J28j45J75k9O6l72N43l35j34J08
$$ 241 -102 -59 -69 -194 187 232 0 146 38 -107 10 -119 9 -136 39 10 76 -296 247 -88 -222 -114
6969a14L5J14K4J65k08pOrj23J66j93n5J19j6K07j7r7O0j44j5P8J55J3j85J88
$$ -114 -79 35 59 224 16 9 15 6 -117 49 -144 -199 -80 -96 111 94 -3 57 -87 -102 -24 131 144 -41 147
6994A47j89p2J68M8K1j45L15k33j94J42K8p8J22p1n7PK7P4k35K00j73J52n2Jl15
$$ 147 -42 -114 54 102 123 -22 293 60 -134 8 36 -42 80 9 -48 -41 -14 60 -175 25 -148 4 -48 -47 -362
7019c62L84J08k98L09k78n5J20k19K81J00j91q8L94j37k40L47k76J13J4r4J08
$$ -362 22 130 -168 141 -137 -192 -72 -291 -10 90 -101 -189 205 68 -172 175 -101 12 26 -68 40
7040D0r1Q0J56k80O6j08J14PL26k10m25J82J23J14k95L5K98mjJ73m34Qr8J06L4
$$ 40 -51 29 185 -95 -29 -137 -23 -16 310 100 -325 -143 -20 94 -201 -166 132 128 127 300 -134 -126 -224 -118 -84
7065h4J40J21q3M0Rl83J72L3j61K84J88j09l39J57Q8J74k61K74l63L77l31M6r9
$$ -84 56 177 94 134 143 -240 -68 -35 -196 88 276 167 -172 -15 73 247 -14 260 -103 274 -57 -11 -110
7088a10j4O6k27L78J64l77J35KK7N6l7Q2l55K59J99k06j4Mn3J65K26n13J61J67
$$ -110 -124 -58 -285 93 257 -120 15 17 44 100 63 145 -210 49 248 42 28 32 -21 144 370 -143 18 185
7112A85k15L2k25J27J09p9p7K96j23j76L14k62n9J93J9m0J61m84J07LK74J58m69
$$ 185 -30 2 -223 -96 13 -66 -143 153 30 -146 168 -94 -153 40 59 19 180 -304 -197 -194 80 238 -231
7135b31K68m9L31m72N3J89J85m10J28m5K21k82K18m6pJ17l51O5K1j27J33J5K87
$$ -231 37 -12 319 -153 -100 89 274 -136 -8 -53 168 -114 104 58 51 168 -183 -118 -97 -224 -91 -76 211
7158B11m15L08j49L57k10j03J54O0m04J81K47k63j47J15J50m2j58j53J52J37q
$$ 211 -204 104 -45 312 102 -1 153 213 -191 -10 237 -26 -173 -58 92 50 -108 -261 -109 28 20
7179B0l7j31K37R3r9m0J06k86J07m5L00j41j35K25k91L06l73q8L62j31J7mJ44
$$ 20 -17 -148 89 182 83 43 149 -137 -30 -75 225 84 -51 174 -117 189 -184 -272 90 -41 -24 -28 116
7202A16k03q8m1K31Ql0L0q1K95l24k0L07K0k92M0J86j71p6J23l25K34R0pQ8L4
$$ 116 -87 -175 -216 15 23 -7 23 -58 237 -87 -107 200 220 -72 -32 154 -17 -93 30 -295 -61 29 22 110 144
7227A44K8k23L0Lj0J57j47K55m54M56l06J08P2j41J19l8p3P2k6K4j55j7K56j15
$$ 144 172 -51 -21 -18 -28 129 -18 237 -217 239 -67 41 113 -28 91 53 -20 52 26 50 -105 -122 134 19
7251A9Rr2M1k31L28j56LJ15r5J88l65L80k59n7J88Q1M8k27J51k1k31K45p1r2J34
$$ 19 28 -64 -23 -254 74 -82 -79 36 -59 129 -236 144 -115 -172 16 97 145 -82 69 48 -183 62 -9 -101 33
7276C3J25j25n7L9R2L0k13J39M6R5k3k67L33n29K6K03nlK22k12j10J15O4rj10
$$ 33 158 33 -24 15 107 137 -76 63 109 204 181 -86 247 -282 -256 -53 -58 -61 161 -51 -161 -46 18 9 -101
7301a01L40k31k44M74k88J38o5J34l01J94j80K80n3K30l89P4K6k2j13L7J43R4
$$ -101 239 8 -236 238 -50 88 23 157 -144 50 -130 150 97 327 -62 12 38 16 -97 -60 83 177
7323A77l13K9o1L52j49P9j13O3j07J05k6K2j37mj5M8M5j71K88jlk63J62L23k86
$$ 177 -136 -107 -168 184 35 114 1 64 -43 62 36 58 -79 -83 -98 -50 -5 -176 112 111 108 -155 7 330 44
7348D4J9M3L0j55r0J59j02J03l4k12K42J53j67L8k28K60p3J08k4j33j9j17J76
$$ 44 63 106 136 -19 -109 50 -52 51 17 -195 47 200 33 71 -157 103 30 138 114 -19 -38 -155 21
7371B1M1j44J14P8l59J69J48J41l21O2j1j14J54M9r5k7J99j36J79q7j73m5m2K05
$$ 21 62 -82 32 110 -249 -80 68 209 -112 -50 -61 -175 -21 28 -67 -94 105 -31 148 61 -112 -157 -199 6
7395FK09l88%K29J70l65j21o8r2M93o4p5J70k09J83o6j95K22m0k3Q0k89K64Q4
$$ 6 215 -173 -173 56 226 -139 -260 -328 -420 73 9 -66 104 -105 78 12 -183 39 -1 -24 56 -233 31 115
7419A15j12n7J35m6k7n4j7J62j67J84K1j89Nn4j30k0L31j02J42j72K17l73J41
$$ 115 3 -54 81 35 8 -46 -63 99 -68 116 137 -52 -47 -101 -231 -251 80 -22 120 -52 165 -208 -67
7442f7Q0l02L63k63K71j01J33j80O2K2J8j21J28q7q9K81l28P8n2Q3K71k19j6q1
$$ -67 13 -289 74 -189 82 -19 114 -66 -4 18 36 -85 43 -44 -133 148 -180 -102 -154 -71 200 -19 -35 -116
7466a16p3J76J86p9O4q3k90K75j84M0n8M12k02p4j42m1J69q3M4j66J20K05o7R5
$$ -116 -189 -13 173 94 158 75 -215 60 -124 -84 -142 270 68 -6 -148 -189 -20 -103 -59 -225 -105 100 33 128
7490A28j38m8N0r6k31L57j99K29R1J4j66J39j11R5p3k12M8K83m11Q1K9M14j32
$$ 128 -10 -58 -8 -104 -335 22 -177 52 143 157 -9 130 19 114 41 -171 -123 160 -251 -170 -141 273 141
7513A41j45Q1m48K02R3l9K50m13J15K34j55Q5Q7j35P8r4j09L74k02k01K30k27
$$ 141 -4 77 -371 -169 -76 -115 135 -278 -163 71 -84 1 88 -47 31 -63 -172 202 0 -201 29 -198
7535a98J9M97l74M3J72l42M05k53N5N5M7j07K33k04n9o4M8K33k99K08j06J13j6
$$ -198 -179 318 -56 -13 159 -183 222 -31 24 79 126 19 252 48 -11 -75 -27 206 -93 115 9 122 106
7558A06J07k71M02l92J38%R8k24j36K19J2k94J50J34J32j93J77l51K44m5m8k9
$$ 106 213 -58 344 -48 90 90 188 -36 -172 47 59 -235 -85 49 181 -12 165 -186 58 13 -35 -64
7580f4Q5K17o00L86J8o9L03l52o1K23m2k69K94k6J32l71K22k17K0L83l04J05j98
$$ -64 21 238 -362 24 42 -27 276 -76 -137 86 44 -225 69 43 175 -196 26 -191 -171 212 -92 13 -185
7603a85K28J27l79K37m0J38o1L99m82q4K58kM1k49L4j17P0l52J83K10j08l5M22
$$ -185 43 170 -209 28 -12 126 65 464 -18 -102 156 154 195 -54 -20 -137 -67 -419 -236 -26 -134 -169 253
7626B53%k75J5l3N6K20m47K24J48J30j74J25m38J48j43J84O1n5q3j41J18Q8L1
$$ 253 253 -22 -7 -40 16 236 -211 13 161 291 117 242 -196 -48 -191 -7 54 -1 -84 -225 -107 -19 12
7649A2k17M02k92K97m8lm3K6l38N9Q0n4J59k7J95j85k63K81N1n5k39J33L82r6
$$ 12 -205 197 -95 202 154 151 108 134 -204 -145 -65 -119 40 13 208 23 -240 41 92 37 -202 -69 313 217
7673B17l49K22j95Q2K20J58l98J66k23m2J10K6k84J57K74J07m19M5L4O1N0K2j52
$$ 217 -132 90 -105 -23 197 355 -43 123 -100 -142 -32 -6 -290 -133 141 248 -171 -126 -92 -31 19 41 -111
7696a11J66j69J30Q8k0o6j97K46j80J0j72K10O0nj05K27j28J43k76L09k0r4k56
$$ -111 55 -114 16 104 84 18 -179 67 -113 -103 -275 -65 -5 -10 -115 112 -16 127 -149 160 140 46 -210
7719b10K94kJ2l20K22Nk23J00K5K45p7Qj87J44L13j64k66P2K33q7j07j01l3k00
$$ -210 84 82 94 -226 -4 1 -222 -122 -97 148 71 79 -108 36 349 185 -81 -9 224 137 30 -71 -104 -304
7743c04K60j1K53P5l60Q7k4J18m4j09j80J80R2J6j74K59j58O0nj20q8l8L14j8
$$ -304 -44 -55 198 273 -87 0 -24 94 50 -59 -239 -59 33 49 -125 134 -24 36 31 -89 -177 -215 99 81
7767H1j52J88j61l05M73r7K6j04o9j49L97J7l07k0K50j33J94k59J9J97m5l8r4
$$ 81 -71 117 -44 -349 124 27 53 -51 -120 -269 128 145 -162 -182 68 -65 129 -130 -111 86 41 3 -91
7790i1J54J9K07j86q5N2K53l56L91l50l38K91J03j97J19J13j50J71m1M0k23K02
$$ -91 63 82 289 103 18 70 323 -33 358 8 -330 -39 64 -133 -14 99 -51 120 79 119 -104 98
7812I8J19l15K6J86q4J81k48M1J41l76M21l9l77L22j84K45Nmk16K93j16%j36n5
$$ 98 217 -98 -72 114 30 211 -37 4 145 -231 190 151 -226 96 -88 157 162 158 -58 235 119 119 -17 -72
7836g2J25Q6q6opJ43k58j2J29j20j73J34K34k59J22j42M8K27P9k34Q2j36pK25
$$ -72 53 139 53 47 40 183 -75 -87 42 -78 -251 -117 117 -142 -20 -162 -114 113 192 -42 40 -96 -103 122
7860A22Jn7m9k51K19n2J79L9q6l1J39l14J58j94J96n8n9Q5kj48K44P2j10p3J45
$$ 122 123 66 17 -234 -15 -67 112 151 65 34 173 -141 17 -177 19 -39 -98 -13 -15 -163 81 153 43 -30 115
7885A15k65J25j91Q8o8L04k54O7J03O9mj20J46o6j99L27k23J34j41l0K27k95q6
$$ 115 -150 -25 -216 -128 -196 108 -146 -79 24 93 89 -31 115 49 -150 177 -46 88 -53 -83 144 -151 -237
7908b37Q4O3j09J77L1P7k39K52j67kn2J46pk47J26J77Ql08K39J05j61j05l5L37
$$ -237 -153 -90 -199 -22 9 86 -153 99 -68 -70 -122 24 17 -230 -104 73 81 -227 12 117 -44 -149 -184 153
7932A53K2j49Q2l85M20j91p7L71k70n0L9P1J59k90P1o5J98j17J09r2m4N3J9r1
$$ 153 175 26 108 -277 143 -48 -125 246 -24 -74 -35 36 195 -95 -24 -89 109 -8 101 9 -35 18 37 -54
7956e4K97k11P3K5k00P5k24K3J86K9j01J55n0L3j43L96k69K0j86MQ7J19m6j8J14
$$ -54 243 32 105 130 -70 5 -219 -196 -10 19 -82 73 23 56 -87 309 40 60 -126 -122 -35 84 38 20 134
7981A34M1k82K33oj95l1K14J00K6k87L01j10Kj8o2j52J65J86j47p4j46J91R1j70
$$ 134 175 -107 126 120 -75 -106 108 208 234 -53 248 138 140 122 60 -92 73 259 112 38 -108 83 174 4
8005DLj72o4L01Q1j77K2n8J11N5j03J91j15P7j63j96J30K74j99j8N9O0k37L21
$$ 4 7 -165 -229 72 153 -24 -2 -60 51 106 3 194 79 156 -7 -203 -73 201 2 -16 43 103 -134 187
8029A87m6n6k45j36L54J32l6l34J53J31rmk10P1J47K2j23n6J74j56n4R3L04k40
$$ 187 141 85 -160 -296 58 190 154 -180 -27 104 95 91 -119 -48 99 121 -2 -58 116 -40 -94 -1 303 63
8053F3K25q2l02K6K31o1q4l96M03j39P9J62q3K9J84k96p0M8P7K0O3L1j28J34J03
$$ 63 288 206 -96 -70 161 100 16 -380 23 -116 -37 125 42 71 255 -41 -111 -63 14 34 97 128 0 134 237
8078B37j91J5k2m04M51k38n3J21O6J20p9j26P8N2j92K26q1j07J34j23n0lJ05J03
$$ 237 46 61 39 -365 86 -152 -205 -84 -18 102 23 -103 -25 27 -165 61 -20 -127 7 -116 -166 -169 -64 39
8102C9j57Q6o3K44l63M60l99J26j95J56j6n1L9K35m4j9P9m63L41Q8k9O6k27j18
$$ 39 -118 -32 -95 149 -214 246 -153 -27 -222 -66 -82 -133 -94 141 97 78 157 -306 35 123 94 160 -67 -185
8126a85L33K0j60O9l22m9L02j34J98q4rK87m55K00kj73J62j3P1J9k41K27k01j12
$$ -185 148 168 8 77 -245 -294 8 -126 72 -12 -21 266 -189 11 9 -164 -2 -15 56 75 -166 61 -140 -252
8150b52O9K99j43J10j16P3j84J32R4J32l48J43L4k20QK31J41l04k5K43j44j58
$$ -252 -183 116 -27 83 -33 40 -144 -12 82 214 -134 9 43 -177 -169 62 203 -101 -126 117 -27 -185
8172a85J49J26k35J91J6j95j14J60K50j28r3J16j14M8K4m0l0J74q8
$$ -185 -36 90 -145 46 62 -133 -247 -87 163 35 -58 58 -56 -8 16 -24 -54 120 32
8191C2
$$ Imaginary data points
##PAGE= N=2
##DATA TABLE= (X++(I..I)), XYDATA
0@%%%%%%%%%%%%%%%%%pJ5j6J6j6J6j6K4l2L2l9M7n4O2p1P9q7J02j15J26j39J56
$$ 0 0 0 0 0 0 0 0 0 0 0 0 0 0 0 0 0 0 -7 8 -8 8 -8 8 -8 16 -16 16 -23 24 -30 32 -39 40 -47 55 -60 66 -73 83
39H3j76J96k18K42k68K97l27L60l98M39m84N32n86O47p13P89q75R71j080J207
$$ 83 -93 103 -115 127 -141 156 -171 189 -209 230 -254 278 -308 339 -374 415 -460 511 -569 638
59F38j357J539j762K041k403K895l611M738o786J1650m3388k4868J14811j0318
$$ 638 -719 820 -942 1099 -1304 1591 -2020 2718 -4068 7582 -35806 -60674 54137 43819
73D3819o5990L3528K8057o2675J868M7379j6266q808M4732j6987m7783K2054J2885
$$ 43819 -22171 11357 39414 -23261 -21393 25986 9720 912 45644 28657 -19126 2928 15813
86A5813o0307o479O4586J305m0366L5053L6793m6761l3466K9187k999k6244K4581
$$ 15813 -44494 -50973 13613 14918 -25448 9605 46398 -363 -33829 -4642 -7641 -33885 -9304
99i304K4243j2164J2390J5758l0712j1067K9805j1046l1999K4677K8430k9758
$$ -9304 14939 2775 15165 30923 211 -10856 18949 7903 -24096 581 29011 -747
111g47k1056K5614O127k8603l252K6267O092j3200M579J0047j0110q052J958q242
$$ -747 -21803 3811 9938 -18665 -21917 4350 10442 -2758 1821 11868 1758 -6294 -4336 -12578
125a2578j58K1494j274j8395K0524K1327l1552j7723L3529K322l7866N955L0747
$$ -12578 -12736 8758 7484 -10911 9613 30940 -612 -18335 15194 17516 -20350 -14395 16352
138A6352j6551k1153K0133J0142j5659O581J2939j3867o95J7074j8757k1210K8105
$$ 16352 -199 -21352 -1219 8923 -6736 -155 12784 -1083 -1778 15296 -3461 -24671 3434
151C434J0558l7107Q148M4699j8550l3327L1056J6382l8091j828K8723j4403j4372
$$ 3434 13992 -23115 -14967 29732 11182 -22145 8911 25293 -12798 -14626 14097 -306 -14678
164a4678K2257n110k0119K1895R935l0148R178L6610k1752k9567L0708J2538m1448
$$ -14678 7579 2469 -17650 4245 14180 -15968 -6790 29820 8068 -21499 9209 21747 -19701
177a9701l834L4989p787k1434K1962J3208j8892L077J0209j9307l421K0602j2591
$$ -19701 -23535 11454 3667 -17767 4195 17403 -1489 1588 11797 -7510 -10931 9671 -2920
190b920j9067K6650J3887l1333r34L3016q936k6755J7530J7626j9059r510J3756
$$ -2920 -21987 4663 18550 -12783 -13717 19299 10363 -16392 1138 18764 -295 -9805 3951
203C951k647j0639O079K373n619J0089Q927j3805l359J7695n466k4872P939K0711
$$ 3951 1304 -9335 -3256 -883 -6502 3587 12514 -1291 -4650 13045 7579 -17293 -9354 11357
217A1357j4814j5082K1736J2265j8107l300J6679l100j1708N260J492q407M809
$$ 11357 -3457 -18539 3197 15462 -2645 -5945 10734 7634 -4074 1186 2678 -5729 -920
230i20L587j3094K750J8983q409j6801J9342J5134k5139r486K4538k166k5725
$$ -920 2667 -10427 -7677 11306 2897 -13904 5438 20572 -4567 -14053 10485 8319 -17406
243a7406Q599J8675j2289n870J5544k160q102J1462j038j7168J0368J2854k2490
$$ -17406 -8807 9868 -2421 -8291 7253 5093 -3009 8453 7415 -9753 615 13469 -9021
256i021q467K7386j376k7259J2984K4984j6976j3663K0333K502j9186L203Q319
$$ -9021 -17488 9898 8522 -18737 -5753 19231 2255 -11408 8925 11427 -7759 -4556 3763
269C763j2048J943J2476r750n155K0668l86k2716R903J9942j9655j6379K1619
$$ 3763 -8285 -6342 6134 -3616 -8771 11897 11511 -11205 -1302 18640 -1015 -17394 4225
282D225O439k2512J742J8167o164q492J0250K029p491O432J191j3581L126J2717
$$ 4225 10664 -11848 -10106 8061 1897 -6595 3655 5684 -1807 4625 5816 -7765 -4639 8078
296H078j2868j1193J9035R191j9518K93K1717m827j8522O642J0904j1565o267
$$ 8078 -4790 -15983 3052 12243 -7275 -6982 14735 9908 -8614 -1972 8932 -2633 -8900
309h900Q657r1l837O166L14o453Q224O636j3831m330J6320k608k0349O645J7596
$$ -8900 -243 -334 -4171 1995 2309 -4144 4080 10716 -3115 -7445 8875 6267 -14082 -7437 10159
324A0159j1212j2544J6644Q312j3603j99J0458n738n682N824m462o690J0555K722
$$ 10159 -1053 -13597 3047 11359 -2244 -2443 8015 2277 -3405 2419 -2043 -8733 1822 4544
338D544j4706O349J8396j1633j4616J7380R095k1789l876J8268n281j3995Q808
$$ 4544 -10162 -3813 14583 2950 -11666 5714 14809 -6980 -10856 7412 2131 -11864 -3056
351c056P965q485L408P389q178l32J1829r317j3052J4072P475k0388j163K1850
$$ -3056 4909 -3576 -168 7221 -957 -1289 10540 1223 -11829 2243 9718 -10670 -11833 10017
365A0017m220j6921J1165J2866j2462n636R841k300p522M845l15o898P307O302
$$ 10017 5797 -11124 41 12907 445 -5191 4650 2350 -5172 -327 -642 -7540 -233 6069
379F069j1494O68J6176m245j6036Q248J2118j3804r610J2985L972j1304J459R640
$$ 6069 -5425 -4757 11419 7174 -8862 -614 11504 -2300 -11910 1075 5047 -6257 -4798 4842
393D842k036k825L677k129k866N470k223j0276M838J0033r316q297J4409P050
$$ 4842 2806 -19 3658 1529 -1337 4133 1910 -8366 -3528 6505 -2811 -11108 3301 10351
407A0351j4180j832J4727k223j3587M091P133o801l249N749j246j082O958j779
$$ 10351 -3829 -5661 9066 6843 -6744 -2653 4480 -2321 -5570 179 -1067 -2149 4809 3030
421C030p410Q141O282j4381m190J5769l030j6649P387J4063r642p456J2430K976
$$ 3030 -4380 3761 10043 -4338 -8528 7241 4211 -12438 -5051 9012 -630 -8086 4344 7320
435G320r216K043M114o838K07N759q025l674J3630k91j4265Q108J4456j2311j0550
$$ 7320 -1896 147 4261 -2577 -2370 3389 -4636 -8310 5320 5029 -9236 -1128 13328 1017 -9533
450i533J4960L394j5935P79J1271n698n162P261l65l596P215N22r946M848R098
$$ -9533 5427 8821 -7114 -6335 4936 -762 -5924 1337 972 -2624 4591 5113 -4833 15 9113
465I113j1846p966J3740L139j5173K514J4703m259r675P674N154p245j723L160
$$ 9113 -2733 -10699 3041 6180 -8993 -6479 8224 3965 -5710 1964 7118 -127 -1850 1310
479A310l563l14M080m331l026R563K461j0601J660J1587m709j1485O042P680q442
$$ 1310 -2253 -2567 1513 -2818 -5844 3719 6180 -4421 -2761 8826 4117 -7368 -1326 6354 -2088
494b088o214Q293L112n564P16M593q50j7J075l991j264N316k078q591M676R704
$$ -2088 -8302 -9 3103 -2461 -1745 2848 1998 1981 3056 -935 -2199 3117 1039 -7552 -2876 6828
510F828p392p364J1545N701j1807j911J0328k592r020L339L710m335J286L233
$$ 6828 -564 -7928 3617 9318 -2489 -4400 5928 3336 -5684 -2345 1365 -2970 -1684 1549
524A549l857J464P611n201p366R434M330j3980k044J4256l097j2456P389R479
$$ 1549 -2308 -844 6767 1566 -5800 3634 7964 -6016 -8060 6196 3099 -9357 -1968 7511
538G511q121l101Q089j214m776M078j606o152N487L821j0301L36J3102l584j1356
$$ 7511 -610 -3711 4378 3164 -1612 2466 860 -5292 195 4016 -6285 -5949 7153 3569 -7787
553g787Q695R588j1777n332J0305k05q862K469M517l430P34M077m194M71O913
$$ -7787 908 10496 -1281 -6613 3692 3487 -5375 -2906 1611 -1819 -1085 2992 -1202 -731 6182
568F182m028q241O759N993j0587m532J1581J257j0028K305Q841k791n173L490
$$ 6182 2154 -6087 672 6665 -3922 -8454 3127 4384 -5644 -3339 5502 2711 -2462 1028
582A028J517k948P8n59k427K897L008n083j470Q590R65q790R17Q720l620r138
$$ 1028 2545 -403 -325 -884 -3311 -414 2594 -2489 -3959 4631 5596 -3194 -2277 6443 2823 -6315
598f315L865O367n183l977N376K648l086L94J547j282J454Q44n324p19O761k500
$$ -6315 -2450 3917 -1266 -5243 133 2781 -305 89 1636 354 1808 2652 -2672 -3391 3370 870
614H70q060N316Q835o896n820R052L792r160j236O707k524m408K630N35k317M097
$$ 870 -7190 -1874 6961 65 -5755 3297 7089 -2071 -3307 3400 876 -3532 -902 -367 -2684 1413
630A413P52n483L328P194p213o271R607K236j2185M77J1247l683p584O232M801
$$ 1413 2165 -3318 10 7204 -9 -6280 3327 5563 -6622 -6145 5102 1419 -6165 67 4868
645D868n129J2K921k907k75L554n079l459P537J531r026K504J0282m782q196O816
$$ 4868 -261 -249 2672 -235 -510 3044 -2035 -5494 2043 3574 -5452 -2948 7334 2552 -5644 1172
661A172N294p766l407O074j49m180K009R72j358L186Q24m999K080N927n012o184
$$ 1172 6466 -1300 -4707 1367 1218 -2962 -953 19 -1339 1847 2671 -2328 -248 5679 667 -5517
677e517N871M398p901k808Q194J294o297Q48N338j268l274Q05N26q16O85j057
$$ -5517 354 4752 -3149 -5957 2237 3531 -2766 -1918 3420 2152 -1122 -317 209 -607 78 -979
693i79k325L297L449m851k082P299J142q016L07P213k750o644K981M928l419k209
$$ -979 -3304 -7 3442 -1409 -3491 3808 4950 -3066 -2759 4454 1704 -4940 -1959 2969 -450 -2659
709b659L569O94j149R94j292j796L265N80o040K62P304k660o985N410O702o013
$$ -2659 910 1604 455 1449 157 -1639 1626 2206 -3834 -3572 3732 1072 -5913 -503 6199 186
725A86m513P136J524o537K37L285k407l10K068k434K38N338k227n728N417N008
$$ 186 -4327 2809 4333 -2204 -1967 1318 -1089 -1399 669 -1765 -1527 3811 1584 -4144 1273 6281
741F281q116l597Q290N73q383J629O816k506l620L480J123j961P35P7l308K715
$$ 6281 -1835 -5432 2858 3431 -4952 -3323 3493 987 -2633 847 1970 9 744 821 -2487 228
757B28K377n254j794P592K26p646K743P461m228n692M704K778m826j301K479L5
$$ 228 2605 -2649 -4443 3149 3375 -4271 -1528 5933 1705 -3987 717 3495 -1331 -2632 -153 -118
773a18o78J070j080l0L673r48m380K186M338l987m867M941L779n776k024N742
$$ -118 -796 274 -806 -836 2837 1889 -2491 -305 4033 46 -4821 120 3899 -1877 -3901 1841
789A841J585m842J24L472q38j624k68n50K11K070j891k393L639L455n168j864
$$ 1841 3426 -1416 -1292 2180 1342 -282 -550 -1100 -889 1181 -710 -3103 536 3991 -1177 -3041
805c041O354N06o905K63N986j984n150L041L069k354n34J776q18O94J584l475
$$ -3041 3313 3819 -3086 -2823 3163 1179 -3971 -930 2139 -215 -749 1027 209 903 2487 -988
821i88j770M855J44o613J650P013l617n426N488M018n442k068M282j33k984P83
$$ -988 -2758 2097 2241 -4372 -2722 4291 674 -4752 736 4754 -688 -2756 1526 1393 -1591 -808
837h08O68j061J885L83l625J886N117m018m216N191K678n895k015N857K4m962
$$ -808 -140 -1201 684 1067 -2558 -672 4445 427 -3789 1402 4080 -1815 -3830 2027 2051 -2911
853b911J372L827j559j512J263j66j73J529k470k200L783J569m922m74O027l36
$$ -2911 -1539 2288 729 -783 480 314 141 1670 -800 -3000 783 2352 -2570 -3044 2983 2647
869B647n758J916N147k617m259K872J852k250j122J446LO47N31j974K23L240q82
$$ 2647 -3111 -1195 3952 1335 -2924 -52 1800 -450 -1572 -126 -123 524 1055 -919 -696 2544 1662
886A662m515J864M357l472m238M150L459m084k119M317Q81k765l0J620r46j16
$$ 1662 -2853 -989 3368 -104 -4342 -192 3267 -817 -2936 1381 2262 -503 -533 1087 141 25
902B5j60j748J301K819k327l225M639K639n131j865N815K7n782Q07M399j906k620
$$ 25 -135 -1883 -582 2237 -90 -3315 1324 3963 -1168 -3033 2782 2809 -2973 -2166 2233 327 -2293
919b293K188O18n80J062q20j620K584J243m534m82N158q08n612K616N077l522
$$ -2293 -105 513 -67 995 175 -1445 1139 2382 -2152 -2634 2524 1716 -3896 -1280 3797 275
935B75l211L789J920l036q30J820q61l07O79j591J81L042j010l681K799L634l780
$$ 275 -2936 853 2773 -263 -1093 727 -134 -441 238 -1353 -1172 1870 860 -2821 -22 3612 -168
952a68l342M383K354m891j102M321k16k580L71J699j06j37n36j089J192J636l000
$$ -168 -3510 873 3227 -1664 -2766 1555 1339 -1241 -870 829 723 586 50 -1039 153 1789 -1211
969a211j480L489J657m509k44M701k33m507R18L772j532k778J493J426j188k37
$$ -1211 -2691 798 2455 -2054 -2298 2403 2170 -2337 -1419 2353 821 -1957 -464 962 -226 -463
985d63K80j94J294O26k868J75L643r85m481J744M093k814l535L666K830l767j220
$$ -463 -183 -377 917 1543 -1325 -1150 2493 1508 -2973 -1229 2864 50 -3485 181 3011 -756 -1976
1002a976K902K21j350j06j26j90J548n65k566J915L466k951l216M439J839n192
$$ -1976 926 1147 -203 -309 -435 -625 923 358 -2208 -293 3173 222 -2994 1445 3284 -1908
1018a908m70M519m35l967J324K482j695n06Q86m55Q36R61k306j439L708N34m564
$$ -1908 -2378 2141 1706 -2261 -937 1545 -150 -656 230 -225 611 1572 -734 -2173 1535 2069 -2495
1035b495J60M878j325m469K498L543k415k300K448Q28j436k66j05J03J221j10
$$ -2495 -2335 2543 1218 -3251 -753 2790 375 -1925 523 1351 -85 -351 -456 -353 868 758
1051G58k600J055L337j989l118K585K870l432k098L237J376l103q61K582L68j198
$$ 758 -1842 -787 2550 561 -2557 28 2898 -534 -2632 605 1981 -1122 -1983 599 967 -231
1067b31l61N47Q73o5q21j260J775J320k757j360L253J611m084j48L544p1l338
$$ -231 -592 -45 828 763 -58 -1318 457 1777 -980 -2340 913 2524 -1560 -1708 1836 1765 -1573
1084a573O29K581q43k124Q95R74m21N32j197l68K047M29l020j22L745j002l673
$$ -1573 -944 1637 794 -1330 -435 539 118 650 -547 -915 1132 1561 -1459 -1581 2164 1162 -2511
1101b511J846L651k720k687K958J644k530o56J512l27n5J41j288K13K420j059
$$ -2511 -665 2986 266 -2421 537 2181 -349 -1005 507 180 125 266 -1022 -809 1611 552
1117E52l178K469L060l573k024M054R01l755j82L230n65k002N72Q41n3J77p43
$$ 552 -2626 -157 2903 -670 -2694 1360 2261 -1494 -1676 1554 989 -1013 -441 400 347 524 -219
1134b19j002K070J012k955r32L570L6l941P98L519r62k896J347K386j480j406
$$ -219 -1221 849 1861 -1094 -2026 1544 1580 -2361 -1563 1956 994 -1902 -555 1831 351 -1055
1150a055R95N39k42Mj134L7K249n28k790J322L125j726l063J991K564k542j695
$$ -1055 -60 479 237 241 -893 -856 1393 865 -1925 -603 2522 796 -2267 -276 2288 -254 -1949
1167a949K143J457k017r86J780J7m62l05l46N02J350j221j781K037J815k690j774
$$ -1949 194 1651 -366 -1352 428 445 -17 -322 -668 -166 1184 -37 -1818 219 2034 -656 -2430
1184b430L601J202l673n65L312l54k538Q49J805o84q01J01j87Q97M59j861m33
$$ -2430 1171 2373 -1300 -1865 1447 1093 -1445 -596 1209 525 -276 -175 -362 535 994 -867 -1300
1201a300K436K65l398N64L672j372l102J887K648k396j662J987P20j242K33j95
$$ -1300 1136 1401 -1997 -1433 2239 867 -2235 -348 2300 -96 -1758 229 949 -293 -60 -255
1217b55p8J245l96j804Q58K592j842k913K947J834l103j270L220L99k327j1J695
$$ -255 -333 912 516 -1288 -430 2162 320 -2593 354 2188 -915 -2185 1035 1434 -893 -904 791
1234G91l09p08N9l30O84Q84j484q51K148Q64k840n09L237L0l284M76K869j072
$$ 791 482 -226 -167 -497 187 1071 -413 -1264 884 1748 -1092 -1601 1636 1666 -1618 -1142 1727 655
1252F55j961O83J497l64j284J82M09P88j13j210J26J532j56k656J119K763j667
$$ 655 -1306 -623 874 510 -774 -592 -183 605 492 -718 -592 940 784 -1872 -753 2010 343
1269C43k478J874K300k011j483J780P71j276m12M59J98K56l46j065Q42J857j618
$$ 343 -2135 -261 2039 28 -1455 325 1096 -180 -592 -133 65 321 -25 -1090 -248 1609 -9
1286ij836K261J600k731j259L223L80k727m1K223j38j620L49P64r0K9l42j073
$$ -9 -1845 416 2016 -715 -1974 1249 1629 -1098 -1139 1084 946 -674 -325 439 349 378 36 -1037
1304a037J845L86k391m26L202j50l349R21K898j066k725J523J565j421m55L06
$$ -1037 808 1194 -1197 -1623 1579 1429 -1920 -999 1899 833 -1892 -369 1196 -225 -680 -374
1320c74N21J08j58q86L73J778q45k198J182K460j883k117K258J502k176q96J988
$$ -374 147 255 97 -789 -416 1362 517 -1681 -499 1961 78 -2039 219 1721 -455 -1351 637
1337F37N19j486K9M54Q0J87q07m50R94R19j563q91J928Q95k512o5K273J61k665
$$ 637 1156 -330 -301 153 233 420 -387 -837 157 1076 -487 -1378 550 1445 -1067 -1132 1141 1302 -1363
1356a363K29J957k82j640L74J457j68n47m48N58P23j66j620m6K208n90k556J011
$$ -1363 -1134 823 541 -1099 -725 732 564 17 -431 127 850 684 -936 -982 1226 636 -1920 -909
1374i09K625j238k160J663J692j377j602J523L98l65p36m3N33R32p14j449J325
$$ -909 1716 478 -1682 -19 1673 296 -1306 217 615 250 -486 -529 4 936 222 -1227 98
1391I8J815j759j984K328J481k949p89K609L15k050j63J740o1o99K00o97O88P97
$$ 98 1913 154 -1830 498 1979 -970 -1759 850 1165 -885 -1048 692 631 -68 132 -565 123 920
1409I20j335q09J839O08k451K2K737m86k632R54K282j099j563N67J056n95k80
$$ 920 -415 -1224 615 1223 -1228 -1206 1531 1045 -1587 -633 1649 550 -1013 -446 610 15 -265
1426b65j20J91R32o7j649L88K114r72k311J437J703j471j634K073J112j922n85
$$ -265 -385 -194 738 671 -978 -590 1524 552 -1759 -322 1381 -90 -1724 349 1461 -461 -1046
1443a046J349N93j060k52Q2P59J31j030o21J193J098j665j055K310P46k314l21
$$ -1046 303 896 -164 -416 -334 425 556 -474 -1095 98 1196 -469 -1524 786 1532 -782 -1103
1460a103J877L37k261J22J413J44q27k66O75J54M45j123N6J363j26j987k28K520
$$ -1103 774 1111 -1150 -1028 385 529 -298 -564 111 265 710 -413 -357 1006 880 -1107 -1335 1185
1478A185n47k194O84K593j375j686J272J321j116o61L61J24L03l53o04K89J377
$$ 1185 638 -1556 -872 1721 346 -1340 -68 1253 137 -524 -163 -39 264 -89 -693 -404 973
1495I73o85j574J486J673k163j200J988J107k292q22K116L44j256q1O56O8J43
$$ 973 288 -1286 200 1873 -290 -1490 498 1605 -687 -1509 607 951 -305 -386 270 338 481
1512D81n81n12Q91Q23j832o83K067L76k342J41K659l97j820K68J520n95j309O54
$$ 481 -100 -612 279 1102 -730 -1413 654 1030 -1312 -1171 1488 1091 -729 -461 1059 464 -845 -191
1530a91M57K04k27q00K93J189j83j535L33K025j279j755R57J795j218j763J644
$$ -191 266 470 243 -557 -264 925 742 -793 -460 1565 286 -1469 -512 1283 65 -1698 -54
1547e4J004j045o83P88L89p7m63m46M55Q07j032p67J289J187j548j246K224O81
$$ -54 950 -95 -778 10 399 322 -141 -587 -132 675 -357 -1124 165 1352 -196 -1442 782 1463
1565A463k056o83J963J72j684L4R43J48p3n02K13P29L55j535l35J551K26j868
$$ 1463 -593 -1276 687 859 -825 -791 152 300 227 -275 -62 667 1022 -513 -848 703 929 -939
1583i39k89K365m18j897O90J727n56j302M08O85l43k53n45K66R58k45j509J063
$$ -939 -1228 1137 719 -1178 -488 1239 683 -619 -211 474 131 -122 -667 -401 557 312 -1197 -134
1601a34J571j089j744J506J769k029j162J234P48j020m41J130K24n03j68j92O38
$$ -134 1437 348 -1396 110 1879 -150 -1312 -78 670 -350 -791 339 563 60 -108 -300 338
1618C38L86r89n35J129L39j308o33J920N98j898j15J629j11j320k25J253K4r12
$$ 338 724 -265 -800 329 668 -640 -1273 647 1245 -653 -768 861 750 -570 -795 458 482 -430
1636d30k20N55O34j11p28j52J335j10j579K65J695n27j953Q77J496j094q38P97
$$ -430 -650 -95 539 428 -300 -452 883 773 -806 -541 1154 627 -1326 -449 1047 -47 -885 -88
1654h8Q94k53j003K69O25J27m18q12M94R05o87j229J232J273j569r19J741N16
$$ -88 806 553 -450 -181 444 571 153 -659 -165 740 53 -1176 56 1329 -240 -1159 582 1098
1672A098j484n46J188J74p87J04K65J6L25k03o03J106K90j569l68J469K83j680
$$ 1098 -386 -932 256 430 -357 -253 12 28 353 150 -453 653 943 -626 -994 475 758 -922
1690i22j08J916l67j321O07J043o58m94R5N75m5l58n14K96R17l98j451R51J546
$$ -922 -1030 886 519 -802 -195 848 190 -304 -209 366 321 -37 -551 -255 662 264 -1187 -236 1310
1709A310p35j646J029J019j137q26Q80N18l62m96K78N64Q6n49l38P87N55j055
$$ 1310 575 -1071 -42 977 -160 -986 -106 412 50 -446 -168 396 482 -67 -405 382 937 -118
1727a18j069J393P78j365o02J475O70j701j74J417K31j201l35R30l10j5m40J93
$$ -118 -1187 206 984 -381 -983 492 1162 -539 -713 704 935 -266 -601 329 19 4 -436 -243
1745b43Q18M1j061k20J471k1j752J43J625k02j744N12J586q40o78O78M47j7o02
$$ -243 575 616 -445 -665 806 785 -967 -824 801 599 -1145 -633 953 113 -565 113 560 543 -59
1764e9M4K38K93m02j069O32J458r29j407J226J495j552r05J244N24j351L7L95
$$ -59 -15 223 516 114 -955 -323 1135 206 -1201 25 1520 -32 -937 307 831 -520 -483 -88
1782h8L37p5m88n1O33N61q47r21J457L08j571l66J540L33j361k07J273j9q37K9
$$ -88 249 174 -314 -365 268 829 -18 -939 518 826 -745 -1111 429 762 -599 -806 467 448 -389 -360
1802c60P26J15m83n31K03O85j76p78K38J128j38j379O26J176o21j306N91J055
$$ -360 366 481 -2 -533 -330 355 179 -599 -361 767 629 -750 -124 1052 431 -875 -284 771
1820G71p30o52M65N15m2n46KN23K78o94l52M85N81p62r99J292P23j065o60J451
$$ 771 41 -611 -146 369 327 -219 -217 306 584 -110 -462 23 604 -158 -1157 135 858 -207 -867 584
1840E84M39j132m58O49L50n33j46L50L5R1o68O9P38K94j122j18J316j90j350j30
$$ 584 1023 -109 -567 82 432 -101 -247 103 138 229 -439 -370 368 662 -460 -578 738 548 -802 -932
1860i32J547l20r39L17Q38j78m19q2J17K05o4p11J68R51l51j195P63J312p09j387
$$ -932 615 295 -644 -327 511 333 -86 -168 -51 154 90 -621 -453 498 147 -1048 -285 1027 318 -1069
1880a069J211N42q54m48N99N48o86k69L91Q2L47n16m64J137K67q07q04J076K89
$$ -1069 142 684 -170 -618 -19 529 -157 -426 -35 47 394 -122 -586 551 818 11 -793 283 572
1899E72r51m82J129M89j320J62Q34L35q07k66L76K73j74n53k18R91q6p57j27J365
$$ 572 -379 -861 268 757 -563 -401 433 768 -39 -305 71 344 170 -383 -601 390 304 -453 -580 785
1919G85k95j204L61J132l89j288Q97N89m00n49o9O66N1m5o78M54P64o89r69P48
$$ 785 490 -714 -353 779 390 -898 -1 588 188 -361 -430 236 287 242 -436 18 782 93 -876 -128
1939a28Q12p10j083J254P81j259l78O72R38p51o68M10M69m20n18kO86L92n62m51
$$ -128 684 -26 -1109 145 926 -333 -711 -39 899 148 -520 -110 359 -61 -579 -581 105 497 -65 -516
1959e16J173j27j053p5R90K02j134j18J043j05q52M21O04l6m49m19J88P70l98
$$ -516 657 530 -523 -598 392 594 -540 -658 385 280 -572 -151 453 417 -32 -451 -263 507 109
1978A09o40J65Q63j81j206M97J356p25q87O15N38m10o76N51L80l09m45J36L78
$$ 109 -531 -366 497 316 -890 -393 963 238 -649 -34 504 94 -582 -31 349 40 -405 -269 109
1997A09N29q70l10O37N85p33p84J040M07q61j80Q31R3o32m4N37j32p4k75q5O84
$$ 109 638 -232 -542 95 680 -53 -837 203 610 -251 -431 400 493 -139 -183 354 222 148 -127 -212 472
2018D72j34p67O3O71J63j040O1J199j06j108N2R13o0r32J71M77L6l89q5M19P07
$$ 472 338 -429 -366 305 468 -572 -511 688 582 -526 -474 439 379 -553 -382 95 131 -258 -343 76 783
2039G83p06n35K93O73l09j168R04P29o04q22N21J129o50p83O71L58n41l58J46
$$ 783 77 -458 -165 508 199 -969 -65 664 60 -762 -241 888 238 -545 126 484 -57 -415 -269
2058b69K73K36m00j31N13M65q26o41J249K98r84m54J031K84j140J88O18j58k74
$$ -269 4 240 -160 -291 222 687 -139 -780 469 767 -217 -671 360 644 -496 -308 310 152 -122
2077a22k46L50M04q9o80L4O81m22n49Q8J058j42j104L92J241o58r97N65O10k71
$$ -122 -368 -18 386 297 -383 -349 332 -90 -639 -551 507 365 -739 -347 894 236 -761 -196 414 143
2097A43m48O6N23J13j74o48N46L66m32q52R06R14j493m36R03M87p50k86Q68p1
$$ 143 -305 -239 284 397 223 -425 121 487 55 -797 109 1023 -470 -906 -3 484 -266 -552 316 245
2117B45m22k47K44N22j85l14k07M70M15q06k6P27Lr78J97P36p1q46jR47j54m14
$$ 245 -177 -424 -180 342 157 -157 -364 106 521 -285 -311 416 419 -559 -362 374 303 -543 -544 403 249 -165
2139a65m0J35M66k99m12K18Q11l04j241N16Q77m65r53O85R30q68m28L14O24k84
$$ -165 -205 -70 396 97 -315 -97 714 410 -831 -315 562 97 -856 -171 759 -109 -537 -223 401 117
2159A17n76K88K58K88o82p1M24O72p33p19R50L41o68o01R73J17n63k13O43J48
$$ 117 -459 -171 87 375 -307 -378 46 718 -15 -734 216 557 -111 -712 261 378 -185 -398 245 393
2179C93n62k31N79P0J3k03l95P30l8q39jN69L23q75K03P55K2j060L35Q25l18p56
$$ 393 -169 -400 179 249 262 59 -336 394 356 -483 -484 85 408 -467 -264 491 513 -547 -212 613 295 -461
2201d61L05L32r5j63k95N31J97k18o35L24O18m16p63P19Q25p85q02Q94M43n24
$$ -461 -156 176 81 -82 -377 154 351 133 -502 -178 440 24 -739 -20 805 20 -782 112 555 31
2221C1k61K19L17j84k07j14K01L41n20p8M08K56p47j92P77P6q22Q0Q73j59o37
$$ 31 -230 -11 306 122 -85 -199 2 343 -177 -255 153 409 -338 -530 247 323 -499 -419 454 295 -342
2242c42K5N79j10m70P1K09N68k14n89P2P16j65j059M94Q09n11o89N22N74o5o66
$$ -342 -317 262 152 -318 -247 -38 530 316 -273 -201 515 350 -709 -215 594 83 -606 -84 490 425 -241
2263b41j43Q39k39m28p9M95J46m74m02O83J71k32p36P04M24o31l35O25L72o45
$$ -241 -384 455 216 -212 -291 204 350 -124 -526 157 328 96 -640 64 488 -143 -478 147 519 -126
2283a26m87O63J68m79L7j10N35M1n66K98K30P3n82J3P97L3p38J62L53J36o43q0
$$ -126 -613 50 218 -261 -224 -334 201 242 -324 -26 204 277 -305 -292 505 538 -200 -38 315 451 -192 -272
2305b72L88J97m14k66P05k44m6l88L49K53j0p22M64O42n48o25M74L60n31k29N12
$$ -272 116 313 -101 -367 338 94 48 -340 9 262 252 -470 -6 636 88 -537 -63 297 -234 -463 49
2326D9J7J39o15K57K86n5j43k32L55M02o76k11O07L56o63m37R75K37r77J17N37
$$ 49 66 205 -410 -153 133 78 -65 -297 58 460 -216 -427 180 536 -127 -564 411 648 -329 -212 325
2347C25kj89l71K92K86k41l29J87J33K3n82M08M88l75n01J54Q51n91k22N9P47
$$ 325 323 134 -237 55 341 100 -229 -42 91 114 -468 -60 428 53 -448 -294 557 -34 -256 -197 550
2368E50k53o45K69K87K7k61l82M46M58m49k90L08L09k86m17M75L47n23n68Q48
$$ 550 297 -348 -79 208 235 -26 -408 38 496 47 -243 65 374 88 -329 146 493 -30 -598 250
2388B50K4l6m10o8L35m1m71J54L02K70n32k79Q00o0j27k00K81J6p69J57N62j01
$$ 250 274 238 -172 -240 95 54 -417 -263 39 309 -223 -502 298 238 111 -89 192 208 -561 -404 158 57
2410E7m44j12R31l2n92R8p9K47nm33K0N39r1n65K62P88m73m94N29L74m21p52M36
$$ 57 -387 -499 432 400 -192 -94 -173 74 69 -364 -344 195 104 -461 -199 589 116 -378 151 525 104 -648 -212
2433b12L50k88q5J33M51k79n1k01L44J72k09m22M44L12p17l79P89J46k86j18K38
$$ -212 138 -150 -235 -102 349 70 19 -182 162 334 125 -297 147 459 -258 -637 152 298 12 -106 132
2454A32K50n41J16j26K14R5m63M6K66K16n81M6N29J68o54o8Q16j16p44O6O03M5
$$ 132 382 -159 -43 -169 45 140 -323 -277 -11 205 -376 -330 199 367 -287 -355 461 345 -399 -333 270 315
2476C15j20k19Q0M15m31k38K37M38n12m13K33N39l17m88L82O05m87l22M58L73
$$ 315 195 -24 56 471 40 -198 39 477 -35 -448 -215 324 7 -481 -99 506 19 -303 155 528
2496E28n17j68m5M75n6k66l57O18j0m28M7M05J41m79q0K29J20m76n2K12K01l73
$$ 528 11 -157 -202 273 217 -49 -406 212 202 -226 -179 226 367 -112 -192 37 157 -319 -371 -159 42 -331
2518c31K15K32K20l62k87J89J78L5l82J07N36k46l32k2P74k68p47L12N69j12m31
$$ -331 -116 116 336 -26 -313 -124 54 89 -293 -186 350 104 -228 -250 524 256 -491 -179 390 278 -153
2539a53k27M54r7m3l13M44J19k8o12M30N24k75o81N79J88m34j8J20M12n04k62
$$ -153 -380 74 -23 -66 -379 65 184 156 -456 -26 498 223 -458 121 309 -125 -143 -23 389 -115 -377
2560c77L54O8ok43j37O94j54n04P6M16J37l05l13N41K49p33PM04Qk95j20K65l
$$ -377 -23 45 39 -204 -341 353 199 -305 -229 187 324 19 -294 247 496 -237 -230 174 182 -113 -233 32 29
2583B9j45J31J86M5k07l44J84O80p06l76K01M57o6l68L66K42l02l95L93L18l10
$$ 29 -116 15 201 246 39 -305 -121 559 -147 -523 -322 135 69 -299 67 309 7 -388 5 323 13
2604A3l19K19K27J52m58j19N45K8m16l6L64N6m61j21L43Q1m50J40R6J65n3P5r
$$ 13 -306 -87 140 292 -166 -285 260 288 -128 -164 200 256 -205 -326 17 98 -352 -212 -116 49 -4 71 62
2627F2L23k02k78l21L05L17n45J15P22l50l82R5N43j92n65K95K04K7j99k62L04
$$ 62 385 183 -95 -416 -111 206 -339 -224 498 148 -234 -139 404 212 -353 -58 146 173 -26 -288 16
2648A6Q8Q9m15J90L18k32m16N23K37m43p18O27N41k65o40P28K08k85j78P4J61
$$ 16 104 193 -222 -32 286 54 -362 161 398 -45 -763 -136 405 140 -500 228 436 151 -27 47 208
2669B08j69l93K48J26J20l78k58P05K7o25J61O62l66k43j24K31mk62J75K41L8
$$ 208 39 -354 -106 20 140 -238 -496 209 236 -389 -228 434 68 -175 -299 -68 -72 -334 -159 82 120
2690A20k19j46R1K04r7l18O5N09k01j66J3K36O9k11O7M61k44l13q8L84k70j9j30
$$ 120 -99 -245 -154 50 -47 -365 -300 209 8 -158 -145 91 160 -51 16 477 233 -80 -168 216 -54 -73 -203
2713b03j24R94q32J02M89j80l85n9J69L32m66j57L27K46rm50M39o5K60m82J33
$$ -203 -327 667 -165 -63 426 246 -139 -198 -29 303 -163 -320 7 253 244 -206 233 168 428 -54 79
2734G9J52k00k60l4L17J55n33J54O49p3l99m8K96l53k99K52M0J29l00K4M55K88
$$ 79 231 31 -229 -263 54 209 -324 -170 479 406 7 -41 255 -98 -397 -145 -105 24 -276 -252 203 491
2756D91l29k14r3N57m71j70k4N14m69r7K28K43J28n96L84L85j36n83J18K43l0
$$ 491 162 -52 -145 412 -59 -229 -253 261 -208 -305 -77 166 294 -302 82 467 331 -252 -134 109 79
2777G9m5m02M37K72m59j46L31J22l85m8L38P3l70l1J98PJ07j77J58K22j09k77
$$ 79 34 -368 69 341 -118 -264 67 189 -196 -244 94 167 -203 -234 -36 -29 78 -99 59 281 172 -105
2799a05P3L93l68k18l2M59j70k32M34J73l65Q8p6J60m4l17j02K43L15l82j68K23
$$ -105 -32 361 -7 -225 -257 202 32 -200 234 407 42 130 54 214 170 -147 -249 -6 309 -73 -241 -18
2821a8M13l57k04L38J07q0m71J59L70l42j84M45j18L0m9J10m8K36k07j00P0p4
$$ -18 395 38 -166 172 279 199 -272 -113 257 -85 -269 176 58 88 39 149 101 337 130 30 100 26
2843B6o1N5O0K12m06LM14k61r3Q8J74k18Ol75N05l3k39j08J57L95L4l51PM07m21
$$ 26 -35 20 80 292 -114 -111 303 42 -51 37 211 -7 -1 -376 129 96 -143 -251 -94 301 335 -16 -9 398 -23
2868b3j69kP6J81m42M14L82m25OMJ52o1k19k73L50J10j23n0L77j7k35r0M51j76
$$ -23 -192 -194 -118 63 -379 35 417 -8 -2 2 154 93 -126 -399 -49 61 -62 -112 265 248 13 -77 374 198
2892A98l09j95o5P04l77k83L49J22ml89L10K67r4l02J24J95l36j32NL50j29l69
$$ 198 -111 -306 -371 333 -44 -327 22 144 140 -249 61 328 234 -68 56 251 -85 -217 -212 138 9 -360
2914c60L49M35j82k11l00K49M37m94j24j28L04J71m53K78K09j15k11L69p0j11
$$ -360 -11 424 242 31 -269 -20 417 -77 -201 -329 -25 146 -307 -29 180 65 -146 223 153 42
2934D2l04j81N10k14k43L19L23j96n3p7K38o9l59q1L94r1J6m9K86J00l60K52J3
$$ 42 -262 -443 67 -147 -390 -71 252 56 3 -74 164 95 -264 -345 49 -42 -26 -75 211 311 -49 203 216
2957B16L06m96q6J35q9j32k8L12Q9J2k46L2M17l12m02L72R0l3m26J02L52j25j38
$$ 216 522 26 -60 75 -14 -146 -174 138 227 239 -7 25 442 130 -272 100 190 157 -269 -167 185 60 -78
2980g8n7L27pl45R6K0l5j8j37J32J43J5k91J62M74l74R5j59K01q7k47RJ47j34
$$ -78 -135 192 185 -160 -64 -44 -79 -97 -234 -102 41 56 -235 -73 401 27 122 -37 164 77 -170 -161 -14 -148
3004a48jQ5J22J33p3l40M46K71p35L5K86J21m16q0N91J7k34j19L10j69mj17j9
$$ -148 -149 -64 58 191 118 -222 224 495 -240 -205 81 202 -214 -294 297 314 80 -39 271 102 98 -19 -38
3027c8n9M5m31K62L29l34L24K04j71J69o48K89K56j88j33j06K52J47l19J10M83
$$ -38 -97 -52 -483 -221 108 -226 98 302 131 300 -348 -59 197 9 -124 -230 22 169 -150 -40 443
3048D43q5k00k51K91J61n47o9K62J54l41j25M33R8j58M0r8O6N8j17k67M13j33
$$ 443 358 158 -93 198 359 -188 -257 5 159 -182 -307 126 224 66 106 8 74 132 15 -252 161 28
3070B8k91K57J97o0j39J4L37m8l72j25M09m7m54K78K63o4k89j6K03K14k99k68
$$ 28 -263 -6 191 131 -8 6 343 295 -77 -202 207 160 -294 -16 247 183 -106 -122 81 295 -4 -272
3092b72J74P5k09R6J58K40q5l59L06L50m72k84M74k0k87j04L19Q1j65K1j91K45
$$ -272 -98 -23 -232 -136 22 262 177 -182 124 474 2 -282 192 172 -115 -219 100 181 16 37 -154 91
3114I1K63l11l00L45K58l44j82K32k90J96r2K65J66k78M9m8J08l99J95j0K9J65
$$ 91 354 43 -257 88 346 2 -180 52 -238 -42 -134 131 297 19 68 20 128 -271 -76 -86 -57 108
3136A08p11M58M14j71l19K96K04j09k58m9K53p1j25J91L0J12k22J25KM0k51L6
$$ 108 -603 -145 269 98 -221 75 279 170 -88 -137 116 45 -80 111 141 253 31 156 158 198 -53 -17
3158a7Q9j64K2j08J68L38l17j55L06K34l65k74L42J12p0k19j50L75k7Nk32M71
$$ -17 72 -92 -70 -178 -10 328 11 -144 162 396 31 -243 99 211 141 -78 -228 147 120 125 -107 364
3180C64l31mk3R0j70l43L04J09J60p6j44m9M9J01L8l2L22m71j29rK33k58QL66
$$ 364 33 29 6 96 -74 -417 -113 -4 156 80 -64 -113 -64 37 75 43 365 -106 -235 -244 -11 -269 -261 105
3204A05J01M9j54J22R3j37k85p2O8O2j9q9L46j72r4k8K22n3j81q0K33J23m39p7
$$ 105 206 255 101 223 316 179 -106 -178 -110 -48 -67 -156 190 18 -76 -104 118 65 -116 -196 37 160 -279 -356
3228c56K89K52m58R0K18J62k20k32L49pk61j45J07J00O18q21K37L75O4n69N7L41
$$ -356 -67 185 -273 -183 35 197 -23 -255 94 87 -174 -319 -212 -112 506 -315 -78 297 361 -208 -151 190
3250A90j41l64J7K94K6Jl9p3J14L3J55j17l7k8j66J86L1o2r8K94j83j16J4M06
$$ 190 49 -315 -298 -4 22 23 -16 -89 25 58 213 96 59 31 -135 51 82 20 -78 216 33 -83 -69 337
3274C37k98M6l48K36j50J44p5J25j0K67k30r4K49J74p33K95K55k34N0r2K14M4
$$ 337 39 85 -263 -27 -177 -33 -108 17 7 274 44 -50 199 373 -360 -65 190 -44 6 -86 128 172
3296A72j4k46L31j36l1J14l68M37k10k87n7L66P9k74R1K21j6l52K29k00J37j51
$$ 172 158 -88 243 107 76 190 -178 259 49 -238 -295 71 150 -124 -33 188 172 -180 49 -151 -14 -165
3318a65j28N07k77n4j22M65k80Q6JR3J4k26Q9j12P2k01k1K56r2M22l35Q2K54k89
$$ -165 -293 214 -63 -117 -239 226 -54 32 33 126 140 -86 3 -109 -37 -238 -259 -3 -95 327 -8 74 328 39
3342C9o2k59J69J33j14K4J46ok07J97O1K22l83J41k07J46j33j45m8K45R3j57M76
$$ 39 -23 -282 -113 20 -94 -70 76 70 -137 60 121 343 -40 101 -106 40 -93 -238 -286 -41 52 -105 371
3365C71m31K40l14k03K88k40oK34N6J63j30l1K32j29K0J01m46J68k63K43n8R9
$$ 371 -60 180 -134 -337 -49 -289 -295 -61 -5 158 28 -3 229 100 120 221 -225 -57 -320 -77 -135 -36
3387c6j37J61J88J06l67J10K33r4j80Q2j4l6k21n3K61q0L85n00K62k9j92j92K22
$$ -36 -173 -12 176 282 -85 25 258 164 -16 66 52 16 -205 -258 3 -77 308 -192 70 41 -151 -343 -121
3410a21M07m29j85J86K53J86l84P3J04R7k40J1o0K21k50j07K82K19l11R9J11O6
$$ -121 286 -143 -328 -142 111 297 -87 -14 90 187 -53 -42 -102 119 -131 -238 44 263 -48 51 162 228
3432B28m01J25J78P3k60l36O06J03k58K4q5K25m9k24L25o8k63jk90J85L41l33
$$ 228 -173 -48 130 203 -57 -393 213 316 58 82 -3 222 173 -51 274 206 -57 -58 -348 -163 178 -155
3454a55k6M64j93j52J4P9K21l14O2N7k33oJ88K73j92k2q5J68j51j3j08p1J34j58
$$ -155 -181 283 90 -62 -48 31 252 -62 0 57 -176 -182 6 279 87 65 -20 148 -3 -16 -124 -195 -61 -219
3478b19J44K08p7j7M0L24l54k2K32k57K47n44J72N7k23L16J0k82M31L65n22j78
$$ -219 -75 133 56 39 79 403 49 27 259 2 249 -295 -123 -66 -289 27 37 -245 186 551 29 -149
3500a49K93J07l95k9K99j92p2R4K30j9Q3j00o1p0k3j21J07j19O7j51K11J02J07
$$ -149 144 251 -144 -173 126 -66 -138 -44 186 167 250 150 89 19 -4 -125 -18 -137 -70 -221 -10 92 199
3523A99Oj14j64J74l92K02j2K88l37j17M11N1l44J91p0K76j57k11q2M58l56M2
$$ 199 205 91 -73 101 -291 -89 -101 187 -150 -267 144 195 -149 42 -28 248 91 -120 -202 256 -100 -58
3545e8j13K60O0k67J22j99M00m63K78K3o9k97J97J21j51K32j16J61o9j20p5K87
$$ -58 -171 89 149 -118 4 -195 205 -258 20 43 -26 -323 -126 -5 -156 76 -40 121 52 -68 -143 144
3567A44j65n2p9J14J29l70Q9L46L08n27J07J4J16k91R4j26L64j14k19n4K77J15
$$ 144 -21 -73 -152 -38 91 -279 -190 156 464 -63 44 58 174 -117 -23 -149 215 101 -118 -172 105 220
3589B20k02k8N7J01k34o6O6K3k47J20L48j37j26M0J43L67l10n92L15J33J36j82
$$ 220 18 -10 47 148 -86 -152 -86 -63 -310 -190 158 21 -105 -65 78 445 135 -457 -142 -9 127 -55
3611e5L5QK41m0j60L15l03k0R5k30P7j09o6J42J07j67R3K32j58j39J03N8k09L06
$$ -55 -20 -12 229 189 29 344 41 21 116 -114 -37 -146 -212 -70 37 -130 -37 195 37 -102 1 59 -150 156
3635A56j84K47r2l33K17N2k35M49l65J58r4l9P1j19J17l00K95k97M05j6Jr7J9
$$ 156 -28 219 127 -206 11 63 -172 277 -88 70 -24 -63 8 -111 6 -294 1 -296 109 93 94 -3 16
3658A6n5k21J53J90j56K02m36K88K97l87K24N8k59R2k57K62n7j02j30M14j36O8
$$ 16 -39 -260 -107 83 -73 129 -307 -19 278 -109 115 173 -86 6 -251 11 -46 -148 -278 136 0 68
3680F8N7J02k92K71k63j3N1K77l46j10J90J44j34r3M72l68J25k13nK17J28l33
$$ 68 125 227 -65 206 -57 -70 -19 258 -88 -198 -8 136 2 -91 381 13 138 -75 -80 137 265 -68
3702f8R6r4J28j93L32J83m28l2P5M5n2j75L29k61q9J49m3K11LMk25O7K42l74K5
$$ -68 28 -66 62 -131 201 384 -44 -76 -1 44 -8 -183 146 -115 -204 -55 -98 113 116 120 -105 -38 204 -170 -145
3727a45J23j05K85j07J98j36j35MJ93L8l31J74O4L2j53n4J62P1k55J02mK28j66
$$ -145 -22 -127 158 51 249 113 -22 -18 175 213 -118 56 120 152 -1 -55 107 178 -77 25 21 249 83
3750H3j78R8k4k65J57o2J67j01K02j18J04q1j21Q7J7K79m27K99m19L69l48J26
$$ 83 -95 3 -21 -286 -129 -191 -24 -125 77 -41 63 -18 -139 -52 -35 244 -183 116 -303 66 -282 -156
3772a56L30J52j09J7j36J01l09P4j66L4K87j79M94k24q5r2k06L25L9k88j02K09
$$ -156 174 326 217 234 98 199 -110 -36 -202 -168 119 -60 434 210 125 33 -173 152 191 -97 -199 10
3794A0J26J0k6L5J9q7j41K50Q9l31J48Km18K86L41l51M8j08o1J27j45K21J6j15
$$ 10 136 146 120 155 174 87 -54 196 285 -46 102 104 -314 -28 313 -38 10 -98 -159 -32 -177 44 60 -55
3818e5R2l5j32J52K18m58N4J76K68m31M33m32J82J00k39j55L11l6N3j36j48K46
$$ -55 37 2 -130 22 240 -218 -164 12 280 -151 282 -150 32 132 -107 -262 49 13 66 -70 -218 28
3840B8k4k07K07j16R4O6j14Q3n9r0J04J09L1q8J77K37l02k52P0J2P5J18o9k3m2
$$ 28 4 -203 4 -112 -18 48 -66 17 -42 -132 -28 81 112 24 201 438 136 -116 -46 -34 41 159 90 67 25
3865B5l8J85K1j34P0l8NJ07k57ol6J60J16l71L94j73l3P8j48L1M5M4m7k68L31
$$ 25 -13 172 193 59 129 91 96 203 -54 -60 -96 64 180 -191 203 30 -3 75 -73 -42 3 47 0 -268 63
3890F3k95J95j11L89k47K4n3K41r5l52M02Q6l72K08ok71O8K14j32J25j66J24q
$$ 63 -232 -37 -148 241 -6 18 -35 206 111 -241 161 247 -125 83 77 -194 -126 88 -44 81 -85 39 31
3913C1k31P8L30j79n7l8k46K90M6M4O1R2j19l7J19j42L3K58k84l9%J24k30K00
$$ 31 -200 -122 208 29 -28 -66 -312 -22 24 68 129 221 102 65 184 42 75 333 49 10 10 134 -96 104
3937A04k6j85K19k96M57l49K37j75m5L3k6K3Q4r9J2k97L68j08N5j41n1K72K3k62
$$ 104 78 -107 112 -184 273 -76 161 -14 -59 -26 -52 -29 55 -44 -32 -329 39 -69 -14 -155 -206 66 89 -173
3961a73K00R6j36j51L28J3k20O5k44K48K86l08j83K06j12J75k94K20L4j09R8p4
$$ -173 27 123 -13 -164 164 177 -43 22 -222 26 312 4 -179 27 -85 90 -204 16 50 -59 39 -35
3983c5J70k72j07K93qJ67l22L5QJ24M7m4J4J69k31K5J77j04j06j42P03p99J89
$$ -35 135 -137 -244 49 41 208 -114 -79 -71 53 100 56 70 239 8 33 210 106 0 -142 561 -238 -49
4006d9l41M09J70o6l75N03j35j03j19O8L25m50J60L07J7k29P5j84J34j59m0J63
$$ -49 -390 19 189 123 -252 251 116 13 -106 -38 287 -163 -3 304 321 92 167 -17 117 -42 -82 81
4028H1R6l74J99l27L59MO7m26M00j11K44k0j29J19j16l30j9K40k1L59k82k36j1
$$ 81 177 -197 2 -325 34 38 105 -321 79 -32 212 192 63 182 66 -264 -283 -43 -64 295 13 -223 -234
4051b34J38K6O2oJ32j08p9R8o9K37o9J01j76p5j0P4k6j16K99k40k49L81R0j77
$$ -234 -96 -70 -8 -14 118 10 -69 29 -40 197 128 229 53 -22 -32 42 16 -100 199 -41 -290 91 181 4
4075DJ80r7m8J43l09q2L18P9n0m65J77K79L5j74k1j29K00N5Q4q9mj01p1o8P3J52
$$ 4 184 87 39 182 -127 -209 109 188 138 -327 -150 129 164 -10 -31 -160 40 95 179 90 86 -15 -86 -154 -81 71
4101G1K92j90j32J48k57JR7j52J55k42K09j37K87P0l88K27K90j02m05M07k79j00
$$ 71 363 173 41 189 -68 -67 30 -122 33 -209 0 -137 150 220 -168 59 349 247 -158 249 -30 -130
4123a30K32k5J01k1k48M02l73j02J65RJ1l4jJ44j00K7O7l5j88J58k42J77OJ9r8
$$ -130 102 77 178 157 -91 311 -62 -164 1 10 21 -13 -14 130 30 57 124 89 -99 59 -183 -6 0 19 -79
4148g9J94Q9j84M3N4j10j66J24j2M3O8r3J59k45Q1j14L5l4l6K3N6M7O8j1k12K80
$$ -79 115 204 20 63 117 7 -159 -35 -47 -4 64 -29 130 -115 -34 -148 -113 -147 -183 -160 -104 -57 11 0 -212 68
4174F8jJ59j28qj01O7p2J75j92N8J81r3k67N0k17K51L03q2r0l19J32J70J46K31
$$ 68 67 226 98 90 -11 56 -16 159 -33 25 206 113 -154 -104 -321 -70 233 151 61 -258 -126 44 190 421
4198D21l98k20K85r2J93j91j50J0K81j94Q3k22L30L7j83o2k65J55J0r1M00r1k5
$$ 421 23 -197 88 -4 189 -2 -152 -142 139 -55 28 -194 136 173 -10 -72 -337 -182 -172 -263 137 46 21
4221B1q1J92l15J2J60R2k60N7N4L73j80p4r4R5R1j63K6m2J10O8k20p7j4J07j14
$$ 21 -60 132 -183 -171 -11 81 -179 -122 -68 305 125 51 -43 52 143 -20 6 -36 74 142 -78 -155 -169 -62 -176
4246a76J92K72r0r0j4j84K09k43oM22l74R2R0k10K16q6K20O1l22j62M05j56o3
$$ -176 16 288 198 108 94 -90 119 -124 -130 292 -82 10 100 -110 106 20 240 301 -21 -183 222 66 3
4269Cq4K59j60j38N2L7M0m2l6R0n3k39M39m50qK75J65r3n2J02nK8J00l08J92j77
$$ 3 -81 178 18 -120 -68 -31 9 -33 -69 21 -32 -271 168 -282 -290 -15 150 57 5 107 102 130 230 -78 114 -63
4295f3L6M8j79l2O3j6J64M7o2r7J76k5k48M34j43j07J60j74J70j37r6m4J46oj39
$$ -63 -27 21 -158 -190 -127 -143 21 68 6 -91 85 60 -188 246 103 -4 156 -18 152 15 -81 -125 21 15 -124
4320a24K4J76n3J79l26L6J01j77M21m31K09k79K01nL6J20O2j56K8J58j06p5k57
$$ -124 -100 76 23 202 -124 -88 13 -164 257 -174 35 -244 -43 -48 -12 108 170 14 42 200 94 19 -238
4343b38K14J0K5K38l29P4j28k0L25k27J03L7j10q7j93L27r5MOl9K37l25n7K47
$$ -238 -24 -14 11 249 -80 -6 -134 -154 171 -56 47 84 -26 -113 -306 21 -74 -70 -64 -103 134 -191 -248 -1
4367aQo2K72j23j44j3L34q1k2j60M7M1k64K5J19j36J22j2q4p4L45p4j17J40j00
$$ -1 7 -55 217 94 -50 -63 271 190 168 8 55 96 -168 -143 -24 -160 -38 -50 -134 -208 137 63 -54 86 -14
4392a4J74j60N7j20j0ML51k69Q6l26L24p8J54j0j04j95j3J22J82Or9n3k46K38
$$ -14 160 0 57 -63 -73 -69 282 13 99 -227 97 19 173 163 59 -136 -149 -27 155 161 62 9 -237 1
4416Aj3J1n9M9K66k03j8O1Ol14L17J52l24J61l60K45k0j00N7J62j04n4K01k61
$$ 1 -12 -1 -60 -11 255 52 34 95 101 -213 104 256 -68 93 -267 -22 -42 -142 -85 77 -27 -81 120 -141
4440a41L66l81L41l96J60R5qP8k99l4K68q5J64R5l79K18N6j77J21rk4O9o7m3K37
$$ -141 225 -156 185 -211 -51 44 36 114 -185 -219 49 -36 128 223 -156 62 118 -59 62 53 29 98 31 -12 225
4465B25o4k16J9p5L13L0k10J45l12J29J39n9l33L64j43k8J3J26R7L2k19k2q9J26
$$ 225 161 -55 -36 -111 202 232 22 167 -145 -16 123 64 -269 95 -48 -76 -63 63 160 192 -27 -49 -138 -12
4489a2k6k68K85MJ6mm4j16K60k74J39J1l5K94l59L45l03N5J9k8K4Q3J07k15j02
$$ -12 -38 -306 -21 -17 -1 -5 -49 -165 95 -179 -40 -29 -64 230 -129 216 -87 -32 -13 -41 -17 66 173 -42 -144
4514a44K48k66J51J54l18K15J1j21k80K00J45R2j78J18N4K79k95k6J19m88K70
$$ -144 104 -162 -11 143 -175 40 51 -70 -350 -150 -5 87 -91 27 81 360 65 39 158 -330 -60
4535f0O6k26L58j46j24K73K9j24r6M36l48k17R1J92K98k67j41P7J34m67J58J4
$$ -60 6 -220 138 -8 -132 141 170 46 -50 386 38 -179 -88 104 402 135 -6 71 205 -262 -104 -90
4557i0k05J08Q2Q6M6j87L10k21%J34j34J4j45L04N9K32m82J87q3L5K7K92l95j20
$$ -90 -295 -187 -105 -19 27 -160 150 -71 -71 63 -71 -57 -202 102 161 393 -89 98 15 50 77 369 -26 -146
4581a46J76J8j17J80j63N2O8p6j65m5M61n2j78p0k7J99l90K56K00k56J9K14j59
$$ -146 30 48 -69 111 -52 0 68 -8 -173 -218 243 191 13 -57 -84 115 -275 -19 181 -75 -56 158 -1
4604aJ34l22%K29k74K38L26o96L47J20k45j16L19l1P7P9j37k7m2nk38K47J46P8
$$ -1 133 -189 -189 40 -234 4 330 -366 -19 101 -144 -260 59 28 105 184 47 20 -22 -27 -265 -18 128 206
4628B06Mn7Pk92qR2j95L17m0J0j49j05K16J0Q7j25j50j48M80N9K5j94K08k35P
$$ 206 210 153 160 -132 -140 -48 -243 74 34 44 -105 -210 6 16 103 -22 -172 -320 160 219 244 50 258 23 30
4653C0Q5j86J77l40L83n9k15j3K97j49K12k54O0K87k05lj30l5Q0k66L07j00J28
$$ 30 115 -71 106 -234 149 90 -125 -138 159 10 222 -32 28 315 110 107 -23 -58 22 -244 63 -37 91
4676I1p4o8ml9J24J2L9k07K42j87L25m90K53m1k03L24o8j76J27J16l19J75J9M1
$$ 91 17 -51 -55 -94 30 42 81 -126 116 -71 254 -236 17 -24 -227 97 29 -147 -20 96 -223 -48 -29 12
4700A2J9K7l26K10J69m2J38k77J49J03k31J61k7m6o1l7M0j17q8N5K57j53j3R1
$$ 12 31 58 -268 -58 111 69 207 -70 79 182 -49 112 85 39 -22 -59 -19 -136 -224 -169 88 -65 -78 13
4724A3J67K3k42K56k5l20L8O3j18Q9p6K83k58R4k6M3l36J52K32r3J35rm7j89J91
$$ 13 180 203 -39 217 192 -128 -90 -27 -145 -56 -132 151 -107 -13 -39 4 -332 -180 52 -41 94 85 38 -151 40
4749D0J90j07j01Q9k07K11k18L74l24r9K75k30J34pj24N9NlN3J43J70l95R4o3
$$ 40 230 123 22 111 -96 115 -103 271 -53 -152 123 -107 27 20 -104 -45 -40 -43 10 153 323 -72 22 -41
4773d1J50k73K67k96K09k43L28J57q3k44J5k21K15J08k11K90j70J37j24j6K19
$$ -41 109 -164 103 -193 16 -227 101 258 175 -69 -54 -275 -60 48 -163 127 -43 94 -30 -46 173
4794A73j13j25L5J47j09j76J74j98J32J33j11L27k01l5Qm3R3o0J32j21J6Nj21
$$ 173 60 -65 -30 117 8 -168 6 -192 -60 73 -38 289 88 53 61 18 111 51 183 62 78 83 -38
4817c8m0J23j89J54k31J39j07J50J32j43J21L5j53R0K6M1l20O8K30O2k08J32J5
$$ -38 -78 45 -144 10 -221 -82 -189 -39 93 -50 71 106 -47 43 69 110 -210 -142 88 150 -58 74 89
4840H9j50j9K98l53J59o3L8q8p6J34J61q7k71L74j54L1k6O8q6j42lK02l09M50
$$ 89 -61 -80 218 -135 24 -39 -1 -89 -165 -31 130 43 -228 146 -8 23 -3 65 -21 -163 -166 36 -273 177
4864A77J0j30P5N1k70L43k81j18O5j45K26j64L11j31k76J70O8j01L2K02j69k72
$$ 177 187 57 132 183 -87 256 -25 -143 -78 -223 3 -161 150 19 -257 -87 -19 -120 -88 114 -55 -327
4886c27K1L81J4K5q4j07O2K53l35L05k35Q5J2K1j04k2k3r0K03J89k10k24K49p5
$$ -327 -306 75 89 114 30 -77 -15 238 -97 208 -27 58 70 91 -13 -35 -58 -148 55 244 34 -190 59 -16
4910a6J01j22O8j31J43n9P7m9J47j21P3q6Pq7J12O1rl24L44j79L02l41J21L0L0
$$ -16 85 -37 31 -100 43 -16 61 12 159 38 111 25 32 -55 57 118 109 -215 129 -50 252 -89 32 62 92
4935I2o8n8o0K64j94K27k05m6QM1J3k39m0M52o4k46O2J02J26j98J51j54k9m5K21
$$ 92 24 -34 -94 170 -24 203 -2 -48 -40 1 14 -225 -265 187 123 -123 -61 41 167 -31 120 -34 -63 -108 113
4960A13Ml60J58q8L26l21J31r1O2J91j71J05j30J75l04K96j11J33k6K0k30J45
$$ 113 117 -243 -85 -173 153 -168 -37 -128 -66 125 -46 59 -71 104 -200 96 -15 118 92 112 -118 27
4982B7J45k21m8K78k73J38Q8m37J51K10j70J59J01j73k4l2R1j58J84q7PP9j25
$$ 27 172 -49 -97 181 -92 46 134 -303 -152 58 -112 47 148 -25 -49 -81 10 -148 36 -51 -44 35 -90
5005i0O4q9P5r0M37l94l0l5K07j88R3Jl3n1l3L42o5o4J68k21m5J77j29L3k10L29
$$ -90 -26 -115 -40 -130 307 -87 -117 -152 55 -133 -40 -39 -72 -123 -156 186 121 57 225 4 -41 136 7 40 -170 159
5031A59m00K71m8k08K21l5Q2m2j15M6qo8m0J90Q2j57L12m18M85N9j93k12j63K31
$$ 159 -241 30 -18 -226 -5 -40 42 0 -115 -69 -77 -145 -185 5 87 -70 242 -176 309 368 175 -37 -200 31
5055C1k87M33n6P6k70K86j12k60K92K53m71J68o7J3j7o7K23p9j46L1j29K7J28
$$ 31 -256 177 121 197 -73 213 101 -159 133 386 -85 83 16 29 12 -55 168 89 -57 -26 -155 -128 0
5078@K0L4P7J3l43M95n25K71j39L77k69Q1l3Q7q9l9KQ7j87pj4L57l29J47R7l07
$$ 0 20 54 131 144 -199 296 -229 42 -97 280 11 92 59 146 57 18 20 107 -80 -87 -101 256 -73 74 171 -136
5104a36K18j51L69k75J95j36J51k07qJ30q8j95K24k05j6R1J69j27k5k2l5k28K26
$$ -136 82 -69 300 25 220 84 235 28 20 150 62 -133 91 -114 -130 -39 130 3 -22 -44 -79 -307 -81
5127h1J85rQk22l4J43J11j94N4K94m68K91l01Q0K50k97N22n04J37k03K60J92o8
$$ -81 104 95 103 -119 -153 -10 101 -93 -39 255 -213 78 -223 -143 107 -190 332 -172 -35 -238 22 214 146
5150A46j47j08K24k5k18O6J27l5p4N7J75k13R2j06K48l09J29k33J20L77m36K35
$$ 146 -1 -109 115 90 -128 -62 65 30 -44 13 188 -25 67 -39 209 -100 29 -204 -84 293 -143 92
5172I2j19N7M7l07R6M9l0j51K86J59j97j65J12N9J15k36J05O0Q6k6n0j32j14K09
$$ 92 -27 30 77 -230 -134 -85 -115 -266 20 179 -18 -183 -71 -12 103 -133 -28 32 118 92 42 -90 -204 5
5196Ek16K43P4j55j5J23j31J43l74M69k80J99j05j96R0L5P3kN1K58m64J71K91
$$ 5 -211 32 106 -49 -64 59 -72 71 -303 166 -114 85 -20 -216 -126 -91 -18 -20 31 289 -175 -4 287
5219B87m83K56mj36M1K67l10m8J2L65k09k92J38J08K3l0M7p8P1n0K35j78N8j80
$$ 287 -196 60 56 -80 -39 228 -82 -130 -118 247 38 -254 -116 -8 15 -15 32 -46 25 -25 210 32 90 -90
5243i0M2mJ25j48J46j35R3K2N6o5R3j32J87j69J6NQ5q1j70J60k9j14k46J56L32
$$ -90 -48 -52 73 -75 71 -64 29 51 107 42 135 3 190 21 37 42 127 46 -124 36 7 -107 -353 -197 135
5268A35m1j32R0K2J9k13K0J27p0K02l78K54Q3j08Q8l4j80q4K12j21K79j42K9M9
$$ 135 94 -38 52 74 93 -120 -100 27 -43 159 -219 35 118 10 98 64 -116 -200 12 -109 170 28 57 106
5292A06J8l12J06J81r0J53k27j1J48J0l02L9K76l93M9J33j14L00jk26J22J69k06
$$ 106 124 -188 -82 99 9 162 -65 -76 72 82 -220 -181 95 -298 -249 -116 -230 70 69 -157 -35 134 -72
5315g2k17M88r4p9q0j23M32l58O1J9P1k18O11n98M11k75J15J0J99m07j21L15p8
$$ -72 -289 199 105 26 -54 -177 255 -103 -42 -23 48 -170 441 -157 254 -21 94 104 303 -104 -225 90 12
5338A2L4k79K45O9l13J05P0r2J2k45N73k8n6l3J37l34K04r1J39k63J17N6k52K91
$$ 12 46 -233 12 81 -232 -127 -57 -149 -137 -382 191 163 107 74 211 -123 81 -10 129 -134 -17 39 -213 78
5362G8M6k21R6k2K46K5j98R6L32m84j74l0J20J20j44o9K82j48m7K79o3l2N8m3
$$ 78 124 -97 -1 -23 223 248 50 146 478 -6 -180 -210 -90 30 -114 -183 99 -49 -96 183 120 88 146 103
5386A03k7k92J89l5O1j03M01m94L42j78K3J83k55KM4o8J0K66J0l20K68j31k8P6
$$ 103 76 -216 -27 -62 -1 -104 297 -197 145 -33 -10 173 -82 -80 -36 -104 -94 172 182 -138 130 -1 -29 47
5410D7j70nK65Kk67q8K41K37l11l2J34j05O9lJ50j16m1j05R0O6j72L48j25k74
$$ 47 -123 -128 137 139 -128 -216 25 262 -49 -81 53 -52 17 14 164 48 7 -98 -8 58 -114 234 109 -165
5434a65L27q3m9R9J23n8p9L4l0r6j81K6L48k87l0oJ5J12m5R5oj24K8L8j8j5Q2
$$ -165 162 79 30 129 252 194 115 149 119 23 -158 -132 216 -71 -101 -107 -92 20 -25 70 64 -60 -32 6 -12 -27 55
5461E5p1K96j14l90J54n9L3K46l18Q2r4K25r2L6m3nJ8r3L39k13O3j57J51r0k17
$$ 55 -16 280 166 -224 -70 -129 -96 150 -168 -86 -180 45 -47 -11 -54 -59 -41 -134 205 -8 55 -102 49 -41 -258
5486b58L11j01K12j74n9P9r4L76k69j44J34R4k12K64j19N9j40K79o03L10n0n3
$$ -258 53 -48 164 -10 -69 10 -84 292 23 -121 13 107 -105 159 40 99 -41 238 -365 -55 -105 -158
5508a58J21J37j63J7R7l58K33qJ73k9p7J95j43j47L8j75L41k04J93j20m0o1J60
$$ -158 -37 100 -63 -46 51 -307 -74 -82 91 62 -15 180 37 -110 -72 -247 94 -110 83 -37 -77 -138 22
5531B2J16Q0k22N5j22L50j35k15m3L40k89O1j15q2K92j05l5j46j08K34P9Ll6o2
$$ 22 138 218 -4 51 -71 279 144 -71 -114 226 -63 -2 -117 -199 93 -12 -47 -193 -301 -67 12 15 -21 -83
5555h3N3J63k84K24j2j57R0J65j95q1J39R7k35J80j40N7m9K30j16Oj63J8K52k99
$$ -83 -30 133 -151 73 61 -96 -6 159 -36 -117 22 119 -116 64 -76 -19 -68 162 46 52 -111 -93 159 -140
5579a40P2j4J46k34M90l61J75j27l7kK70k89jK32R0m25J11K34rJ27l31L1n2P8
$$ -140 -68 -82 64 -170 320 -41 134 7 -30 -32 238 -51 -52 180 270 -155 -44 190 181 308 -23 8 -44 34
5603C4J73j60k75K65K09n7k6l49J72J55J6j41k08J36K65j47J8j23P1J13o8j40
$$ 34 207 47 -228 37 246 189 163 -186 -14 141 157 16 -192 -56 209 62 80 -43 28 141 73 -67
5625f7K23j41j21j7o3K52P0k05p0K52j03p5L9K38j74k07L08l52K05r1kJ02J27
$$ -67 156 15 -106 -123 -186 66 136 -69 -139 113 10 -65 -26 212 38 -169 139 -213 -8 -99 -101 1 128
5648A28k06L2K9r6N3r3L31J24l55Q9j48o0L7q2L19J43k93Q1J21r8K6k11J39j23
$$ 128 -78 -46 -17 -113 -60 -153 178 302 -53 36 -112 -172 -135 -217 102 245 -48 33 154 56 82 -129 10 -113
5672a13M21l58n1R5k5NK64k74P1j05n9J20J13j05k35M6K23j9j55p7L47k32N2J34
$$ -113 308 -50 -101 -6 -31 -26 238 -36 35 -70 -129 -9 104 -1 -236 -190 33 14 -141 -218 129 -103 -51 83
5696H3j10j15J15J87k3L8j05j37J92j7k70J47j09J54Q4l24J33K3qJ24J4J65j50
$$ 83 -27 -142 -27 160 137 175 70 -67 125 108 -162 -15 -124 30 114 -210 -77 -54 -62 62 76 241 91
5719I1j72L3K34l97J05K90j2m47M97j52j69K24j08l7k33P5R0J43R7r4O8j71J47
$$ 91 -81 -48 186 -211 -106 184 172 -275 222 70 -99 125 17 -20 -253 -178 -88 55 152 58 126 -45 102
5742A02k71L12o0j67K47l00L81l41J83j81J28k22L38j30J8N7j73L8j55K30J20
$$ 102 -169 143 83 -84 163 -137 244 -97 86 -95 33 -189 149 19 37 94 -79 -41 -196 34 154
5763A54J2j60j20J99k07L03k18K38k38Q4j22J24j20m4JL66m33K12k29K87J0j79
$$ 154 166 6 -114 85 -122 181 -37 201 -37 47 -75 49 -71 -115 -114 252 -181 31 -198 89 99 -80
$$ [...]
8191A45
##END NTUPLES=NMR FID
##END=
