##TITLE=1H_UK-23-3-1
 CD2Cl2
 8 sc, 
 28.07.2022
##JCAMPDX= 6.0         $$ Bruker NMR JCAMP-DX V2.0
##DATA TYPE= NMR FID
##DATA CLASS= NTUPLES
##ORIGIN= UXNMR, Bruker Analytische Messtechnik GmbH
##OWNER= root
$$ XWIN-NMR		Version 3.5
$$ Thu Jul 28 14:05:36 2022 Russian Standard Time (UT+4h)  she@DPX200
##.OBSERVE FREQUENCY= 200.1313499994
##.OBSERVE NUCLEUS= ^1H
##.DELAY= (6, 6)
##.ACQUISITION MODE= SIMULTANEOUS
##.ACQUISITION SCHEME= undefined
##.AVERAGES= 8
##.DIGITISER RES= 18
##SPECTROMETER/DATA SYSTEM= spect
##.PULSE SEQUENCE= zg30
##.SOLVENT NAME= CD2Cl2
##.SHIFT REFERENCE= (INTERNAL, CD2Cl2, 0, 15.7039)
##AUDIT TRAIL= $$ (NUMBER, WHEN, WHO, WHERE, WHAT)
$$ ##TITLE= Audit trail, XWIN-NMR		Version 3.5
$$ ##JCAMPDX= 5.01
$$ ##ORIGIN= Bruker BioSpin GmbH
$$ ##OWNER= she
$$ F:/spectra/data/she/nmr/H-F/1/audita.txt
$$ ##AUDIT TRAIL=  $$ (NUMBER, WHEN, WHO, WHERE, WHAT)
(   1,<2022-07-28 14:03:44.57 +0400>,<she>,<DPX200>,
      <created by zg, POWCHK disabled, PULCHK disabled
       configuration hash MD5:
       00 E9 B6 7A A2 85 ED C7 34 08 36 98 17 FE 4E 26
       data hash MD5: 16K
       16 A4 BE 03 11 2A A9 25 D9 F6 37 8F B8 F5 F7 CB>)
$$ ##END=
$$ 
$$ hash MD5
$$ A8 5D 00 8E 49 9D 08 88 99 50 BF 86 50 29 59 AB
##$RELAX= 
##$RELAX= 
##$RELAX= 
##$RELAX= 
##$RELAX= 
##$RELAX= 
$$ Bruker specific parameters
$$ --------------------------
##$DU= <F:/spectra>
##$EXPNO= 1
##$NAME= <H-F>
##$PROCNO= 1
##$TYPE= <nmr>
##$USER= <she>
##$AMP= (0..31)
100 100 100 100 100 100 100 100 100 100 100 100 100 100 100 100 100 100 
100 100 100 100 100 100 100 100 100 100 100 100 100 100 
##$AQSEQ= 0
##$AQ_mod= 1
##$AUNM= <au_zg>
##$AUTOPOS= <>
##$BF1= 200.13
##$BF2= 200.13
##$BF3= 200.13
##$BF4= 200.13
##$BF5= 200.13
##$BF6= 200.13
##$BF7= 200.13
##$BF8= 200.13
##$BYTORDA= 1
##$CFDGTYP= 0
##$CFRGTYP= 5
##$CHEMSTR= <none>
##$CNST= (0..31)
1 1 145 1 1 1 1 1 1 1 1 1 1 1 1 1 1 1 1 1 1 1 1 1 1 1 1 1 1 1 1 1 
##$CPDPRG= <>
##$CPDPRG1= <>
##$CPDPRG2= <>
##$CPDPRG3= <>
##$CPDPRG4= <mlev>
##$CPDPRG5= <mlev>
##$CPDPRG6= <mlev>
##$CPDPRG7= <mlev>
##$CPDPRG8= <mlev>
##$CPDPRGB= <>
##$CPDPRGT= <>
##$D= (0..31)
0 1.2 0 0 0 0 0 0 0 0.06 0 0.03 0 0 0 0 0.0002 0 0 0 0 0 0 0 0 0 0 0 0 
0 0 0 
##$DATE= 1659002623
##$DBL= (0..7)
120 120 120 120 120 120 120 120 
##$DBP= (0..7)
150 150 150 150 150 150 150 150 
##$DBP07= 0
##$DBPNAM0= <>
##$DBPNAM1= <>
##$DBPNAM2= <>
##$DBPNAM3= <>
##$DBPNAM4= <>
##$DBPNAM5= <>
##$DBPNAM6= <>
##$DBPNAM7= <>
##$DBPOAL= (0..7)
0.5 0.5 0.5 0.5 0.5 0.5 0.5 0.5 
##$DBPOFFS= (0..7)
0 0 0 0 0 0 0 0 
##$DE= 6
##$DECBNUC= <off>
##$DECIM= 32
##$DECNUC= <off>
##$DECSTAT= 4
##$DIGMOD= 1
##$DIGTYP= 9
##$DL= (0..7)
0 120 120 120 120 120 120 120 
##$DP= (0..7)
150 150 150 150 150 150 150 150 
##$DP07= 0
##$DPNAME0= <>
##$DPNAME1= <>
##$DPNAME2= <>
##$DPNAME3= <>
##$DPNAME4= <>
##$DPNAME5= <>
##$DPNAME6= <>
##$DPNAME7= <>
##$DPOAL= (0..7)
0.5 0.5 0.5 0.5 0.5 0.5 0.5 0.5 
##$DPOFFS= (0..7)
0 0 0 0 0 0 0 0 
##$DQDMODE= 0
##$DR= 18
##$DS= 0
$$ [...]
##$SUBNAM2= <"">
##$SUBNAM3= <"">
##$SUBNAM4= <"">
##$SUBNAM5= <"">
##$SUBNAM6= <"">
##$SUBNAM7= <"">
##$SUBNAM8= <"">
##$SUBNAM9= <"">
##$SW= 18.0517283424941
##$SWIBOX= (0..15)
0 0 2 0 0 0 0 0 0 0 0 0 0 0 0 0 
##$SW_h= 3612.71676300578
##$TD= 16384
##$TD0= 1
##$TE= 0
##$TE2= 300
##$TE3= 300
##$TEG= 300
##$TL= (0..7)
0 120 120 120 120 120 120 120 
##$TP= (0..7)
150 150 150 150 150 150 150 150 
##$TP07= 0
##$TPNAME0= <>
##$TPNAME1= <>
##$TPNAME2= <>
##$TPNAME3= <>
##$TPNAME4= <>
##$TPNAME5= <>
##$TPNAME6= <>
##$TPNAME7= <>
##$TPOAL= (0..7)
0.5 0.5 0.5 0.5 0.5 0.5 0.5 0.5 
##$TPOFFS= (0..7)
0 0 0 0 0 0 0 0 
##$TUNHIN= 0
##$TUNHOUT= 0
##$TUNXOUT= 0
##$USERA1= <user>
##$USERA2= <user>
##$USERA3= <user>
##$USERA4= <user>
##$USERA5= <user>
##$V9= 5
##$VALIST= <valist>
##$VCLIST= <CCCCCCCCCCCCCCC>
##$VD= 0
##$VDLIST= <DDDDDDDDDDDDDDD>
##$VPLIST= <PPPPPPPPPPPPPPP>
##$VTLIST= <TTTTTTTTTTTTTTT>
##$WBST= 1024
##$WBSW= 4
##$XGAIN= (0..3)
0 0 0 0 
##$XL= 0
##$YL= 0
##$YMAX_a= 33643
##$YMIN_a= -43969
##$ZGOPTNS= <>
##$ZL1= 120
##$ZL2= 120
##$ZL3= 120
##$ZL4= 120
##$ABSF1= 10
##$ABSF2= 0
##$ABSG= 5
##$ABSL= 3
##$ALPHA= 0
##$AQORDER= 0
##$ASSFAC= 0
##$ASSFACI= 0
##$ASSFACX= 0
##$ASSWID= 0
##$AUNMP= <proc_1d>
##$AZFE= 0.1
##$AZFW= 0.1
##$BCFW= 1
##$BC_mod= 2
##$BYTORDP= 1
##$COROFFS= 0
##$CY= 11.3945322036743
##$DATMOD= 1
##$DC= 2
##$DFILT= <>
##$DTYPP= 0
##$F1P= 2.36226072786647
##$F2P= -0.459571619588291
##$FCOR= 0.5
##$FTSIZE= 0
##$FT_mod= 4
##$GAMMA= 1
##$GB= 0.15
##$INTBC= 1
##$INTSCL= 1
##$ISEN= 128
##$LB= 0.24
##$LEV0= 0
##$LPBIN= 0
##$MAXI= 10000
##$MC2= 0
##$MEAN= 0
##$ME_mod= 0
##$MI= 1.114404
##$NCOEF= 0
##$NC_proc= 0
##$NLEV= 6
##$NOISF1= 3.799351
##$NOISF2= 2.8
##$NSP= 1
##$NTH_PI= 0
##$NZP= 0
##$OFFSET= 15.70392
##$PC= 1
##$PHC0= -18042.41
##$PHC1= 17.40068
##$PH_mod= 1
##$PKNL= yes
##$PPARMOD= 0
##$PSCAL= 0
##$PSIGN= 0
##$REVERSE= no
##$SF= 200.130013532006
##$SI= 16384
##$SIGF1= 3
##$SIGF2= 2
##$SINO= 400
##$SIOLD= 16384
##$SREGLST= <1H.CDCl3>
##$SSB= 0
##$STSI= 0
##$STSR= 0
##$SW_p= 3612.71676300578
##$SYMM= 0
##$S_DEV= 0
##$TDeff= 0
##$TDoff= 0
##$TI= <>
##$TILT= no
##$TM1= 0
##$TM2= 0
##$TOPLEV= 0
##$USERP1= <user>
##$USERP2= <user>
##$USERP3= <user>
##$USERP4= <user>
##$USERP5= <user>
##$WDW= 1
##$XDIM= 8192
##$YMAX_p= 0
##$YMIN_p= 0
$$ End of Bruker specific parameters
$$ ---------------------------------
##NTUPLES= NMR FID
##VAR_NAME=  TIME,          FID/REAL,        FID/IMAG
##SYMBOL=    X,             R,               I
##VAR_TYPE=  INDEPENDENT,   DEPENDENT,       DEPENDENT
##VAR_FORM=  AFFN,          ASDF,            ASDF
##VAR_DIM=   8192,          8192,            8192
##UNITS=     SECONDS,       ARBITRARY UNITS, ARBITRARY UNITS
##FACTOR=    0.0002768,     1,               1
##FIRST=     0,             0,               0
##LAST=      2.2672688,     0,               0
##MIN=       0,             -43969,          0
##MAX=       2.2672688,     33643,           0
$$ Real data points
##PAGE= N=1
##DATA TABLE= (X++(R..R)), XYDATA
$$ [...]
2017c67R21l36p31L47M57n38k70P71K54n83p5J31M22n53k02N48J53q24j17N65
2037b7M60p52r7P69J06m75J5L62m7m36l70N47J97l98k63N19Q2l92k12P02j77j86
2059g3l28P78j46o68J25R10l68m80J52N04k42m82J56P36l83m90J15N30j67p32
2079e53L45O29k15n64L91L53l98k92J16M90q2o24M22L93r3p05K92N53k57o13L43
2100f9M48l04q61Q11K99o62r4O98K89o36l08N98J42l74p70O99L06k25l12N34J25
2121C34n64j75N64L33o46n4N43K6n23k04M66M42p82k5P26n1p39KM35K24o46j89
2143e03R07j24n81j46P77r7l91J40K07p4m08Q5O38r9o48L66M89l51o20J35P04
2164D06k56n45J58N47m22l86M77N96m46m34J41N45m07l35L22N91m84l17K30L39
$$ y = [-367, 554, 218, -513, -166, 291, -247, -517, 254, 508, -75, -150, -19, 403, -150, -352, 196, 349, -475, -592, -27, 433, -319, -416, 353, 459, -16, -1, 361, 314, -122, -492, 55, 252, -146, -409, 110, 192, -200, -412, 290, 113, -73, -401, 377, 231, -437, -312, 598, 230, -250, -98, 406, 164, -318, -162, 574, 191, -299, -184, 346, 179, -553, -208, 421, 206, -358, 33, 386, -12, -304, -188, 302, 220, -404, 18, 411, 318, -387, -95, 458, 201, -412, -69, 379, 75, -786, 25, 324, -338, -432, 266, 555, -81, -389, 209, 351, -23, -793, -94, 212, -13, -325, 209, 334, -230, -405, 159, 492, -154, -208, 335, 361, -162, -366, 100, 542, -240, -265, 461, 410, -329, -327, 108, 332, -314, -503, 404, 280, -301, -447, 330, 233, -158, -18, 189, 115, -293, -208, 430, 331, -317, 49, 538, 187, -433, -298, 406, 150, -395, -237, 310, -112, -498, -21, 575, 129, -305, -164, 381, -26, -361, -39, 552, 68, -249, -19, 320]
2184C20j55m86L46M15m24m11K74M96l59m37N05K84m80k01L92K78m12k64M79J88
2204C48l81m35O96q1l70l64J098k44m60j3L67J44o38ML47L23m16m56Q46j67m60
2225c12K99L61j13k71j41M68k32n73L21N22L1p07L2O30J1o23K42M34o1j088O07
2246a63N63l23o49L61N24l07j23P4K41M6m60L53N07p11q7OO95l91o61N34M62n40
2268d9n66O45L55n76j82K57M18j78o61N60M53p58m28P37K44l78j51L11L21m31
2288e7k84M19K25m23l2M40P9p50K06M30j68k20p9L45L16o86p9N15R6p51J99M87
2310B28j04k57j0M72N2p60L35L43k72l09q5L13K61n56L39K14N4q21N57L99m30
2331c7k38J84M09k88l03K06N18l24n00K34N19n91l57N66N50k84n54M75N6l97n2
$$ y = [320, 165, -321, 25, 440, 16, -395, -121, 375, 16, -421, 84, 368, -112, -313, 79, 357, -55, -319, 160, 348, -33, -468, 228, 147, -223, -587, 511, 267, -193, -206, 161, 305, -333, -329, 18, 341, -75, -531, 315, 148, -312, -13, 348, 235, -36, -177, 291, 59, -514, -193, 329, 360, -347, -315, 315, 326, -297, -55, 379, 318, -770, -163, 400, 77, -572, -211, 313, 6, -117, -43, 198, 244, -216, 137, 644, -67, -154, -148, 547, 156, -505, 29, 491, -49, -615, 30, 385, -191, -373, -116, 302, 124, -537, 23, 476, -282, -710, 27, 271, -107, -258, 53, 374, -57, -341, 78, 303, -120, -152, 288, 367, -383, -177, 253, 85, -135, -214, 131, 447, -239, -318, 197, 293, -458, -259, 228, 124, -133, -143, 329, 381, -379, -44, 299, 27, -282, -367, -54, 207, -349, -10, 204, 258, -563, -6, 393, -37, -275, -91, 318, 30, -273, -67, 451, 127, -373, -139, 380, -211, -568, -2, 548, 264, -290, 185, 241, -156, -208]
2352b08J61L82j61m84L29M15l21m26L19K29k96k97M71L79n90m59O26J26l14m9
2372a68L70O2j16n62P81k5l57j43N03k00j57l96O16J67o40L6M42L10p23o4L37
2393G3K26o27K64K47q0k76J07J15N6n45M08K98K02m52k17O09l01n33O5O58l08
2414a1l59J74O94n10k14J38L02p6m99K32O60o11k01K40M17j89o42O35L84n54l92
2435c82N56K23n94k53L99M60l57k10K86L62o84R4K96l8l12j95O31j70j0l88P48
2456D62Mm80m24P56P0o35J59J57J0m52Q7L65K60n21P2L87R7l28k14L51j95k71
2478b83j00O98l17l82K66O86l92l71K47J60o5p48N77J58Mm10K73M84r1o34j3L94
2500A41j75l59L66N09k89n14L25K75o5p76N05O76n42l36L32J9k93j25M22K83p05
$$ y = [-208, -47, 335, 174, -310, 19, 434, 113, -313, 6, 235, -61, -358, 113, 492, -98, -557, 69, 195, -119, -168, 202, 264, 148, -414, 367, 342, -15, -158, 345, 145, -12, -408, 208, 375, -265, -229, 213, 523, -200, -264, 73, 299, -328, -64, 183, 103, -173, -66, 49, 105, -440, -32, 266, 468, 16, -201, 408, 107, -426, -361, 297, -11, -370, -196, 498, -12, -226, -88, 214, 138, -361, -129, 531, -80, -281, -41, 376, 187, -455, 180, 564, 10, -382, 174, 397, -197, -450, -51, 409, 52, -158, 128, 490, -194, -100, 196, 158, -154, -349, 282, 112, 102, -286, 462, 466, -14, -438, 318, 388, -247, -88, 69, 79, -373, -286, 79, 339, -182, -110, 277, 374, 46, -168, 183, -12, -283, -383, 315, -2, -384, -118, 568, 176, -195, 52, 212, 147, -601, -24, 134, 138, -272, 1, 485, 394, -240, -253, 141, -34, -393, -27, 482, 193, -321, 4, 279, 214, -562, -57, 619, 77, -259, 73, 92, -201, -326, 96, 379, -326]
2521c26n1N80M8k90k73O83J3n01l63K78O42m24k71O06J50o73K2L51L8l54k25O13
2543B73j66m63j28L75L99n02J9Q19m19j8k79K82r9l66k1L21J16o22J08N28K68
2564D25n86J9K98J7l97r1L72k7m39K72O31l12l69J97L82l03o44L24K79n0k46L38
2586I0K49k82j98K47J42k08n14N47M95n91l76M14P7j63r9K84L24l87m72O13J13
2607C05n55J78J25J94m97K1K88L37l19j54L84J56n48k57L54L22q55M8O26Km64
2628c09l2P88j29n15K28J62j4o22L3N17L33n08l8N80k47k27j58L59k20k89r0N12
2650A14j22k81p8Q07l19k08L27J81l1o32N6N54k97m16mO42j94m13M58L07n04p3
2672a26j99O78k19n99M81M03p21J06J04K60J6l67J79K52m25k61M55n3j22k02M72
$$ y = [-326, -377, 203, 251, -39, -312, 371, 384, -117, -480, -202, 440, 16, -255, 351, 501, -172, -150, 201, 239, -115, -340, 273, 107, -356, -484, -109, 290, -212, -193, 626, 207, 189, -90, 192, 93, -273, -294, 27, 143, -479, -371, 157, 425, -161, -142, 156, 173, -224, -315, 57, 30, -409, -137, 494, 182, -187, 10, 392, 89, -555, -231, 48, -2, -248, 90, 339, 57, -141, 106, 248, 40, -474, 73, 568, -23, -399, 15, 92, -71, -170, 114, 438, 51, -421, 192, 305, -250, -72, 53, 247, -250, -229, 59, 396, 77, -77, 307, 463, -85, -342, 12, 334, -521, -473, 153, 155, -309, -341, 447, 318, -197, 31, 193, 179, -443, -410, 107, 440, -68, -106, 474, 227, 0, -158, 201, -19, -308, -398, 114, -8, -289, -367, 440, 121, -87, 240, 421, 390, -242, -186, 368, 71, -345, -349, 293, 99, -314, 144, 451, -53, -126, -325, 353, 134, -465, 16, 419, -302, -196, -92, 168, 184, -183, -4, 248, -177, -438, 17, -36, -158, -360, 112]
2693A12J56m75M6K54P6l75j71N33j64j24m15O36K62l68k95M07L14m54m6J94k22
2714a19k65R3K73K4l50K77L02j6k12k07N50j19q22M57K26Mk60l61P87k75l5j76
2736b24P68n92k15K33J52j55l41J08L97O7l58L0N95k34m44N05j38j07l64K21L79
2757B83j68j52K22J98q6o03M89K67l57k82j11N84m59j65M52K59l22j48K53P9j87
2778D6k39M09r2j92k00L13K43n41j30Q00l79m01J77P8M35p21j73O53J91p5l61
2799a59L22J98k74j91M07o9p63J85K32J18l01K37M77k76O3m70N81k42l73J89J31
2820B2j79k41K02J35R5k27L65M63n35k86o1K94J7l01KL76k01j05K88J59k62r7
2842g7l4L95l68j08J57K19n34m4N01L72l60k51K25K00k59k01N7K52k11n33O73
$$ y = [112, 268, -207, -161, 93, 169, -206, -377, 156, -8, -132, -547, 89, 351, -17, -312, 95, 409, -45, -91, 103, -119, -384, -291, -18, 6, -344, -67, 235, 219, 7, -200, 350, 231, -591, -134, 92, 96, -164, -525, 262, -13, -48, -224, 544, -48, -263, -30, 122, -33, -374, -266, 131, 198, -160, -130, 465, 231, -213, 292, 154, 47, -317, -96, 283, 115, -37, 185, 383, 297, -306, 183, 450, 93, -189, -300, 284, -175, -340, 112, 371, 49, -99, 154, 233, 46, -193, 216, 124, -68, -268, 45, 288, -253, -383, 417, 38, -363, -186, -108, 327, -394, -567, 86, 277, 202, -159, 163, 361, 87, -104, 303, 234, -529, -344, -112, 6, -295, -58, 419, 143, 206, -264, 317, 75, -298, -109, 22, -157, -398, -196, -61, 34, -193, 172, 635, 100, -186, -247, 47, 64, -237, -235, 141, -60, -165, 123, 282, 20, -77, -111, 284, -84, -192, -35, 184, -350, -394, 107, 479, 119, -132, 93, 293, 34, -167, -110, 142, -69, -602, 71]
2863G1J17l97N9N99j73l21l98O25q1k84o8J85L30k07L2J60O8k67k40K26K14n22
2885b72J26L72m66M3k1K70J07m34K12M36k55j85j30L62k43j74J75M05p8l19M12
2906C43l1l41j8j75K74k71m5K28J1k5m8K16J0k06j27K10L53l06j14k2M34n57n0
2929b57K90J45j63l27M43M13n34l90K31K42k4l79L41J59k60p7N74rl87k36L48
2950A43Q1n23j22M60J00j93J10J08J04r2k12L61l34l65j7L00J74m22J02J81L47
2971B91j63r0K6Q3m86J71L10k13l82K26M37J41n42Q9N11j15n77K25J45k00m11
2992e24M59K88j66j75N7N25k63q2j80K52m21q7M6M49l04l42N37K34m56J07L40
3013B94j72r6n88O56J06j67o15N31M10p12K31M04p1M8l56K85K3m96K49j0M4j93
$$ y = [71, 188, -209, -150, 449, 276, -45, -443, 182, 101, -183, -251, -66, 264, 57, 89, 249, 317, 50, -190, 36, 250, -272, -146, 226, -240, -197, -218, 52, 159, -275, -63, 373, 118, -67, -197, 165, -78, -252, -77, 328, 250, -69, 343, 312, -29, -47, -222, 52, -219, -264, -36, -25, -50, -98, 118, 128, -78, -205, 5, 358, 52, -62, -84, 350, -207, -257, 33, 178, 15, -312, 131, 544, 10, -380, -149, 93, 69, -310, 31, 190, -70, -147, 427, 418, 31, -205, 143, 224, -299, -421, 39, 139, -54, 56, 164, 268, 176, -36, 325, -9, -374, -391, -91, 83, -339, -237, -56, 291, 128, 38, 64, 147, -339, -168, 142, -71, -453, -227, 210, 351, -191, -102, 409, 294, -283, -58, 87, -113, -524, -65, 223, 57, -118, -61, 464, 201, 119, -61, 191, -230, -317, -271, 178, -126, -468, 69, 303, -153, -46, 294, 122, 26, -562, 94, 200, 33, -582, -51, 359, -353, -122, 282, 211, 259, -97, 188, 211, -285, -36, -46, -2, -195]
3035a95J11M21o0k45k09M91k87j60Q0N3J87m71M51j9J24n55K08L80j79q7l2J52
3057A59m21j7l4L43J12l28L39J62Q6o02L15K21k26k37j34K95j3j39O6M99k16k00
3079C0O4L8o3l87L80J09j90k90M64R5k97O7L56N0m74l95K38L08j81l34K89J60
3101C7j87R0J81K48k51J06j95j4j35J71rq2m1j29L82O7k61J54P8k87q1l07L66
3124i9K1r6J00l7K92k28r9K62R5l23k12L4M15l65l7L21M3l20J60M40L0n75L26
3147A48J23k24l10Q5J77K19l57K39J06m9k06L09l5k97k06j19M52l59L4J02L94
3168B26j75j43Q4L40l97j29J01m8J06l96L41L10l11l9L20M6k62P1p1J66k88j70
3190c18K19L48k16l65M88J86j76j93L58J69o49m2J01q5n9j2J88J51l74K91J22
$$ y = [-195, -84, 337, 277, 32, -177, 314, 27, -133, -53, 0, 187, -284, 167, 148, 272, -283, -75, 305, 126, 39, 7, 159, -262, -279, -313, 30, 142, -186, 153, 315, 401, -201, 114, 335, 109, -128, -262, 33, 20, -119, -53, 446, 230, 30, 94, 132, 69, -318, 62, 171, -19, -309, 155, 250, -47, 20, 376, 426, -48, -443, -205, 103, -78, -412, -123, 37, -150, -60, 121, 369, 118, 224, 29, 15, -120, 51, 42, -40, -81, -210, 172, 239, -22, 132, 210, -77, -158, -465, -99, -78, -174, -74, -111, 181, -47, -146, 116, 211, -112, -324, -290, 125, -240, -277, 44, 87, -233, -73, 367, 397, -178, 148, 271, 47, -263, -178, -1, 218, -139, 100, 206, 157, -49, 260, 225, -72, -278, -397, 55, -304, -270, -168, 226, 51, -92, -8, 332, -65, -194, -93, -141, -35, -431, -90, 220, -91, -130, 190, 236, -26, 45, -26, 140, -148, -318, -99, 249, 33, -332, 156, 342, 166, -27, 331, 500, -149, -191, -90, -175, -234, -246, -58, 93, -281, 10, 132]
3211A32p8l14L16L21n05lk63M06M1k25L01P0n5j04j01J09P8j59j96M25k81k29
3233c14M20J77n9j46j34J69j54k38K13J46j11j45j75J91N06m17J30K92j08n88
3253c45K99K33j63m57L62K01m75L64L3N24m62j28L82l6m87m01L98J88J4j19J9
3274e6O51n40j34J60J72k82k22O10m24l95J88K00L72l68L0L43k06j38PQ0j25l9
3296a16l2J78n2J03p9J68l8k60J68J46j95j32J28J95j57k57L37J85l2k89N44m10
3318A03q0k85L00j3k20k91M67K46k19jK57o9n8k74j64L20jk61K74J25j89k5j42
3341b00L51Pj25r1M71l53m08K81J52l29J68k4M37q6l49L34j35l28M2K61o4j04
3363i2N3j48L25j96K17Q5L3m80J21l2K45j33k55L44j12O8J04K71J41l12k42J9
$$ y = [132, 54, -260, 56, 377, -128, -131, -394, 12, 53, -172, 129, 199, 144, 40, -61, 48, 126, -33, -229, 196, -85, -314, 106, 283, 224, 78, -56, 113, -41, -279, -66, 80, -31, -176, -351, -160, 346, -71, 59, 351, 243, -345, -46, 187, 24, -433, -71, 130, -345, 19, 52, 576, 114, -14, 368, 332, -155, -556, -158, 30, 44, -75, -56, 595, 55, -79, 81, 253, -29, -251, 359, -65, -460, -272, -72, 300, -68, -38, 305, 99, -39, -32, 48, -77, -116, -148, 30, -22, 81, 2, 170, 132, -128, 40, 186, -9, -141, -13, 182, 25, -232, 105, 290, 258, -31, 513, 103, 23, -262, 38, 25, -195, -486, -19, 227, 8, 7, 264, 195, 137, -137, -301, 19, 18, -243, 31, 156, -33, -58, -200, 151, 158, 33, -58, 413, 60, -348, -67, 85, -244, -76, -100, 337, 251, -98, 236, 101, -227, -185, 76, 12, -92, -39, -187, 138, -58, 159, 244, 277, -203, -82, -114, 131, -2, -257, 87, -25, 43, 147, 418, 559, 247, 5, 24]
3385B4J38k87l21L31J41j27J82r6K66n45L12L10k29j31j58K17j55j98L24K58j71
3406H5l10K14L70j64k00N1J41n21J95J21M8J92n38L89R9J00j32j5J60m77P4J03
3428a5k09K95k2K58L8n00J55K51k04J64l22N1n4j68K91Q5O2j28L6K17J35l48o9
3451aL9p4j77j94K58K90l44J96k84M80k60j46N31l78j44J50J26o4l9p1L85l64
3473h5rM65j62L2l71OJ74Q2k87k7L77j0l18K11R2l17J44k3J86k18k96J53J37Q0
3497A6k65O17k71N9k74J86k6j04j45J04K91m4k06o1K94k73J01J64K31m43r6L13
3519A68r8m05K35J96p9pk48L72m2j35J03J68k45l04J24j18M27j03K2k0J78m39
3541b50L67j2o6k13l8L78k67j67M05j9j65n3P2M84k12m04Q6j5J53j40j18L54k07
$$ y = [24, 162, -125, -446, -115, 26, -101, 81, -15, 251, -294, 18, 328, 99, -32, -190, 27, -128, -326, -2, 256, 85, -225, -11, 359, 195, -5, 46, 187, -334, -139, -18, 30, 222, -316, 73, 172, 272, 140, 125, 285, -192, -118, -15, -224, 71, 49, 307, 345, -155, 0, 251, 47, 211, -111, -60, -114, -282, 9, 94, 156, 28, 64, 281, 416, 68, -1, 38, -36, -213, -407, -149, 141, -203, -7, -291, 189, -71, -217, 314, -64, -208, -58, 68, 4, -35, -106, 279, -85, -94, 371, 209, 241, -130, -124, 50, 132, -155, -182, 195, 185, -133, 78, 170, -147, -3, -26, 160, -58, -354, -201, -64, 16, -249, 368, 97, 156, -118, 68, 42, -62, -207, -103, 188, 144, -62, -123, 171, -102, -1, 163, 394, -49, -145, 168, 70, -335, -100, 96, 17, 10, -238, 134, 92, -43, 60, 228, -17, -321, -197, -315, 112, 9, 31, 11, 189, -250, 117, 105, 39, -174, -212, 166, -101, -268, 137, 118, -47, -100, -28, 456, 244, -160, -74, -89, 64, -76, -194, 160, -47]
3564d7j86K64K26M6n73L39Q3j32l84L02l7j13J00J67J30l25P2K10Q0l09j12rJ24
3587h4j01J6K40j29N4j09K81j18N5l23m0K41m1j89K70K56l00J03p8Q2k55O5l4
3610a38M3K8j02L14j04r8j05M26j24q5kj57L28l69k5J66j91n9O0K79K6k47J17
3633a9K38k91n1J19kR8m31K55J95k03n2K37K7L4k63R1J38q5k76J52K21n3j27l3
3657h1L43l90J97j83M31j88l16Q0K04k00qJ43J45j10J1K1K35l33j53R1R0l0k28
3680b29K86O3j92p5J95J65k21l92N97k87P3k6j14J90k06J89J67k0o8j57J60r1
3702GP9j89J18K13l25L61j51l6L5j81K87j90j95P6L11j94j16J88r9j05p8K31N6
3725A03m8m5J0N9j71J10j97J08P2j18r4L99k8k45J00J71K3l81q7K19p6p0J61m5
$$ y = [-47, -233, 31, 257, 303, -270, 69, 152, 20, -364, -62, -99, -212, -112, 55, 185, -140, -68, 142, 222, -87, -199, -208, -84, -185, -169, 71, -58, -4, -113, 168, 50, 105, -218, -258, -17, -58, -247, 23, 279, -21, 82, 4, 86, -169, -104, -138, -95, -67, -169, 145, 41, -57, -162, 264, 140, 55, 53, -104, 224, -145, -170, -4, -195, -254, -194, 85, 111, -136, -19, 219, -72, -123, -4, -6, 92, -339, -84, 111, -92, -144, 93, 120, 154, -109, -18, 120, 35, -241, -89, 132, 79, -48, -81, 262, -128, 69, -114, 317, 129, -187, -107, 97, -103, -111, 32, 177, 67, 78, 99, 334, 1, -152, -61, 29, -1, -229, 57, 120, -72, -147, 48, 213, -8, -400, 197, -90, -17, -43, -157, 33, -173, 16, 183, 163, 95, -62, 98, 7, 86, -103, 15, 228, -97, 264, 113, 77, 112, -69, 218, 28, -167, -91, 220, 26, -90, 98, -1, -106, -184, 47, 103, 55, 10, 20, 79, -92, 18, -179, -71, 1, -117, -211, 188, 160, -85, 15, 186, 209, -172, -259, -40, -116, -186, -25, -70]
3749g0J51k1M2J21j19Nm9p9k90O6K19j9K20j62n9Q4O7k6Q4K38n74k6j02L55Oo0
3775BK26j63q9j9L3J20j44k68K16K82k45J3L3O8M7j37J58k51K31o5J72j44o3j55
3799a42K13k47K2K89R6q2l10L41P3l05k43K87R2k58L13J51m21K46l3J98l9k30
3821A1L2j51J00j55R5j2L12r5n5J42j49j64K12k45L49k96k0j4P8P5l74M89j35
3844C0J89j12N2J19m16m6J22J77r7n3R6K4k15r7L19k8k07J13j39L02j16k6J38
3867A29j60Q9l31N17m15K45m8JO5j82J94J53l24K7O2K06j04j92Q1J09l14l7K70
3890D1L38l97P5J09k01J93k72J15J20k94M3j32J79k23K89K31p6j84L0R9J00k80
3912i7J00l17L01J94m51N08j86j35N2m8O0o6P5J14p1J2j56N3L4k73J02J68J24
$$ y = [-70, 81, 60, 102, 223, 104, 109, 60, -19, -309, -243, -24, -43, 177, 15, -44, 40, 107, 81, 165, 403, -171, -197, -299, 56, 62, 2, 228, 65, -24, -43, -10, 110, -34, -302, -86, 196, -49, -36, -3, 65, 112, -25, 133, -118, 113, 48, 220, 76, 13, -142, 71, -176, -154, 135, 231, 149, -161, 180, 253, -52, -295, -8, 84, -174, 139, 290, -131, 115, 82, 280, 241, 11, 43, -108, -8, -163, -68, -80, 232, 137, 82, 224, 75, -89, 123, -122, 227, -69, -89, -103, -25, 50, -324, 165, 30, 219, 107, 159, 278, -138, -184, -62, 115, 18, -35, 61, 85, -130, -227, 92, 64, -143, -30, -169, 133, 17, -9, 129, -31, 58, -273, 244, -171, 74, 26, 27, 92, -90, 104, 257, -67, -40, 22, 228, 124, -68, 13, 122, -192, -229, 41, 379, -18, 57, 166, -35, 158, -114, 1, 121, -173, -130, -262, -83, -306, -17, 214, 138, -46, -16, 83, 183, -97, 3, -314, -13, 181, -270, 238, 52, -83, -31, -79, -19, -85, -10, 104, 33, 45, -111, -58, -24, -297, -195, -27, 97]
3935I7k41J95p0J09j82n3O0j8K0J47L3J41k94j2K24k42N8m7K81k8j21j25L12j04
3959A40r2r7J87O5n12M82j96J4k98J73P1J4l8K03J67l35M0k34M33k63J39l3p0
3982d0K32m87L37n4K26k85J08j81K00lO1K23n19O4JL35k70jN9R3o8n9R8k19K16
4007F7k80P0N5k6p9K54qk56L62p0J47j98k20L10J8m1k00K94l5l56K93M9l86K54
4031A8j23J98j46j32LL04j42l0J50P1J45k78j54N2K08p4j10pj36J8Q8L45o28J72
4055a88J41J57k68mJ85J8m14J11L50K0l5j98K69oj4m3j96L40j79O6j67K24l43
4078a74K0j1M10j52k85N1M77l39j23J98p3j09L5K91l7n1o7k38L39j65J02m1k09
4101a51l3L00j01l9R2PJ54k77k46M01j86m7l9N7K0K01Q5p0J29l88J29O4K4j33
$$ y = [97, -144, 51, -19, 90, -92, -145, -85, -103, -83, 64, 97, 238, -56, -68, 156, -86, -28, -75, 206, 178, 57, -68, 244, 140, 48, -49, 138, 203, -309, 173, -23, -9, -307, -134, -63, -49, -87, 116, 283, -52, -12, -246, 187, -76, 63, 30, -40, 192, -295, 42, -12, 214, -71, 37, -144, 56, 53, 114, 337, -182, -118, -117, 218, -52, -53, 6, 99, 31, -28, 70, -149, 67, -213, -143, -88, -114, -193, 61, 53, -203, 159, 89, 236, 38, -182, 128, 146, 105, -95, 199, 164, -192, 101, 150, -236, 18, -105, 93, -53, -185, -182, 122, -20, -50, 100, 171, 316, 38, -116, -64, 144, 70, -40, -47, -183, -165, -77, 268, -360, -188, -47, 110, -158, -162, 23, 41, -373, -262, 88, 108, 73, -125, 144, 138, 124, 81, -115, 225, 46, 112, -55, 169, -174, -154, -165, 245, 93, -192, -141, 336, -3, -126, 72, -1, -110, -75, 216, 179, 128, 61, -177, 162, -3, 99, 58, -151, -184, 116, 15, -24, 68, 75, 229, -48, -294, 107, -79, -126, -165, -108, -88, 113, 198, 128, 257, -131, -2, 62, 86, -47]
4125d7J83l3k21R4m5K01M7j21P2k75L09l36J26J27J8q7N7J2J64k77P3jO3k5j96
4150a18J89j56Kj79K73R2j54p1K62j21k11K58k07nK67q4L7J7k00k29K30n2L33
4173A73l14L14r1J2j81q6j61K83q3K04J13j87L5M1j8j14J35j55O7j37Q7K08m4
4196A01l07N2K87k46J54l1L09m47j10K48Q2m4M5j2k31L28l2k68K29l29M7J28P1
4219B4j18k9J75J43k38R2J50m24L00l04J80M1k6l1K27J0l00J46K06j56M2j52P1
4242B9J36j7l84K27K62l08nJ39r8n4p9K81P6k73q8K42j00q9R1K10n84L13L4M26
4266C87m01j42p3L37l48L69j03J29P6j98l07J89J03n6K38k74Q1j2J68n9J84m18
4288a30L20k82j6j05K25N6j53K35k85J06n5J0J73J87j94k88J20L00k20J66j53
$$ y = [-47, 136, 103, -118, -24, -69, 132, 179, 58, 130, -145, 164, -172, -46, 81, 99, 12, 69, 81, 245, -32, 41, 40, 103, 78, -118, 71, -85, -83, -262, 11, 103, -51, -122, 140, 19, -192, 66, -141, -146, 121, 37, 74, 91, -109, -338, -108, -160, 173, -141, 173, 82, 94, -87, -173, -334, -51, -134, 70, 183, -4, 31, 72, 54, -60, 75, -80, -13, -150, -63, 145, 101, -206, -154, 133, -113, 41, 10, 319, -128, -238, 10, 92, 48, 93, 81, -150, 178, 146, -122, 107, -222, -175, -47, 24, -94, -123, 52, 195, -43, 49, 199, -225, 75, -229, -49, -8, -34, -65, 162, 172, -128, 18, 224, 68, 110, -42, 29, 165, 148, -236, -9, 253, -55, -60, 79, -19, -73, -152, 129, 205, -68, -156, 86, -14, -103, -12, 198, -386, -73, -39, 387, -14, -156, -229, 108, -240, 129, 26, 155, 231, 33, -274, -85, 18, -38, 200, -74, 7, -5, 163, 104, 288, -130, 190, -92, -108, -213, 12, 68, -85, 150, -135, -29, -84, -74, 99, 286, 92, -196, -76, 224, 4, 170, 17]
4309A7P4k17J71L6n8k29P4K81j25k22K08K9P2k83L18k89K68N8k73j17M05l49P5
4332g6R6j7j39J67J59p8J5k99K3J87o6J69r3p2q0j13K69Q2r5k54L44m7Q0l82M45
4357B25j74J50k55K29K7j69j51J00Rk3j25L53j14j74N2J89j15l41K87j26R9o6
4379a13J13j50Q2J12m3L0j68P6r7L76l54K25k64P6L1l1J90Rj40J7l01L47q6L6
4403b7n2J55n2j83L67k22Q4j21K56p3J5j03j29J72J42k06k1R4j08K7L9LL4J44
4427B35j82j87L66k58O1j45J10J78k09n4K5Q5l0m7j02J44k6J58k61j52J78J1J01
4450aj85J60o0J16j46J86J42m7k26P9j15J9LM9K8k3J90k34Q2o3J56L1j4j6j41
4475c0J04m3K7K10l50j39K48j19L37l20l8J88k10K72j20J23k68L45k29K54Ok56
$$ y = [17, 91, -126, 45, 81, 23, -206, -132, 149, 24, -198, 10, 39, 111, -172, 146, -143, 125, 183, -90, -207, 198, -151, -76, 20, 3, -136, 31, 190, 112, 127, -172, -149, 38, -28, 141, 48, -24, -104, -217, 52, 134, 39, -215, 129, 82, 162, -220, 225, 51, 201, -54, 175, 202, 33, -118, -18, -9, -32, -157, 196, 82, -92, -40, 149, 34, -307, -20, -146, -47, -113, 0, -150, -68, 44, 1, 31, -137, -61, -158, 218, -136, 89, -175, -99, -68, -99, 91, 100, -40, -23, -324, 23, -63, -27, -79, 76, 24, -159, 208, -14, 70, -51, 205, 132, 147, 44, -85, 87, 229, 23, 2, 96, -12, 15, 54, 57, 91, 235, 53, -134, 232, -26, 35, -110, 0, 178, -31, -85, -60, 25, -5, -52, -154, -10, -36, 122, -139, -291, -113, -102, -1, -186, -26, -86, 30, -116, 70, 212, 165, -61, 18, -97, -78, -75, -26, 2, -21, 169, -65, 17, -46, 110, 141, 127, 111, -30, 74, 31, 58, 268, -82, -221, 27, -92, 245, -75, -113, 75, -135, 137, 17, 140, -128, 217, -12, 242, 248, -8]
4497hN1n8j22J7L46k36N5l9J2o2J19k7k4J27R4l97n5K49RQ1k87L03j26j8n7J29
4523G6J27j55R0k23J7J25j89J34l34K56J22j0o7m8L20M2j70k43J64j52L2K42J61
4546C17m77L31j36J82k29K5N1J5J49l58O9m0J77J04k79K91j95kk5L01k10J50j74
4569C7J07l10R8K1L3J32k01R7n2j05K58j97N4J4mK62k55K56l04r0J01R2o5J72
4593A51k42K44m61L91l3J4q0M4N9M3k10J67L2p2N2j19MQ6j48J87k12L70o31L49
4617a5L27k04o8k5J6j18J35m4K94l88M3K79k15J42o5rQ6K4p2j77M9j57J04J40
4641H2l5j52jK06j97L6RL89j41r6j39J1Q2j15j54J39J41K7k35O9J94l74M10j95
4665c9J14P1j44J71N2l02J69j29M6j83J33J43j83J56k46P3P5q7J00m7J31k37K21
$$ y = [-8, 43, -15, -137, -120, 226, -10, 45, 6, 18, -44, 75, 48, 24, 151, 245, -152, -207, 42, 51, 132, -155, 148, 22, 4, -53, 76, 203, 48, 138, -85, -68, 57, -132, 2, -332, -76, 46, 36, -31, -79, 241, 283, 113, -130, 34, -118, -86, 156, 317, -160, 171, 35, 217, -12, 13, 64, 79, 228, -130, -61, -101, 76, 180, -99, 192, -3, -5, -30, 271, 61, 211, 37, 144, -166, -68, -47, -14, 118, -83, 14, -38, -143, 115, -82, -28, -14, -18, 244, -11, 245, -59, -149, -48, 44, -21, 151, -91, 153, -308, 83, 50, 64, -16, 28, 87, 130, -80, 87, 119, 47, 99, -20, -16, 70, -78, 109, -103, 267, -364, -15, 312, 108, 40, 15, 31, -87, 48, 4, 298, -90, -47, 232, 17, 159, 94, 85, 171, 195, 123, -54, -5, -162, -58, 82, 47, -105, -106, 100, -97, -61, -52, 337, 196, 100, -39, -28, 54, -61, -215, -76, 65, 92, -143, -74, 120, -254, 156, -39, 75, 146, 2, 173, 225, -77, 92, -37, 9, -174, -41, 102, -81, 75, -171, -98, -23, -110, -10, -57, 74, -163, 58]
4688E8L5M5k4p6K24k76n5j41QK78k10M9lJ06p2J51R7m14J13M4J07j30j42N4K78
4713A04Jn9O9k48J82j51j92M11O4k20r3L35k72j9n0K39p0p5K26m83L27J77j83
4736B0J20k78J58p1q2L0j61M61Q4l18O5N4P5l11M69m51J73l6o8K43ml47J35L14
4760B74o10L68J28j42n9J38l06L45N0l06J66o2o3j59K73k9J0j07M1J33lk45J10
4783e5L03n6l17J59L7p3k62K00l4m3j07J55J68J4k02j35J74J97k05N31j64m16
4805a31P5K81q5j52J27L9m8m7k28J73o2L40j31j75R8j73J1j06K49r3j84N74o25
4828b73P3K37R4j89l6K56J35k61k60Q3L39q2l21L04J05j42j08N9J34l75L47q4
4850C5J82n16K81L4J35k00l4J24M9k86J9L07J58l42j16K71J34j75j62J56M7m4
$$ y = [58, 93, 138, 114, 38, 262, -14, -69, -210, -202, 76, -134, -85, -88, 18, -54, 97, 194, -220, -107, -63, 44, -86, -228, -174, 104, 105, 46, 115, -133, 49, -102, -294, 117, 181, -39, -132, 203, -69, -88, -138, 101, 31, -44, 182, -301, 26, 203, 20, 140, -138, 20, -51, -133, -103, -264, 197, 281, -37, 28, 82, 157, -154, 315, -136, 37, 1, -67, 176, 172, -175, -40, 274, -336, 32, 160, 18, -41, 97, -209, 136, 186, -120, 46, -16, -79, -238, 35, 6, 16, -91, -50, 83, 80, -165, -55, 248, 192, -125, 34, 71, -2, -264, -64, -98, -141, -248, -93, 75, 89, -113, -248, -74, 123, -82, 449, 285, -131, -56, 225, 140, -12, 115, 154, 106, 59, -169, 4, -58, 282, 151, -24, 74, -99, -88, -194, 55, -38, -222, 352, -273, -200, 37, 131, -58, -94, 162, 297, 36, -224, -141, 198, 116, -205, 99, 204, 62, -46, 13, 147, -228, 119, 35, 217, -299, -18, 16, 151, -49, -83, 41, 90, -196, -177, 130, 288, -54, -170, 101, 235, 60, -102, 54, 101, 57]
4872E7k48M1J22l8j08K99p5j18PJ50k41K09L7r4J63l95J12J55L0j38j40J55J40
4895H2q7j49K86l8m3k35M97k79j25J43j32K02j77q2R5J96r9p8k0k22L33j44N4
4918b2K5J18k11K15k3j15q1J53L7l09L49K10j92j61p3L1J7R6L09m0n37J63P8M7
4942H4k69L22l10L70j02k23r2J69J40j55J97k58Q9J03J49j97O8k49J32N5j70R7
4964e0n8N3P0p1j3K82j57j67K35j23K8J13j60k5k15k0L35Rk72K35R4k87J5p9L04
4989G6k15K77l52K26L05l24m4k2P2n2J66j88J33jN7l01J21J21l67K68P5K49k42
5012C8NNj38J19j40J82M6j0p7q4m5j7J90mL3k3j99o5K34j28K05l64J17K29k71
5037a62J33m1J87r7Q0k09j8J76J51l25K22n5j80j4J30N9j74J03J09p5L75m25k9
$$ y = [57, -191, -150, -28, -66, -174, 125, 50, -68, -61, 89, -152, 57, 94, 0, 163, -232, -120, 35, 65, -73, -213, -58, 82, -5, -154, 132, 94, 51, -184, 313, 34, -91, 52, -80, 122, -55, -137, -42, 154, 55, -23, -43, -265, 68, -76, -22, 3, 121, -90, 125, 102, -13, -94, 59, 96, -213, 136, 346, 154, -7, -80, -49, -32, 64, 373, 333, -204, -41, 37, 84, -185, 137, -173, 197, 95, -128, -220, -51, 89, -66, 131, -127, -38, 65, 214, 17, 85, -164, -32, 23, -147, -50, -108, -55, 15, -56, -69, 213, 56, -111, 124, 1, 29, 142, -18, -43, -258, -278, 57, 66, -206, 29, 123, -164, -149, -228, 76, -139, 138, -214, 12, 317, -7, -51, -73, -1, -53, 113, -75, 58, 57, 114, -187, -66, 55, -312, -44, 31, 280, 38, 43, 48, -90, 29, -111, 71, 117, 107, 30, -54, -99, -116, 74, 70, 103, 80, -119, -184, 50, -78, 127, -237, -120, 109, -162, -29, -70, 117, 20, 100, -109, -127, 49, 200, -125, 97, 42, -138, -152, -22, 37, -137, -34, 75, 0, 375, -50, -79]
5060g9K72l73J44j08J93k27J48R8q3r1J19M8oR3j86m2R5j71K20l0r1l2K03M2l09
5085a53K16K5K23l52j68J50K75m15M3K22J34Mj25M3k64J6m5L23j2k78L00j53o8
5108e9M3j30K58k51J96r9J0j15J54J06j74Q6n2K5K89m28K73l81L40P4j98o3J76
5131H0o6P3k58K34q9o9J24j75nK22J9o5P1j70K6J71k24N9K72k28J45K3%K56o70
5156b44K91O3j57J63l6L3n9j16J73o4n3Q8j23j64M4K32q9M7J49k89o9R0J95p3
5180C2j43nRq5K54k74J00K23N9k9mj38J17j66R0j77P2K54R0j45j86L0j3L75l83
5205d3J59k51L9L0K44j50o9j5J92j09j41N3J70k17O8n0J34M5j22j38M2J59J13
5228A43o0P0k53J29j6K85j59k80L80q5j7p2j63J34l0J6k67K04j81K42K22r5p9
$$ y = [-79, 193, -180, -36, -144, 49, -178, -30, 68, -15, -106, 13, 61, 55, 148, -38, -80, 15, -156, 64, 34, -57, -89, 114, 156, -153, 63, 88, 311, -41, -209, -59, 216, -199, -156, 66, 200, 204, 79, 122, -142, -126, -171, 152, 140, -138, 162, 9, -59, -16, -146, 112, -139, 57, -42, -32, -147, 7, 113, -61, 25, -27, -2, 287, -141, 132, -249, 91, 165, -33, -96, 80, 14, 87, -171, 63, -26, -95, 29, -146, -151, 71, 90, 25, 96, -74, -48, 123, -101, -42, 230, 2, 147, 170, 170, 426, -244, 47, 110, -47, 116, 80, 113, 54, -62, 111, 47, -6, 82, -41, -205, -161, 71, -18, 29, 178, -111, -180, -90, 105, 32, -111, -116, -107, -192, 62, -212, -112, 111, 170, 141, 137, -1, 116, -50, 40, -137, -65, 189, 279, 134, -52, -22, -35, 340, -43, 116, -135, -96, -66, 178, 28, -41, -56, 136, 27, -114, -61, 109, -108, -40, -90, 44, 89, -33, -171, -129, 30, 143, 83, 153, -100, 29, 13, 298, 139, -141, 239, 154, 137, 65, -98, 36, 6, 22, -245, -41, -222, 20, 242, 147, 68]
5251F8j42K01k88J49j91M3j5%Q9J10l19K74J12j84J20J43k35L6K64j26j6j10r8
5274a15J7j9j47J51J82O1j59J08k03K57q1K45l76p7J25j08J91J6o6J60k51R7o3
5297e5k0N5J59o8P0M9k10j6J20j24j04K34j84R2j18J95L4m1q2j33J67Q7Q5j81
5321A1J53j45J12l39J83M9j4qM2j95M3K80m87K31Q4L2O6J3j40N33m08l22J46Q1
5345AM3k65L37m8mJ8l4j4l8R6M2j16j01l2Q2J69j75J46J78k01N9l0j54P0m5J19
5371A03j0Q4k90J81J1j01J45j09n3q8J43k69M11k29M4J24k89K08q7L17k04j38
5393i6J61j07K96j47m18J11J18J17k45L36j43o0k4K44R4k62j59P1J33O6M2l90
5415b62L32k2k61J10J18L8MJ09j89LN4Q0j09O2Q2n4j81k4J11O6n1q7J75m75K83
$$ y = [68, -74, 127, -161, -12, -203, -160, -175, -175, -86, 24, -295, -21, 91, -93, 27, 170, -65, -29, 235, 109, 93, -17, -115, -98, -117, -264, -113, 69, 130, -29, 79, -124, 133, 52, 297, -79, -156, -31, -139, 52, 68, 2, 162, -89, 8, -55, -75, -20, 139, 71, 141, 190, -20, -36, 84, -40, -144, 90, -94, -2, -120, 75, 109, 68, -14, -147, 20, 107, 192, 11, 164, 19, 131, -208, -25, 24, 10, 2, 44, -151, -108, 172, -315, -84, 0, 32, 98, 111, -29, 504, 96, -226, -80, 1, 44, -221, 116, 68, 64, 82, 48, 34, -4, 92, 134, 18, -83, -115, -33, 136, -39, 107, 285, 84, 143, 113, -41, 29, -16, 103, 93, 177, -113, 68, 79, -22, 123, 14, -39, -127, 16, -253, 158, -71, -27, 97, -192, 16, -71, 246, 42, -96, 65, -42, 254, 107, -311, -200, -82, 35, -210, 126, -17, -77, -101, 143, 237, -25, -184, -113, 20, 86, 128, -262, 70, 48, -213, -103, 15, 53, 57, 166, -23, -20, 34, 114, 5, 67, 149, 95, -86, -110, 1, 67, 16, -71, 104, -371, -88]
5440h8m5K62l5j13j0m3K66j70l6q5Q5q7M05l63N5j21M7J31j76Q4J98k39J9l5p6
5465a70J55m6J58k49J39J24j04nk25J38J44r0j27J85m4j46O9J52j58K5L77J4m7
5488B69k21R2j10K94m45J85n1k79K07K00k45K59k79K87l66L64l20R8N6N3j36L03
5510B15n51K08K4L60m15K57m1j24k2M2oR7lp2l02L29o8k33M67k39L92n37L97j58
5534A7L21l17o7n9L58m34R1J45l03L33j81K77q7k48J62J6P8l63K13M27m53j19
5556a93K61K90m28M4k75N24m76K60J15k16o9K84k1Q2J2l10L28M3j41j74j92N06
5578B54m81M84K0m37q2L53j48L58m70R6N2j63J64M8j67J14K03m87L46j19J80k44
5600a26K30j74J29l45J94N3O2r6L05j25J37l50M9j39KK55k5M4j9l09M61k60Q6
$$ y = [-88, -133, 129, 94, -19, -29, -72, 194, 24, -12, -97, -12, -99, 306, -57, -2, -123, -76, 55, -121, -37, 161, -78, -59, -94, -170, -15, -61, 97, -152, -13, 111, 7, 2, -223, -85, 59, -31, -158, 27, -17, -163, -94, 58, -100, -75, 302, 316, 269, 48, 140, 30, 324, -121, 64, 13, -266, -59, 141, -104, 155, -124, 163, -203, 161, -159, -61, -5, 48, -88, 215, -336, -128, -104, 256, -159, 98, 57, -67, -89, -47, -53, 44, 41, -31, -333, -4, -72, -305, 162, -77, 315, -222, 175, 17, 338, 21, -46, -105, 253, -181, -90, 55, -248, 85, -96, 181, 94, -154, 8, 24, 102, -261, -48, 379, -74, -193, 68, 358, -70, -26, -301, 223, -253, 7, 122, -94, -163, 121, 100, 182, 194, -116, 212, 255, 114, -60, -252, 254, -227, 257, 277, -160, -242, 111, -37, 321, -149, -53, -1, -164, 0, 48, -119, -5, 198, -289, 57, -62, 118, -126, 104, -70, 59, -286, -92, -39, 23, -73, 232, 107, 244, -106, -57, -196, -194, 61, 36, 80, 61, -248, 213, -47, 39]
5623C9j29K87p7k9k27K43L2j90N2o2J20k38k8J69m6j09K71RJ75n62J53L50m47
5646b44J97M0k1j55J53j61J74m4J1j9Q5k6J58j47j43J35JMp2J27j51J71J00Mk08
5671c1J78k90J17O7K20l54K02k9k9J15j49m0K73k36k61mL35k5N9k65K65J1l8l17
5695b26M18j14k10J53j72K82k57j86O18l70K53l42j47J67J51J31k05P7M7q8R3
5716G3k11K26J9n9j9j60J25J04J62m29J46J03j19Q1k13L93k08o3P8L9j65J11k20
5739b06J62LL1J00L9j86k92L88L4k02j14M67k2j9k47K52r5j0j56j66N22k63j58
5762a38J63l2o0J65J37j38o1jJ07j2n64J76J42N9KL5J1k67K04J7J42n3R3j42J35
5787A20j5j47L3K2M7n9R2J69l87K11PJ15j61q8k03K82j35R5O6L8P5l31L53j74
$$ y = [39, -90, 197, 120, 91, -136, 107, 139, -51, 1, -61, 59, -179, -207, -38, -84, -193, 78, 87, 262, -300, -147, 203, -244, -47, -7, -28, -183, -30, -191, -17, -61, -50, -69, 16, -10, 148, 1, -142, -7, -6, -2, -74, 53, -98, 73, 173, 177, -31, 147, -143, -26, 41, 261, -93, 109, 80, 51, 166, 17, -23, 250, 14, -247, -251, 84, 59, 118, -147, 118, 129, 91, -226, 192, 78, -132, 21, -151, 131, -126, -312, 306, -64, 189, -153, -300, -133, 18, 149, -56, 21, 68, -20, 73, -138, 88, 107, 48, 29, -131, -6, 98, 260, -169, -23, 80, -39, 42, -171, 222, 14, -49, 29, 68, -97, 14, -206, -44, -41, -10, 90, 129, -57, -349, 39, 73, -129, -243, 224, 202, 183, -64, 188, 93, 83, -73, -239, 283, 20, -138, 25, -7, -67, 98, 235, 97, 36, 35, 142, 130, -434, -258, -116, -57, -55, -20, -9, -276, -72, -55, 87, 34, 127, -15, 120, 105, -42, -9, 13, 60, 1, 93, 262, -125, 86, 93, 208, 47, -41, -244, 38, -97, -2, 64, 102, 177, -154, 199, 25]
5811B5O1j49q6J86j13R6m9J88pk13L1K88l73m6J44K46l11j77K58j18Q7o1K18k3
5835A02n2j64J01K50j47k19P3J44P3k96K88k68r0K00N4L3j39J08j24j38J20L03
5857B12j21L0K1k50K44J11l17K93j01k06K2oRJ74k52J67j11J78l52oK35l39K38
5880a27j42J95j27J12N1L64j53m33L63k01J74K24p00L18j18J87j16J46R2j58j8
5901f7QK45j21j74k30N83l72l2K73q7l33K61j17M9K61n4o3j41k6K39k24O2J53
5924I3k4m7j64K53pj73Q0j00P9K9k66J10J83j2NJ39k42J26J29j95k4p8M2J07O8
5949A11m9o2O2l01O3K86J1O3r7N2q3K5o9j16K43l18K90l96K73M4q9J75k79L32
5973A71j09p4K62n40P5L2O6J39J53r6M6j75jJ09Q1k16J50k20K47j20j60J50QJ16
$$ y = [25, 86, -63, -149, 37, -76, 20, -29, 159, 152, -61, -30, 258, -115, -161, -17, 229, -82, -259, -1, -119, -32, -93, 125, 102, 50, -114, -13, 237, 90, -129, -56, 88, 161, -135, 153, -115, -205, -5, 49, 82, -57, 51, -73, -211, -91, 212, 91, 121, 142, -108, 136, 247, -70, 223, 122, -84, -62, -68, -59, 115, -137, 30, -81, 97, -255, -261, -26, -365, -127, -269, -74, -201, -89, -38, 326, 173, -260, 103, -98, 76, 300, -400, -82, -200, -13, -129, 17, 109, -49, -67, -59, 186, 65, -109, -339, 244, -128, -160, 113, 26, -307, -46, -163, -114, 147, 93, 30, -111, -137, 102, -122, -60, 93, 69, 22, -142, 111, 104, -69, 11, -89, -10, 19, -247, -137, 46, 34, 39, 178, -64, 62, 191, -4, -28, -106, -64, 43, 111, 62, 0, 62, -239, -176, 110, 121, 184, 87, 139, 56, 81, 12, -104, 139, -179, 111, -285, -12, 32, -57, 118, -161, 171, 62, -12, 250, -290, -215, -183, -117, 22, 175, 79, 125, -50, -51, 58, 139, -77, 73, -147, 100, -20, -180, -30, -22, 94]
5997I4J09k05K25m5m25R0K11N2N5j57K90k28J13k3j60l1N2N5M0j39l0K17k32K21
6021A49l16J49j28K85m8j34K5l0P0J12j11J32j85N6RjJ8O7j0r2j85K05j00M32
6045C69j80On0l66J14r0O8P8o1PL48j40j35j08p8K20k0J30j80J07K5j48J3k1l
6070i5L32p0Q4l15r3L77q3J9j74J84k6j69O1K10l91K36J46j72j4J29l8j29lp8
6094g2J71pj36L6J46k09K9lk17N86m35M99m56J22p9J6P1J57l85J6K17j62K27l11
6118a79K95Qj53J31K1k9j99J66j84J03p5J05K1k02J65K12q2J81l80L9K14k00k7
6141d9J44J60m45K6L1K42j72j26J75p3K28j81J1j12J31o9K03k03J24j89R0K16
6163A62j97l2L0K17j28k61J55j22J8J45J05o1M9j22M7O1m00K08L18j44k57N0L08
$$ y = [94, 203, -2, 223, 178, -247, -157, 54, 106, 161, 4, 294, 66, 179, 156, -4, -35, 17, 72, 112, -27, -57, 160, -72, 149, -167, -18, -146, 139, 91, -43, -18, -48, 22, 134, 23, 155, -30, 26, 35, 34, 52, 119, 109, 17, -168, 37, -63, 369, 189, 195, 145, -221, -107, -197, -129, -51, -112, -105, 243, 103, -32, -140, -218, 2, -18, 112, -68, 39, 64, -84, -71, -92, -95, 237, 167, 251, -64, -157, 220, 137, 156, -18, 166, 140, -29, 32, 242, -149, 87, 233, 61, 47, 176, 138, 9, 6, -72, 99, 92, -44, -8, 138, -71, -42, -45, -262, 324, -111, 388, -68, 54, -25, -9, 62, 219, -166, -150, 67, -95, 132, -179, 116, 124, -29, 102, 123, 94, -105, 61, -123, -20, -95, 10, 31, -171, -6, 206, 124, 305, -75, -36, 178, -22, -49, 95, 255, -190, -164, -133, 109, -63, -189, -14, -87, 141, -40, -29, -141, -10, -79, 124, -79, 45, -144, -54, 162, -35, -67, -37, 180, 52, -209, -54, -176, -158, -13, 92, 31, 80, -42, 5, 66, -334, -126, 192, 48, -209, -159, 149]
6186A49k22J69K44n84L73p4n0J72j47J74j90J49j78R0j34J20j12mjP8QK1l62N21
6210B10k3j65k14J34K54l50J90J09l68K75q6J17o6N9ql55J22J86rR7k90J42j62
6233b01K25n0J6q0n1J74j56K32L8j31L7q5J26j96j88M05k09L2kQL03l65J43j08
6257h3J72j02N9J71l45r2J93p2p6K93j17M9j24M0R3k66K70k33K54J12j58k40N57
6280C55l96J35k91K38O0r9o9l9J60K3n6m2J59n%J26r2j68j91Q3J21k53J01K7P2
6305d1Q7j22j08J64jK16m20L49k3k17J61l0j91L94k96J92k35Q8J42j17J33L7J
6328A63m34K51l2J55M6n1k84J85o7K00Q2J54k19k63P1M1J34j31j61K41j36L8k50
6351b67K5K34l47L02j5j4k7J6l7K52k36K05k41O7L19l99K40j04q5J33j53Q9R7
$$ y = [149, -73, 96, 340, -244, 129, 55, 5, 177, 30, 204, 14, 163, -15, 75, -59, 61, -51, -55, -56, 22, 30, 51, -311, 210, 187, 22, -192, -58, 196, -154, 36, 145, -223, 52, -34, 83, 17, 76, 68, -287, -165, 21, 12, 109, -181, -39, -201, 24, -26, -10, -90, -141, 33, -123, 109, 147, 16, 53, -32, 94, -102, -290, 115, -94, -62, -64, -56, 247, -118, 25, -83, 89, -13, 46, 217, -128, -220, -27, -99, -175, 118, 1, 50, -74, -34, 59, -207, 63, -170, 84, 196, 38, -202, 355, -41, 94, -197, 41, 101, 2, -67, -106, 54, 77, 21, -21, 138, 133, 133, 259, 167, -1, -192, -109, 12, -241, -140, -113, -41, 46, -76, -184, -20, -21, 195, -225, 124, 101, -116, 45, 15, -176, 218, -78, 114, -121, -33, 109, -8, 125, 162, 163, -271, -20, -52, 103, 149, 98, -186, -1, -68, 132, 214, 368, 149, -114, -43, -2, 132, 1, -160, 81, -55, -17, -267, -242, -8, -355, -53, -68, -82, -109, -93, -130, 122, -114, 91, -150, -83, 236, -163, 77, -27, -112, 21, -132, -43, 54]
6374E4l2Q3j92R1Q0L88m65k08%K99n2R3k98N16m04K29Q1m13J68j19J63m4o1l2
6398g5K64j57j8j06j99L81K07k91K80m12r8K52J57k65M3N8k7L52l83j37P6J41
6420D3j31J31J35k69J77p7j07K13q9J33j05k76p7L06N3o3j4K10j11l3j38j2K38
6443A37j11j22K48k69K25l89L28r9j81K91J01k14J11k22NL07k21K30J33p6k90
6464g8P4J54nk8k85K84j94K56j91l4j14P3M8m5J84Kl16L74j06j29j18R3K48j28
6488A9q0K39l23J2K79j34K83m16R7l4J85j0r0ol84M04Q2N6r6r4l7j85K90mk72
6513b19L01l3j21l3Q0K4J06rM5Q6j37j03k9L15o4n4k51J16J97k24K56k99l84N36
6537A02PN1k98L7Ko0j25K33K0Qpl9K46j53R0j5j03K75k30K46m25K23j01r5K30
$$ y = [54, 22, 105, -87, 4, 84, 472, 7, -201, -201, 98, 46, 139, -159, 357, -47, 182, 263, -150, 18, -101, 62, 18, -43, -75, 189, 32, 14, -92, -291, 90, 297, 6, 286, -126, -224, 28, 185, -80, -37, 21, -6, 346, -37, -174, -98, 43, -88, 43, 178, -91, 86, 9, -98, 115, 26, 159, 54, -222, -299, 7, 60, -3, -17, 193, 82, 49, -89, -101, 137, 26, -96, 152, -117, 108, -281, 47, -52, -233, 58, 159, -55, 56, -166, -161, 146, -75, 155, 288, 212, -78, -4, 150, 145, 117, -168, 116, -78, 178, -13, -47, -161, -88, -40, -85, 99, 101, -215, 159, 53, -76, -194, -101, 147, 19, -61, 178, -145, -133, 146, 12, 295, -121, -24, -58, 127, 117, 27, 21, -363, 41, 123, 179, 83, -11, -48, -233, 57, 53, -219, 82, 49, -72, -105, -25, -1, 105, 96, 141, 227, 90, -13, -42, 273, 209, 155, -96, 20, 217, -7, 249, -50, -434, 102, 109, 160, -138, -101, -99, -159, -284, -51, -31, -23, -30, -69, 177, 24, 114, 99, -4, 271, 41, 287, -138, 85, -16, -111, 119]
6562A19j18J17k13Q7K2J19O6k7k94J92p2Q8j02k54L86j63P6j95J34J61k31K19
6584A17O6j47j19J67R9j37p6M9K75k24k04O5R8j39N29l31j7L8j33q2J3l3OL78
6608B58k70J42j22j07P1o6K0J97J52j93k50P2K77j93p5J10m9O0j16k84L45j73
6630a94J97J14q3q2j8rJ09q9n8l6J58j84J57K22l7k84J0J68J37l72M3J17O1k1
6654B6o0q2mK65l58J27K51k10j35K34O7m0m01M70r8MJ08j01M0j36q3J00k41J77
6678h0K02%m9nL7rK3l64Q4J6L04k4k65R2nL9j7q9J36j90O8k5P2L7kJ44j66J60
6706A24K7j09o2Pj5J62k66L11m1L1k14m6J89J63m08L2O0J89k24L7O2j6J09J8r
6731A11j6l20P6K14k8J07k51M4J35j25p6J66R2J87l75J00q0M5k4K50k65l1j47
$$ y = [119, 1, 118, -95, -8, 14, 133, 199, 172, -122, 70, -2, 86, -16, -270, 116, -47, 29, -166, -32, 129, -102, 117, 183, 36, -83, 84, 183, 46, -30, 19, 294, 70, -134, -69, 29, -110, 419, 88, 71, 109, -24, -106, -93, -126, -120, 258, -12, 130, 8, -99, -28, -94, -74, 123, 275, 82, -168, -96, 181, -12, -87, 23, -26, 34, -82, -366, -21, -194, 3, 117, 34, -48, -66, -75, 34, -55, -113, -149, 9, -175, -18, 204, 167, -117, -107, 61, 198, -174, -131, -14, 47, 26, -34, -116, -120, 145, -213, -86, 165, -45, -180, 54, 121, 81, -320, 150, 52, 56, 164, 63, 103, -33, -116, -16, -257, -80, 122, 122, 73, 68, 105, 96, 119, -245, -161, -145, 159, 135, -130, -38, -43, -4, -21, -110, 26, -164, -96, -121, -49, -12, -14, 130, -36, 124, 151, 42, -20, -13, -28, 134, -132, 179, 138, 169, -45, -91, 98, 261, -147, -115, -55, 134, -90, -53, 9, -7, 102, 120, 111, 95, -225, -149, 65, 37, 144, -107, -63, 72, -53, -129, 37, 129, 316, -59, 41, -39, 6, -18, 232, -33, -64, -211]
6754b11J85p5K6J83j73M2J9j41J63J36j90j21L07R4l43J9K24p1K9K4j02J13l63
6777b26J76J21m1J63j73m5K14o5k65J39P7P2j53k53K45N7j85J8m1L03j87K06M9
6800B06j33jo1m6q6K07j08p8mK30J14k47n2JK41j04P4J28k63R5k05J95K9j74J71
6825A29j04q6k58J78K38k89K80N5l8J95r9k92o9MJ88ll1K88n17M07P8j65N8j25
6849B2J98p7l18M57m09L97r0j88j2K04N1l40M0K63j33j64K04J83q4k18J33j29
6871a0j21pp6K58j93K33J16k01k84M36k46J09j57K06n2l60N65l79K64M7l02R2
6893f2J42j92N0Qj43K11qL31o44J36K57l4O3o3j71J15l5N8j9j06K54k95J85j16
6917g8J42P2k33K39k13j44J74K59k39J05q9k4J44o5k15K13j54M5Q8Q5j62j74K37
$$ y = [-211, -26, -101, -75, 108, -65, -23, -4, -145, 18, 154, -36, -157, 150, 244, -99, -80, 144, 73, 102, 126, 24, 137, -226, -50, 71, 30, 193, 20, -25, 189, 124, -141, -2, 75, 147, -6, -259, -14, 43, -142, -124, -165, 138, -49, 157, 206, 73, 72, 11, -35, -121, 86, -22, -100, -104, 126, 240, -7, -59, -58, 183, 79, 153, 281, 18, 113, -92, 103, 132, -42, 129, 25, -61, -319, -141, 97, -192, 88, 143, 105, 300, 201, -91, -160, -156, 32, 29, -2, 286, -231, 176, 254, 89, 147, 22, 220, 143, -175, 282, -127, 270, 180, -8, -20, 184, 235, -105, -65, 198, 65, -99, 105, 288, 204, -14, 119, -10, -131, -138, -214, 44, -149, 84, 200, -1, -285, 151, -95, 14, -143, 63, 11, -349, 216, -163, 101, 148, -154, -62, 80, -112, -62, -54, -197, 14, 6, 337, -307, -171, 86, 52, 115, 52, -119, -4, -39, 19, 0, -106, 148, -147, 38, -78, 64, 136, -97, 142, -71, -215, -41, 218, -21, 84, -5, -29, 115, 50, -165, 48, -106, -61, 27, 112, -50, -224, 13]
6940A3m4M6n5O8J82j39k48J35l0O1r5R0j4J28J05j04k71K41j30k50L81k68K33
6963C5j2p5J80n1M6j19k14K09J2L8j12J84l0j14q9J51p4nj2Q7p5l1K52j90K6n2
6989c5R5j08K48r0j05Ol5K26l31J5J30J82k98J01K0k07M4J30o4po6L5J41O2k23
7014a34J29o1Kk9K36l1j76j98M73k8l95L30k36L44l74J18M0L84l38k03K14K34
7036C01l60O4J34J56m65J51j21n5J39J49j75J00J91l93M52l40J60k25K29k6M3
7057A09k92J32m6J53J88k48J78k91J93m1k90K69j39J74p2n2K28k62J0K4J27O9
7079A21p7j15n9K06n6j32M3OK67j59j25k4L49m06oK20J1p5K00l67K12j02j0n9
7103a37L5J08r0L02j82Pj62m9J63qr8l7M01K8k55L0J11j53j8M6k8p2L32L4m03
$$ y = [13, -31, 15, -40, 28, 210, 71, -177, -42, -72, -11, -106, -16, -30, 98, 203, 99, -172, 69, -61, -311, 70, -198, 35, 23, -52, 128, 77, 123, 4, -210, -1, 11, 49, -63, 121, 91, -23, -112, 39, -35, -40, -52, 35, -40, -71, 181, -9, 17, -35, 60, -48, 200, 110, 5, 11, -24, 202, -129, -114, 16, 198, -100, 1, 21, -186, -142, -12, -76, -83, -149, -114, 27, 89, -134, -5, -66, -64, -93, 143, 112, -64, -262, 211, 183, -212, 118, -118, 226, -148, -30, 10, 394, 56, -147, 67, 301, -59, 5, 139, 295, -170, -19, -140, -195, -56, 93, -82, 18, 209, -184, 268, -72, 88, -137, 92, 66, 109, -183, -51, -97, 56, 244, -4, 174, -117, 76, 35, -255, 14, -125, 49, -23, -75, 153, -109, -99, -75, 52, 121, 44, -71, -130, 76, 20, -112, -69, -63, 204, 45, -80, -104, 245, -161, -167, 53, 64, -11, 189, -178, 34, -68, -78, -137, -102, 6, -84, 218, 36, 43, -119, -168, -5, -13, -111, -148, 253, 281, 26, 56, 167, 14, -4, 42, 14, -58, 274, 308, -95]
7128i5R0%J56l22K88K7J0l21M9%k77L58k1j13K67k59M1Q8N8M6l64N22m61k18P05
7153B54j45M6m8k68N6L18k62J03j43R3k35Q2Q7J24l30R6J14o6J39j40O4j4J79
7176A04j84k05M14j60N1j15O8M9N1J9j06K5m4J89n3m3QN2j18j56J29R3j47j70
7200b49K90K5j42o8L53k49K70j98J21m4J53j16k25P2K04k51n1j34Q4K85l10L53
7222A73k48k0J09R8m14J07J37K1p7k7J34p2j49R9L04k00K04j95J4p9j56L04j77
7245a10K0P0r7L22k60P6j47K7J01k5P3m1J1n3n5j10J29J51m3k6r6M6J9J85l8j98
7271f9K02k20J47J34k6l94J63n8K41N4k14M8O9k5Q1J5m5j23k9N6j83M85l28k67
7295b86J39O4Q3k9m3J21j10K20k00J37l49M68J09k99R9j57k1KM0L1j79J39jlj0
$$ y = [-95, -5, -5, 151, -171, 117, 144, 154, -167, -118, -118, -395, -37, -58, -171, 96, -163, -122, -34, 24, 70, -294, 228, -233, -451, 254, 109, 155, 107, -161, -105, 213, -49, 54, -89, 4, -231, -149, -62, 62, -268, -172, -58, -124, 15, -125, -61, -75, 104, -80, -285, 129, -31, 20, -95, -27, 22, 73, 92, -14, 11, -33, 156, 103, 60, 68, 120, 2, -154, -25, 68, -79, -249, 41, 66, -76, -144, 209, -40, 230, 32, 153, 109, 262, 146, -79, -7, 197, -54, -105, -239, -155, 130, -180, 173, -75, -95, 14, 112, -302, -195, -58, -37, -114, -141, -7, -79, -228, -129, 175, -25, 179, -16, -2, -81, -237, 67, -110, -90, -20, -117, 205, -55, 21, -126, -99, 2, -23, 50, 9, 20, -33, -88, -198, -69, 82, 39, 13, -83, -37, -18, 167, 129, -69, 133, -87, 60, 194, 168, -226, -63, -121, 120, 174, -40, 8, 77, 52, 133, 148, 103, -20, -49, 7, -176, 309, -19, -286, -147, -83, 0, -29, -72, 49, -61, 159, -41, 96, -253, 215, 324, 25, 124, -33, -54, -52, -12, 19, -160, -21, -22, -25, -35]
7320c5J16j93J14K9K07j77l35L07k05j58J19M37j91Kk27K85j76O7R6l00K12J34
7342A28j70J13Jj14n7K08r7l8M7Jn0o0k3O6R7O5J09j65j11J54J2j12K3JL8j18
7368e2Qj49N3L34k66L3K27k42L32j92j17Qn4K49j65l3k22K96P4j81L9l5mK52k01
7393hJ8O4J32l79L75k75m8K93k28j96K79J53m83K94J14j79K7J15k67K73N2j04
7415B2P3k30M7Q4J18p1q0J01j14J28l36K58K45m13K29j33l4J68n5J28j89k6J44
7438F4j22m1K17j31j89L58k07Q1O1j20J36j62J14k03J44R0O9m6j21Jm6K50m38
7461b41L19j62J59j8m9K66j39m0j23L62l45nJ27j48j81Q8K8P0r1K81r8n9K09j19
7485I1k14J12J11l23J40K11j75j1L6k06L02j78k5L38r5p7k38kM3L6J89P0l7j75
$$ y = [-35, 81, -112, 2, 31, 238, 61, -274, 33, -172, -330, -211, 226, 35, 37, -190, 95, -81, -14, 82, -218, -6, 128, -42, 71, 72, -42, -99, 109, 12, -26, 21, 22, -28, -88, -111, -45, 52, 117, 226, 61, -50, 104, 116, 4, 27, 28, 66, -52, -44, -193, -140, 194, -72, -39, 188, -54, 278, 86, -31, -23, -77, 172, 7, -26, -248, 48, 122, -59, -20, -55, -59, 193, -8, 10, 74, 206, -173, 202, -73, -121, 172, -56, -252, 27, 180, -303, -9, 105, -74, -47, 68, -199, 74, 126, 22, 95, -135, -88, -4, 114, 43, -37, 64, -50, 78, -258, 0, 245, -168, 61, -72, -106, 62, 7, 135, -54, -80, 64, -58, -99, 118, -13, -202, 156, -51, 30, 91, -29, 107, -55, 59, -144, 0, 90, 159, 113, -8, -7, -53, 197, -241, 78, -84, 75, 57, 8, 274, 135, 95, -28, 334, -11, -16, 111, -37, -218, -130, -102, -32, -123, 158, 60, 1, 210, 91, -123, -11, 100, -223, -83, 128, -47, -58, -22, -228, 74, -104, -129, 209, 114, 37, -201, -203, -160, -124, 65, 135, 98, -77]
7509g7R2j64J21Q9j9l54L96r0kk83L32N2j40q2M6K54o5Q4k37K65j51m17K81m6
7533a15N9J84k08J27J85k90j9K12L2j02j64J85J50m40L01Kn2J99l53l1L18k6j52
7556BN5Q1l42J64P5r3J32k39K93j27L0p2M3L08l45j51J31J5L97n47J1K28k98J35
7580a14M18p8k83J91q3o4j5J36j68k12M10l03K00%K36n3j65j50K0K53q1j69j19
7603a93R2K5L62k91K64j25%j60k86L81j86P8P9om6mO0L8p0j2j52M3M4P6j34P4
7629d9N0L4O5l08J56r2J81P9j42J26J31j71j10j51J93J10k7k24J76j48J71k90
7651b40K12%o7J25J68j71j04K5J43k77K52j23k49N32k40O4M6k89J41k40L16J43
7673A67l24J26o2J58k42L60p0Q0k83J23J3j0m0K19k00k05R2ml2P4k0J2J32k83
$$ y = [-77, 15, -149, -28, 61, 42, -312, 84, -6, -8, -291, 41, 93, -47, -129, -83, 171, 106, 190, -47, 218, 67, -350, -69, -115, -56, 128, -80, 47, 232, -58, -77, 135, 167, 65, -99, 86, 236, -204, 97, 99, 47, 246, -107, -138, 180, 154, 2, 57, 138, -204, -40, 35, -58, 74, -165, 128, 1, 31, -41, 2, 310, -35, -186, -55, -40, 357, -190, -179, 49, -249, -114, 304, 226, -57, 134, 51, -13, -28, 108, -60, -272, 138, -165, 35, 35, 271, 218, 53, -97, -77, 176, 95, -74, -193, -101, -76, 286, -5, 259, 134, 134, -26, -312, 69, -117, -39, 40, 34, -12, -16, 44, 82, 12, 0, -152, -109, -65, 11, -123, -49, 1, 35, 100, -208, -52, -144, 37, 116, -26, 100, 231, 60, -50, -201, -8, 102, 75, -149, 27, -121, 50, -240, -28, -28, -95, 30, 198, 27, -77, -52, 91, -186, 66, -57, -306, 226, -14, 50, 96, -193, -52, -292, 24, 167, -157, -31, -93, 65, -177, 183, 113, 193, -90, 33, 46, 36, -4, 215, 15, -190, -98, -102, -134, -60, -80, -68, 64, -219]
7697b19K91O7j66K7j62J11N9Pm7J09m0m8j94K72p0qK63l17J01J5j22J31j81K65
7721A44J0L8j81k06m4K91j78L04j5m51K05J57j01L51m44L1L10k49p3L9k7J0J47
7744F8j46J63j75J80l6j8o5J66n1l40K27J2Q7j70K02J20N3m12K36l8q6k25K2K57
7768C1J35j63o2K04l21K36o0j57J66O4q8l5N9L53k81j1O1j26r1J01k08K81L7p8
7792D7j22j4Q0j32n9R1n2j32L46N4j92MO0J22n0j24L26j47Q0j52k31K9N9n9pr7
7818b72K79J01Q0m02K50J46O3k79k7P3L8j50K12j75LJ76N6l11L9P5L3L1k28M38
7842B49o2o2j3J5j34K42m27L08k68J18L5J51m60K67Q8q6J8k65K56Q2k50O4K60
7865A26n6R9p6k45J83n7j03j6L15k41L7J78k26J57j4m1j87J41o6K84L2j36j07
$$ y = [-219, 72, 139, -27, 0, -162, -51, 8, 15, -32, 77, 37, -11, -205, 67, -3, -11, 252, -65, 36, 51, -71, 60, -121, 144, 154, 192, 11, -195, -239, 52, -126, 178, 163, -288, -83, 74, -27, 324, -120, -89, 221, -28, -101, -62, -89, -79, 68, -78, 85, -90, 90, 54, 36, -29, 137, 86, -254, -27, -15, 72, -98, 104, 224, 277, -135, 101, 63, -23, -248, -226, 31, 166, 3, -59, 145, -176, 60, 0, -157, 9, 73, -15, -50, 9, 362, 81, 70, 131, 5, -86, 15, -193, 88, 125, 47, -75, -89, -9, -141, -200, -109, -161, -293, 53, 107, -85, -81, -21, 101, 51, -73, 253, 106, 186, 34, -197, -168, -109, -168, -175, -272, 7, 108, 188, -214, 36, 182, 245, -34, -61, 12, 50, -100, 112, -63, -60, 116, 172, -139, -100, -25, 8, 39, -189, 249, 187, 125, 112, 127, -7, 235, -192, 116, -152, -34, 1, 152, -308, -41, 47, -39, -21, -286, -30, 52, -198, -134, 126, 70, 169, 93, -152, 31, -26, -129, -145, 170, -71, -34, 144, -82, 75, 61, 20, -167, -26, -92, 192, 224, 88, -19]
7888a9K24k32P0q9J4R6j94ln8K5J46N0M7J61k92j79J34K52j9j07k8j47L6J36r3
7913f9m9L47L8m26K83k21Q7P8j73K28r5j16J67j92M5J22M2pp9P2j27N6J7J18j61
7938a5j02K48j4j60Q8m9J36j75K3J53K42n93K49k0j03J65k43J21J78j70o0K49
7960A48j04k75K70J66k50N9o0O4qM4r2J65k06M0n4P2p1n3L02j72l91L46n9K11
7984I2k2n0o8p1J52j86J6N8J64pN6rM0j93j93J81O9l5j04L20k77PR9K39l25J77
8010A30k38p2K33k19J31R2L3M0l7jk54j2M43k38p7R5O9o1O3l5p7L8K8J1j47nk09
8037b76K19J44L4j21J61k53L30j47j93J96J33l37K2J59l00L76m16k3L43k5k66
8058b40K64m1j36L09k53lK50k49p9K65r0K08l11O3O2K51l98J13K7j13Q5j41JJ97
$$ y = [-19, 205, -27, 43, -46, -32, 64, -130, -133, -191, -166, -20, 30, 77, 238, -54, -233, -99, 153, 134, 27, -1, -148, -112, 24, -69, -118, 229, 267, -159, 124, -97, -10, 68, -105, 123, 28, -88, 79, -113, -68, 54, 96, 89, 10, 82, -45, 11, 28, 146, -15, -117, 131, 117, -43, 45, -4, 132, -43, -20, 133, 375, -218, 31, 11, -92, 73, -170, -49, 129, -41, -101, 148, 44, -231, 39, 205, -45, 14, -46, 18, 10, 54, -38, 127, -79, -39, -93, -21, -92, -145, 157, -15, -406, -60, -119, 92, 70, 20, -48, -119, 33, -153, -137, -79, 85, 78, 134, 125, 165, -28, -221, -40, 29, -6, -110, 210, -67, -60, 39, 278, -47, 130, -108, -180, 53, -166, -35, 57, 90, 130, 93, 92, -162, -174, 269, 31, -46, 49, 118, 57, 120, 85, 8, 46, 74, 85, -62, -67, -276, -57, 87, 121, 0, 161, -92, 238, 91, -102, 94, 227, -110, -88, 71, -229, 147, -269, -292, 51, 26, -240, 24, -17, -153, 156, -97, -100, 150, -99, -178, 87, -3, 205, -106, -43, 19, 270, -128, -15, 12, -101, -16, -157, -156, 41]
8082D1j0n7n6nJ40N9p7j7j7p6o8l4R4Q7j7j60J34J8M4K83l96oJ26j3P5k20J10
8109a8r7J70Rj52K0K54j51m8m3L07m06K07j83L0J94k61L00m10K55K17L0r2q6M2
8133H8n3Q9l94J54O9n3J11j05J20m3J50j72N8n6j01k6n5K72j30N1J46l33L12j10
8157a1r2J94k3QJMj25J87l07j23L55p0J68j67j69J47P0k0j87J77j16lj13J60K51
8182A96k99M7K12M8r3J5m3J06j47
$$ y = [41, 31, -26, -82, -87, 53, 112, 35, 18, 1, -75, -143, -177, -83, 4, -13, -173, -39, -21, 23, 306, -90, -96, 30, 17, 92, -128, -18, -115, 55, 64, -88, -68, 186, 35, -13, -56, 251, -155, 52, -131, -101, 93, -168, 132, -278, -23, 194, 224, 132, 46, 88, 35, 124, -270, -116, -47, -100, 11, -94, 26, -17, 133, -39, 19, -37, -138, -164, -219, 53, -77, -26, 120, -213, 99, -11, -103, 91, 68, 76, 77, 81, -44, 143, -164, -287, 68, -2, 166, -1, -170, -23, 47, 27, -160, 17, -99, -102, -215, -55, 196, -103, -56, 156, 204, 111, 126, 83, 189, 42]
8191D2
$$ Imaginary data points
##PAGE= N=2
##DATA TABLE= (X++(I..I)), XYDATA
0@%%%%%%%%%%%%%%%%%%%%Pj5J6j6J6j6J6k3L1l2L2m0M8n2O0o7P5q4R3j04J17j30
42f8J44j60J76j95K15k35K59k87L15l45L82m21M64n16N73o38P16q07R15j045J213
63F55j434J730k162K852m116P159k8064k0589O7608j3322m6705L3749L3920l7885
77f604m162L3390q346k3346J1601K911j5774J982R770q271j267J4384J846j1578
91c464P490J1684j3104j3275J2045M655j7886l930J7351L870j2766K196J8872
104A3738Q95j9683J142K0255j2244k5290J6320J7062k4640n437L0171k667k0322
117a0700J7451J0377k0774Q70J2774j6302o916J7639n913j5229J8915J2851k0624
130e581m97K5404q519k4292J2265J5198k1380j1847K2021M699j8141M949J7970
$$ y = [0, 0, 0, 0, 0, 0, 0, 0, 0, 0, 0, 0, 0, 0, 0, 0, 0, 0, 0, 0, 0, 7, -8, 8, -8, 8, -8, 8, -15, 16, -16, 16, -24, 24, -28, 32, -35, 40, -44, 49, -55, 62, -68, 76, -84, 92, -103, 112, -123, 136, -151, 164, -181, 201, -220, 244, -272, 301, -337, 379, -428, 487, -558, 655, -779, 951, -1211, 1641, -2475, 4684, -23380, -43969, 23639, 10317, -36388, -2639, 31281, -6604, -10766, 22624, 14278, -9068, 2533, 5444, -10330, -8348, 1422, -6849, -8116, 6268, 8114, -3464, 4026, 15710, 2606, -10669, 1376, 6031, -11855, -15785, 1566, 5436, -7330, -5134, 13738, 14633, -5050, -3908, 16347, 4103, -21187, -4867, 12195, -12445, -17882, 12289, 9622, -10700, 6751, 17128, -3646, -2776, 9998, -6304, -13220, 4419, -1494, -16723, 2192, 15043, -5581, -6078, 19326, 10807, -13485, -1220, 13978, -7402, -19249, 2772, 7471, -10670, -5721, 12249]
143A2249n001r816O310L727o700n196m97J443J035l373R10P551J458l043L046
158D103J320k922l41m375m686O211J220j1892N912J6543r097j1004J8062P623
172A6677k2240k247J9339q666j9695J1729J2922j3715l833J6594J567j0354M832
185B910M750p953j735L402o932j850Q765l478n962J1634O582j1238n22J2580n173
200E780j2934L645P068o622o978O359Q077l440m780O851O995o997p667O977L055
215E389j1377k834R111J94o264M839O241k002j413K553j963j963J297n147m158
230g497P127J406q980M437J3177o026r360J1384N875j5003l924J1663k784j1933
244a0438N068R142l428l475N709L562k368k434q70O82q91m363j754M225K004l436
$$ y = [12249, 7248, -2568, 3742, 7469, 769, -4427, -4924, -3481, -2446, -5819, -4909, 2642, 4100, 1057, 4103, 5423, 2501, 2160, -2215, -6901, -690, 530, -11362, -5450, 11093, 1996, -9008, 9054, 16677, -5563, -7810, 11529, 2863, -16832, -5103, 7819, -5896, -9729, 6865, 8432, -1922, 2910, 7660, -293, -2028, 1374, -5558, -7408, 1357, -2121, -8083, 3551, 10133, -1105, -1627, 10953, 5780, -7154, -3509, 3559, -3063, -10041, -3682, 4395, 955, -3825, 3026, 10021, 3024, -4643, 2334, 5389, -5988, -8822, 289, 483, -5781, -942, 5299, 3297, 1884, 4437, 2474, 511, 1808, -3339, -7497, -370, 1036, -7944, -3507, 9670, 3644, -5716, 5668, 11543, -3460, -7384, 4279, 1495, -10438, -5370, 3772, 344, -3131, 2578, 6140, 3772, 1338, 468, 1150, 259, -4104, -5858, -1633, 371, -3065]
260c065J407N803Q45l413o03K427p01n441l226M538K243o152n37J0606J634r340
276b975K889J0062o308j0393O270N079j0035l094R116J123n008L522M401j481
290C168k73n38l175O16J062n658j601P229M95o596M429R009m600o463N891L752
306F747q702m318N840J230n490l66N906L030l251j139N077J447o615k506M291
321A181r70n847N38N459j8j924K512K626J09j287k475r0K019l363n208M672N115
338C049n827j828R213K306q687O88P936m185q453L114L999m227k321M233L031
353B041n77o05Q73K168o42m190j420L392j340n365J800N971j380k858L632L922
369E422k192l807Q45K020k113n244J038N038j128m450M233O527l858m639N431
$$ y = [-3065, -1658, 4145, 4990, 1577, 974, 3401, 2700, -2741, -5967, -1429, 814, -5338, -5875, 4731, 6365, -2975, -86, 9976, 3668, -6725, -455, 4624, -5411, -8505, 611, 1734, -3274, 248, 4649, 3168, 2895, 2357, -818, -202, 860, -4798, -6399, 830, 1325, -5271, -842, 8167, 3567, -2896, 2995, 6747, -1955, -6273, -433, 797, -4693, -5059, 847, 3877, 626, -513, 4564, 6011, -604, -3110, 1181, 211, -5636, -5098, 361, 343, -1581, 931, 3557, 3666, 2379, -96, -186, 1833, -1530, -6738, -2066, 3049, -2778, -4606, 4607, 6913, -1774, -1086, 6850, 2665, -5788, -2674, 1325, -2902, -5223, -990, 2041, 1464, 859, 1732, 3900, 3258, -932, -2352, 1040, -300, -5665, -3865, 2106, 726, -2132, 1500, 5422, 3230, -577, 268, 2288, 175, -5069, -4031, 1007, -121, -4571, -338, 6189, 2331, -2308, 3123]
384C123K623p670k329M932q12m253J315M144M10l10N30R5J883j343m485L31L427
401A611l471n132N235N307m910j627P100J493o246m21M130j851n019J38L186M10
417f7k267J98M566J644l791m28L937r01n485l47L646j794l137K154L558j55j035
434B96R74J711J21l088k475K784N01n096n02O746k84n113L572N991l817m538L874
451A657J751n233k025K690O67j313j43K017K585K2k661M85L235k608n120K105
467a889L357l700k462M381L037k660j011L895R02l031k271R09J517k798k812L208
483a428L509k786j922N461K472n661r89M545j688n417J097L199j651j125J438
498i46J997J382n82k143J786J903l941l234L956J325n445J54O201K48m659K394
$$ y = [3123, 5746, -1924, -4253, 679, -133, -4386, -3071, 1073, 1483, 1173, 1703, 1798, 3681, 2338, -2147, -1816, 1611, -1860, -6992, -1757, 3550, -1360, -2987, 4113, 5606, -640, -1061, 3069, 1218, -3801, -3663, -477, -67, -2334, -2136, 2430, 4074, 283, -145, 3792, 2891, -2594, -2941, 705, -1089, -4226, -2072, 1486, 1331, 296, 1270, 2981, 3102, 14, -2461, 323, 824, -4272, -4774, 1972, 1688, -3425, 147, 6138, 2321, -2217, 1657, 3408, -1825, -3850, -1160, -493, -1806, -1949, 68, 2653, 2675, 14, 499, 3734, 1126, -3994, -1889, 1468, -2232, -4694, -313, 2724, 64, -947, 2948, 3850, 819, -1452, -543, 974, -1824, -4636, -1428, 2081, -705, -2627, 2834, 5306, -355, -1344, 3201, 1513, -3904, -2807, 392, -1259, -2384, -946, 1051, 2433, 1851, -292, 1494, 3397, -544, -3778, 178, 1503, -3942, -3788, 2413, 2661, -1998, 396]
514C96M365k542m028J626J348k079k514J129K204O28k144J155M141n80l810L81
530c24L507k928m132K227K760k392j426K709K176n68j346O94J822j389l724J65
546b169L344j899l817L653M276l196k090M587J635m593j247K853q69k730l58J823
562g97J265o01r71J973K509j815l123K400J916m404k381L709J373l798O66M162
578B083K58k861P47K283l99k813j382J650R78k668j306M418J494l804N31M817
594D026j346m528J228K440k492k275J201J822k16p56N61K201R40k580j029K748
610A945n42m879R90L769j537l441L504L432k347k090K818J356l036j642J311N78
626A89j325j588J266L044n56k220J801L295k719l562K815J547l935j336L197R42
$$ y = [396, 4761, 2219, -1809, -183, 1165, -914, -3428, -2299, -95, 533, -1611, -456, 3685, 3105, -705, -324, 3183, 255, -3877, -1650, 1110, -1282, -2708, 1, 2177, 1609, 263, 957, 2779, 1390, -2334, -2169, 1175, -724, -4541, -888, 3388, 192, -1898, 2689, 4324, -269, -1516, 1337, 468, -2262, -2620, -797, 468, -133, -1104, 869, 3378, 1563, -1560, 840, 2756, -1648, -4029, -320, 1053, -2745, -2079, 2083, 2341, -520, 227, 2510, 2111, -702, -2084, -434, 544, -2124, -3430, 988, 2482, -1322, -791, 4026, 2680, -1848, -620, 1820, -672, -2947, -1746, 76, -140, -896, -335, 1866, 2806, 226, -803, 1945, 1403, -3476, -2486, 1283, -254, -3695, -191, 3241, 894, -1196, 1622, 2978, -58, -1700, -389, 189, -1136, -2724, -1458, 1586, 1030, -1190, 611, 3906, 1187, -2375, 440, 1987, -1948, -3284, -87, 855]
642H55j825O5K166J158j382j714J230J632k741k785K884J947l473o58M047J288
658B694l363L09K822o27l012J87J439o29j648k50J982J615j583o45K802J154l617
675c70j176L467p16m611J046L762j296k305K313K508j426j397N39Q23l31k725
691a895n12L091m23l128J442M205r78l272K144K466k717k393J933Q27j879j207
707b296J626J550m94q63Q27K138q16l323J144K444k328l546L267K500l246n54
723a970L940M57k351k31J559m85j530q14O28J323j015j717K383K561k515j509
739a286K819J019l613o76K673m36k787N21K614j61j527P92J566L48j801j109J681
756F37M81k797o96L120L12k983Q69L712j247k594J467J548j757j824Q09J282l88
$$ y = [855, -970, -905, 1261, 2419, 1037, -677, 553, 2185, -556, -3341, -457, 1490, -1983, -2641, 1406, 2694, -669, -360, 2462, 1835, -1177, -990, 449, -180, -1828, -2078, -96, 1519, -64, -709, 2093, 3247, -370, -1546, 1921, 1205, -3406, -2360, 1402, 106, -2199, 114, 2622, 1196, -201, 338, 1161, 830, -1895, -2407, 684, 261, -2867, -1425, 2780, 1802, -1470, 674, 3140, 423, -1970, -37, 790, -1089, -2296, -670, 880, 386, -477, 350, 2488, 1672, -1651, -507, 1937, -391, -3937, -670, 1830, -1416, -1970, 1970, 2427, 76, -155, 1404, 919, -611, -1425, -797, 526, -489, -2206, 177, 2738, 223, -1286, 1533, 2552, -1061, -1737, 936, 500, -2287, -1766, 848, 687, -840, -48, 1518, 1866, 65, -1044, 637, 1118, -1679, -2375, 745, 1057, -1926, -1057, 2655, 1408, -1186, 281, 1829, 72, -1752, -943, 339, -49]
773d9j398J87K351N29k540O60K715j271l518J532K477k192k297K390K062j848
789b10o41J915Q70j053j767N52J291j225j951J025K551j612k016K866K213k666
805A42j655K949L05k989n62K015J95j316l38J419R49o33j389J688J658k502j990
822b054K637Q83l467k28L319Q4k300M39K362l89j735q5J184j54j682m74J760N56
840F56j584k59K505M42k590j4K865q32k915O22K177j127j583J154J627m12j386
857f54N20J776n02k396K69K367r37k718J198K853j621j638J984J745j707j515
873i76J403N58j218j474J123J323p12j551J551J728j308j708J640J328k323j463
889b079K594O48k393l99K199Q60j833j55J183Q31j513j055J096J181k130q58K063
$$ y = [-49, -1447, -1260, 1091, 1620, -920, -260, 2455, 1184, -2334, -802, 1675, -517, -2814, -424, 1638, -210, -851, 1064, 1934, 881, -886, -334, 957, -268, -2219, -1194, 1357, -255, -2271, 595, 2808, 142, -1513, 1436, 1741, -1248, -1810, 205, 400, -916, -1254, 165, 1114, 481, -908, 780, 2438, -64, -2054, 583, 1466, -2001, -2229, 1090, 1174, -1126, -687, 1675, 1286, -449, -534, 650, 496, -1186, -1660, 100, 656, -928, -1187, 1318, 1760, -830, -844, 2021, 1189, -1726, -1104, 1073, -54, -1637, -483, 1144, 732, -654, -134, 1642, 1140, -1256, -987, 1380, 443, -2275, -1077, 1776, 155, -1483, 501, 2246, 539, -976, 427, 985, -233, -1707, -584, 739, 27, -1524, 27, 1755, 447, -1261, 379, 1707, -616, -2079, 515, 1163, -1230, -1629, 570, 1430, -403, -558, 625, 1456, -57, -1112, -16, 1165, -965, -1823, 240]
906B40R68j889m67K751p4k375J9J829j99k369L99J551Oj150j71J650Q57k073j79
925f76K030jk759m8K797q12k395J145K257q19j688J183J455r50j491K37J407m76
943C96k045M91K214l72k153J200K233j272k183J568J616k026j360J573J343j563
959c40r79J399J206o96j264Q88J313j227k013J507J691k135j125K276R63j830
975c66p33K144M35k118k57R63N62j308n76J389Q80j655n39K385M10k139n08K155
993A124j05k169M8K080n05j607O26J337K2j296j20J448k21j578j08J586K12j925
1011a151J04K344n61j917J062J723q37j878O74J534r83j119K18J516j99j401N04
1028c67J825p04j901Q60J445j174j600J324J674j587r31J214J192j138q82P10
$$ y = [240, 1208, -681, -1148, 1603, 1529, -846, -827, 1002, 803, -1566, -1167, 384, 390, -760, -931, 719, 1576, -497, -676, 1354, 1353, -1406, -1454, 1343, 531, -1864, -719, 1538, 719, -969, 214, 1669, 719, -772, -535, 872, 396, -1649, -1158, 1056, 684, -1469, -269, 1964, 692, -1491, 77, 1693, -333, -1693, -120, 1223, -340, -1319, 80, 1286, 590, -674, 214, 1527, 300, -1713, -206, 1485, -650, -1775, 501, 1464, -366, -1099, 1045, 1480, -638, -895, 68, 630, -678, -1254, 135, 1015, -640, -1179, 1206, 1616, -523, -1031, 1124, 1019, -1150, -1102, 978, 473, -1134, -508, 829, 851, -445, -565, 883, 662, -916, -1024, 562, 774, -1151, -1047, 1297, 736, -1181, -119, 1604, 767, -1111, -437, 1097, 114, -1005, -787, 729, 530, -871, -367, 1458, 754, -1147, -287, 1158, -16, -1616, -292, 1382, -205, -1136, 78, 1270, 132, -750, -40]
1044d0J283j207j361J325J009q68j412J304J387j590j014J815Q59j990n06J615
1060F09L88j560l49J119L56q39o79J557N95j369p03J393O51j876l73J756K72k039
1078a091M99J499m3j524K1J416k87j340o1J444O6j520J39J551K03k001L87J985
1096A343o81j820P03J627r81j539Q58J585p52j058K25J244k60j635M78J812p29
1113D20j605P79J527j181j292J125J263q63j230J205Q38j027q67N86J011o23j197
1130a131R27J543j259j133J252O08j235m45J284O95j834l01J583K93j508nJ103
1147D37M98j259m84J011P85j357q96J696M96j462m67J897Q8j719KJ402j04j251
1165f87K91J086k14r82LR71L19j565p9J671m1j721J61J884l75j809N77J501n00
$$ y = [-40, 1243, 36, -1325, 0, 1009, 141, -1271, 33, 1420, -170, -1184, 631, 1490, -500, -1006, 609, 997, -563, -912, 207, 563, -276, -955, 602, 1197, -172, -875, 518, 1169, -707, -1080, 676, 948, -1091, -592, 907, 864, -660, -639, 777, 490, -850, -911, 533, 599, -921, -782, 769, 972, -1029, -642, 1343, 662, -1158, -455, 1172, 191, -1348, -490, 1095, 343, -715, -490, 754, 494, -1141, -663, 1149, 420, -1185, -406, 1121, -60, -1352, -227, 1036, 173, -1057, 148, 986, -41, -908, -322, 689, 66, -1131, -204, 1339, 80, -1053, 199, 807, -428, -873, 411, 1106, -728, -1029, 554, 847, -661, -666, 437, 935, -324, -808, 203, 988, -369, -1265, 431, 927, -535, -1002, 895, 983, -736, -734, 668, 564, -687, -396, 690, 476, -506, -503, 468, 787, -778, -857, 814, 773, -948, -787, 1097, 722, -1087, -510, 991, 491]
1184D91j524P91J318q98r43M96J136k58j460N11J425n48j639P36J674r98j626
1201a316J403J144j302j099J414O05r73q33J028Q32p22j149R18Q71p44j278J221
1218B0J179j279j036J404N14j585l43J580N86j663o8J152Q3q33n38Q11R15j421
1236e22n06J289N97j627k43J443N48j749m5J916l26j314J5J290k40r69P6J014
1254F47j13j025j26J346K12j618J00J625p35j384P74J216p39j262Q03J191q66
1271D6o19L49R99l47j058L76J112k68j386L44J351p33j024P82J144j045j037J361
1289C47N66j220n29Q62P08q10o13Q53O77p00j105J094J067j371j046J394J025
1306A199j781k14J443R7j141J17Q79n0j023j69O43P62j157l22Q77N76j137l21
$$ y = [491, -1033, -242, 1076, 178, -765, -269, 867, 609, -851, -340, 1085, 537, -1102, -366, 1308, 310, -1316, 87, 1231, -71, -1170, 244, 849, -124, -957, 71, 903, 181, -968, -50, 821, 77, -1201, 20, 1199, -80, -1116, 288, 802, -783, -1126, 454, 1040, -623, -691, 461, 544, -289, -827, -16, 899, -522, -1028, 261, 858, -769, -1012, 431, 979, -770, -815, 1101, 775, -539, -524, 766, 526, -443, -367, 647, 534, -491, -617, 729, 941, -677, -577, 1048, 313, -1071, -297, 919, 180, -1082, -279, 912, 46, -573, -224, 775, 428, -630, -254, 858, 590, -796, -452, 899, 166, -858, -76, 1068, 23, -1014, 347, 913, -307, -836, 26, 734, -76, -689, 164, 841, 141, -964, 130, 1197, -174, -1220, 174, 1199, -582, -796, 647, 744, -397, -280, 599, 549, -474, -643, 0, 762, -395, -717, 160, 736, -401, -722]
1324g22J437P8j466K46J255l05j290L80J224o41n91O7R68j87j054P4J169K75j528
1343f11j71J376j76j193j65J936r56r87J033R60j006j021J031O24l46j001N03
1360a70P76m53j078Q66R36o75j019Q53Q28j096q86J044R63j270o19J485M07p45
1378A47p90Q00O28p91r00Q50R06p66j031J348O45j272n44J348K13j055m38J263
1396E61k42p11p9P79M88j076n46J193L06r85k51J455J27j679q6J417l94r88K11
1415e00J355k71j253M62P99q8j330J54J286k68j117J18J041m1j027N39J148n83
1433D24j128L96J062n41j220J028N62n21o11O90O88n41o86O34N69p21j154O40
1451d30J065j022n26J041Q51j056l80O95M42j015l47Q13K43p22k86O50P45j016
$$ y = [-722, 715, 793, -673, -427, 828, 523, -767, -387, 837, 196, -395, -328, 640, 453, -601, -527, 642, 917, -611, -782, 594, 418, -775, -940, 996, 40, -947, 86, 1046, 40, -981, 50, 674, 328, -673, -170, 606, 153, -925, -59, 877, 202, -817, 36, 864, -232, -1118, -74, 889, -381, -1000, 485, 892, 147, -643, 157, 785, -6, -906, -56, 850, 84, -947, 401, 1046, -226, -770, 578, 791, -264, -702, 561, 319, -392, -471, 308, 796, -280, -826, 367, 673, -312, -563, 892, 1019, -660, -746, 671, 277, -711, -500, 855, 584, -669, -207, 592, 504, -826, -672, 614, 346, -771, -653, 388, 347, -680, -141, 1007, 424, -704, -308, 754, 213, -1007, 21, 583, 62, -549, 141, 829, 288, -398, 236, 805, 84, -1070, -430, 635, -387, -913, 128, 979, -77, -457, 238, 680, -335, -682, 131, 374, -348, -634, 16, 761, -255]
1469b55m74J467K36j214m33J099K09j220j21R16L37j166J96R67K62q69k67O60
1487C30K38q30m62J119M9j025o2J269n2j066L67Q75j15j003M5N47J0p21M9Q73
1507D35Oj115N71J147n04j287J39J384o51r93N82R63o76r33R68O16m24n25K03
1526i4P32l21p86L13N33m69n64O35Q13p25o84R80P18j047o85Q64L25q78l18P49
1546I1L09m72l91Q99M54r20n76P80L76r91l67Q66M75j012q0J069K76j358K29P75
1566D32Jp36j03O36J7q06M9Q94J85j125J28J040J10j287K48P68k20r16J36R63
1586D14k03o22L52Q09k32q45OQ20j49j042J38J208n34r99R85N44n15n17M36N89
1606F43m86q04M69M63n58j99K67J055p40l47L13R06r88p23P45J71n50m80Q61M60
$$ y = [-255, -729, 738, 974, -240, -673, 426, 635, -585, -706, 210, 547, -619, -423, 544, 806, -63, -330, 330, 568, -262, -724, 395, 444, -581, -643, 626, 574, -492, -125, 750, 635, -368, -323, 224, 234, -487, -438, 435, 441, -674, -103, 1044, 540, -747, -608, 776, 125, -868, -286, 677, 1, -932, 36, 652, 228, -297, -94, 638, 317, -469, -156, 377, -92, -656, -21, 792, 67, -617, 363, 1081, 34, -651, 213, 538, -340, -658, 91, 400, -72, -463, 436, 890, -30, -606, 174, 550, -441, -808, 58, 533, -479, -559, 510, 786, -572, -343, 432, 433, -303, -406, 230, 247, -559, -510, 384, 569, -556, -428, 612, 722, -565, -317, 451, 231, -685, -549, 414, 211, -411, -59, 750, 518, -327, -321, 499, 350, -692, -554, 654, 120, -879, 106, 650, 135, -382, 54, 643, 157, -647, -178, 285, -273, -472, -205, 850, 110, -237, 76, 982, -6, -729, 16, 187, -363, -843, 18, 478]
1626D78m57n15P70N20p55o24R51L44j057l90O73M43q39J61N37L21r26j14P05M14
1646F40q92q5O87n5o61k51J023M55j411M38N17L26j131j74J134j7j368M25J002
1665F02j30r00K63R36m12q87O17O82o86n08k03J356p41p43M97J056m78r76Q02
1684A47N08p30o56N22P72n83n82K98R45l21p88O71O40n73r04P01K20o04p01Q49
1704a69M66l75j99P21L66q95k97O79O4q66kO59J33n27m25J038M61r54k11R38m3
1725E62p69m08O79R8o43P8O75K96p76J81M59j58n59o6O45k20p57L04O30R5j066
1746g20M84J063o08n25J99N84j65q57M61N18l78p73L35J047k65q11M08O50l29
1765C18j139O07P43q29n31P71N85o06m77M75P20m71p54M71P85o14p84P55M81o73
$$ y = [478, 21, -494, 276, 796, 41, -583, 368, 712, -345, -735, -62, 381, -458, -297, 240, 561, -365, -479, 226, 640, -252, -337, 350, 295, -366, -617, 406, 861, -550, -112, 405, 731, -400, -574, 560, 543, -825, -400, 602, 472, -428, -165, 771, 359, -528, 89, 771, 85, -423, -626, 730, -11, -754, -257, 799, 321, -655, 147, 655, -75, -731, -209, 563, -20, -602, -304, 641, 320, -468, 203, 843, 270, -634, 67, 287, -317, -1018, -169, 297, -78, -277, 444, 810, -85, -382, 297, 361, -505, -507, 152, 285, -242, -667, 371, 832, -122, -333, 605, 562, -207, -615, 64, 162, -481, -403, 272, 568, -208, -27, 432, 274, -285, -351, 294, 74, -683, -379, 251, 346, -720, -236, 827, 219, -306, -107, 477, 312, -545, -84, 434, 56, -717, -382, 665, 400, -411, -3, 647, 318, -821, -214, 529, -300, -831, -60, 525, -81, -558, -83, 637, 166, -588, -117, 668, 54, -730, 25, 506, -167]
1785a67k49O40O52q45l71N57L09n54o96O79K45n61J06L37M12m22j88M54K18r61
1805d05Q2N29M2r03j57J043J52p44L94P40o1q02p3N33o3q59j38J059O6o98J62
1826a01Q39j74j132N34O94p10l70J99N68l61m86K39P41j83n13K32K54l2q57L67
1846b52P63o82n34N04N83l30m68N82K78m88m86M21L44l33m49N00M24j29p27O04
1866A25P08n87p82M83P21r48l28O33L53m85j32L21L14l19o02J087L4p68l21K50
1886b43L42p45k06J026L95r06p4Q38N3j002M9Q29j52n16o14J189j64l85j5N32
1906B31M9p18J86N95m5p26K2P54j42r25O26P06k22q99M65Q02m45n64l7Q00n89
1927g6m56J98Q74l82n25M89M98n43n47N23K50k63l70K58M75k92o83P11O00p71
$$ y = [-167, -416, 224, 876, 31, -340, 217, 526, -28, -724, -45, 200, -361, -255, 82, 494, 72, -116, 338, 556, -405, -323, 206, 248, -655, -812, 231, 383, -361, 33, 773, 712, -90, -163, 370, 307, -552, -690, 369, 435, -263, -101, 738, 564, -568, -34, 660, -50, -420, -221, 347, -14, -500, -261, 480, 297, -216, 16, 270, 238, -619, -252, 511, -171, -705, -201, 382, 52, -416, 166, 444, -44, -530, -109, 235, -98, -547, -47, 377, 248, -479, 125, 833, 246, -536, -53, 668, -280, -608, 25, 378, -107, -239, 82, 396, 77, -525, 562, 596, -172, -493, -243, 99, -646, -852, 174, 569, -337, -411, 427, 480, -522, -473, 356, 204, -312, -926, 263, 99, -286, -301, 231, 280, -438, -252, 343, 298, -428, -406, 348, 206, -719, -93, 613, 391, -508, -43, 759, 314, -250, -287, 513, -76, -532, -334, 540, 158, -367, 122, 620, 77, -470, 53, 303, 40, -330, -72, 403, 111, -572, 139, 739, -32]
1947c2o08Q41M71p91m00O90L75q32k67R21J16n72k15Q14K05p64o12Q71J10o81
1967c60k75Q10K99o59j06P14K24q45j81P46k62m82nO17J43o56J00N43j86m52Q
1988b65Q27r2o85l53R30m39m24L33P34m34o95O33O35n26o75J87N69P2q37M45O01
2009E41l99n35N12N59n02o33O14J70l05p15P45K89m48l09N50N32p97m10P47L23
2029E29o25l54L71M39k63p44Q29M2j00m23N23L19p95j26O16J28m73l55P21J73
2049D32p63Q7O80j20l65l48O23K91j100J5P84j3m62l2O85o9n29K65N04l55o85
2070d75J19N67L4o31p8P39K1q71K39N26J48r97L04Q16m34p32M51O71l47k53k36
2091d19P16j71o52L61O31o65j23K66N69m49n08N80R9j84n92M69M20m43m64N21
$$ y = [-32, -640, 201, 672, -119, -519, 171, 546, -286, -553, 368, 484, -88, -303, 511, 716, -48, -660, 211, 321, -360, -635, 175, 474, -185, -291, 423, 647, -198, -379, 367, 105, -377, -382, 235, 378, -278, -178, 365, 179, -273, -265, 562, 470, -215, -568, 362, -77, -501, -168, 566, 132, -563, 70, 705, 179, -496, -309, 260, 332, -505, -60, 541, 142, -393, 119, 678, 176, -457, 157, 327, 22, -693, 52, 341, -107, -416, 134, 666, -131, -541, 206, 529, -96, -450, -79, 360, 97, -647, 182, 224, 124, -299, 224, 543, -252, -378, 238, 366, -107, -462, 259, 432, -331, -244, 436, 316, -49, -397, 226, 517, -583, -568, 216, 203, -259, -291, 394, 325, -204, 61, 565, 210, -475, -356, 211, 245, -386, -464, 275, 296, -575, -336, 190, 338, -659, -355, 461, 27, -705, -254, 417, 70, -183, -419, 297, 126, -526, -165, 466, -199, -322, -56, 513, 64, -444, 136, 235, 51, -541, -72, 348, -95, -559, -38]
2111c8L60l03l42K64L59m22m08N89M06o04k56Q64n1p82J08K76L14n64j40N47J78
2132C55p41k29R49j31l19k78K67K29k37j36M13J47n79Q6M61ko25K77L86j08o20
2153d35K06M10J29m83k3O89o3n95j31N01l7p58M95L49K59q95K15N18r0o51L53
2174c7L28j89o54M77N67n33m04M45L50j75m07K07P62p98m62M05M24l53k50K80
2194a7L01l43l50P16K04n48m67O32N9m55l54R15N1o18RO10j41n24N6L13L02n94
2216b43j85Q00L7p83J39N80o2o58J53K62O13j142J81P76m34l1k39N32Jo91O6Q52
2238E24l76l27o1O07j85n23K36N15j88l75J51M09k18o00M66K90k30p10M61N70
2258D36m30j35j14O65l01m29K19O97o65j69J92K83m48M5K30L58n44l28L43N37
$$ y = [-38, 322, 19, -323, -59, 300, -122, -530, 59, 465, -139, -395, 469, 418, -364, -256, 20, 334, -230, -370, 177, 355, -386, -615, 334, 203, -116, -394, -127, 102, -135, -271, 142, 289, -290, -204, 257, 255, -370, -93, 293, 185, -435, -229, 181, 310, -173, -196, 493, 430, -165, -296, 205, 168, -590, -95, 254, 513, -382, -167, 351, 261, -390, -37, 291, 102, -552, -75, 492, -41, -445, 0, 350, 175, -232, -25, 737, -61, -523, -118, 306, -47, -297, -17, 284, -59, -409, 307, 511, -37, -504, 128, 187, -268, -622, 293, 344, -274, -265, 345, 204, -320, -264, 49, 351, -243, -428, 372, 409, -374, -235, 345, 283, -375, -222, 40, 653, -489, -308, 468, 34, 3, -236, 296, 297, -394, -328, 524, 148, -179, -240, 367, 182, -341, -105, 410, 222, -153, -2, 407, 189, -411, 55, 345, 115, -595, -134, 436, 6, -129, -243, 422, 121, -308, -89, 608, -57, -226, -34, 249, -199, -154, 76, 434, -110, -438, -95, 442]
2278D42m89k58L47K52n03o1M99J08m84l52P00K20p78P7M01N2o3j24J32K50o22
2299b54j14N54Oo40R7P03o8q02K16N19j80l14k25P93N9p12K37O73m59l78L39L53
2321D03k06m92RP91m71n39O59L9j98m67M83N47l98k25o5O27k61m60L50Q7k33l19
2343c39K97K39j15p75P67M98o54l84M77L81n67m52N55N30k71m91P52M1o69j00
2363b80M21J37n54J10M01Rj62l48M99P3q35L78K57K15m71M3J44M36o28k04N13
2384A54L37n61j64N04N3n84J52N00j06n10J41M64k02j93j98M04Q7l38n1K94q2
2405A01m56J01M34nn16J85K52Q3m50K36L25l27n53O61j32K1l13K42L20k50n73
2426f14Q69J62l17k24J75L54l65p22N05O96o56r2J95N42m32j26J11N00n36o06
$$ y = [442, -47, -305, 42, 294, -209, -270, 229, 337, -147, -499, 201, 421, -357, -280, 121, 173, 110, -14, 118, 368, -254, -368, 186, 192, -448, -351, 352, 284, -518, -302, 217, 37, -277, -502, 291, 350, -362, -125, 548, 89, -289, 50, 403, 197, -295, -286, 505, 34, -505, 154, 193, -5, -472, 11, 558, 160, -65, -130, 497, 236, -224, 126, 213, -20, -339, -42, 197, 82, -693, 74, 572, -82, -466, 11, 392, -175, -627, -72, 458, 187, -304, 448, 489, -180, -280, 141, 278, -276, -166, 235, 244, 82, -266, 233, 306, -529, -151, 106, 321, -150, -107, 37, 473, -155, -359, 154, 491, -70, -234, 270, 323, -261, -109, 391, 285, -225, -84, 380, 178, -15, -213, 191, 278, -60, -111, 183, 101, -355, -254, 180, 175, -341, -156, 96, 179, -271, -35, 290, -37, -590, 71, -61, -40, -353, -111, 209, -41, -614, 255, 417, 100, -124, 51, 405, 40, -682, -177, 519, -137, -229, -34, 508, 76, -50, 61, 561, 25, -581]
2446e81L53M74k07o07N96Q9j93o4M44q2l12k47P48k77l43R0Q6L45n04j93N90K17
2468D22m91j52L02L10p13l7L65J24n12J81L69J73m95p8N11p2l98q1M65j71k64
2489b42l6N23l80k09J07P28n22l29L36N32n70n43P07J99m39j03K45M43m07l57
2509c17K04M55k34n97M75K1K8m44N32L18l40k90K69L83m93k57L60J53r3o10M32
2530d5L75l07q2L01K87o14k73M94P2l94k08L67L91p77M42M52j89k45J18o9K13
2551C09m40j17N57r1k72k73L96J68j94J16K03k56l86P1L41n7m26K6M63K99n06
2572f9o7N85j36o03K3O44k71m54R3O63m75Rj6N23k57l71K54J5j94l43M81M4o4
2595A4j94mM37k02j94O6N58o00j23K96J10m14j20L83J03k04k38O15o5n14PK99
$$ y = [-581, -228, 246, 39, -568, 28, 117, -76, -140, 304, 222, -90, -337, 411, 134, -209, -119, -33, 312, -192, -385, 205, 422, -69, -221, 81, 391, -322, -359, 6, 130, -382, -201, 168, 341, -154, -232, 279, 207, -191, -272, 193, 22, -242, -278, 245, -135, -344, -237, 491, -31, -360, -24, 508, -62, -605, 102, 301, -138, -241, 4, 447, 40, -317, -113, 342, 108, -489, -14, 7, 35, -409, 123, 441, 101, -189, 80, 463, -30, -287, 73, 226, 133, -477, -45, 330, 23, -59, 242, 529, -85, -358, 136, 208, -186, -394, -27, 364, -413, 29, 481, 292, 47, 165, 96, 309, -131, -248, 309, 218, -54, -327, 69, 237, 43, 159, 362, 106, -280, -209, 132, 75, -351, -325, 138, 437, -69, -136, 449, 313, -290, -267, 377, 106, -348, -255, 408, -67, -58, -74, 449, 192, -179, 75, 90, -104, -447, 34, 78, 14, -180, -184, 253, 51, -143, -77, 481, -119, -242, 54, 164, -250, -370, 13, 116, -88, -326, 289, 224, -290, -283, 16]
2617A6P3j04k18K58L22o96M95n1K13m58k7L60j74l61J29M40R6n51J38K86K98n58
2639g4J8K44L9m41q3M38j25l68N1M47n3l78K09K04J77n20J73J99j35m77L13N06
2661C64k99l24K13N95m19l05Q1K71Pm58J50L43n21j06K48P03l53k20J13L83m15
2682E1o67N66O6N8m61L71M41n59j73N87J52m05l03M73K4m43j57O00l27m0j22N94
2704C26j8m21k1L39n2m26j04M98J29l06j06M56j23q9j59K52J27o54J72K66j38
2725e2o58K27Q17l40j60J70L89m00q6Q5M31k46m37k11O42r5m43L42N37l6o78L21
2747A19K83n9o97P5K73L7n52L95L27j03n34O86K31m31l05L44r9j55o7J33N18m78
2769e9j89K29M97p13N5L26Q4m68L3P2L07k50k20O04M07o98k60K17J30k11l36N38
$$ y = [16, 89, -15, -233, 25, 347, -349, 146, 95, 308, -150, -177, 183, 9, -352, -223, 217, 313, -238, -100, 186, 484, -74, -56, 188, 227, -214, -297, 141, 16, -352, -301, 146, 93, -285, -76, 128, 305, -215, -42, 157, 22, -455, -142, 364, 65, -259, -46, 549, 130, -175, -94, 177, 184, -274, -124, 219, -302, -408, -160, 543, 190, -30, 83, 466, 51, -616, -50, 16, 74, -387, -16, 425, -134, -307, 280, 432, 27, -276, 197, 221, -222, -379, 221, -106, -146, -268, 326, 308, -113, -134, 205, 153, -273, -377, 121, 250, -56, -162, 294, 171, 82, -77, 175, 302, -352, -180, 86, -52, -710, -483, 334, -6, -166, 4, 393, -7, -93, -8, 423, 177, -260, -471, 171, 76, -367, -25, 512, 476, -202, 119, 402, 343, -354, -279, -6, 31, -521, -126, 201, 98, -436, 250, 481, 50, -255, 89, -10, -165, -232, -99, 419, -59, -248, -19, 478, -235, -180, 146, 230, -238, -205, -133, 174, -76, -296, 308, 715, 17, -243, -26, 104, -107, -443, 95]
2791I5n9l55J73M20Q5m94P5L79j02m52l5J83J09j95j18M34K38m01O0L10l9m03
2813i2J1K27j70l15L1M20n9k41K28M65k72j35p0L44l80k73J73L25j74l13J97K85
2835B12k21k80L09J32k33k05K43J97l04k79M28K20j30l36M67J30k19l45K85K01
2855B72o62J34K81K33n66J91J41K39r7l94K81L54p28J53R5J78l16p0M24j1n3l15
2877b36M82%l02J5M30l95k3j82M82p1j47j63M77K0p54M58J28j82l14o5M08k09
2899a43m0K74j76L53l72K74K7l23k2N8J75M3k73L4L23l46%J23K72j34k77J35J3
2922bk77JN0N51l69j04J32M51j78l92M8J36k10m9O5K57l67J07M16o9j28M6M8q6
2946G7j22j59M03q5m48J55L50k4o9j43L31q8m82Q6L29Q6k82j20K75L9m88N27J48
$$ y = [95, 36, -319, -146, 274, 359, -135, -60, 319, 217, -235, -270, -87, 22, -173, -291, 143, 381, -20, 40, 350, 311, -92, -81, 146, -24, -339, -308, 112, 53, -188, 40, 505, 233, 98, 28, 372, -8, -281, -108, 217, 43, -270, -73, 212, -9, -289, 20, 152, -81, -286, -43, 154, -150, -429, -1, 219, 89, -247, 220, 350, 131, -214, 71, 272, -390, -256, 25, 258, -308, -117, 24, 263, 166, -228, 53, 407, -321, -168, -73, 105, -211, -281, 143, 132, 79, -236, 246, 246, -56, -41, 389, -6, -29, -211, 271, 200, 53, -110, 367, 387, -367, 91, 219, 37, -277, -342, 66, -143, -183, 91, -85, 268, -104, 170, 197, -126, -148, -90, 85, 128, -145, -111, 212, -134, -134, -11, 261, 127, -150, -15, -2, -279, -278, -228, 323, -46, -150, -18, 433, 255, -137, -89, 47, -163, -212, -147, 110, -257, -150, 266, 197, 69, 115, 163, 77, -45, -204, 199, 114, -334, -179, 171, 147, 78, -65, 266, 178, -304, -218, 111, 197, -85, -205, 70, 109, -379, 148, 296]
2969B96L4l81N0J86k33l58K64K57r3j97j9O37q4l22j80M08j05k31j03K97j40l78
2991c95N81L59l65l40L58J48k6m01J03L8k48l59M48K37j10l6N3L82o00J09K22
3012A58R0k87k06K73N2J15m16O20N5l85j24K09J90m92j27J21R1j66J03L78l14
3033f2j8j13N38mn20M6J08J23k82j59M48j95o5K27L15j70l22J18J82K5n65Q2K67
3056Do9o0J88M87j79m14R3L59m45q0O9Q4J5k97pK45o2R3j2L83l70j78L30r7k85
3081b05k02K8M07j6l31N12K57l01m43L00L9n7j28l7L53j92P7N0L26l43j75J80
3103I9J98k72k84J66L19l94j40L92n2p3R0J68O2l30k67M58k14L4k21L75K67n70
3125a89k7O49J22p26J14P3J41j81k40M6n2L17l32N02M9k22j4R6j41M1l21L57j91
$$ y = [296, 330, -51, -1, 185, -48, -406, -142, 115, 22, -175, -194, 443, 359, 37, -143, 265, 160, -71, -174, 123, -17, -395, 186, 545, 180, -160, 198, 346, 320, -81, 22, 60, -188, -547, -99, 138, 28, -8, 45, 427, -173, -64, 158, 248, -39, -245, 28, 80, 195, -221, 399, 454, 69, -55, 154, 344, -148, -275, -154, -63, -229, -126, 252, -62, -80, -193, 345, 341, -179, -133, -25, 98, -184, -343, 105, -90, -155, 72, 387, 217, -105, 13, 195, 220, -345, -263, 4, -65, -125, 63, 550, 371, -43, 50, 409, -36, -116, -47, 37, 52, -245, -252, -7, -69, 24, 12, 395, 25, -153, 177, 80, -205, -407, -379, 28, 12, -319, 193, 450, 149, -294, 6, 45, -12, -140, -177, 176, -16, 61, 111, 437, 94, -81, 99, 297, 25, -259, -93, 226, -168, -308, 84, 32, -41, 49, 217, 279, -51, -318, 140, -74, -40, -261, 114, 381, -189, -216, 433, 555, -171, -57, 16, 157, -24, -264, -218, -270, 47, -285, 217, 266, 44, 30, 126, -15, 26, -295, 62, -129]
3148a29k00K6N24n3k98K16K62k70j11o8K34n43K92J0K30l8j97J01N4J31k36J99
3170A36mk98k81K41M17j58k00J65L20j75q5L16l96j30l65L45L74l17k96N26J15
3191B50l45R2L4K74n71P3L05p0l21R6J91J22l04L0J25J76J91l11J84k61k24m7
3213c11L40j25j9j7K69M0l7n0k6K1k51l8K17Pn35N35lj58J07K28J29k40j43K70
3237B10k47J48m03J13J52J80m10L49K85l66j32J62J44k43k16M9N84n86K26j02
3257a03M82n07Q6P2L62l95k47K40K26k00l51M51J4j06k47M65J6l13%J33p5l4k09
3280b40K94l3j48jM16k67N4k76K00J34l09j9J03J78l89M35O0M8k38J15J35j6n83
3303c47K79K31k2m43J18L99k53n8J52J98r5l74L05k48J14j04P3Q8J53m07M97K48
$$ y = [-129, -329, -303, 221, 168, -130, 86, 348, 78, -33, -101, 133, -410, -118, -108, 122, 84, -113, -12, 42, 173, -63, 136, 132, -166, -447, -206, 211, 53, -147, 18, 338, 163, 78, 394, -2, -132, -497, -152, 222, -95, -391, 135, 250, -95, -3, 31, 305, -266, -193, 112, 42, -279, -183, 8, 130, -174, -144, -19, 157, 348, 37, 221, -40, -264, -311, 29, -96, -115, -132, 137, 177, 140, 90, 64, 85, -166, -204, 13, 20, -515, 20, 17, -141, -34, 194, 323, 83, -60, 210, -37, 111, -292, -179, -27, 153, -257, 92, 377, 11, -121, 41, 185, -58, -274, -225, 359, -227, -1, -103, 379, -128, -42, 30, 392, -3, -250, -10, 216, 16, -335, 116, 130, 24, -223, 242, 258, -55, -55, 78, 3, -31, -240, 54, 21, -127, -128, 288, 21, 75, -201, -1, 133, -176, -195, -92, 86, -303, 132, 192, 240, 2, 117, 252, 236, -347, -68, 163, 141, -302, -184, 215, -38, -96, 56, 254, 159, -215, 90, -158, -44, -148, -75, 13, 166, -241, 256, 504]
3325E04j26l87P0J67j51j90K78j95k06LK51L09l41L01LJ4k13m46K82L7r6l06N11
3348G3K31m44k4L46oq2k72n9K61j81j49J15J70l14K17L26n2m12L6K67n2k82J1
3371b76L12L6l08J16L53q3k66OL12K2n50K08K58l14q3K90J51J5l80J63N29k49
3393B62k77l9K66k31m26L33J70j03j29L42k5pq8j08K81k33j13p0M51l91q3L55
3415A37J19J52m93J23L26m03m73L91K05l95L6N7K17N5q8J71L43m61l97M40J40
3436B02k74k1n3J64k68L86K17l36j83K40R0j17j31N1N7k37j01K51L36r9j69k11
3458b06M25k67q4R1J86j28m97J94N52m5l54L21n3K22m84N5J52k04j74R8K63O5
3480A28k82K63L4o1j56m5J82o6j18M7L3m6j92K37j13L30k04P3J63j6m70L59j05
$$ y = [504, 378, -9, 61, 228, 77, -113, 165, -30, -236, -233, 18, 327, -14, 287, 290, 304, 91, -355, -73, -36, -132, -438, 73, 304, -140, -164, 182, 176, 94, -178, -237, 24, -157, -306, -191, -21, -335, -118, 208, 156, -256, -220, 47, -5, -287, -276, 36, 72, -236, -120, 233, 150, -116, -110, 202, 224, -326, -118, 140, -174, -257, 33, 184, 199, -181, -18, 511, 262, -15, -54, 212, -19, -445, -112, 58, -45, -174, 168, 143, 136, 48, -60, 221, -12, -125, -195, 256, -135, -218, 137, 256, 408, -85, 38, 364, -39, -512, -121, 84, -311, -275, -218, -1, 54, -34, 137, 480, 19, -378, 62, 202, -72, -93, -146, 18, -250, 136, 353, 17, -166, 74, 164, 47, -84, -33, 24, -213, -314, -63, 273, 174, 5, -206, 219, -48, -132, -41, 145, 17, -480, -286, 266, 221, -133, 188, 135, 357, -127, -72, 80, -124, -298, -200, 63, 128, -154, 109, 143, 82, -74, -119, 63, -3, -121, -74, -41, -87, -279, -42, -155, 175, -29, 44, 207, 191, -279, 80, -25]
3503b5lj88L52Oo0R5J92k13N5j71L6L8k19k82M28j33j20Q6K84O7k62n6J2J65k02
3528a18j16L35j38k54L93m8L60n23m2M42j52k28Q1q4n5l34M54J10j24q9O0J66
3550I6j34j55k0K58k2j51l1J09j83Q4J41L17m29n1K61O6m46j54O02k06Lp7k1L35
3574A92l56K07o7K99k08j58k0J58j71r3k5M61j50Ljl0J7k24j7M10k83j55K75J45
3598B09k35p1jQ2O5j77L80j51k48j80K19K57Pn44L14K02j5J79k65N0K9j70J26
3621F2J09k34j51K36J7pj13M43l81l2k11N20k34k00K13k43K87r5j89K10K91m55
3643a57J75J0Q2k02k40J62O0p5M54k68N8n76O88k68o0J59J3k33J2J31P1L51m40
3666i3NK16N14o72l4J15j59o8Q1L3L60l47l7J27J50j82j79Q6M32n18K30K7l4p4
$$ y = [-25, -28, -216, 136, 142, 82, 177, 369, 156, 211, 40, 76, 114, -105, -387, 41, -92, -212, -126, 158, 225, -37, -93, -81, 84, -118, -234, 101, -37, -291, 102, 54, 414, -109, -151, 291, 139, -89, -8, -92, -147, -481, -27, 83, -41, -130, -70, 96, -38, -193, -213, 45, 23, -128, -159, -50, -233, -149, -8, 309, -120, -171, 90, 156, -290, -444, 158, -48, -45, -122, -143, 192, -164, 43, -24, 275, 67, -91, -111, 47, -124, -217, -242, 219, 69, 72, 71, 41, 58, -166, -183, 227, -56, -211, 64, 209, -26, -97, -98, -16, 49, -128, 252, 101, -147, -327, -108, 149, 156, -388, -74, 128, 113, 292, 27, 77, 106, -64, 62, 171, -63, -214, 22, 39, 32, -81, 362, -19, -51, -262, 258, 24, -176, 37, -206, 81, -14, -203, 7, 298, -157, 18, 28, 110, -92, -332, -170, -110, -185, 269, 1, 59, -517, 171, -97, -157, 2, 15, -218, -206, -75, -4, 347, -93, -88, 128, 642, -30, -64, 51, -108, -176, -95, -62, 298, -49, -86, 41, 191, 9, -170, -84, 348, -170, 60, 87, 53, -21]
3690b1j89K54j28J12rM7r2J26l5n6k15K11l04J84K16j68L9j10K66k14M3J06j76
3713a13o4K47j03K09k88j79M09R8k70J14J0k0j37J7q6Q3p7p9L76j73jP2J63j60
3737D8j2P2k98J29J36q8J18n3J06k11Q8J21k11J88M8k36m7J73j6j30q0K65l3j94
3761a17NJ48J50k1k79J63j33k3J00j3L40l08J0L6j69J13Mm2J61Oj37N1j87J85
3785D3J03j19J01m9j40K02j79Qj32ro2J98mP2j7Pj26K40K0l27kOJ64j41l0J04
3811f9j0K42p0L2m9l5l4o8J79l21K14K31k34j1J26L1q8K17m77J46K22l10K52k06
3835i0K24k89K16J5j04j06Q5N6j85M4J86j41K08l62L38j45r6k25K86l5K81l44
3857a83K02M5j43J38J08N8q8p7j43J26j58K24k29L33l18L7J49m0l5j74L78P8l84
$$ y = [-21, -210, 44, -84, 28, 19, 66, -26, 100, 65, 9, -206, 5, -299, -115, 101, -67, -28, -138, 128, -86, -43, 63, -113, -177, 70, -33, 176, -112, -291, 118, 216, -54, 60, 70, 50, -87, -70, -156, -73, -150, -229, 147, -26, -27, 45, 208, 48, 36, 108, -190, -61, 75, -13, 105, 52, 158, -53, 35, 156, -55, 133, 181, -55, -102, 71, 55, -75, -155, 110, 77, -117, -112, 36, 186, 165, -114, 49, -84, -107, -7, -20, 320, 12, 22, 58, -111, 2, 6, -36, 125, 131, -6, 45, -142, 43, 146, 27, 128, 79, -61, 141, -38, -30, -162, -171, -233, -35, -39, 33, 16, 23, -103, 137, 157, -170, -172, -166, -2, -143, -173, -69, -79, 163, 93, 125, 76, 41, 7, -61, 118, -203, 11, 242, 8, -3, 123, 154, 66, 283, -194, -48, 174, -136, 116, -90, 134, -155, 61, 76, -28, -134, -49, 7, -178, -134, 52, -89, 119, -243, 95, -50, -146, -371, -85, -120, 161, -183, 19, 64, -79, 59, 167, 225, 137, 60, -83, 43, -115, 109, -120, 213, -105, -68, 81, 41, 6, -168, 210, 288, -96]
3880i6P7J45k28j74k8L76L9l73L55k33K84l25j3P3J40n9k5K84j98n0J1Q8r1j42
3904a63L57kj7j54j6l33L66k90P0L40l73L4L55k71K69j60j10R7j72J77k66R3L09
3927A40j12q7Q3l18R7K51P5K5k46l1q1L17l90J38K43l24L67k65K53j98K7jJ38
3950A01j01k31L98k79J60j60J92J28j48J20N7l43l7K11J98k88p7j19M59l03j30
3971a92N43k76M6m4Q6k0N3j63r0R9j72J44j55L54l00KK01n3k64N6R7J78n4j40
3995f4o7K63l1j03N3j39Q3J4q7J93J9n40L40L29l25K14j89L6m4j34K04rj18K1
4019h1J38m7j52j37M06Q1m89K29m2N9m10K60jL7j1j41M30j82J25j43P3m3r9J60
4043B0K72m46O5j39K97L6k56J68O9j48j7RK11k64j20R9R5J52l22P6L17j8l30K19
$$ y = [-96, -19, 126, -102, -276, -304, 72, 111, -262, 93, -140, 144, -181, -194, -121, 19, -40, -65, 219, 21, -29, -18, 70, -21, -163, 194, 192, 175, 21, 5, -328, 38, -252, -182, 158, -215, -181, 174, -97, 172, 12, -98, -1, -173, 4, -262, -169, 140, 28, -59, 24, -294, -197, 54, 129, 154, -92, -123, -204, 113, -277, -139, 104, -220, 147, -118, 135, -63, -36, -37, 101, 0, -231, 167, -112, 48, -112, 80, 208, 60, 180, 237, -106, -143, 68, 266, -22, -99, -218, 241, -62, -192, 351, 75, 121, 77, 163, 143, 196, 33, -57, 42, -130, 14, -141, 213, -87, -85, 116, 63, -201, -145, -48, 130, 76, -64, -131, 132, 101, -2, 51, -88, -5, 9, -78, 115, 134, -406, -66, 263, -62, 152, -37, -1, -45, -179, 25, 16, -102, -81, 57, 10, -142, -279, 127, 208, -281, -52, -94, -35, -445, -185, -186, -149, -160, -301, 129, -53, 72, -71, 2, -41, -140, 20, 292, -154, -89, -228, 69, 105, -151, 17, 86, -62, -79, -70, 141, -123, -243, -144, -49, 103, -219, -143, 174, 156, -174, 45]
4067D5J21m86L76j81rR5p9Q7M81n54kn5K83j30l39L46n8J32j4j0oo4j33l1L51
4092A66j23n9J27K7k33l4K77J12r5j94P2K7jl72K82K0P6O0M6J0l54O4J81k71J75
4117a4j84J27M6k36K05p8K44m4j16J75mR7J15m91L03r8j56J87j23k80K70J6pM
4141d2J71l15J28K71m82M82l19K4l4K22p4o3k31O14k08k07J77j88mJ33j11J37
4163H1j18J14J13K0m09K60l0j29J94k04J21j6R3j66J48k8r2L10o4K9o4r0R0k00
4187c7jJ2L5j7N1J1J54m30K84J32k90M02k53Pj50J18k5J14m9k15P0j26M53l58
4211a08Q2K5P7j17L0J89m61L00ro4o8o6J87J51P2j59j65L9j10R6O6Q0n1m5M6Q
4237B5q8J97J17l84l5o1k73N38k0K6k37K36j57M2J34K14j21l52J82l5L02k44J93
$$ y = [45, 166, -320, 56, -125, -134, -39, -118, -31, 450, -104, -106, -161, 122, -8, -347, -1, -59, 73, 59, 49, 43, -21, -154, -185, 166, 43, -16, 111, 138, -95, -129, 148, 260, 165, -29, 43, 70, 69, -303, -21, -1, 75, 135, 181, 191, -163, -99, 82, -189, -14, -198, -71, -25, -261, -56, -134, 110, 66, -50, 125, 121, 218, 333, -158, 145, 47, -109, 78, -45, -325, -55, -39, -46, -42, 129, -186, -58, 213, -269, 213, -106, -82, -116, 106, 32, -31, -262, 352, 144, -63, 114, -74, -78, 55, -56, 81, -37, 77, 190, 210, -199, 61, 31, -98, 96, -108, 13, -3, 90, -76, 72, 44, -48, 262, 198, 227, 163, 73, 163, -37, -38, -26, 9, -8, 43, 54, 208, -222, 62, 194, -96, 306, 53, 60, -90, 28, 3, 117, 68, -147, -77, -203, 250, -108, -26, -1, 76, -41, -11, 178, -283, 17, 8, -56, -124, -190, -3, 148, 220, 61, -104, -65, -175, -79, -13, 67, 16, -29, 17, 25, -63, 134, 251, -133, -168, -229, -502, 36, 16, 42, -195, 41, -116, -74, 60, 274, 153, -199, -17, -52, 250, 6, 199]
4260A99l16N3j7j08K11p1j46K21o8K05n8j84J41K7k6j52J52M3j77j53K81k7j47
4283a17K77l20R5p8J45r5K99j47J49k86K9j7j91J29J01j37O6J92k23J28Q0j18
4305c9K05k33M7J52j43j43K92j85J25k3m5N0k35K60j69N3J26O1J90k82q8J10j74
4328h8n4Pm4K71j7j39j4k7J1p6q6J20L2Pj6J30K10l95n7L76j73j17K06P4k39J37
4354C9n4r3J97j03M2j22K7q6K25j53n6K14m4p0J08Qr5pl9j02O7L14k44J83j25
4379C1M8J42l25k79L19J21l26R2q2K48j4J13k68K35J5l0J01q7p5j0m0q9J80m7
4403b7M9K9l3qj46M1n3L0L93k63j42M75l83j22L8L72k20k93M81r3j72m6K08l03
4427a88KO3M02k49Nr1Pj8O2J37nj37J22n4m1K19l27n4j5Q7J29l49J06R1o2Q7J22
$$ y = [199, -117, -64, -81, -189, 22, -49, -195, 26, -42, 163, 105, -79, 62, 89, 63, -89, 63, 106, -71, -224, 57, 30, -117, 160, -160, -65, -143, 2, -93, 206, 59, 208, -78, -49, -66, -257, -128, -27, -164, -98, 94, -129, -1, 79, -39, 166, -67, -20, 132, -11, -154, 138, -47, 78, 55, 10, 60, -175, 85, -84, -31, 95, 156, 346, 64, -24, 86, -88, -142, -135, -179, 92, 75, -64, -78, -105, -94, -170, -256, -136, -104, -97, -113, 17, 227, -168, -225, 151, -22, -139, 67, 141, -98, 39, -15, -108, 89, -14, 28, -94, -67, -153, 72, -81, -137, 77, 33, -37, 71, 79, -16, -23, -62, -164, -97, 217, -27, 156, 31, 79, 221, -104, -383, -64, 57, -269, -177, -259, -11, -25, 88, -180, 55, 70, 40, 141, 54, -21, -31, -71, -160, 20, -27, 22, 51, 18, 10, -136, -95, -148, -118, 275, 12, -130, 345, -38, -160, -122, 250, 30, -263, 218, 125, -47, -93, 115, -188, -186, -123, 279, 30, 35, -56, -49, -67, -5, 132, 127, -10, 112, 58, 17, 236, -91, -145, -160, -73, 56, -293, -187, -96, -158, -71, 51]
4454E1J35j43j03J06j1j1j89J25L9j6j02K20r7j53J11R1J49j43m9K6j93J49k3
4477c1R4K5l20J96Q3p1o7K1k8J68o8K9N5L9k05R1M0J13j46j88M6M4k0j9K77j02
4503E6j69j9M63l18k54J59R1O8k66J17O5K47m13K07k45J36J06j85J19R3l72J47
4525a67J79J79r2m2J04j64%Q0L3k7j10K2q6P7j84M9K61r8J8Q5k65K62j81M6K82
4550B61k46j50J85J30l07K9J04K13r6m23M64m4m04J04O9J11Q2m1j72nm9K92L6
4573A43j62J07Q9k45J84j96K09j85J2j09L79m39L74j67J35o9j21M4q6J72J39l09
4595a01J09L0l02L12O0j0k68K26O1q7K50m46P6J73k18q8J18K45j23o4O6k7j16
4618a24L4J57j63K39j56L4J0j26P5J72j11r5J49k8o5n4KK8J45k91L91l18N6J1
$$ y = [51, 186, 43, -60, 46, 35, 24, -165, -40, -1, -17, -119, 101, 4, -149, -38, 53, 202, 59, 10, 36, -157, -8, -31, 63, 88, -232, -36, 47, -24, -91, -70, -98, 70, 2, 31, 86, 125, -80, 11, 51, 164, 18, -170, -124, -80, -100, -119, 158, 56, -113, -132, 331, 13, -241, -82, 9, 77, -189, -72, -7, 240, -173, 34, -211, -75, 31, -154, -35, 58, -314, -167, 12, 191, 99, 57, 161, -3, -3, 77, 110, 83, -27, -5, -91, -14, -198, -149, 112, 14, 32, 117, -148, 114, -67, -21, 261, 15, -135, 50, 180, -127, -98, 6, 219, 123, -300, 164, 120, -284, -180, -111, 0, 82, 41, -131, -136, -185, 107, 143, -19, 88, 177, -68, 116, -80, 129, -56, -44, -153, 226, -213, 161, -6, 129, 60, -61, -17, -103, 69, 208, -101, 8, 38, -264, 48, 108, 98, -170, 56, 117, 30, 280, -166, -90, 83, -135, -223, -105, 140, 17, -47, 19, -8, -124, -90, 67, -96, 143, -13, 21, 31, -95, -20, 152, 41, -54, 95, 67, 2, -52, -50, -22, 123, -168, 223, -95, -39, -28]
4642b8M0N2j1o0OJ68k27K20k38K19j09p0j95J38K23k58K03j5j44J66j11p5J09
4665Ck82J33J34P0l17K86m0O3j44M6J62J67n74L07J27j27M3J7j10k3j12K14M09
4688D52p18J37K2L40l08j01k3K39J35k00J18O2j51j81M2k7J39K1j6j44K52O8m97
4711c39L07J9K11j90k9n9J21J84j67l13J64m7K88l46J42R4o1q2L1K16L1j37n9
4734b1J8J10j33j00K80j06j33Jl6j0k3m9K06k1m1pj21L4R9j6oJ04r9O8n5K37k26
4761d6L10j47J4J8l34K07J81j69J89K0m09K02l88L53Mj6K18j48j54Q6J78k70O2
4784c9N5J19j71k3N9j01Q5M1j2P2k05m3K27k3n7o4l45K82K93l4p2m6o1P0J44r3
4810E8J52j40j57Q8O4j63J63j73J00k8K50k20j20P1L5Nj78J87J35n9j6L2j06K04
$$ y = [-28, 12, 64, 53, -7, -1, 167, -60, 160, -78, 141, 32, -38, -233, -95, 128, -130, 73, 58, -86, 80, -31, -106, 3, -279, -146, -12, 58, -259, 27, -13, 50, -94, -48, 114, 281, -293, 14, 141, 14, 57, 74, -36, -59, -171, 43, 452, -266, -129, -107, 233, -75, -176, -199, 40, 175, -25, 93, 155, 4, -177, -135, -162, -23, -2, -18, -162, 90, 158, -339, -32, -13, 198, 8, -21, -80, 41, 225, 58, -255, -91, -138, 150, -196, -54, 40, -21, -103, -72, 144, 175, 38, -21, -3, 107, -26, -126, 154, 48, -85, -84, -120, -130, -153, -202, 4, -17, -58, -65, -186, -152, -53, -69, -75, 29, -70, -2, -57, 180, -46, 264, 117, 131, 149, -185, 22, 203, 34, 223, 243, -166, 36, -352, 1, 5, -11, 207, 59, -95, -9, 169, -101, -39, 16, 135, -36, -59, 0, -101, -16, 25, 13, 85, -120, -163, 64, 41, -16, -80, -425, -143, 150, 116, 44, -2, -63, 7, 151, 58, 210, 70, -87, 1, 65, -98, 65, -108, -8, -36, 214, -6, -126, -55, -20, -15, -193, -6, 129, 70, 54, 86, -20, 184]
4834A84k11l3J32j77J64j13K33K86n75R6J17j50J7Mj31K78L8j76j6J36L7k17K69
4857A92J6j98L0j56K22k04J99o0m0j39J32j35K78r4j13j40N05k25m6q5J42k56
4879a75L88j37j32J78j50j2j84M23l27K54Qo9j69N38l69k15R1J45j68J67j34q4
4901a33L19j12k36M17k14j60j26L21J00j60J9L2j38J26J91o18M34k8J27N3k74
4922f0oR9N3n3jJ2O5rq8l7k2J5j54j04L71k07M1J88k28J0J27K2p7j72J35R7J36
4949A53L08k76j63j30J13r9J10M3r9n5J8J08l16K97K97m11KJ21kj37kj64j0L43
4973D9j72N8K61l64q3P4J60J03j61J52j76J8J21k53K67M8j73K48J23m85R0K21
4995A26L6k8j28l4O0N7k39K3R2Q0j5nL63l50j56J3LP9k36K75j07N3O2k01J50n6
$$ y = [184, -27, -60, 72, -105, 59, -54, 179, 465, -110, -14, 103, -47, -30, -26, -157, 121, 159, -17, -33, 103, 140, -77, 192, 208, 10, 40, -116, 106, -98, 101, 41, 1, -138, -6, -141, 137, 43, -70, -210, 295, 70, 24, -61, 81, -175, 213, 76, -56, 122, -28, -40, -224, 199, -128, 126, 134, 65, -104, 434, 65, -150, -59, 86, -82, 85, -49, -133, 186, 74, -162, 255, 41, -119, -245, 76, 176, 16, 35, 67, -71, 55, 246, -372, 62, 34, 161, 214, -60, -66, 33, 86, 33, 32, 44, 109, 100, 12, -25, -47, -32, -186, -290, 81, -126, -85, 103, -125, -115, 12, 34, -43, -215, -80, 17, 153, 461, 185, 22, -108, 5, -94, 16, 59, -40, -95, -77, 31, -285, 12, 309, -102, -100, 21, 19, -118, -120, -284, -294, 49, -123, -65, 196, -168, -251, -177, -17, 86, -75, 77, -99, -81, 40, -213, 54, 102, -71, 177, 300, -185, -95, 126, 162, 134, 6, -28, 32, 89, -150, -127, -35, 45, 30, 25, 388, 38, -118, -105, -102, -23, -259, 16, -91, -38, 24, -177, -27, -83]
5021h3R0J41j89M7R7k66P1m1r3L69J45k40j24K3Q4j2j99M55k79k4j97L82K0j40
5045C7M2K5q0J3n7J68o0j74j98J54M13m96K98k88M9L03k61K18k30R4j05L26l29
5068a38r2L89r7L7l46M52k04J35k12L9nj24J44R1j46K14j60J68k16j74J50K63
5090A68j44j01N6q6N3O5J05J27l95L41j24j77K02l67K2N6K59j47m0J00K36j39
5112G0k71K62J19o8p7n0O4j84J66J01j60R4l3k61K95j43N8R3k01R6j5jJ85n1k47
5137a59L75n60M53k50J18K2O2L5j69k48L66j30J88j07J85k92R0k8K19k22n2O8
5159c6j70J87K7J10%J80k44J79k07o1K36J0l55P8p6K77l3p3m6P1k08J37o3q7m8
5184b15J07K02k37q2R6K23j51J67J58o40M30J47J06l05j60L29j19l4l6kM9N5p8
$$ y = [-83, 7, 148, -41, 6, 103, -163, -92, -133, -226, 143, 288, 48, -76, -53, 31, 19, -180, 275, -4, -28, -225, 157, 177, 37, 79, 104, 24, 37, -20, 148, 88, -86, -284, -130, 283, -213, 85, -203, -154, 149, -112, 106, -124, -30, -135, 191, -138, -230, 159, 62, 99, -247, 205, 1, 136, -76, -37, -42, -166, -22, 69, -77, 137, -23, 145, -71, -245, -95, 168, 24, -77, -21, -107, -54, 11, 116, 243, -152, 189, 65, -112, 90, -277, -255, -199, 60, -87, -127, -27, 209, 70, -201, 61, 180, 112, 35, -15, 49, -135, 31, 132, -28, 66, 33, -228, 67, -76, -18, 75, -126, -30, -45, -46, 139, 88, -159, 216, -344, 109, -141, -23, -1, 61, 96, -73, -321, 45, -85, 103, -4, 181, -111, -21, -49, 170, -52, -104, -36, -206, -19, 8, 118, 118, 298, 54, 233, 26, -35, 201, 211, -144, -66, -142, 135, 102, 29, -17, 54, -154, -17, -80, -167, -215, -108, 94, -143, -225, -129, 94, -57, 110, 268, -372, 58, 205, 311, 6, -154, 175, 56, 22, -14, -16, 33, 88, 10]
5207A0o9J47o4j61j23K80j92K30j62J54Pk28J27L0%J43k06N2L3j98L35k27j81
5230b63L97k22K05m12J54J01qJ55j29K46k57K07q5j19n1L7j75Q4N4P8Q9j19NJ59
5254A31k00k08M47k46j19R7J85J8k92K57j71M6j36K71J79k90q9O6J25k88K44j10
5276h3L01l47K43k32J26j47RK35K2j9j01o3O1j9O8lP2r1K37j70pkl30K76j33J45
5302D8l66L42k40K10O8j14k21J19o1L08O9k00J22j3j47P8j48K10j02j56J31L2
5324c1l2j3R7j7P0j25J13K3j13k19K10J28j6j51J90R2jj76m6k17J13J33k2J72
5348A62kP8k06J06k6m51K63K02j80j46J40K43m79M03j49J67j04l2N9j78l2K22
5370F0k07mO6J35q9K93n92M72l10J44l98M20R6j3o2j33K69jj93R0L5q3J69j26
$$ y = [10, -59, 88, 24, -137, -260, 20, -172, 58, -104, 50, 57, -171, -44, -14, -14, 129, -77, -25, 8, -190, 145, -82, -263, 134, -88, 117, -295, -141, -40, -48, 107, -22, 224, -33, 174, 89, -30, -81, -44, -219, -135, -81, -3, 86, -33, -28, 131, -69, -277, 170, -76, -195, -98, 87, 105, -187, 70, -101, -55, -191, 80, 259, -31, -120, -54, 71, -217, 27, -83, 218, -129, 114, -118, 8, -139, -130, 105, 127, 108, 7, -56, 5, -14, 54, 51, 123, 32, 269, 99, 92, 90, -240, 36, -97, 48, -318, 24, -216, -6, 62, -52, -273, -154, -215, 93, 162, -38, 84, 71, -76, 2, -146, 64, -38, -194, -63, -31, -63, -76, 21, 4, 74, -51, 62, 85, -28, -247, -37, 91, 75, -76, 114, 206, 205, 29, -17, -234, -121, 12, -10, 162, 160, 238, 32, 138, 112, -339, -76, 126, -54, -200, -60, 183, -296, 107, -42, 125, 21, -11, 48, -130, -162, 60, -147, -151, -85, 50, -39, 254, -338, 134, -176, -32, -430, -10, 86, 73, 11, -122, 147, 146, -47, 43, 78, -5, 164, 38]
5394C8k81J17M44k86n3k17J52J33p6Ko9n6K94k49J87j5n2j03Q2J04l30L6%M4L72
5419B18l06L7L81q9j92j08L4n4M1m2J17K05n16J82J66k43o5L90k01M5Q6j72K37
5442A51m54J38Q2l5N5k5j04J58m0J31O4k70J0O0K54l01n6K95k63K25kK8k49O3
5466h5J58J1o5J5J26m45L31O1j8n2j32J85R0l6rj83K41o2N4J38l79K44o1j18j38
5491a29K76J08j01j77j87P3qL14j52j76L16K5l2k38K31j22Q2Jr4k89K02N9J92
5514A74k1l76M25p2k03J4J26n1R8m5j98QJ96k66J84j04N5K6K21k99k07M22J7j21
5538Co8J29P0k31J77j83K62j62j11M7R1q5J49j32m9R9%O6k81J54K23p7k72n7J26
5563a12J72m2J67j5J7l56k1k8J72o9J4o2K61l40J54K36j14N9q7r8j12J70J24L4
$$ y = [38, -243, -126, 318, 32, -21, -238, -86, 47, -29, -27, -96, -152, 142, -107, 80, 65, 13, -90, -8, 96, -234, -198, -198, -154, 218, -88, -51, 330, 241, 49, -59, -25, -79, -38, -80, 37, 242, -274, -92, 74, -169, -234, 156, -45, 0, 86, -86, 151, -303, -165, -83, -118, -63, -88, -192, -34, -74, 57, 121, -149, -139, -79, 175, -126, -182, 113, -150, 75, 73, 101, -148, -85, 73, 84, 19, 34, 160, -285, 46, 107, 89, 37, -95, 90, 180, 144, 135, -48, 193, 131, 185, 323, -56, 188, 127, 9, -129, 147, 255, 154, -23, -210, -137, -145, 169, 17, -159, 157, 182, 150, -88, 143, 21, 103, 104, 10, -279, -77, -18, 174, 153, -223, 202, 130, -73, -59, 67, 16, 114, 69, -129, -121, 75, -191, -7, -111, -56, -30, 191, -108, -315, 107, 124, 3, -65, 64, 134, -97, 80, -103, 159, -3, -114, -67, 24, -61, 88, -44, -93, 6, 6, 72, -209, -55, 168, 91, -181, -238, -112, 60, 18, 185, 170, 187, -169, -190, -218, -46, -115, -101, -163, 98, -242, -88, 148, 34, 93, 6, -92, -204, -34, 90, 124]
5587A24r7q9K20l70K28J27k00j8M9j17L18r1N9l51J83M6O5o6j79J33Ppn8O7k24
5612b41O5o1K23N2j66L00k16M3j1j51J71j49K42k98L22j15j61n5K83K89k59l36
5634b29J00kM3%N1J44j4K6k66J91lM8m5J14k73Q3m5J12j79J54k30K36m6R8J88
5659B56l23N0n3P9p0M2L6L03j06j28j8MJ03j95j05K69l21K06k58J04K60k43P7
5682c1O1J72k01j22O7J80j7l90L33j4p1L42k46k16J52j10K12j70m4J13l6j06M
5705a38L17k58N7R8k38L02q4m9Q5k70J54j70J9K49q0R1j13p0M0J58nq9J34j5J05
5730B30k00j11QJ23j03l6J12J61j84n6J7J58j04n1m3L8N4Q3j19l07M00JMj03J35
5755A07m0jP7j4j83J32M6j22R8Jr6mj58K81R4q4j84j1J23k1N6k66L10j56N6N7
$$ y = [124, 27, -62, 158, -212, 16, 143, -57, -75, -26, -143, 175, 84, 143, -208, -25, 21, 86, 20, -159, -26, -19, -26, -84, -17, -241, -176, -237, -14, 38, -128, 172, -44, -1, -12, -163, 8, -141, 101, -197, 125, 10, -151, -206, 77, 366, 107, -229, -129, -131, -88, -88, -37, 107, 93, 119, -147, 44, 41, 89, 44, 158, -115, -32, -77, 35, -144, 10, -220, 16, -30, 68, 256, -67, -17, -70, 9, -61, -19, 17, 320, 214, 86, 68, 72, 175, -20, -125, 144, -177, 29, -229, -125, 135, -108, -31, 30, 202, 1, -121, -54, 126, 109, -281, 52, 38, -33, 309, 63, -153, -1, -111, 101, -69, -113, 0, -36, -142, -138, 179, -79, -22, 76, -162, 140, 56, 7, 92, -178, -24, -194, -175, 74, -6, 85, -28, -98, -58, 100, 95, 6, 140, 125, 230, 30, -81, -73, 50, -53, -89, 23, 184, 0, -56, -39, 119, 15, -36, -79, -41, 13, 96, -23, -330, 70, 71, 75, -28, 107, 67, 66, 143, 129, -54, 78, 124, 2, 100, 101, 5, 1, -157, 124, 218, 134, -50, -61, 62, 41, 97, -169, 141, -15, 41, 98]
5781I8J67k22r8q1J93j51J05J0J43J42m99J74J02j30J09k45k0L15j74J70K81k26
5803A63j53J96k51o1j53L27Q0l38J53l2QN5J2n6q3J61M2j12N2j23R0q2J14mJ6
5828B1n2j07J71k57M09k09L6kP1j66J38j80P5J43%k22J92J4j36K63l74J94k4j26
5852a28K38J9r0j55N2J11k14J78p4J76j88J48J8ql42K15K27o9j95L63k54R2N3
5875A73l7M6j31Lj89L9J25J33k81K70l1j9j44R0k62J14K43j13P0k5p7K05l52O7
5899h3M1J65Q1l49J64R9m20J67K04r8L98k63j32K3q7o8N4N8o9J46j8k8j05L7L27
5924B44j63P7k49K92l14Q0K34k56j2K62j83K75m1k8j20O7p7j02M4J26j42j91N21
5947C44j89j34kj28K14K38m83K52n9%k13J77K1J2k14Q9M2Jk14j2L67q8J51l77
$$ y = [98, 265, 43, -55, -136, 57, -94, 11, 21, 164, 306, -193, -19, 83, -47, 62, -183, -203, 112, -62, 108, 389, 163, 10, 206, -45, -106, -259, 68, 148, -190, -37, -69, -61, -6, 6, -50, -133, 28, 70, -42, 10, -113, -23, -105, 9, 5, 21, -31, -138, 33, -224, 185, -24, 12, 10, 81, -85, 53, -127, -52, 91, 91, -131, 61, 75, -61, 202, -172, 22, -2, -128, 110, 129, 39, -116, -64, 47, -167, 11, -63, 113, -75, 73, 91, 83, -259, -44, 183, 114, -81, 282, 28, 120, 173, 136, 182, 51, 54, -135, -96, 29, 162, -119, 151, 120, 101, -43, 47, -215, -101, 142, 29, 99, 74, -3, 202, -150, -83, -42, 123, 204, -145, 19, 118, -302, -135, 69, -29, 369, 106, -26, -3, -90, -158, -104, -46, -115, 31, 13, -15, -120, -83, 244, 81, 158, -91, 201, -113, -33, 201, -55, -67, 195, 12, 287, 246, 218, 98, 165, 88, -14, 30, 156, 14, -177, 344, 155, 21, 19, -109, 105, 343, -140, 112, 53, 53, -160, 17, 38, 50, -164, -75, -33, -32, -246, -258, 109, 21, 172, -205]
5971b05J52J23n0M8K9j21J43k66Q7m8J3K00p3Kp5l5J53k9Q5Q3j07j33L4L1k03
5996a62J51q3o5K07q2K35k38l1k30N01n8k67J69L44n94M35l25K8L34k15o2J25
6018A17K01m54n7OO8K08J02r2L9l49M19k32j17l7Q3l8L9J57N7j46J72j6k7q5K04
6043B22j64j39J25P8j78j34L16k57J26j62M4J36j70J85Nk09K31k42J98r0j1k77
6065c67M59l7j31J78M5j68N0Q0j39K59k56j54o0K25p8M2K24k85q3R7L48k97P0
6088B2j3J82k17o6N4K14k85K41k42J02l9p6j58P5K97k31P6O9j55J32j49J93M9
6111G5O5j61j22J95k98L80j95R8j14N8j25j20M8M16l87K62p5J5j19J74k77K91
$$ y = [-205, -53, 70, 20, 68, 97, -24, 119, -147, -60, -108, -95, 105, 32, 34, -41, -76, 77, 48, 133, 216, 109, -24, 10, 41, -162, -11, -94, -159, 48, -34, 201, -37, -68, -298, 203, 145, -122, 47, 391, -203, 232, -93, -65, 269, 54, -8, 117, 318, -136, -193, -187, -119, 89, 191, 99, 138, -211, 208, -24, -141, -178, -95, -133, -94, 63, 120, -26, 146, 130, 103, 18, 222, 58, -81, 44, 122, -56, -190, 126, -131, -5, -167, -123, 13, -157, 28, 33, -176, 55, -187, 11, -79, -90, -367, 92, 55, -76, 102, 147, -21, 29, 109, -30, 229, -27, -181, -241, -16, -94, -52, 172, -113, -196, -99, 249, -48, 22, 9, 191, -26, -92, -38, 176, -109, 132, -110, -8, -47, -123, -281, -206, 91, -140, -64, 5, -150, -18, -167, 26, 75, 140, -21, -143, 52, -246, 134, -61, 37, -77, -19, -144, -264, -216, 200, -187, 75, 0, 15, -104, 70, -207, 84]
$$ [...]
8191c8
##END NTUPLES=NMR FID
##END=
