##TITLE=1H_UK_23-1
 CD2Cl2
 24 sc, 
 5.07.2022
##JCAMPDX= 6.0         $$ Bruker NMR JCAMP-DX V2.0
##DATA TYPE= NMR FID
##DATA CLASS= NTUPLES
##ORIGIN= UXNMR, Bruker Analytische Messtechnik GmbH
##OWNER= root
$$ XWIN-NMR		Version 3.5
$$ Tue Jul  5 13:44:44 2022 Russian Standard Time (UT+4h)  she@DPX200
##.OBSERVE FREQUENCY= 200.1313499994
##.OBSERVE NUCLEUS= ^1H
##.DELAY= (6, 6)
##.ACQUISITION MODE= SIMULTANEOUS
##.ACQUISITION SCHEME= undefined
##.AVERAGES= 24
##.DIGITISER RES= 18
##SPECTROMETER/DATA SYSTEM= spect
##.PULSE SEQUENCE= zg30
##.SOLVENT NAME= CDCl3
##.SHIFT REFERENCE= (INTERNAL, CDCl3, 0, 15.7039)
##AUDIT TRAIL= $$ (NUMBER, WHEN, WHO, WHERE, WHAT)
$$ ##TITLE= Audit trail, XWIN-NMR		Version 3.5
$$ ##JCAMPDX= 5.01
$$ ##ORIGIN= Bruker BioSpin GmbH
$$ ##OWNER= she
$$ F:/spectra/data/she/nmr/H-F/1/audita.txt
$$ ##AUDIT TRAIL=  $$ (NUMBER, WHEN, WHO, WHERE, WHAT)
(   1,<2022-07-05 13:43:44.64 +0400>,<she>,<DPX200>,
      <continue with go, POWCHK disabled, PULCHK disabled
       configuration hash MD5:
       00 E9 B6 7A A2 85 ED C7 34 08 36 98 17 FE 4E 26
       data hash MD5: 16K
       1A C8 6A 02 79 31 1A 0E 0F 70 2C 8C 29 89 D7 1D>)
$$ ##END=
$$ 
$$ hash MD5
$$ 16 64 10 D8 9D CC EF B4 05 4E CB 66 5D 1B D5 1A
##$RELAX= 
##$RELAX= 
##$RELAX= 
##$RELAX= 
##$RELAX= 
##$RELAX= 
$$ Bruker specific parameters
$$ --------------------------
##$DU= <F:/spectra>
##$EXPNO= 1
##$NAME= <H-F>
##$PROCNO= 1
##$TYPE= <nmr>
##$USER= <she>
##$AMP= (0..31)
100 100 100 100 100 100 100 100 100 100 100 100 100 100 100 100 100 100 
100 100 100 100 100 100 100 100 100 100 100 100 100 100 
##$AQSEQ= 0
##$AQ_mod= 1
##$AUNM= <au_zg>
##$AUTOPOS= <>
##$BF1= 200.13
##$BF2= 200.13
##$BF3= 200.13
##$BF4= 200.13
##$BF5= 200.13
##$BF6= 200.13
##$BF7= 200.13
##$BF8= 200.13
##$BYTORDA= 1
##$CFDGTYP= 0
##$CFRGTYP= 5
##$CHEMSTR= <none>
##$CNST= (0..31)
1 1 145 1 1 1 1 1 1 1 1 1 1 1 1 1 1 1 1 1 1 1 1 1 1 1 1 1 1 1 1 1 
##$CPDPRG= <>
##$CPDPRG1= <>
##$CPDPRG2= <>
##$CPDPRG3= <>
##$CPDPRG4= <mlev>
##$CPDPRG5= <mlev>
##$CPDPRG6= <mlev>
##$CPDPRG7= <mlev>
##$CPDPRG8= <mlev>
##$CPDPRGB= <>
##$CPDPRGT= <>
##$D= (0..31)
0 1.2 0 0 0 0 0 0 0 0.06 0 0.03 0 0 0 0 0.0002 0 0 0 0 0 0 0 0 0 0 0 0 
0 0 0 
##$DATE= 1657014119
##$DBL= (0..7)
120 120 120 120 120 120 120 120 
##$DBP= (0..7)
150 150 150 150 150 150 150 150 
##$DBP07= 0
##$DBPNAM0= <>
##$DBPNAM1= <>
##$DBPNAM2= <>
##$DBPNAM3= <>
##$DBPNAM4= <>
##$DBPNAM5= <>
##$DBPNAM6= <>
##$DBPNAM7= <>
##$DBPOAL= (0..7)
0.5 0.5 0.5 0.5 0.5 0.5 0.5 0.5 
##$DBPOFFS= (0..7)
0 0 0 0 0 0 0 0 
##$DE= 6
##$DECBNUC= <off>
##$DECIM= 32
##$DECNUC= <off>
##$DECSTAT= 4
##$DIGMOD= 1
##$DIGTYP= 9
##$DL= (0..7)
0 120 120 120 120 120 120 120 
##$DP= (0..7)
150 150 150 150 150 150 150 150 
##$DP07= 0
##$DPNAME0= <>
##$DPNAME1= <>
##$DPNAME2= <>
##$DPNAME3= <>
##$DPNAME4= <>
##$DPNAME5= <>
##$DPNAME6= <>
##$DPNAME7= <>
##$DPOAL= (0..7)
0.5 0.5 0.5 0.5 0.5 0.5 0.5 0.5 
##$DPOFFS= (0..7)
0 0 0 0 0 0 0 0 
##$DQDMODE= 0
##$DR= 18
##$DS= 0
$$ [...]
##$SUBNAM2= <"">
##$SUBNAM3= <"">
##$SUBNAM4= <"">
##$SUBNAM5= <"">
##$SUBNAM6= <"">
##$SUBNAM7= <"">
##$SUBNAM8= <"">
##$SUBNAM9= <"">
##$SW= 18.0517283424941
##$SWIBOX= (0..15)
0 0 2 0 0 0 0 0 0 0 0 0 0 0 0 0 
##$SW_h= 3612.71676300578
##$TD= 16384
##$TD0= 1
##$TE= 0
##$TE2= 300
##$TE3= 300
##$TEG= 300
##$TL= (0..7)
0 120 120 120 120 120 120 120 
##$TP= (0..7)
150 150 150 150 150 150 150 150 
##$TP07= 0
##$TPNAME0= <>
##$TPNAME1= <>
##$TPNAME2= <>
##$TPNAME3= <>
##$TPNAME4= <>
##$TPNAME5= <>
##$TPNAME6= <>
##$TPNAME7= <>
##$TPOAL= (0..7)
0.5 0.5 0.5 0.5 0.5 0.5 0.5 0.5 
##$TPOFFS= (0..7)
0 0 0 0 0 0 0 0 
##$TUNHIN= 0
##$TUNHOUT= 0
##$TUNXOUT= 0
##$USERA1= <user>
##$USERA2= <user>
##$USERA3= <user>
##$USERA4= <user>
##$USERA5= <user>
##$V9= 5
##$VALIST= <valist>
##$VCLIST= <CCCCCCCCCCCCCCC>
##$VD= 0
##$VDLIST= <DDDDDDDDDDDDDDD>
##$VPLIST= <PPPPPPPPPPPPPPP>
##$VTLIST= <TTTTTTTTTTTTTTT>
##$WBST= 1024
##$WBSW= 4
##$XGAIN= (0..3)
0 0 0 0 
##$XL= 0
##$YL= 0
##$YMAX_a= 273515
##$YMIN_a= -231689
##$ZGOPTNS= <>
##$ZL1= 120
##$ZL2= 120
##$ZL3= 120
##$ZL4= 120
##$ABSF1= 10
##$ABSF2= 0
##$ABSG= 5
##$ABSL= 3
##$ALPHA= 0
##$AQORDER= 0
##$ASSFAC= 0
##$ASSFACI= 0
##$ASSFACX= 0
##$ASSWID= 0
##$AUNMP= <proc_1d>
##$AZFE= 0.1
##$AZFW= 0.1
##$BCFW= 1
##$BC_mod= 2
##$BYTORDP= 1
##$COROFFS= 0
##$CY= 11.3945322036743
##$DATMOD= 1
##$DC= 2
##$DFILT= <>
##$DTYPP= 0
##$F1P= 2.36226072786647
##$F2P= -0.459571619588291
##$FCOR= 0.5
##$FTSIZE= 0
##$FT_mod= 4
##$GAMMA= 1
##$GB= 0.15
##$INTBC= 1
##$INTSCL= 1
##$ISEN= 128
##$LB= 0.24
##$LEV0= 0
##$LPBIN= 0
##$MAXI= 10000
##$MC2= 0
##$MEAN= 0
##$ME_mod= 0
##$MI= 1.114404
##$NCOEF= 0
##$NC_proc= 0
##$NLEV= 6
##$NOISF1= 3.799351
##$NOISF2= 2.8
##$NSP= 1
##$NTH_PI= 0
##$NZP= 0
##$OFFSET= 15.70392
##$PC= 1
##$PHC0= -18072.72
##$PHC1= 30.80069
##$PH_mod= 1
##$PKNL= yes
##$PPARMOD= 0
##$PSCAL= 0
##$PSIGN= 0
##$REVERSE= no
##$SF= 200.130013532006
##$SI= 16384
##$SIGF1= 3
##$SIGF2= 2
##$SINO= 400
##$SIOLD= 16384
##$SREGLST= <1H.CDCl3>
##$SSB= 0
##$STSI= 0
##$STSR= 0
##$SW_p= 3612.71676300578
##$SYMM= 0
##$S_DEV= 0
##$TDeff= 0
##$TDoff= 0
##$TI= <>
##$TILT= no
##$TM1= 0
##$TM2= 0
##$TOPLEV= 0
##$USERP1= <user>
##$USERP2= <user>
##$USERP3= <user>
##$USERP4= <user>
##$USERP5= <user>
##$WDW= 1
##$XDIM= 8192
##$YMAX_p= 0
##$YMIN_p= 0
$$ End of Bruker specific parameters
$$ ---------------------------------
##NTUPLES= NMR FID
##VAR_NAME=  TIME,          FID/REAL,        FID/IMAG
##SYMBOL=    X,             R,               I
##VAR_TYPE=  INDEPENDENT,   DEPENDENT,       DEPENDENT
##VAR_FORM=  AFFN,          ASDF,            ASDF
##VAR_DIM=   8192,          8192,            8192
##UNITS=     SECONDS,       ARBITRARY UNITS, ARBITRARY UNITS
##FACTOR=    0.0002768,     1,               1
##FIRST=     0,             0,               0
##LAST=      2.2672688,     0,               0
##MIN=       0,             -231689,         0
##MAX=       2.2672688,     273515,          0
$$ Real data points
##PAGE= N=1
##DATA TABLE= (X++(R..R)), XYDATA
$$ [...]
2181d17m45J483O64k308J021J305j966K30J575j141j282J958k85j760J128J220
$$ -417 -862 621 1285 -1023 -2 1303 -663 -433 1142 1 -1281 677 392 -1368 -240 980
2197I80j767l72K348j294n97J189J89j910R85J246j623l03J421r1j177J525j22
$$ 980 -787 -1159 1189 -105 -702 487 676 -1234 -249 997 -626 -929 492 401 -776 749 627
2214F27j067R08Q01j608m61K003q84j484J492Kj270Q03R81j114n93J664j176q71
$$ 627 -440 468 1269 -339 -800 1203 319 -1165 327 329 -941 -138 843 -271 -864 800 -376 -1247
2232a247J361N19j938J151J127j235n69J510m48j076R65O47j709O23J444j205
$$ -1247 114 633 -1305 -154 973 -262 -831 679 231 -845 120 767 -942 -319 1125 -80
2248h0j78J135l56j298J194J26q70J89J048j398j82J320l34j043J245K25j186
$$ -80 -258 877 521 -777 417 543 -327 -138 910 -488 -670 650 316 -727 518 743 -443
2265d43nJ308j032n93J108N3j192J047L80j336L59J389q57j056J408l0j591J552
$$ -443 -448 860 -172 -765 343 396 -796 251 631 -705 -346 1043 186 -870 538 508 -1083 469
2283D69J87j436K64J357j110r51J734K63j630O69J215j499k59J431l81j068J209
$$ 469 656 -780 -516 841 -269 -1220 514 777 -853 -184 1031 -468 -727 704 323 -745 464
2300D64k7j247M67J518j425j42J217q19m41J284j48j479Q10O19j200j19J606r02
$$ 464 437 -810 -343 1175 -250 -392 825 6 -435 849 701 -778 32 651 -549 -668 938 36
2318C6o73P42O84j574P23R32j069m28J028l66j160J495K18j650O41J349j083n59
$$ 36 -637 105 789 -785 -62 870 -199 -627 401 35 -1125 370 588 -1062 -421 928 -155 -714
2336g14J604o01r12Q49N3j058L88J249r65q27J507j86r40J080K75j630O25J020
$$ -714 890 289 -623 226 279 -779 -391 858 -107 -934 573 387 -553 527 802 -828 -203 817
2354H17j079k30J217j039r05J255P67j852P40J438r96o36R76J30j328P11O20j083
$$ 817 -262 -492 725 -314 -1219 36 803 -1049 -309 1129 133 -503 473 603 -725 -14 606 -477
2372d77q2J133p00m94J041r2j136Q37Q69j749P71J014r29j129J772n2r56N22O84
$$ -477 -559 574 -126 -620 421 329 -807 30 899 -850 -79 935 6 -1123 649 597 -359 163 847
2391H47r32l47J252p95p56P59N97j282Q73O02j305L85O46l00o96Q12l6j022K73
$$ 847 -85 -432 820 25 -731 28 625 -657 216 818 -487 -102 544 244 -452 360 324 -698 -425
2410d25R10j013l32J172l32o48J040n4p90N01O88p02q98J095k01n85R36M51j189
$$ -425 485 -528 -860 312 -20 -668 372 318 -472 29 717 15 -883 212 11 -574 362 813 -376
2429c76M24R47q12o91P65K33j322Q44O60j162m0R10q54N7Q51J96j403Q02J033
$$ -376 48 995 183 -508 257 490 -832 12 672 -490 -530 380 -474 -417 434 630 -773 29 1062
2448A062j768m7J133j187j02J394J2q90N12N60j127M5J088o51p70R73lq78Q95
$$ 1062 -706 -753 380 -807 -909 485 497 -393 119 679 -448 -403 685 34 -736 237 234 -644 251
2467B51K07p67J33J063r02o49J232K00j607L09O64j40j85Q53j24j219J432K0j592
$$ 251 458 -309 -176 887 -15 -664 568 768 -839 -530 134 -6 -191 662 538 -681 751 771 -821
2486h21K68P56j286Q0J303n46l78R25N32j178P97L86j254P7P63l05q92R73M92
$$ -821 -553 203 -1083 -1003 300 -246 -624 301 833 -345 452 838 -416 -339 424 119 -773 200 692
2505F92j332q5J911j151l7N85k06p70M32L66r88L13P98o83o35J323j90j045J078
$$ 692 -640 -725 1186 35 -2 583 377 -393 39 405 -583 -270 528 -155 -790 533 343 -702 376
2524C76J87p71l7Q80q63q22J460mq63K89J412j687K12P39o1j128J196l14j035
$$ 376 563 -208 -245 635 -228 -1050 410 406 -457 -168 1244 -443 -231 508 447 -681 515 201 -834
2543h34Q68K79o35l47J102o81m04Q45L22j175K27R29r69j05R60m34l53J081L47
$$ -834 34 313 -322 -669 433 -248 -652 193 515 -660 -433 496 -473 -578 382 -52 -405 676 1023
2562A023j490P32Q12j116l39R43o59q25J216K88j147Q00P09j237j90J173o22j087
$$ 1023 -467 265 1077 -39 -378 565 -94 -919 297 585 -562 238 947 -290 -480 693 71 -1016
2580a016J047K34j116O36R32r01q9J104j62j224J132k83r70O20K06q40j63J453
$$ -1016 31 265 -851 -215 717 -184 -273 831 669 -555 577 294 -676 -56 150 -690 -853 600
2598F00l61p79Q00O72r23k2P53j350L0R00n23p70R29L17l70M5Q48m53j059J257
$$ 600 239 -540 260 932 9 -13 740 -610 -580 320 -203 -973 -44 273 -97 -52 796 343 -716 541
2618E41r3j132P20L19j154J85J258k18r57J001L83j229O01M44j530N06J073k68
$$ 541 448 -684 36 355 -799 -614 644 426 -531 470 853 -376 225 669 -861 -355 718 450
2636D50j224J146j54o79R16M28j047K00Q41j180o59O05L97n47L75R74r55m9J137
$$ 450 -774 372 218 -461 455 883 -164 36 877 -303 -962 -357 40 -507 -132 842 -113 -162 975
2655I75n49j034J250m17o49j72J022j357K59J222k83k68K52N65j273K88O07q31
$$ 975 426 -608 642 225 -424 -596 426 -931 -672 550 267 -1 251 816 -457 -169 438 -393
2673c93J65L60l18o13Q80K61o10M50P55n56p72P22l93q52P40L57k82n24J377n21
$$ -393 -228 132 -186 -799 81 342 -268 182 937 381 -391 331 -62 -914 -174 183 -99 -623 754 233
2693B33n3R66r86q45P50K64j169L07P34m37p42J631r4q98P18M9q47J7N45q2n42
$$ 233 180 1146 160 -685 65 329 -840 -533 201 -236 -978 653 559 -339 379 428 -419 -402 143 61 -481
2714d81P99j91r01Q59P20p96K8O89o17o43Q42m05p21M54O45m62k12M35K87m96
$$ -481 318 127 -774 85 805 9 37 726 109 -534 308 -97 -818 -364 281 -181 -393 42 329 -167
2734a67O45j92p24J49O64r40L39N54l38n75J385l42k82K81J40q72m0L43j91j001
$$ -167 478 286 -438 -289 375 -565 -226 328 -10 -585 800 458 176 457 597 -275 -315 28 -163 -1164
2754a164R90N65q69P66O49q75k67P16k21q18L73J29j015O82M81k40j49O48m2m10
$$ -1164 -174 391 -478 288 937 62 -205 511 290 -528 -155 -26 -1041 -359 122 -118 -267 381 339 -71
2774g1M55M2j361J111j62o02j63Q93n50j74J124K66q93M62O93j177q31R95l81
$$ -71 384 426 -935 176 14 -588 -751 142 -408 -582 542 808 -85 377 1070 -107 -938 57 -324
2793c24m68O78N79j146P42Q21n73k58J122r88o31L89mp11J34J027j021N45N32
$$ -324 -792 -114 465 -681 61 882 309 51 1173 185 -446 -57 -61 -772 -638 389 -632 -87 445
2812D45P5q45M90K93o79l14P16l89k06M15J53n36M96O83o65L40K14n77j107J508
$$ 445 520 -325 165 458 -221 -535 181 -208 -414 1 154 -382 114 797 132 472 686 109 -998 510
2832E10r33l90M13O75k55J5M00j69m06O04m2j050K41O66q60k25J432m68n31O61
$$ 510 -423 -813 -400 275 20 35 435 266 -140 464 422 -628 -387 279 -581 -806 626 158 -373 288
2852B88R36j297L10K4n73j43P18l65p02P62K29l36L87L20l18l45Q53q94l62j28
$$ 288 1224 -73 237 261 -312 -455 263 -102 -804 -42 187 -149 238 558 240 -105 748 -146 -508 -636
2872f36L68o01L26J146q38K50Q43k22p16J20mp17l8J093j029pR10q9p61Q69N55
$$ -636 -268 -869 -543 603 -235 15 858 636 -80 40 36 -681 -719 374 -655 -662 248 159 -602 267 822
2893H22p08J5L56r09m19R23j16m51Q12N8j055P12N47j46q78Q55j11o86M18p8o75
$$ 822 114 129 485 -424 -843 80 -36 -487 325 383 -672 40 587 441 -437 418 307 -379 39 -39 -714
2914g14O77L92P9n99P94n6j080R76k57j035K08P33p59K8J207m76l66M17M04m29
$$ -714 -37 355 434 -165 629 573 -507 469 212 -823 -615 118 -641 -613 594 118 -248 169 573 144
2934A44l41N58j92j125R82K97l59j32Q27n99L30M03q14k2o1k46l34K12M48k81
$$ 144 -197 361 169 -956 26 323 -36 -168 659 60 390 793 -21 -43 -104 -350 -684 -472 -24 -305
2954c05k35J097M0n03L60M34j253P30m92l72j15N09K65p00N88O02p15R4P46q36
$$ -305 -540 557 597 94 454 888 -365 365 -127 -499 -614 -105 160 -540 48 650 -65 29 775 -61
2974f1n79Q06j99p08O49M85j053M19J023n75K82J25n7j242P81K28q03K3L01k28
$$ -61 -640 166 -33 -741 -92 393 -660 -241 782 207 489 614 557 -685 96 324 -479 -456 -155 -383
2994c83j1M39J50m66P19Qo45m37N54o63J58L21J44o3K34R10j142L54L90o66j66
$$ -383 -394 45 195 -271 448 456 -189 -626 -72 -735 -577 -256 -112 -175 59 969 -173 181 571 -95 -261
3015b61J15L16o02j7P09l95P0P14m19j5K43m2p84L3K92q65J18J080m80j65N18
$$ -261 -146 170 -432 -449 260 -135 -65 649 230 215 458 416 -368 -335 -43 -908 -790 290 -190 -355 163
3036A63L01l74J23J10o41J88K68l54m21N14O08o89K99M61l14J68J25n33n61O51
$$ 163 464 90 213 323 -318 -130 138 -216 -637 -123 485 -204 95 556 242 410 535 2 -559 92
3056I2k58q36O53O22m38M29O8k70m17N65K18q27J29N08q04Q0L43K72k81N98J20
$$ 92 -166 -1002 -349 273 -165 264 332 62 -355 210 428 -399 -270 238 -566 -486 -143 129 -152 446 566
3077E66m69M4K94o42j12M52o40R5J71N54n63M49N33p95L4l3K37m73J11J22l71
$$ 566 97 141 435 -207 -319 133 -507 -412 -241 313 -250 199 732 -63 -29 -62 175 -298 -187 -65 -436
3098d36K77K94Lk41Q42k99m16K01mk89K8k64k84J06P03K98n34L26N28n69l09N02
$$ -436 -159 135 138 -103 739 440 24 225 221 -68 -40 -304 -588 -482 221 519 -15 311 839 270 -39 463
3120D63o18k76M42M15n43k71P16k43J84L87k64m91M43m28k34J76K70n13J17N40
$$ 463 -155 -431 11 426 -117 -388 328 85 269 656 392 -99 344 -84 -318 -142 128 -385 -268 272
3140B72l42l74J106P3q50N8L18n64n3M95m63m16J048k04J72j93N91p42q7O21o58
$$ 272 -70 -444 662 735 -115 -57 261 -303 -356 139 -324 -740 308 104 276 83 674 -68 -155 466 -192
3161a92n67K05O38m18L89N64p92N54K90o93m84M60J81l28p8L45n64P3O69j87K14
$$ -192 -759 -554 84 -334 55 619 -173 381 671 -22 -506 -46 135 -193 -271 74 -490 -417 252 65 279
3182B79k7R4l11K37J8j020k65Q15J61p06P97L84k65k02M37J91q94K49L78j339
$$ 279 252 346 35 272 290 -730 -995 -180 -19 -725 72 456 191 -11 426 617 -277 -28 350 -989
3202i89R81N27j155L67P95k63n43Q12m06m02K72J1o58j0O51r3m34J157m1k91j75
$$ -989 -8 519 -636 -269 526 263 -280 532 126 -276 -4 7 -651 -661 -10 -103 -537 620 579 288 113
3223A13K99n5k88J73j81q82Q83K79o62O13P8pl34P23l41n92K17k22k87J59J49
$$ 113 412 357 69 242 61 -821 62 341 -321 292 370 363 29 752 411 -181 36 -186 -473 -314 -165
3244a65k28J46R95l51m31N31K14j223K05L57k22l68N99J63k97O92J30n07k29O82
$$ -165 -393 -247 748 397 -34 497 711 -512 -307 50 -172 -540 59 222 -75 617 747 240 11 693
3264F93o11n53L83l24J42N03q0o67O46L00k74m18O34j26n86K19J86j019P71K11
$$ 693 82 -471 -88 -412 -270 233 153 -514 132 432 158 -260 374 248 -338 -119 67 -952 -181 30
3284C0K0m61J299l68m66P3N49j268N68J29l25p8N06K56o05L03K14k24J36K39m97
$$ 30 50 -411 888 520 54 127 676 -592 -24 105 -220 -298 208 464 -141 162 376 152 288 527 30
3305C0m66K72o0p20M87M80j44K81J92Q1n29M16K78p11j14P4l37J35L86K3J56M70
$$ 30 -436 -164 -224 -944 -457 23 -121 160 352 433 -96 320 598 -113 -227 -153 -490 -355 31 54 210 680
3327F80n35k80J83L36n76l57N59o3n75M79O21n11K18L02n91L47P6m45m56M88L09
$$ 680 145 -135 48 384 -192 -549 10 -53 -628 -149 472 -39 179 481 -110 237 313 -132 -588 -100 209
3348B09q53L01R10m80J14M60l50n00K39n0o54L12Q0m69L54Q51j5m74K90L37k57
$$ 209 -644 -343 567 87 201 661 311 -189 50 0 -654 -342 -262 -731 -377 474 459 -15 275 612 355
3369C55l54L44j56q73L86O0m41L66J94j82K81L36p4l69O24l92p49N79L1Qp4L50
$$ 355 1 345 189 -684 -298 -238 -679 -313 -119 -301 -20 316 242 -127 497 105 -644 -65 -34 -26 -100 250
3391B50J10m27N54l48j01q9L87k29n63L51K48n87Q75n2l66M52o4J6p03L54l65
$$ 250 360 -67 487 139 38 -51 336 107 -456 -105 143 -444 431 379 13 465 401 417 -286 68 -297
3412b97k49L76K05l09J24Q92m48k66M82j69n05L02k2p22N90J97j69m27J217m97
$$ -297 -546 -170 35 -274 -150 742 294 28 510 341 -164 138 116 -606 -16 181 12 -415 802 305
3432C05m06Q26l74l21K1L99p19m44P56j37j29K72L97r13Q61j75J03n83N15m14
$$ 305 -101 725 351 30 51 450 -269 -713 43 -94 -223 49 446 -467 394 219 322 -261 254 -160
3452a60J17m6M1k39O10J73k47k69M53k46p68P50k10n35j96Q17l88L92N78j88p61
$$ -160 -43 -89 -48 -287 323 496 249 -20 433 187 -581 169 -41 -576 -772 45 -343 49 627 439 -322
3473c22N23R8j79l73O56n30o14L56P0k59N13O69q6j37R2r5p28K36k96m35L93O53
$$ -322 201 299 120 -253 403 -127 -741 -385 -315 -574 -61 608 522 385 477 382 -346 -110 -406 -841 -448 205
3495B05k17J74M70r1m95N57k29n08l43O88o11rN17n65O0O43N51m94kR4k88K53
$$ 205 -12 162 632 541 46 603 374 -134 -477 211 -400 -409 108 -457 -397 246 797 303 301 395 107 360
3517C60m10j00m88N12P8k65K27O41p42L09n7k27j95L76K01q9l75L21j79m6N64
$$ 360 -50 -150 -638 -126 -48 -313 -86 555 -187 122 65 -162 -357 19 220 131 -244 77 -102 -148 416
3538D16n2o03L23l5r6l49J7R6N4N35l56K40k28L27K84n37K13p20J96K22k08k99
$$ 416 364 -239 84 49 -47 -396 -379 -283 -229 306 -50 190 -38 289 573 36 249 -471 -275 -53 -261 -560
3560e60M43M52j86n4J27j14k25M09k3m88j15N19o41M88R5r9J75J15l72k65Q05
$$ -560 -117 335 149 95 222 108 -117 292 269 -219 -334 185 -456 32 127 28 203 318 -54 -319 486
3581D86m9o63K98j65l13l76Q43l26kP84K2n41J82J87l1m81N0m05J79L43K07L4
$$ 486 437 -226 72 -93 -406 -782 61 -265 -267 517 539 -2 180 367 336 -145 -95 -500 -321 22 229 263
3603B63j97N31k65o30L31L80p74J33M65q77O59J16KM9J12N05p62K2J33k15n30
$$ 263 66 597 332 -298 33 413 -361 -228 237 -640 19 135 137 186 298 803 41 63 196 -19 -549
3624e49Q62l21l02J31P99o24%K51k46j75L06m05M5J62j33l75R7O48J88n47L67
$$ -549 313 -8 -310 -179 620 -4 -4 247 1 -174 132 -273 -228 -66 -199 -574 -477 171 359 -188 179
3645A79O1n92N72k72m10L42J20j12r7K51L20m37L24J65p46O09o68M9K02j98K22
$$ 179 240 -352 220 -52 -462 -120 0 -112 -209 42 362 -75 249 414 -332 277 -391 -342 -140 -338 -116
3666a16l4j07P01n07K89K62k63K60m35j44p10L13J31J32M63j66Qq6L14j06k03
$$ -116 -150 -257 444 -63 226 488 225 485 50 -94 -804 -491 -360 -228 235 69 77 -9 305 199 -4
3687dj30K0k70J27K53k73N7L43K52l68J2L39l37k07L49j67o50P55K25l94J86K91
$$ -4 -134 -114 -384 -257 -4 -277 -220 123 375 7 19 358 21 -186 163 -4 -654 101 326 -68 118 409
3709D09k18j67M70m57j92M7j46J14m50N30K90j16J45j15j66J58L55p24k35K45
$$ 409 191 24 494 37 -155 -108 -254 -140 -590 -60 230 114 259 144 -22 136 491 -233 -468 -223
3729b23k11k3N50J02m78O59p9k19M93j45n89J14rm06Q7N97j78K93n49O19j24q3
$$ -223 -434 -457 93 195 -283 376 297 78 571 426 -163 -49 -58 -464 -377 220 42 335 -214 405 281 198
3751A98P8k11n18J62K53m16L78l1N5K82J45k31j41k10M81m01O9K34n02J1M70k83
$$ 198 276 65 -453 -291 -38 -454 -76 -107 -52 230 375 144 3 -207 274 -127 -58 176 -326 -315 155 -128
3773a28J88l2L53j69O3o2k61j33K61o64J87o4K78l86N47O66k76k33L71k46p76
$$ -128 60 28 381 212 275 213 -48 -181 80 -584 -397 -461 -183 -569 -22 644 368 135 506 260 -516
3794e16J97L17n22L16N19m82j13L01J97n00K44P1j46k38N84l23l07P33k53k19
$$ -516 -319 -2 -524 -208 311 -171 -284 17 214 -286 -42 29 -117 -355 229 -94 -401 332 79 -140
3814a40J72J99j21K11j93Km44K93qp03P62M03m37j84M52j54m4L25Q3n18l18K59
$$ -140 32 231 110 321 128 130 -314 -21 -29 -732 30 433 -4 -188 264 110 66 391 474 -44 -362 -103
3836a03k1k30Q02k10O1j93M26n97k19K91m23K72Oj33J90M49p5k27j19M75l5m67
$$ -103 -124 -354 448 238 299 106 532 -65 -284 7 -416 -144 -138 -271 -81 368 293 66 -53 422 387 -80
3858h0J99l0m63M21L85p41M91J54k7k75N47l72j31K3K5p7m03K77k62O8J59N62
$$ -80 119 89 -374 47 432 -309 182 336 309 34 581 209 78 101 126 49 -354 -77 -339 -271 -112 450
3880D50o05N30J98q11N6M66J7q38M34K09k31j86Q51l61l71K61R7n5M8k77J20j12
$$ 450 -155 375 573 -238 -182 284 301 -537 -103 106 -125 -311 540 179 -192 69 166 111 159 -118 2 -110
3902a10J99m5l20R4K65k49J92Q4m18K26J91j61p1J28k97J06L07j7j44J20N36p18
$$ -110 89 44 -276 -182 83 -166 26 110 -308 -82 109 -52 -123 5 -292 -186 121 104 -40 80 616 -102
3924a02K30J95J18p25k56P80k49R5J44k33k40M54J53n47JM23n26L93j58j76J36
$$ -102 128 323 441 -284 -540 240 -9 86 230 -3 -243 211 364 -183 -182 241 -285 108 -50 -226 -90
3945i0N73m87n5O6K43K9m48L13j30m66O15L4l36j87Q38l46j10M43l24l43K07k35
$$ -90 483 -4 -59 7 250 279 -169 144 14 -452 163 197 -139 -326 512 166 56 499 175 -168 39 -196
3967a96k68K34l3O7N0K98o4O8Q8Kp5j35l66j34J01J003o11M7l20N67l81J49q9
$$ -196 -464 -230 -263 -196 -146 152 88 156 244 246 171 36 -330 -464 -363 640 29 76 -244 323 -58 91 2
3990Bl24N84k00m27j21Q24j2p04Q80J03l48k78M07l47l50K44j28l15M45O8L3K4
$$ 2 -322 262 62 -365 -486 338 326 -378 502 605 257 -21 386 39 -311 -67 -195 -510 -65 3 36 60
4012F0J76k64K39j13k77K79j77n7k23L49J40k69l25P94m83j21M50r2m91J72M60
$$ 60 236 -28 211 98 -179 100 -77 -134 -357 -8 132 -137 -462 332 -151 -272 178 86 -405 -233 227
4033B27n50k03P18J25l43N9L37l98k32K71m2M8R6j79j31M67Rj85j80N81l43m68
$$ 227 -323 -526 192 317 -26 33 370 -28 -260 11 -31 17 113 -66 -197 270 279 94 -86 495 152 -316
4055c16L49J72Ml29L20m43L14J88K09r56L46L00l12Q1N3K20o04M47k15l31K69
$$ -316 33 205 209 -120 200 -243 71 259 468 -488 -142 158 -154 -73 -20 200 -404 43 -172 -503 -234
4076b34O13p31L08K97Ol74K97n8j02k28RK14k93L03l64m6L58L08r40O67J80n27
$$ -234 379 -352 -44 253 259 -115 182 124 22 -206 -197 17 -276 27 -337 -383 -25 283 -657 10 190 -337
4098c37K71N9o6m10O66J09n99K04L94l20j11O26n65J06j31l5J86L0o4L4j9p1J44
$$ -337 -66 -7 -73 -483 183 292 -307 -103 291 -29 -140 486 -79 27 -104 -139 47 77 13 47 28 -43 101
4121A01o75O64J24k82L91j04m48j3N52K39n78K48r8j18q6M4j18NK25k31K06O6
$$ 101 -574 90 214 -68 323 219 -229 -242 310 549 -29 219 121 3 -83 -39 -157 -152 73 -158 48 114
4143A14j86M90k74K97k70l33J19J60k56M08j86k38o3L80l05k9L56P0k83J98J25
$$ 114 -72 418 144 441 171 -162 -43 117 -139 269 83 -155 -218 162 -143 -172 184 254 -29 169 294
4164B94q23J98K06N1j24M61j78m15K56L83n70J35j12l3j05N53m78J80L33j15k77
$$ 294 -529 -331 -125 -74 -198 263 85 -330 -74 309 -261 -126 -238 -271 -376 177 -301 -121 212 97 -180
4185a80K30L25n57L92K31j47p4l12p4K08O2J51j67o8J84m7j17m90N20K2m75M82
$$ -180 50 375 -182 210 441 294 220 -92 -166 42 104 255 88 20 204 157 40 -450 70 92 -383 99
4207I9j94k35L32K46n34l4O97o01M86k30l44k7L30K35k99j9Q3j76j21R52n15J9
$$ 99 -95 -330 2 248 -286 -320 377 -224 262 32 -312 -339 -9 226 -73 -92 -9 -185 -306 646 131 150
4229A50l29K75jl92J80nJ03L9k59j58K83L87k90j98K47j56j65L28J17l62L83K9
$$ 150 -179 96 95 -297 -117 -122 -19 20 -239 -397 -114 273 -17 -215 32 -124 -289 39 156 -206 177 206
4251B06o29K50L82j71l87P19l29k84L44k32J03N4M61m79o8m9M93p84J57L58m19
$$ 206 -423 -173 209 38 -349 370 41 -243 101 -131 -28 26 487 8 -60 -109 384 -400 -243 115 -304
4272c04J25L88k74j20L27L34n72K27N4l01J29J33m75J02P29m46P5j03R9r2o8K27
$$ -304 -179 209 -65 -185 142 476 -96 131 185 -116 13 146 -329 -227 502 56 131 28 127 35 -33 194
4294A94J09r60N91Pj17K53L32j73l68L04m48K75L86m4l41n2L72q75J74N23Pj80
$$ 194 303 -657 -66 -59 -176 77 409 236 -132 172 -276 -1 385 341 0 -52 320 -555 -381 142 149 -31
4316c1J0J8m74L16L57m75Q2M67j50J51q8k41j04N08k39l51L74J65l43KP4j11O7
$$ -31 -21 -3 -477 -161 196 -279 -197 270 120 271 183 -58 -162 346 107 -244 130 295 -48 -46 28 -83 -16
4339a6l86N03o4l0K13j79k78L69m64K60O1O9p6J05J58o72K24K08J87l34R2J51
$$ -16 -402 101 37 7 220 41 -237 132 -332 -72 -11 58 -18 87 245 -427 -203 5 192 -142 -50 101
4361A01K28j037O76K99p45M83K51l41k30N26j40N5J10p7l75L63j47J5j81J49P8
$$ 101 329 -708 -32 267 -478 5 256 -85 -315 211 71 126 236 159 -216 147 0 15 -166 -17 61
4382F1l49N37J17k04j89J58m11K52K56k50r1K03m3l53K74l52L17J85L31m09K46
$$ 61 -288 249 366 162 -27 131 -280 -28 228 -22 -113 90 47 -306 -32 -384 -67 118 449 40 286
4403B86j9J4k87K25k75k8j43K82P3l61J81J26n54P31k04O0m5J66k38K27J16k22
$$ 286 267 281 -6 219 -56 -84 -227 55 128 -233 -52 74 -480 251 47 107 62 228 -10 217 333 111
4425A11k14k66R80o57k44N07k09j71L96l15j94M77l03K72k54J15J07j57J75m66
$$ 111 -103 -369 611 -46 -290 217 8 -163 233 -82 -276 201 -102 170 -84 31 138 -19 156 -310
4445c10L88m9j67K26m14K35K45l34M49k30k55qP00k38k91K41O7m53Q47o14K2l04
$$ -310 78 29 -138 88 -326 -91 154 -180 269 39 -216 -224 476 238 -53 188 255 -198 649 35 57 -247
4467b47K43K54o56O05R1l91M8M52q57N85j05J70k66J96j93l29J67N14o24L05L02
$$ -247 -4 250 -406 199 290 -101 -53 399 -458 127 22 192 -74 122 -71 -400 -233 281 -343 -38 264
4488B64n04P4L20j59l9q1J35j49L5P08o61j90M18K6k61k03M59k07R1j01L35m11
$$ 264 -240 -166 154 -5 -44 -125 10 -139 -104 604 -57 -247 171 197 -64 -267 192 -15 76 -25 310 -101
4510a01K25k49K5J83k31j4J67p5jl42P19m13j3J88j8K26l22M0k83M75l47k2J72
$$ -101 124 -125 -100 83 -148 -162 5 -70 -71 -413 306 -107 -120 68 50 276 -46 -6 -289 186 -161 -183 -11
4533a1J56J64ol65K93l45k22L23J74k59N6N1OP1r1k50L33j43M15m51J94k4m94
$$ -11 145 309 303 -62 231 -114 -336 -13 161 -98 -42 9 15 86 -5 -255 78 -65 350 -101 93 69 -425
4556d25M24L7Ol88J48J15mJ32j08K18j30K31j51k61q4L78j73K88j74J50n3j00
$$ -425 -1 36 42 -346 -198 -83 -87 45 -63 155 25 256 105 -156 -240 138 -35 253 79 229 176 76
4578G6n9K25j33K85o17o0M18K34m19K67k21j22K37N1j035P66M85m40k34N43j20
$$ 76 17 242 109 394 -223 -283 135 369 -50 217 -4 -126 111 162 -873 -107 378 -62 -296 247 127
4599A27m43L46K90n72O37n13O3k63J70M38n51O39m40l57J87K39j33R5J00l08K57
$$ 127 -316 30 320 -252 385 -128 -65 -328 -158 280 -271 368 -72 -429 -242 -3 -136 -41 59 -249 8
4620HL14m7n02Q3J07O4j99J54j90RJM1j35N6L39nl1J2o9j32L1K96j1j57l3N1l22
$$ 8 322 275 -227 -144 -37 27 -172 -18 -208 -199 -198 -157 -292 -236 103 98 67 79 10 -122 -91 205 194 37 4 55 -267
4647b67M33l41j10J95J94n73N55K25j65l31M66l54j30K60M7k85j18O11j72n85
$$ -267 166 -175 -285 -90 104 -469 86 311 146 -185 281 -73 -203 57 104 -181 -299 312 140 -445
4667d45M92L14m80O5K7J84m25L92l7j56L05J77l16m79M47j4J98Q1n45k6L10N8
$$ -445 47 361 -119 -54 -27 157 -268 124 87 -69 236 413 97 -382 65 51 249 330 -215 -241 69 127
4689A27k10K65m95M33l97L90Q5k88m01Q49k88J0K69k22j62M25l74l65Q06O4m38
$$ 127 -83 182 -313 120 -277 113 198 -90 -491 358 70 80 349 127 -35 390 16 -349 457 521 83
4710H3m3L23n04L03j79k13P14k87J01k48n0P2J21o21M19J20l22nJ43j07p1L16
$$ 83 40 363 -141 162 -17 -230 484 197 298 50 0 72 193 -428 -9 111 -211 -216 -73 -180 -251 65
4732F5o10K57J98K75l47P0M69j43n03L22k78j62N40N5m34J79R0J29k90J73M8j55
$$ 65 -545 -288 -90 185 -162 -92 377 234 -269 53 -225 -387 153 208 -226 -47 43 172 -118 55 103 -52
4754e2l94M32L42p18N82l16K48j02j70j76K04L60n17J08L99l46j09L25j63J55
$$ -52 -446 -14 328 -390 192 -124 124 22 -148 -324 -120 240 -277 -169 230 -116 -225 100 -63 92
4774I2P5j60j26O81m23p69K80M99k75K52j20n0O5ko0l14j6L93J69j84l6j42n5
$$ 92 167 7 -119 562 139 -630 -350 149 -126 126 6 -44 21 19 -41 -355 -371 22 191 7 -29 -171 -226
4797b26J86Q21j249L33N04o98N41l4j90l38L10K46k58K3J91k16J29k42M49m80
$$ -226 -40 781 -468 -135 369 -329 212 178 -12 -350 -40 206 -52 -29 162 -54 75 -167 282 -198
4817a98j43r3O14n80N75J66o29L38P8j89MK61kk01p9K84k10j74J68l1K8j93K01
$$ -198 -341 -434 180 -400 175 341 -288 50 128 -61 -57 204 202 1 -78 206 -4 -178 -10 -41 -13 -206 -5
4840ej69L24K38n61k28M76j08j08o4J75j33O3J91k67l1K92r3j45M54j46r5k8r5
$$ -5 -174 150 388 -173 -401 75 -33 -141 -205 -30 -163 -100 91 -176 -207 85 -8 -153 301 155 60 32 -63
4863f3R6J73J60k6o2k61J76k44K81l94K55k10J20N08m75J61r6j43K63l25O5J27
$$ -63 33 206 366 340 278 17 193 -51 230 -164 91 -119 1 509 34 195 99 -44 219 -106 -41 86
4885H6K20l15J23m50P6J61K33j15jJ78j93J77k11m0N0J1K57Q1o35Q15m02P2n73
$$ 86 306 -9 114 -336 -260 -99 134 19 18 196 3 180 -31 -71 -21 -10 247 328 -307 508 106 178 -395
4908c95N19J35l20J19K01l85J80q1k1m9K47R9m32N9j16j04J45K59j26J36p33Q39
$$ -395 124 259 -61 58 259 -126 54 -27 -48 -97 150 249 -183 -124 -240 -344 -199 60 -66 70 -663 176
4930A76k75q7N76m45J41K3J5Q8j37J12k35m6L50k15m10K82K24k37L6p5J2o6L71
$$ 176 -99 -186 390 -55 86 109 124 212 75 187 -48 -94 256 41 -369 -87 137 -100 -64 -139 -127 -193 178
4953A78k77k10K28L3j8J18o3j03l31N70L7p91O69J33p8L09l16M8r6Ol07N13p3
$$ 178 -99 -309 -81 -48 -66 52 -11 -114 -445 125 162 -629 40 173 95 404 88 136 40 46 -261 252 179
4976A79r9R8j28k14m7N06j61k19N7K15n3p3k0l26J21j78J43L9J85m08N88n49k6
$$ 179 80 178 50 -164 -211 295 134 -85 -28 187 134 61 41 -285 -164 -342 -199 -160 25 -383 205 -344 -370
4999c70P53l96k12J33l0J60l37L29n72P66r5l28K8LK65j5j70L47j65L0Rq9n1O70
$$ -370 383 -13 -225 -92 -122 38 -299 30 -542 224 129 -199 -171 -168 97 82 -88 259 94 124 133 44 -7 663
5023F63m37l05K6jo6P6L84m07J79k11k2q2P19m35J23j92K50m04j62M02N1J6j39
$$ 663 226 -79 -53 -54 -120 -44 340 -67 112 -99 -121 -203 516 81 204 12 262 -142 -304 98 149 165 26
5046B6L06r3k12J02k85L25j2M8m41K25o4m12O48l05pM6P24p75j14N16j20m22K88
$$ 26 332 239 27 129 -156 169 157 205 -236 -11 -75 -487 161 -144 -151 -105 619 -156 -270 246 126 -296 -8
5069hj89O2l0L3J40L48k99L4q7m34M33k41mM70K26p44K49K64k22K63L0O7k45K92
$$ -8 -197 -135 -165 -132 8 356 57 91 4 -430 3 -238 -242 228 454 -290 -41 223 1 264 294 361 116 408
5093D08j04k36J8k94N53m97K52J88J42l39j50j31M11p5m50J09M36n30M96m88M97
$$ 408 304 68 86 -208 345 -152 100 288 430 91 -59 -190 221 146 -304 -195 241 -289 207 -281 216
5114B16m0l72J79L66m38K38q4k35J76J98l93K15N8j29M8k12L62j07j7L03o03K72
$$ 216 176 -196 -17 349 -89 149 65 -170 6 204 -189 26 84 -45 3 -209 153 46 29 332 -271 1
5136AJ72j20j89m26N45l13L86N6m13J91j93M69m31J61L53l72J12k00K82J52K19
$$ 1 173 53 -136 -562 -17 -330 56 112 -301 -110 -303 166 -265 -104 249 -123 -11 -211 71 223 442
5157D42m64j83L3J99k69L08K13l65K95m36K59r1L03j2p01k6L99k56L46R4J92o31
$$ 442 -22 -205 -172 27 -242 66 279 -86 209 -227 32 -59 244 232 -469 -495 -96 -352 -6 88 280 -351
5179c51N90j29k55N77p57K07J0R5J77l70L68r5k98K85K2q6J39L88n29K88k84k97
$$ -351 239 110 -145 432 -325 -118 -108 -13 164 -206 162 67 -231 54 76 -10 129 517 -12 276 -8 -305
5201c05n0N91q5j3l14N16q8o52N80k10n8N79l18l63N36l9n48K87J74O4k47L13
$$ -305 -355 236 151 138 -176 340 252 -400 180 -30 -88 491 173 -190 346 307 -241 46 220 284 37 350
5223C50k59N7l09J86Jk07K01K44n36k2O67m26K19j21L16l13J29l71K5j17Q39n22
$$ 350 91 148 -161 25 26 -181 20 264 -272 -294 373 -53 166 45 361 48 177 -194 -169 -286 553 31
5245C1nJ43m38L57N1k31o33Q31N2k09j94K93L68n83J58J8k06K06K22k31P1j57
$$ 31 26 169 -269 88 139 -92 -725 106 158 -51 -245 48 416 -167 -9 9 -197 9 231 0 71 -86
5267h6L02m3K43l4n44K16pr4l15N64%m64N10m6k04L1J1k9r9J40j54j53J43N24
$$ -86 216 173 416 382 -162 54 47 -47 -362 202 202 -262 248 202 -2 29 40 11 -88 52 -102 -255 -112 412
5291D12j53k63O2m7J33k18J79k67L46j46M6k17L67O9l46L24n1o71L68J64K96k30
$$ 412 259 -4 58 11 144 -74 105 -162 184 38 84 -133 234 303 -43 281 230 -441 -73 91 387 157
5313A57q5J63k67K5J28m39O09p55R4O45j95PJ80N3n56j00M16k00q2L00o2k1j36
$$ 157 72 235 -32 -7 121 -318 291 -464 -370 275 80 87 267 320 -236 -336 80 -120 -202 98 36 15 -121
5336a21P4L48o32L40n5K81k7q7m54L64n7j4o9K30J28n36M31k0J14k52K07k65j36
$$ -121 -47 301 -331 9 -46 235 208 121 -333 31 -26 -40 -109 121 249 -287 144 124 238 -14 193 -72 -208
5359b08K23Q7k86Q1J90jl37N09J58m85N3l09J50j33p8M86K21k80K20K4l47j7R
$$ -208 15 102 -184 -103 87 86 -251 258 416 -69 -16 -325 -175 -308 -386 100 321 41 261 285 -62 -79 -70
5382g0l47j10M27k07K69l6K30q1l76Q6l8K33k6j5L69l7p17K03K18l2k8K95o74
$$ -70 -417 -527 -100 -307 -38 -74 156 75 -301 -215 -253 -20 -46 -61 308 271 -446 -243 -25 -57 -85 210 -464
5405d64M94P3J37j81L4%j0r5K55l16L4K95Q9l88P1J94m12j99N68k25j78R6J97
$$ -464 30 103 240 59 93 93 83 -12 243 -73 -39 256 345 -43 28 222 -190 -389 179 -46 -224 -128 69
5428F9Kk14J48l07K13L17m18j14L50J56j06K40k25j0l18O49k26k40K37N0n77K47
$$ 69 71 -143 5 -302 -89 228 -190 -304 46 202 96 336 111 101 -217 432 206 -34 203 253 -324 -77
5450g7qK00K65l40m00p9L19L00j45m63N91J86j80N6l32J11l96O08o09J37Q78m42
$$ -77 -85 115 380 40 -360 -439 -120 180 35 -428 163 349 169 225 -107 4 -392 216 -393 -256 622 180
5472A80m98L70l31J15j95K72J37l91L52K09k61J33l4l3P7n35L61OK44k11l96M12
$$ 180 -318 52 -279 -164 -359 -87 50 -341 11 220 -41 92 58 25 102 -433 -72 -66 178 -33 -429 -17
5494a7j31L55k57M71j2O8R0n54n28J97L75k27M2L00j53k63K13P4r0r7J37k25Q0
$$ -17 -148 207 -50 421 409 477 567 13 -515 -318 57 -170 -128 172 19 -244 -31 43 -47 -144 -7 -232 -152
5517a52J36M3K0K40k92k60O8N6K77n21K50j06K67l30K94j64P7K91n2P6k57J50
$$ -152 -16 27 47 287 -5 -265 -197 -141 136 -385 -135 -241 26 -304 -10 -174 -97 194 142 218 -39 111
5539A11o3j92j06j38N91N5l80l98J066l15l36O7J4j01j89j25L25J32J2k08L03
$$ 111 48 -144 -250 -388 203 258 -122 -520 546 231 -105 -38 -24 -125 -314 -439 -114 18 30 -178 125
5560A25j54j51L2J64L4k97N66n86J03J78J21k53J55Q6J17k97N3K78k96p3K18%
$$ 125 -29 -180 -148 16 50 -247 319 -267 -164 14 135 -118 37 123 240 -57 -4 274 -22 -95 123 123
5582A23l93L07n3N9m3J83k67J51r4k1J61k93M96n80j5M25j49j6o6j15r8L12R7
$$ 123 -270 37 -16 43 0 183 -84 67 -27 -48 113 -180 316 -264 -279 146 -3 -19 -85 -200 -298 14 111
5605A11P9o4k39M5J88k34J57n6k98N66j85j43J98J97l76M3k02l77M52k23M54l33
$$ 111 190 126 -113 -68 120 -114 43 -13 -311 255 70 -73 125 322 -54 -11 -213 -590 -138 -361 93 -240
5627b40M21K37n72j34L99K8l85K58j83L35J15O7n69R2P5k08L19M35l46k26k5J45
$$ -240 181 418 -154 -288 111 139 -246 12 -171 164 279 346 -223 -131 -56 -264 55 490 144 -82 -107 38
5649C8j0J53k03N9oK87l28Q2K00Pj83j53K30j86K12K05n52k1L64k01n35Q17k09
$$ 38 28 181 -22 37 31 318 -10 72 272 279 96 -57 173 -13 199 404 -148 -169 195 -6 -541 276 67
5672F7o2o7r8j00K60J05j00J57k0j8J02l28O22m02l03L93k68m41J028m63k83P9
$$ 67 5 -62 -160 -260 0 105 5 162 142 124 226 -102 520 118 -185 208 -60 -501 527 64 -219 -140
5694a40Ok80K32K39J5L7k85L56J64m07j01K40l47N23l76K49l79M5K23K77j30J26
$$ -140 -134 -414 -182 57 72 109 -176 180 344 -63 -164 76 -271 252 -124 125 -254 -209 14 291 161 287
5716B87j13J27m71N16n25K64l00J72j32L99l17j18J70k51L99M96r35J52M26l01
$$ 287 174 301 -170 346 -179 85 -215 -43 -175 224 -93 -211 -41 -292 107 603 -332 -180 246 -55
5736e5J07L6L17j77k75P8rl90N31r1l43JL5J48K95l10j33J0K86l73N09j75M80
$$ -55 52 88 405 228 -47 31 22 -368 163 72 -271 -270 -235 -87 208 -102 -235 -225 61 -312 197 22 502
5759E02m20J68j36K54o23M19l47J47o6j17L23l18P6M3j24L8j2kn7Q0K45N8j61
$$ 502 82 250 114 368 -255 164 -183 -36 -102 -219 104 -214 -138 -95 -219 -181 -193 -195 -252 -172 73 131 -30
5782c0J2K14K8m26J58k28L90k23l36Q04n43J9N52j23n01K20N5j68j23o4p2L07
$$ -30 -18 196 224 -202 -44 -272 118 -105 -441 363 -180 -161 391 268 -233 -13 42 -126 -249 -313 -385 -78
5804g8j19k20K66J60k5j52P3N09k85n26K60L22l4k84M99k19l19J49j4J4J47M97
$$ -78 -197 -417 -151 9 -16 -168 -95 414 129 -397 -137 185 151 -133 366 147 -172 -23 -37 -23 124 621
5826F21q43J12J54l62O4K25j69K27N9Q8l67N0R6M01l45J27j91j30K67R4k09L1
$$ 621 -222 -110 44 -318 -254 -29 -198 29 88 176 -191 -141 -45 356 11 138 -53 -183 84 178 -31 0
5848@J70k15Q6J11j26q0r6J21j56M86j42j16L9n6K80m14K43J66n10l19O72n10
$$ 0 170 -45 41 152 26 -54 -150 -29 -185 301 159 43 82 26 306 -108 135 301 -209 -528 144 -366
5870c66N58m7J06p5m46N05m00Q9M42n08m48N71lk71M93K41j01m78L12k84J04m9
$$ -366 192 145 251 176 -270 235 -165 -76 366 -142 -590 -19 -22 -293 200 441 340 -138 174 -110 -6 -55
5892e5M50l84N5M54n50K82n02N16m14K45R7L26m81M5k44Q5J29j85l3L26r9K49
$$ -55 395 11 66 520 -30 252 -250 266 -148 97 194 520 39 84 -160 -75 54 -131 -164 162 63 312
5914C12o28K21L8J2q1k1K74n96K65L85m25L79j99j05O2j4J81J57k78J64j88l%
$$ 312 -316 -95 -57 -45 -126 -147 127 -469 -204 181 -244 135 -64 -169 -107 -121 60 217 -61 103 -85 -88 -88
5937h8q0J42pJ69P0j01m0l05J42j72M82j39j91K46n0N83r65M21k54j01J50J97
$$ -88 -168 -26 -33 136 206 105 65 -240 -98 -270 212 73 -118 128 78 661 -304 117 -137 -238 -88 109
5959A09j63L7k81K93K8j01K91o5L73l52j12n6k74M01n19NJ96M13j14kj45k06J57
$$ 109 -54 -17 -298 -5 23 -78 213 148 521 169 57 1 -273 128 -391 -386 -190 223 109 107 -38 -244 -87
5982h7j9L2j63K07k96R6N78p6j80j93J35P3J95k6k66l6k57L48j43P5j43M32o06
$$ -87 -106 -74 -237 -30 -326 -230 348 272 92 -101 34 107 302 276 10 -26 -283 65 -78 -3 -146 286 -320
6005c20N22j4k19L33K66o59L57j36J9k87L25m3J94l40J69J73o10K67Pj64L33l83
$$ -320 202 188 -31 302 568 -91 266 130 149 -138 187 144 338 -2 167 340 -270 -3 4 -160 173 -210
6027b10L81l10M1L25l26M26k66lq2M9j69l0J75J31j86q7L94n90L00K68n03nJ54
$$ -210 171 -139 -98 227 -99 327 61 58 -24 25 -144 -174 1 132 -54 -141 253 -337 -37 231 -272 -277 -123
6050a23K10k02O2k5j69p0J95j6N1K10j55K3K74R7k77l93L13J59n07K14J59l38
$$ -123 87 -115 -53 -78 -247 -317 -122 -138 -87 123 -32 -9 265 362 85 -308 5 164 -343 -129 30 -308
6072c08K21K43l35j20Q9j03L73j48O0l92N5K75K44j14O1j48M2N8J44m93O5O36
$$ -308 -87 156 -179 -299 -210 -313 60 -88 -28 -420 -365 -90 154 40 101 -47 -5 53 197 -296 -231 405
6094D05q94N47j49K83k31k58L7J17J71mj1o62R61o6j04k22L52j10M4k29k87M64
$$ 405 -489 58 -91 192 -39 -297 -260 -143 28 24 13 -649 312 246 142 -80 272 162 206 -23 -310 154
6116A54m78Q6k3K88K85j84L6J02l60k63P05o21K88k40j77K81LN3j78L71N4j73
$$ 154 -324 -238 -261 27 312 128 164 266 -94 -357 348 -273 15 -225 -402 -121 -118 -65 -243 128 182 9
6138IR4N7j79o7J18l46L14oo11Q33Rk2j90K0K06n29K17J29M1M3k44J12r8R9L51
$$ 9 103 160 -19 -86 32 -314 0 -6 -617 216 225 203 13 33 239 -290 -73 56 97 140 -104 8 -90 9 360
6163C60m43L02m3j76j99K74m76J11l80O14N87r32K12L15lJ38m15l74K30L65J20
$$ 360 -83 219 176 0 -199 75 -401 -290 -670 -56 531 -401 -189 126 123 261 -154 -528 -298 67 187
6184A87l63L15k41N9k22L34J64j17K83o1j03l20n6K63k38L14j89P3m61N61k59
$$ 187 -176 139 -102 -43 -265 69 233 116 399 338 235 -85 -141 122 -116 198 9 82 -379 182 -77
6205g7r9K72k84J63L14J22r58K08L89k29K26q8R3J62j50J3l97pM82O5j67K40k84
$$ -77 -176 96 -188 -25 289 411 -547 -339 50 -179 47 -41 52 214 64 77 -320 -327 155 220 53 293 9
6228Ik5L69m08j75L24k11nJ73O2r7K45k78M01j60j38j12P1P7l01L50j69m86L34
$$ 9 -16 353 -55 -230 94 -117 -122 51 113 16 261 -17 384 224 86 -26 45 122 -179 171 2 -484 -150
6251a50J76L2M73m03j73L12k50J78j6k09l91N9K73R0J16J13j23k47J50K14J14
$$ -150 26 58 531 128 -45 267 17 195 179 -30 -421 -362 -89 1 117 230 107 -140 10 224 338
6272C38l40M47j60k31l96k0n4K23K77O2j29J97k78K37l48N80l38n08M22J47J09
$$ 338 -2 445 285 54 -342 -362 -416 -193 84 146 17 214 -64 173 -175 405 67 -441 -19 128 237
6293B37l61m0N13k16m47J03M73j08l61K40j87m85O19p9K82k28r7K9O5j00P7K98
$$ 237 -124 -164 349 133 -314 -211 262 154 -207 33 -154 -639 -20 -99 183 -45 -142 -113 -48 -148 -71 227
6315B27n79L74J79j30j95K11K58m75L61j47l68m0J70L15pq6j40k6K68j05K02n33
$$ 227 -352 22 201 71 -124 87 345 -130 231 84 -284 -324 -154 161 154 68 -72 -98 170 65 267 -266
6337b66J69J4N58jq22j39O70k19K30j48NJ46Kj17l5j95K43m18k01L49n3P9M37
$$ -266 -97 -83 475 474 -348 -487 183 -36 194 46 51 197 199 82 47 -148 95 -323 -524 -175 -228 -149 288
6360B88k36K82l99j11L21k30M0j30j7o1J17R9l15J85M6K37l37O4L15j85Q3j84
$$ 288 52 334 -65 -176 145 -85 -45 -175 -192 -253 -136 -37 -352 -167 -121 116 -221 -157 158 -27 56 -128
6382a28L83m35J37k40J32L41m86K88M7j70O6K31lj27m58O13L24p84M07k86J84
$$ -128 255 -180 -43 -283 -151 190 -296 -8 39 -131 -65 166 163 36 -422 191 515 -269 138 -148 36
6403C6J55J20r3m68K51j09R7K71m64J74J2r3K9q5L99j31N6k47j23l52Q25k90J91
$$ 36 191 311 218 -250 1 -108 -11 260 -204 -30 -18 -111 -82 -167 232 101 157 -90 -213 -565 260 -30 161
6426A61K15l1k10J90k27j76r6J26j16J97l43J05N0L34j89k6l5lN76l55m88L14
$$ 161 376 345 135 325 98 -78 -174 -48 -164 33 -310 -205 -155 179 -10 -36 -71 -74 502 147 -341 -27
6448b7j92JL03j83l37L44N20m27J30k76K71l27J83k7Ol10O28j53K00k00K1j26
$$ -27 -219 -218 85 -98 -435 -91 429 2 132 -144 127 -200 -17 -44 -38 -348 280 127 327 127 148 22
6470B2j87N25j12n85J80N1J14k57q6M88Q6j33Q4k38L09l32K83J54n98J23R1K8
$$ 22 -165 360 248 -337 -157 -106 8 -249 -335 153 239 106 190 -48 261 -71 212 366 -232 -109 -18 10
6492A0l1k17J21r6L1k66O07k86M12j86j06L80m82k6N7o1r7k63Q01l67j16N11p33
$$ 10 -21 -238 -117 -213 -182 -448 159 -127 285 99 -7 373 -109 -135 -78 -139 -236 -499 302 -65 -181 330 -403
6515d03L0K89J80J06L0m13K37j2m3o8J43O4J6J13o1QN2l25L94n56K90R5l20J97
$$ -403 -373 -84 96 202 232 -181 56 44 1 -67 76 140 156 269 208 216 268 -57 337 -219 71 166 -154 43
6539D3k35J77P5P7k66L99m62N2L6K89j72O8k80K10j67L26QP7l24k54O29l70P3
$$ 43 -192 -15 60 137 -129 270 -192 -140 -104 185 13 81 -199 11 -156 170 178 255 -69 -323 306 -64 9
6562Ik89J68J03q4k18L38J18k58N3j88q8O8N29j99l40L61N80r50K43o2k5J13L46
$$ 9 -280 -112 -9 -93 -311 27 145 -113 -60 -248 -336 -268 261 62 -278 83 663 -287 -44 -106 -131 -18 328
6585C28j51k27l2P23o03j95j54L04Mj50k4m0K81l83K87J37K13q6J18k12o20N08
$$ 328 177 -50 -82 641 38 -157 -311 -7 -3 -153 -177 -217 64 -319 -32 105 318 232 350 138 -482 26
6607B6J58m95L59K57j28k4k94J63k54K6L34j3m9o29R21k86l38K69J55J6R2oo03
$$ 26 184 -311 48 305 177 153 -141 22 -232 -206 128 115 66 -563 358 72 -266 3 158 174 266 260 -343
6630c43O41j60n07K09J67k03K60R2o7o1k7J09n7k43n9J03K57l96M95l6l58J16
$$ -343 298 138 -369 -160 7 -196 64 156 89 28 1 110 53 -190 -249 -146 111 -285 210 174 -184 -68
6652f8j51J29L64m24K98l13K12k25L4J39p4J88l76L86q20J014k77m39M54K18k74
$$ -68 -219 -90 274 -150 148 -165 47 -178 -144 -5 -79 109 -267 119 -701 313 36 -403 51 269 -5
6673ej56J60J7o8k80M56k46K41K4j7j84N9j94K57n3K93k58K73p6l74J15p2m44
$$ -5 -161 -1 16 -52 -332 124 -122 119 143 126 -58 1 -193 64 11 304 46 319 243 -131 -16 -88 -532
6696e32M58j27J27J42j65L16l37q3K51M5O8J38n72N03l08p2O8J01J44n4k37L92
$$ -532 -74 -201 -74 68 -97 219 -118 -201 50 95 163 301 -271 232 -76 -148 -80 21 165 111 -126 266
6718B66l8r0M05m63p7k83K98pl1J12J64r0O6q1q5l0J1N18m97j42L32j85q9p6p4
$$ 266 228 138 543 80 3 -280 18 11 -20 92 256 166 232 151 66 36 47 565 68 -74 258 73 -16 -92 -166
6743a66oL46k20j86QP3K35J9L5J20k41QJ6l87L85j02J68j34L19p1j53l7j68N1
$$ -166 -172 174 -46 -232 -224 -151 84 103 138 258 17 25 41 -346 39 -63 105 -29 290 219 66 29 -139 -88
6767h8L95n01K79k46M1R3J76K32p10N66n20K14j59L88l82O6P28l03k59J84n43
$$ -88 307 -194 85 -161 -120 -27 149 381 -329 237 -283 -69 -228 160 -222 -156 572 269 10 194 -349
6788c49L77l31L92r3k16L30n6Q9k46L97k07J40J62m70k32K65J22K3m22J10k00
$$ -349 28 -303 89 -4 -220 110 54 143 -103 294 87 227 389 -81 -313 -48 74 97 -325 -215 -415
6809d15L24J97K54m18R0r3k97M49l17N8N63n90K59K30l17N4J89m11J94L88n05
$$ -415 -91 106 360 -58 32 -61 -358 91 -226 -168 395 -195 64 294 -23 31 220 -191 3 391 -114
6830a14M70m22L55m30M12j75j03l6K15k03K47k14M3k15N30m03M7J83n89J88K96
$$ -114 356 -66 289 -141 271 96 -7 -43 172 -31 216 2 45 -170 360 -43 4 187 -402 -214 82
6851H2l10M40k24j25R8l06M6K12J0J52K32l35K93k67J25k19K10k73K44j05k17
$$ 82 -228 212 -12 -137 -39 -345 -299 -87 -77 75 307 -28 265 -2 123 -96 114 -159 85 -20 -237
6872b37J41LO2j13k87N80j40K79m19m82O68L9K8k19N35j16k74m98N23j18L37j
$$ -237 -96 -93 -31 -144 -431 149 9 288 -131 -613 55 94 122 -97 438 322 48 -450 73 -45 292 291
6894B91k07k29N19r78P02K04n26M72l65N3N6o0j33K17M14k91j54M02n20N69n40
$$ 291 84 -145 374 -604 98 302 -224 248 -117 -64 -8 -68 -201 16 430 139 -15 387 -133 436 -104
6915a04nN4R6K64K81n68J08j53j43k31M56J26j54j98K52NJ5n6J44l94oM17m09
$$ -104 -109 -55 41 305 586 18 126 -27 -170 -401 55 181 27 -171 81 86 101 45 189 -205 -211 206 -203
6938b03M40k48k31J40J06R4k35j30n6M14j02K5o0Q3l7J49m3P2m22M54j6l29R9
$$ -203 237 -11 -242 -102 4 98 -137 -267 -323 91 -11 14 -46 37 0 149 106 178 -244 210 194 -135 -36
6961c6Q7m11J87J9N03l67k55J67j14K20J18k15P6L1J19m25M60l31l8M43l73K82
$$ -36 51 -360 -173 -154 349 -18 -273 -106 -220 0 118 -97 -21 10 129 -296 164 -167 -205 238 -135 147
6983A47J97j92R3l42K52l77Q5K46j89M18m53M67k93k9K33n21L28k65J85k75J96
$$ 147 344 152 245 -97 155 -222 -137 109 -80 338 -115 352 59 30 263 -258 70 -195 -10 -285 -89
7004h9K80Pl78Q6L41j10m67N72j81k27K53J15o39L81J55o2j10o9J39K81k98J10
$$ -89 191 198 -180 -94 247 137 -330 242 61 -166 87 202 -437 -56 99 37 -73 -142 -3 278 -20 90
7026I0l36j32M25K2L11m97j8k9J9k65P28J22l45l84P2M45m6m35M2R2l6P1J69j94
$$ 90 -246 -378 47 69 380 -117 -135 -164 -145 -410 318 440 95 -289 -217 228 182 -253 -211 -119 -155 -84 85 -109
7050a09M61m20J71k47l48P00m46K98P9n72L78l95N17P3j52Q6l14K27K76j90K54
$$ -109 352 -68 103 -144 -492 208 -238 60 139 -433 -55 -450 67 140 -12 74 -240 -13 263 73 327
7071C27p67L61J08Rj02j02K26j73L69l32m70O20L19p27M51K09j72M1l83j51K45
$$ 327 -440 -79 29 38 -64 -166 60 -113 256 -76 -546 74 393 -334 117 326 154 195 -188 -339 -94
7092i4k65J87M39q91J091q18M05J58j67m06N00n3j80r0P9K48m03o6K94Q7m74P13
$$ -94 -359 -172 267 -624 467 -351 54 212 45 -361 139 86 -94 -184 -105 143 -260 -326 -32 55 -419 294
7114B94k75K99l79L03j88k56K27r6R7r6j57K49l74J24K15j19J85l24K42k2N9j07
$$ 294 19 318 -61 242 54 -202 25 -71 26 -70 -227 22 -352 -228 -13 -132 53 -271 -29 -51 8 -99
7136i9Q3q6K66l15L91m76L84o33K33K47J28m65M54l23j9K17j65N76p19N67n76
$$ -99 -16 -102 164 -151 240 -236 148 -485 -252 -5 123 -342 112 -211 -230 -13 -178 398 -321 246 -330
7157c30J09L28J2K43m36m9L21o7k33M29k22K62J22o33L08o03M39K76m36P3J33
$$ -330 -221 107 119 362 -74 -123 198 131 -102 327 105 367 489 -144 164 -439 0 276 -160 -87 46
7178D6J62m8R2l32l18Q24k96jo7l58J59K96k2k70j66N21m20L67k54L7m07J57l8
$$ 46 208 160 252 -80 -398 426 130 129 62 -296 -137 159 137 -133 -299 222 -198 169 -85 -48 -455 -298 -336
7201c36K23K10j21j42K32j47j10K34j2l18K1N58k60p0p3O9M15l43j87Q2K36mQ0
$$ -336 -113 97 -24 -166 66 -81 -191 43 31 -287 -266 292 32 -38 -111 -42 373 30 -157 -75 161 157 237
7224B37n73M39j19m11J21%N98k35n2M26m16K24j57K42n47L02k09j12K90m06O55
$$ 237 -336 103 -16 -427 -306 -306 292 57 5 431 15 239 82 324 -223 79 -130 -242 48 -358 297
7245B97l50K33l47K69k93L34k15J81j35nL11l13K36m4k68m3L41m47O55n17K64
$$ 297 -53 180 -167 102 -191 143 -72 109 -26 -31 280 -33 203 159 -109 -152 189 -258 397 -120 144
7266A44J16l04j27JL01K07l12K12j32l18J60N9L24p43j14K20L76r6M7j13l11M81
$$ 144 260 -44 -171 -170 131 338 26 238 106 -212 -52 7 331 -412 -526 -306 70 -26 21 -92 -403 78
7288G8N0j60K95Jp7m6l50j32L36K3J34m28K52K00J53j84l79k08M84rr2k37J16
$$ 78 128 -32 263 264 187 141 -209 -341 -5 18 152 -276 -24 176 329 145 -234 -442 42 33 -59 -296 -180
7311a80J18m0J94J08N9p13L76M5J70j54J08n33K72K1j74K94j92K83R7l52J32J27
$$ -180 -62 -102 92 200 259 -454 -78 -33 137 -17 91 -442 -170 -149 -323 -29 -221 62 159 -193 -61 66
7333F6m10K74N59l86k9j87L19l14J34j58k05M67J76l59m82P07r2J00k1j63p4K11
$$ 66 -344 -70 489 103 74 -113 206 -108 26 -132 -337 130 306 -53 -535 172 80 180 159 -4 -78 133
7355A33P8K22j97j97l9K9j0jJ42l2J9M0m30j5K72J93j19j21Q2k64L00J42k45k12
$$ 133 211 433 236 39 0 29 19 18 160 128 147 187 -243 -258 14 207 88 -33 49 -215 85 227 -18 -230
7379b30M49j47q9k29L87J9j9lJ29Mk50K27l51J43j49N6J20P5J11j90N5j0j42m70
$$ -230 219 72 -17 -246 141 160 141 138 267 271 21 248 -103 40 -109 -53 67 142 253 63 118 108 -34 -504
7403e04L51P1j69J75K43o45K84J41K8q7L08R3n47K12J37K9j22m67L44Q3m9q9O8
$$ -504 -153 -82 -251 -76 167 -478 -194 -53 -25 -112 196 289 -258 -46 91 120 -2 -469 -125 -42 -91 -180 -112
7426a12K72O9J9j3j03r1J4l34J47J89O3j38K88j36l39K06J47j90J16Q0l41P15
$$ -112 160 229 248 235 132 41 55 -279 -132 57 120 -18 270 134 -205 1 148 -42 74 154 -187 528
7448E28p37J19M36o69N08K53p39K43Ln0O08p18m4M27L3k31K09k25oK80n6j66m1
$$ 528 -209 -90 346 -323 185 438 -301 -58 -55 -105 503 -215 -259 168 201 -30 179 -46 -52 228 172 6 -35
7471c5L9j36J18k81Q7J50j73J07K91n22L35J52k87K85k67k68L24qk2N44m38P2
$$ -35 4 -132 -14 -295 -208 -58 -231 -124 167 -355 -20 132 -155 130 -137 -405 -81 -89 -111 433 -5 67
7493F7Jk90O8j0j06M40K2K8Kl68K18l49J58qJ97J83l26L19l26N4K8l23L66k1K7
$$ 67 68 -222 -154 -164 -270 170 192 220 222 -146 72 -277 -119 -127 70 253 -73 246 -80 -26 2 -321 45 24 51
7518E1p9J10n12J8N27l49J16K60oj85K72P4o84QM24n0j01K39k42lL12o24N93N0
$$ 51 -28 82 -430 -412 115 -234 -118 142 136 -49 223 297 -387 -379 45 -5 -106 133 -109 -112 200 -424 169 219
7542B19m76O5N83l09m74N88k41l29K99RM1m2m0K55k78J99K5l02K12J98j44m3j55
$$ 219 -257 -192 391 82 -392 196 -45 -374 -75 -66 -25 -67 -107 148 -130 69 94 -208 4 202 58 15 -140
7565a40%J79j6o4K21k67k01O57q29P68j89n5j74j27N47n11M08j67m30L84NJ1J01
$$ -140 -140 39 23 -41 180 -87 -288 369 -460 308 119 64 -110 -237 310 -201 207 40 -390 -6 -1 10 111
7588A11j47J81j77j73O67l7Pr6l96K19j84j82O98o25J81M48k12m55L12J76j21
$$ 111 -36 145 -32 -205 462 425 432 336 -60 159 -25 -207 491 -134 47 495 283 -172 140 316 195
7609A95k86j47K57m1J27j05m47O55j77l47L98jj99M9K07m38M05Pj58Q6k17L92
$$ 195 -91 -238 19 -22 105 0 -447 208 31 -316 82 81 -118 -69 138 -300 105 112 -46 40 -177 215
7631B15j8N0k07q6p4N43n59qM0QJ63J08J6n05K47N01m10j21J18J58k55J50J29
$$ 215 197 247 40 -46 -120 423 -136 -144 -104 -96 67 175 191 -314 -67 434 24 -97 21 179 -76 74 203
7654B03J21m38L93n27J5J56N2J23j49Q2J56k9P3k71R5o0J83r1m7Q6J99l93L40
$$ 203 324 -114 279 -248 -233 -77 -25 98 -51 31 187 158 231 -40 55 -5 178 87 40 126 325 -68 272
7677B72o50L80k10L29K83m82j26L7J33J57L99l13q7n22L20M4q4j37K%N24n70J97
$$ 272 -378 2 -208 121 404 -78 -204 -167 -34 123 522 209 122 -400 -80 -36 -120 -257 -255 -255 269 -301 -104
7700a04J86j07k46M09k48l11P08o1j33l7k8m87N54j33k03R0K10K01k24l23P8P4
$$ -104 82 -25 -271 138 -110 -421 287 226 93 56 28 -459 95 -38 -241 -151 59 260 36 -287 -209 -135
7722a35L7K22k15L16n4K42k38M7P5m63p7j32O03j03l4j59R2K09k09j58L43l65
$$ -135 -98 124 -91 225 171 413 175 222 297 -166 -243 -375 228 125 91 -68 24 233 24 -134 209 -156
7744a56L37l92M03j40k29j91K46O8K59l80O48k44l03M86k09l26K21l30J32qRj96
$$ -156 181 -211 192 52 -177 -368 -122 -54 205 -175 473 229 -74 412 203 -123 98 -232 -100 -108 -99 -295
7766b95R53r44L84L35q38M43N3L0m3j17J6m66K58q9L69J73K5k35l40M9K76L72
$$ -295 658 -286 98 433 -405 38 91 121 78 -39 -23 -489 -231 -320 49 222 247 12 -328 -279 -3 369
7788C69J31j21n47J40k14J18j34L51j24j81j51L30K34n38K05r0K64j58L34l49
$$ 369 500 379 -168 -28 -242 -124 -258 93 -31 -212 -363 -33 201 -337 -132 -222 42 -116 218 -131
7808a31K55j58n5k2j6L01n70N70r3Kj52j20J7K72l20L82l49r5N33J1l56K2K9k44
$$ -131 124 -34 -89 -111 -127 174 -396 174 81 83 -69 -189 -172 100 -220 162 -187 -282 251 262 -94 -72 -43 -287
7832b87P1L66J81m68K15j6K76o06L48q8n9J81L9k53K41K5m53K08K72R6k88p0K88
$$ -287 -216 150 331 -137 78 62 338 -268 80 -8 -67 114 153 -100 141 166 -287 -79 193 289 1 -69 219
7855B19j06O9m7k31N50p65J74k10J42L0n5J67m27O18j1j42j21K89j81j26o4O74
$$ 219 113 182 135 -96 454 -311 -137 -347 -205 -175 -230 -63 -490 128 117 -25 -146 143 -38 -164 -228 446
7877D46m60M2j09R9K11K49m15K6l83p0P64q2k48k87J18L56j0l61k00O98n01K32
$$ 446 -14 28 -81 18 229 478 63 89 -294 -364 400 318 70 -217 -99 257 247 -114 -314 384 -117 115
7899A15l03m9L86q4J27k5j2k49jM8j9J87j58n9J6k17J48N42o70k85P45J27m61
$$ 115 -188 -237 149 65 192 167 155 -94 -95 -47 -66 121 -37 -96 -80 -297 -149 393 -277 -562 183 310 -151
7922a51J31O4R5P1l28J1J4J8J44o8l08L01J19j90M55l39l71P40p28L46M6k46k39
$$ -151 -20 44 139 210 -118 -107 -93 -75 69 1 -307 -6 113 -77 378 39 -332 408 -320 26 72 -174 -413
7945d13M00l03P22n57J49L3o0k86K09j16N84n20J19R3j26J29O0l54M30l13L76
$$ -413 -13 -316 406 -151 -2 31 -29 -315 -106 -222 362 -158 -39 54 -72 57 117 -237 193 -120 256
7966B56m56L50qp7J45j68R2P9R7p34O84l14m07M72J52m1l40j52N12j98K65N3m8
$$ 256 -200 150 142 65 210 42 134 213 310 -424 260 -54 -461 11 163 122 -218 -370 142 -56 209 262 214
7989B14m57R2q1K31J9J58m35Q7J76O4k45l9J69k32k3L46J17k7k99L01k24J61p4
$$ 214 -243 -151 -232 -1 18 176 -259 -172 4 68 -177 -216 -47 -279 -302 44 161 134 -165 136 -88 73 -1
8012aK79l70l58M09j23J58m6J54N19k59j28j55j41L21m86L06L9j3j69k04L5L97
$$ -1 278 -92 -450 -41 -164 -6 -52 102 621 362 234 79 -62 259 -227 79 118 105 -64 -268 -233 164
8034A64k33k5R6l59L55n4qj03M72j07m50J17K57L8l79J18J62Q7K0k31r0L94l21
$$ 164 -69 -94 2 -357 -2 -56 -64 -167 305 198 -252 -135 122 160 -219 -101 61 148 168 -63 -153 241 -80
8057h0q4L58l15J36R3j90J9j19K35L00k89L6j12K22k06K3L04m17M39n20L34J20
$$ -80 -164 194 -121 15 108 -82 -63 -182 53 353 64 100 -12 210 4 27 331 -86 353 -167 167 287
8079B87m69L59k52k03K76o1J06p5l42L59N22k47n95K76K55K4M3m06j3J73M4k13
$$ 287 -182 177 -75 -278 -2 -63 43 -32 -374 -15 507 260 -335 -59 196 220 263 -143 -156 17 61 -152
8101a52R3m9M6K9O2j23n8M71l06k70L72M3m35k14N73j99J23M18j54k51Qr0K33
$$ -152 -59 -108 -62 -33 29 -94 -152 319 13 -257 115 158 -277 -491 82 -117 6 424 270 19 27 -63 170
8124A70k03Q9J65l53J43k66L91l2P9l99J00L53P2j32k99N48m11J80j27j69q6J67
$$ 170 -33 56 221 -132 11 -255 136 104 183 -216 -116 237 309 177 -122 426 15 195 68 -101 -187 -20
8146b0m1K86j13k34L07k69K15M4J53n42O14k46j70j41O14l63j36J17ll51J82J54
$$ -20 -61 225 112 -122 185 -84 131 175 328 -214 400 154 -16 -157 457 94 -42 75 72 -279 -97 57
8168E7Q6j13p0k11K03K35k15l3P0K84l93J71k61j27J79K8J93j58k78M26l72J55
$$ 57 143 30 -40 -251 -48 187 -28 -61 9 293 -100 71 -190 -317 -138 -110 83 -75 -353 73 -299 -144
8190a44J37
$$ -144 -7
8191g
$$ Imaginary data points
##PAGE= N=2
##DATA TABLE= (X++(I..I)), XYDATA
0@%%%%%%%%%%%%%%%k4M8m8M8m8N3p7R6j03J27j44J68k12K36k64L12l60M08m56
$$ 0 0 0 0 0 0 0 0 0 0 0 0 0 0 0 0 -24 24 -24 24 -24 29 -48 48 -55 72 -72 96 -116 120 -144 168 -192 216 -240
34b40N04n72O47p23Q14r08J006j117J242j376J522j680J853k044K251k478K734
$$ -240 264 -308 339 -384 430 -478 528 -589 653 -723 799 -881 972 -1072 1179 -1299 1435
51A435l017L323l663M047m479M972n535O184o952P875r000J0411j2240J4718j8279
$$ 1435 -1582 1741 -1922 2125 -2354 2618 -2917 3267 -3685 4190 -4810 5601 -6639 8079 -10200
66a0200K3855l3857N7138k15128n3497M06372k21772j30446K97358l749k41343
$$ -10200 13655 -20202 36936 -178192 -231689 174683 -47089 -177535 119823 116074 -125269
77a25269K07110R4354k38568N0652J87497j97242p2186K16427n1335j76113J61634
$$ -125269 81841 176195 -62373 -11721 175776 -21466 -93652 122775 71440 -104673 56961
88E6961Q3103j81809K6509J55466j34026r7621J50528k3976j69365R6499R4405
$$ 56961 140064 -41745 -15236 140230 6204 -91417 59111 35135 -134230 -37731 56674
99E6674j54523M629J73134q5297r8129J62960J1947j69403Q8862J04673j67708
$$ 56674 -97849 -93220 79914 -5383 -103512 59448 71395 -98008 -9146 95527 -72181
110g2181j1471J70591r2608j02038J69614J3035j60086R9460J00648j62655q222
$$ -72181 -83652 86939 -5669 -107707 61907 74942 -85144 14316 114964 -47691 -55913
121e5913J48832r9592r8840J47064L834j40904Q9728R5207j29923m104J33777
$$ -55913 92919 -6673 -105513 41551 45385 -95519 -5791 89416 -40507 -44611 89166
132H9166p4265q7903J17867Q908j26212O4703Q9317j08283j4000J27940n2616
$$ 89166 14901 -73002 44865 53773 -72439 -7736 81581 -26702 -40702 87238 34622
143C4622q9682J03824J9715j29206L9513Q5458j08467l1463J20991m2175q9391
$$ 34622 -55060 48764 68479 -60727 -21214 64244 -44223 -75686 45305 3130 -86261
154h6261J05915L3182j18777M0717Q9148j03707l5924J13759m2045q8038J01153
$$ -86261 19654 52836 -65941 -25224 63924 -39783 -75707 38052 -3993 -92031 9122
165I122L7720j03868M8699R5580q6200k9531J06872l8342r1780P8978K8390j06073
$$ 9122 46842 -57026 -8327 87253 1053 -28478 78394 40052 -51728 27250 55640 -50433
177e0433K9117Q7135p6232l2093J04600k2565q6784P1060L3881j05404J1186P9079
$$ -50433 -21316 65819 -10413 -42506 62094 39529 -47255 23805 57686 -47718 -36532 42547
189D2547p4043m3627R7449j1930p8828P3484M8509q9466J3417Q2868o6496m8298
$$ 42547 -31496 -75123 22326 10396 -68432 5052 53561 -35905 -22488 60380 -6116 -54414
201e4414Q5964j2961q1170O1515M7336p9727J3677Q2449n4099m3578P7818q244
$$ -54414 31550 18589 -62581 -1066 46270 -33457 -19780 62669 8570 -35008 42810 34566
213C4566q1295M6048M1360p7069J512P6532m2261m2493P6533K754p3076M0390
$$ 34566 -46729 -681 40679 -36390 -34878 41654 -607 -43100 33433 36187 -36889 3501
225C501M4715p4493q686P0582l9079m7650P0363J2075o8541L8768N2381o7015
$$ 3501 48216 -26277 -34963 35619 -3460 -51110 19253 31328 -37213 1555 53936 -13079
237a3079j2047O8313l8492n5452O1641J1158o9867L3420N4865n7610r538P0695
$$ -13079 -25126 43187 4695 -50757 10884 22042 -47825 -14405 40460 -17150 -26688 44007
249D4007k8761n2923N6196J0005p1451K4040M9293n5238j2613O9406j8066m5153
$$ 44007 15246 -37677 18519 28524 -42927 -18887 30406 -24832 -37445 31961 13895 -31258
261c1258N5988J8238o3716J7719M4667n5151k1998N9075j9378m7556N1453K4139
$$ -31258 24730 42968 -20748 -3029 41638 -13513 -35511 23564 4186 -43370 8083 32222
273C2222n5276J8893N0532m6512k4076N3982j9177n3616M0397K1923n6603J4653
$$ 32222 -23054 -4161 46371 -141 -24217 29765 10588 -43028 -2631 19292 -37311 -22658
285b2658N4473l7691k1185N9505r073n2088L7863K2135n9521N495M9945l8471
$$ -22658 31815 -5876 -27061 32444 23371 -28717 9146 31281 -28240 -22745 27200 -11271
297a1271k5463N9328j833m8299L8984K9508n4367J244M7330l8439l2144N0608
$$ -11271 -36734 22594 20761 -27538 11446 40954 -13413 -12169 35161 -3278 -35422 15186
309A5186l062m9051L5337L3755m8198J478N0626l1357l4022M5543j026n1864K6019
$$ 15186 12124 -36927 -1590 32165 -16033 -14555 36071 4714 -29308 16235 15209 -36655 -10636
322a0636L2705m5068r14N1874k1837l1611M6271N554m9951K0220L1048m5054q608
$$ -10636 22069 -22999 -23913 27961 6124 -25487 20784 26338 -23613 -3393 27655 -17399 -26007
335b6007M8012j9315l1510M5905J2149m5806K0619L4522m4139j3870M2600k1021
$$ -26007 22005 2690 -28820 17085 29234 -16572 4047 38569 -5570 -19440 23160 2139
347B139l8533L8849J3272m4471J9223L9832l5114j3378M5961j6184m1058L2506
$$ 2139 -36394 2455 15727 -28744 -9521 30311 -4803 -18181 27780 11596 -29462 3044
359C044J2646m7480J1612L8883l1524j2415M8350o494l5314L3423J6854m5759
$$ 3044 15690 -31790 -20178 18705 -12819 -25234 23116 16622 -18692 14731 31585 -14174
371a4174M920L4053l3087k0319M1478m260l4544L1767K2708l8503N715L6610k9401
$$ -14174 -9254 24799 -8288 -28607 12871 8611 -25933 5834 28542 -9961 -4246 32364 2963
384B963k4461L5852o405l8653K5648K2198l6616N339L9794k2137k0836L7592k310
$$ 2963 -21498 14354 7949 -30704 -5056 17142 -19474 -14135 25659 3522 -17314 20278 17968
397A7968l9797K0900K0137l8967q59L7624j9755k1407L8352M006l5711J9870K2891
$$ 17968 -21829 -929 19208 -19759 -20618 17006 -2749 -24156 14196 18202 -17509 2361 25252
410B5252l7598n574L4765k0451k5986L5528O331l4328K0748K8173l1683n698L5826
$$ 25252 -12346 -17920 16845 -3606 -29592 5936 12267 -22061 -1313 26860 -4823 -10521 25305
423B5305j8787k8783L1162N496l7348J7037K8709k9163m354L6979j2724k7944
$$ 25305 6518 -22265 8897 14393 -22955 -5918 22791 -6372 -10726 26253 13529 -14415
435a4415K8646N612l9036R695K5020l0879r349L6401q714k5695K9870J2899l3789
$$ -14415 14231 19843 -19193 -9498 15522 -15357 -24706 11695 2981 -22714 7156 20055 -13734
448a3734P971K5602k8896j4564L2338r196k8642K7706J7290l0276J0275L2223
$$ -13734 -5763 19839 -9057 -23621 8717 -479 -29121 -1415 15875 -14401 -4126 28097
460B8097k3398j5218L1695p489l3176K1633J3903l4436O056L2288k0164j4891
$$ 28097 4699 -10519 21176 13687 -19489 2144 16047 -18389 -12333 19955 -209 -15100
472a5100L5162k393l1220K0302J4554l5244p52K8443k2064j7274L3048R13k7445
$$ -15100 20062 17669 -13551 6751 21305 -13939 -14691 13752 -8312 -25586 7462 8375 -19070
485a9070K1235K0114k9834j259K9195k0666k0813K7562M83k9697J7644K1727k6355
$$ -19070 2165 22279 -7555 -8814 20381 -285 -21098 6464 6947 -22750 -5106 16621 -9734
498i734r17L1349j5137k1032K5819K352l1360J2470K0764k6683l140L1456j1488
$$ -9734 -10651 20698 5561 -15471 10348 12700 -18660 -6190 14574 -12109 -15249 16207 4719
511D719j9789K7977O132l0940J1751K0225k8216p509K9059j1574k1131K7311Q727
$$ 4719 -15070 12907 19039 -11901 -150 20075 -8141 -15650 13409 1835 -19296 8015 16742
524A6742k8122J2624K2473k6562r042K6392j2718k5432K3347P576k8237J2000
$$ 16742 -11380 1244 23717 -2845 -11887 14505 1787 -23645 -298 7278 -20959 -8959
536h959K5322k1350p540K9525q773k4943K0461P651k9630N749K4171k0140q250
$$ -8959 16363 -4987 -12527 16998 8225 -16718 3743 11394 -18236 -12487 11684 -8456 -16706
549a6706L0540l633k2043K2738J1710k8621L125K2364k2578j4545K6313l885k3471
$$ -16706 13834 10201 -11842 10896 22606 -6015 -2890 19474 -3104 -17649 8664 4779 -18692
562a8692K1081J4827k5399M390K5921k0095j5686K5076m666k7999J6823J4713
$$ -18692 2389 17216 -8183 -3793 22128 2033 -13653 11423 6757 -21242 -4419 10294
574A0294k5845L391K7245j5186j3846K7327o17k7260J5356J4382k7628j117K5928
$$ 10294 -15551 -12160 15085 -101 -13947 13380 12763 -14497 859 15241 -12387 -13504 12424
587A2424j5192j4717K7111K352k4847J4991J6818k5778l237K4577j4719j9208
$$ 12424 -2768 -17485 9626 11978 -12869 2122 18940 -6838 -10075 14502 -217 -19425
599a9425K4825M106k5380J4747J9975k2755l393K5322j2767k0874K2321L351k7249
$$ -19425 5400 9506 -15874 -1127 18848 -3907 -7300 18022 5255 -15619 6702 10053 -17196
612a7196J1407K0449k1719m041K7093q979j9113K1442M431k7332P870J7297k2417
$$ -17196 -5789 14660 -7059 -11100 15993 7014 -12099 9343 13774 -13558 -5688 11609 -10808
625a0808o983K6327q052j7197K2623Q634k4031P996J9325k1588r586K3102q075
$$ -10808 -17791 8536 484 -16713 5910 14544 -9487 -1491 17834 -3754 -13340 9762 1687
638A687k0887K0075R976k3497Q379K3199j7448r322K4393o928k2802J6242Q615
$$ 1687 -19200 875 10851 -12646 -4267 18932 1484 -7838 16555 9627 -13175 3067 11682
651A1682k6060M735K1945j6750r117K5789k959k0850J6769J0288k5027J689J9944
$$ 11682 -14378 -9643 12302 -4448 -13565 12224 9265 -11585 5184 15472 -9555 -7866 12078
664A2078j7491j1474K3185j504k0218J6971J3339k2134J569K1867j5695j3904
$$ 12078 -5413 -16887 6298 4794 -15424 1547 14886 -7248 -5679 16188 493 -13411
676a3411K1450k049k2309J4938J3942k1590J476K3383j3158j4216K1873q55k3256
$$ -13411 8039 5990 -16319 -1381 12561 -9029 -7553 15830 2672 -11544 10329 9474 -13782
689a3782J2331J3163k2161J9K3197j2251j3662K2853J901k2712J1992J4019k3539
$$ -13782 -1451 11712 -10449 -10430 12767 516 -13146 9707 11608 -11104 888 14907 -8632
702h632k382K2025j2723j4240K1903L384k0299J1153J6531k0403l974K0914j1731
$$ -8632 -11014 11011 -1712 -15952 5951 9335 -10964 189 16720 -3683 -7657 13257 1526
715A526j7068J8955L108k1867J0555J7649j7811l179K3046q843j6647J7655M123
$$ 1526 -15542 3413 6521 -15346 -4791 12858 -4953 -8132 14914 6071 -10576 7079 11202
728A1202k3471O433J6475j8639m861K2923n913j6126J8949P027k1478O016J6293
$$ 11202 -12269 -5836 10639 -8000 -12861 10062 4149 -11977 6972 13999 -7479 -1463 14830
741A4830j8740q165K0024o487j7298J7346Q168j9586O435J8701j6197q200J9722
$$ 14830 -3910 -12075 7949 1462 -15836 1510 9678 -9908 -3473 15228 -969 -9169 10553
754A0553n046j9007J4032Q020k0321M603J8780j3808q051K1213l480j7918J3882
$$ 10553 5507 -13500 532 8552 -11769 -7166 11614 -2194 -10245 10968 7488 -10430 3452
767C452Q470k0641J771J7602j3739r225K0343j271j7638J3789R791j9702J560
$$ 3452 11922 -8719 -6948 10654 -3085 -12310 8033 6762 -10876 2913 12704 -6998 -5438
780e438J7017j3287j0882J8701j693j7546J3107J1542j7901J470J7711j2326j1058
$$ -5438 11579 -1708 -12590 6111 4418 -13128 -21 11521 -6380 -4910 12801 475 -10583
793a0583J6998j134j8463J1054J1248j7025O22J9125r603j0661J7744K10j8803
$$ -10583 6415 5281 -13182 -2128 9120 -7905 -7283 11842 2239 -8422 9322 9532 -9271
806i271R345J0766j8399j648J7994r513j1420J8080L100j6851R296J1985j7763
$$ -9271 74 10840 -7559 -9207 8787 -726 -12146 5934 9034 -7817 1479 13464 -4299
819d299k866J7215j0336j3388J6372K233j7185R250J3845j4923k239J7674p629
$$ -4299 -7165 10050 -286 -13674 2698 4931 -12254 -3004 10841 -4082 -6321 11353 3724
832C724j3323J4320K537j8146O579J3249j4063l622J7865n046j2753J4733M482
$$ 3724 -9599 4721 7258 -10888 -4309 8940 -5123 -8745 9120 4074 -8679 6054 10536
845A0536j7493M863J2770j4642n957J6711m679j3163J3797O536j6198M409J3901
$$ 10536 -6957 -2094 10676 -3966 -9923 6788 2109 -11054 2743 9279 -6919 -2510 11391
858A1391j2990o810J6413m953j4553J3142O105j5920M331J4697j1959o725J6223
$$ 11391 -1599 -8409 8004 3051 -11502 1640 7745 -8175 -3844 10853 -1106 -7831 8392
871H392l155j4787J0799O842j6201J786J4983j0914p171J6338k057j3753J0179
$$ 8392 5237 -9550 1249 8091 -8110 -6324 8659 -2255 -9426 6912 4855 -8898 1281
884A281P665j5659J018J3705r944q026J4585J47j3108J0017R375j4531M39J4043
$$ 1281 8946 -6713 -5695 8010 -1934 -9960 4625 4772 -8336 1681 11056 -3475 -3036 11007
898A1007r658r319J3081k61j4215Q307R323j3205N47J4101p580r672J3112L26
$$ 11007 1349 -7970 5111 4850 -9365 -1058 8265 -4940 -4393 9708 2128 -7544 5568 5894
912E894j5089O916Q809j3783j332J4177o489q184J3111K256j3284P370R323j3286
$$ 5894 -9195 -2279 6530 -7253 -8585 5592 -897 -9081 4030 6286 -6998 372 9695 -3591
926c591k292J3520p261r893J2894K745j3015O359J0537j1568l196J4189o394j1195
$$ -3591 -5883 7637 376 -9517 3377 6122 -6893 -534 10003 -1565 -4761 9428 3034 -8161
940h161J1607K123j3708N058J0353j1111k585J3654m403j0832J1083L871j3806
$$ -8161 3446 5569 -8139 -3081 7272 -3839 -6424 7230 2827 -8005 3078 6949 -6857
953f857L866J0541j0563m010J3122k997j0833J0588M447j2636L043J0127r889
$$ -6857 -2991 7550 -3013 -7023 6099 3102 -7731 2857 7304 -5332 -2289 7838 -2051
966b051n531J2275k368j1021R353N544j2086K850J0760q682o000J2024j939j1885
$$ -2051 -7582 4693 2325 -8696 657 6201 -5885 -3035 7725 -957 -6957 5067 3128 -8757
980h757Q683O585j2109J756J1472p403n674J2140p57j1430O887O096j2151J78
$$ -8757 -74 6511 -5598 -3842 7630 227 -5447 6693 5936 -5494 1393 7489 -4662 -4484
994d484J1059p295o938J2180k72j0617P031P041j1140r28J0290o718p648J0626
$$ -4484 6575 -720 -7658 4522 4250 -6367 664 7705 -3435 -4363 5927 -791 -8439 2187
1008B187K01j0771O231Q313j0039n66J1174m749p494R898R48j1016M623P457r818
$$ 2187 2388 -8383 -2152 6161 -3878 -4444 6730 1981 -5513 4385 5333 -5683 -1060 6397 -3421
1023c421j473J1308m511p876R886K284j0640L769P805r478k930J0484m217q427
$$ -3421 -4894 6414 1903 -5973 3913 6197 -4443 -674 7131 -2347 -5277 5207 990 -7437
1037g437Q862L245j0575L803Q699q793l591J1261l959q034Q216L906j1090L357
$$ -7437 1425 4670 -5905 -2102 6597 -2196 -5787 5474 1515 -6519 1697 5603 -5487 -2130
1051b130Q710q090l224J0031k647q389P316L397j0218K825Q605p390m098J0004
$$ -2130 6580 -1510 -4734 5297 2650 -5739 1577 4974 -5244 -2419 6186 -1204 -5302 4702
1065D702k384q083P384L533r111Q74Q550p420m153R977p93q625O556N532r524
$$ 4702 2318 -5765 1619 5152 -3959 -3085 5465 -1955 -6108 3869 3076 -5549 1007 6539 -2985
1080b985N36Q975o251n849Q894q73q527N871N599q804m58J0036n821o087R446
$$ -2985 -2449 6526 275 -5574 3320 2447 -6080 -209 5390 -3414 -3872 6164 343 -5744 3702
1095C702K41r461M803N629q735p28Q802m764n634Q627J620r151N039O338q207
$$ 3702 3943 -5518 -715 4914 -3821 -4549 4253 -511 -6145 2482 4102 -5049 -10 6328 -1879
1110a879j790Q772m209o687Q137J919r105L799P005p729k227R011l129p541P939
$$ -1879 -3669 5103 894 -5793 2344 4263 -4842 -1043 5962 -1767 -3994 5017 1888 -5653 2286
1125B286K009r231L095P609q248k413R003k424p539P112L245r048K919P111p069
$$ 2286 4295 -4936 -1841 5768 -2480 -4893 4110 1686 -5853 1259 4504 -4544 -1625 5486 -1583
1140a583l039Q780j881q090P095L138q294J761P415o568l291Q474j378p304O343
$$ -1583 -4622 4158 2277 -5813 1282 4420 -3874 -2113 5302 -1266 -4557 3917 2539 -4765 1578
1155A578L565q112P31P556n981m196Q049j068p438N054M826q244N82P998n050
$$ 1578 5143 -2969 -2238 5318 -663 -4859 3190 2122 -5316 -262 4564 -3680 -3098 4900 -150
1170a50m830Q219k06q112N062M588q465J90Q137m817m843Q077O40p805M809N016
$$ -150 -4980 3239 3033 -5079 -17 4571 -3894 -3704 4433 -384 -5227 2850 3490 -4315 494 5510
1186E510p348r85P949l890n646O984J017q464M375N228p082j420Q369m003n764
$$ 5510 -1838 -2823 5126 1236 -4410 2574 3591 -4873 -498 4730 -2352 -3772 4597 594 -5170
1201e170P740J288q395L606N130o816j752Q200l388n932O917K391q101K921O526
$$ -5170 2570 3858 -4537 -931 4199 -2617 -4369 3831 443 -5489 1428 3819 -4282 -1361 5165
1216E165o804k008Q767l137p205P082K276q583K399P072p120k199Q282j913o732
$$ 5165 -1639 -3647 5120 1983 -5222 1860 4136 -4447 -2048 5024 -2096 -4295 3987 2074 -4658
1231d658N881L246p674J725O168n703l179P549j484p221N797M017p731J272P536
$$ -4658 1223 4469 -3205 -1480 4688 -1015 -4194 3355 1871 -5350 447 4464 -3267 -1995 5541
1246E541n680l733P504q16p368N007M301q394P26P144m854m669P992o96o964M959
$$ 5541 -139 -3872 3632 2816 -4552 455 4756 -3638 -2912 4232 -622 -5291 2701 2005 -4959 0
1262@M272p650L43P357m714m744P815k79p104M370M837o554n92P514m221m394
$$ 0 4272 -3378 -3035 4322 -392 -5136 2679 2400 -4704 -334 4503 -2051 -2643 4871 650 -3744
1278c744O940O98p461L575N424p089j174P448l847n397O997P81p952L821N329
$$ -3744 3196 3894 -3567 8 5432 -1657 -2831 4617 770 -4627 2370 3151 -4801 -980 4349
1293D349o949r28P175l010n803O755J476q030L704M996o577j374P278k361n156
$$ 4349 -2600 -3528 3647 637 -5166 1589 3065 -4965 -1261 3735 -2842 -4216 3062 701 -4455
1308d455O366J980o872K508N829n943k625P352l086n753N777K511p176K617N995
$$ -4455 1911 3891 -2981 -473 5356 -587 -3212 4140 1054 -4699 1078 3589 -3587 -970 5025
1323E025o128k306P513k324n998N603K161p110J277O263n329k704P882j857n903
$$ 5025 -1103 -3409 4104 1780 -4218 1385 3546 -3564 -2287 3976 -1353 -4057 3825 1968 -3935
1338c935N600K499p047J318O203n533l492P181j236o337M918L277o645J043O564
$$ -3935 1665 4164 -2883 -1565 4638 -895 -4387 2794 1558 -4779 139 3416 -3229 -2186 4378
1353D378n379l436O804p72o231M584L647o851P53P019m690l726O868p9o824M842
$$ 4378 -1001 -4437 2367 1595 -4636 -52 3595 -3256 -2503 4516 -174 -3900 2968 2889 -3935 907
1369I07L829o714J18O642m324l949O511K81o717L849M171p089n07O275l469m846
$$ 907 4736 -1978 -1860 4782 458 -3491 3020 3301 -3416 433 4604 -2485 -2992 3283 -186 -5032
1385e032O485O78o565L689M509o260p19O533l332m830O041J269o677L252M839
$$ -5032 1453 2131 -4434 -745 3764 -2496 -3215 3318 -14 -4844 1197 2466 -4211 -959 3880
1400C880n613o61P038k585m833N419J340p115K436M746n710j452O900l020m640
$$ 3880 -1733 -2394 4644 2059 -2774 2645 3985 -3130 -694 4052 -1658 -3110 3790 770 -3870
1415c870N761J817o540K228M782n637k257O533k262n371N338J869n888K116N625
$$ -3870 1891 3708 -2832 -604 4178 -1459 -3716 2817 555 -4816 522 2391 -3497 -1381 4244
1430D244n089j509N816k015n456M613K322o760J664N725m608k441O651j271n352
$$ 4244 -845 -2354 3462 1447 -4009 604 2926 -3834 -2170 3555 -1053 -3494 3157 1886 -3466
1445c466M190K511n975O96N393m890k275O342q14n278M240L229n966O46N523m131
$$ -3466 724 3235 -2740 -2044 3349 -1541 -3816 2526 1712 -3566 674 3903 -2063 -1417 4106 -25
1461b5l147N857q17n179L832L258n651L18O011m116l768N656p52n072L069L388
$$ -25 -3172 2685 1868 -3311 521 3779 -1872 -1554 4457 341 -3427 2229 1477 -3595 -526 2862
1477B862n824M59N676l527l265N830L19o347L699L136n536o1N302k951l481N508
$$ 2862 -2962 -2503 3173 -354 -3619 2211 2530 -3817 -118 3018 -2518 -2579 2723 -228 -3709 1799
1493A799J053n422L272L899n870n57N489l147m212M925J243n855K431M021m665
$$ 1799 2852 -2570 702 4601 -1269 -1826 3663 516 -3696 1229 2472 -3383 -952 3069 -1596
1508a596m38N869k768m133M486Q95n484J796L827m400j284N762j268m234M335
$$ -1596 -2034 3835 1067 -3066 1420 2315 -3169 -1373 2454 -1946 -3230 2532 1264 -2970 1365
1523A365J703n190J341M256m670j594N026j847m265M602J996n223J766M706m386
$$ 1365 3068 -2122 -781 3475 -1195 -2789 2237 390 -3875 727 2723 -2500 -734 3972 -414
1538d14j665M354p16n062M238J856n179J232M252l352j488M429j073m067L246
$$ -414 -2079 2275 1559 -3503 735 2591 -2588 -1356 2896 -456 -1944 2485 1412 -2655 591
1553E91J756n157R27M369l335j977N215n82m185L573K247n542P67M095l416k564
$$ 591 2347 -2810 -1883 2486 -849 -2826 2389 1807 -2378 1195 3442 -2100 -1333 2762 -654 -3218
1569c218N009p5m940L452K576m313J28M957l260l330M589k68m371K586K627m327
$$ -3218 1791 1716 -3224 228 2804 -1509 -1381 3576 316 -3014 1575 1307 -3064 -478 2149 -2178
1585b178N41M807k901k248M294J13m961K356K840m620o82M667k241k519M566M35
$$ -2178 -1637 3170 269 -1979 2315 2428 -2533 -177 2663 -1957 -2639 2028 -213 -2732 1834 2269
1601B269m302K512K984m387r97M738l144l293M340J033m731K309L530l643o73
$$ 2269 -2033 479 3463 -924 -1921 2817 -327 -3620 720 1753 -2978 -669 2861 -782 -1455
1616a455M890k241l612L748R4m167J853L409l774m62M535j493l496L498J445m591
$$ -1455 3435 1194 -2418 1330 1424 -2743 -890 2519 -1255 -1717 2818 1325 -2171 1327 2772 -1819
1632a819J009K795l089j332M044j190l308L419J542m397J421L579l458j969M093
$$ -1819 -810 1985 -1104 -2436 1608 418 -2890 529 2071 -2326 -905 2674 -784 -2753 1340
1647A340q49l876L691J759l786Q04M282l088k404M577j102l818K873J867l918
$$ 1340 491 -3385 306 2065 -1721 -917 3365 277 -2127 2450 1348 -2470 403 2270 -1648
1662a648K78M186k861j802M109J23l939K493J728l998n12L579k565k423L780N22
$$ -1648 -1370 2816 -45 -1847 2262 2385 -1554 939 2667 -1331 -1843 1736 -829 -3252 528 1050
1678A050l569K742K372l819j66L443j829l474M035J53l829K296K742l270p8L736
$$ 1050 -2519 223 2595 -1224 -1390 2053 224 -3250 785 938 -2891 -595 2147 -1123 -1201 2535
1694B535j804k255L118J60l948J472K305l274l69M166j579l061L739Q82l051P70
$$ 2535 731 -1524 1594 1754 -2194 -722 1583 -1691 -2060 2106 527 -2534 1205 2087 -964 -194
1710a94K855l319j154L401j084l151L426J102l472J425K743k866j160L346j356
$$ -194 2661 -658 -1812 1589 505 -2646 780 1882 -1590 -165 2578 -288 -1448 1898 542
1725E42k362K484P11l842Q94L078k250j740M190q49l354K857J081l630N99L187
$$ 542 -1820 664 1375 -2467 -1573 1505 -745 -2485 1705 856 -2498 359 1440 -2190 -1591 1596
1741A596k497p84L251p32k858K793J841l138K10K741k584j682L453r35k752K703
$$ 1596 -901 -1685 1566 834 -2024 769 2610 -528 -318 2423 -161 -1843 1610 675 -2077 626
1757F26J492k830L25K872k230k255K948l14l168J686K035k923k58L717j967j344
$$ 626 2118 -712 -387 2485 255 -2000 948 634 -2534 -848 1187 -1736 -1994 1723 -244 -1588
1773a588L274j37l467J439K004k788m56L069j620k004L248O35k745J779J869k992
$$ -1588 1686 1549 -1918 -479 1525 -1263 -1719 1350 -270 -2274 974 1609 -1136 643 2512 -480
1789d80k80K739j803k603K620J010l042J409K313k455o40L643j373k747K736M64
$$ -480 -760 1979 176 -2427 193 1203 -1839 -430 1883 -572 -1212 2431 1058 -1689 1047 1511
1805A511l496J383K217k306p60L474j042k803K757R33l268P04K928k799j646L237
$$ 1511 -1985 -602 1615 -691 -1451 2023 981 -1822 935 1868 -1400 -696 2232 -567 -2213 1024
1821A024j008k097K162J444k905M38L123k416j451K946o25k674K308J079k249
$$ 1024 16 -2081 81 1525 -1380 -942 2181 -235 -1686 1260 635 -2039 269 1348 -901
1836i01j32L518j640j641K805k45l034J477J409l299Q54K625k104j207K943k23
$$ -901 -1033 2485 845 -796 2009 1764 -1270 207 1616 -1683 -829 1796 -308 -1515 1428 1205
1852A205k721K134J304l108P5J919j531j847K479P27k812J784K248k470m21L243
$$ 1205 -1516 618 1922 -1186 -1111 808 -723 -2570 -91 636 -2176 -392 1856 -614 -1035 2208
1868B208j683k324K315L8k665J767K316l068M14K772j435j829K520K23l404J345
$$ 2208 525 -1799 516 554 -2111 -344 1972 -1096 -682 2090 655 -1174 1346 1569 -1835 -490
1884d90K071l023l58L004j239j974K727M50j836P33J820k295p76K053n25k143
$$ -490 1581 -1442 -1800 1204 -35 -2009 718 1168 -668 65 1885 -410 -1186 867 342 -1801
1900a801J912J381l101J299K209j849j028K418r83k189K065M89k461M18K558j722
$$ -1801 111 1492 -1609 -310 1899 50 -978 1440 457 -1732 333 822 -1639 -1221 1337 -385
1916c85j195K798m36k561K313Q09k762M55K232j807j146L191o86k242J804J727
$$ -385 -1580 1218 782 -1779 534 1343 -1419 -964 1268 -539 -1685 1506 820 -1422 382 2109
1932B109k756N53K250k476j000K126j09k368J899J135k155M91K137j573j740K263
$$ 2109 -647 -94 2156 -320 -1320 806 697 -1671 228 1363 -792 -301 1836 263 -1477 786
1948G86L16k579J288J456k613J99K540j107j534K681q7k398J386J536k419o61
$$ 786 1102 -1477 -189 1267 -1346 -1147 1393 286 -1248 1433 1346 -1052 334 1870 -549 -1210
1964a210K218j249j967K942P51k978J637J647k311m2K414j563k093K409O01k772
$$ -1210 1008 -241 -2208 734 1485 -1493 144 1791 -520 -562 1852 289 -1804 605 1206 -1566
1980a566Q39K211k173N3K324r27j725J565O85k637P39K124k380o47K358l36j795
$$ -1566 -727 1484 -689 -636 1688 761 -964 601 1286 -1351 -612 1512 -868 -1515 843 507 -1288
1997a288J876Q68k492O94J715j702j210K755p30k190J887J197k861J036K064j848
$$ -1288 588 1456 -1036 -342 1373 -329 -1539 1216 486 -1704 183 1380 -1481 -445 1619 -229
2013b29j020K893j052k555K017J094k600O34K328j759p56K405n70j890J171J338
$$ -229 -1249 1644 592 -1963 54 1148 -1452 -818 1510 -249 -1005 1400 830 -1060 111 1449
2029A449k820L87K036j300j200K478K24k257J615J249k407n49K467j941p84J804
$$ 1449 -1371 -984 1052 -248 -1448 1030 1254 -1003 612 1861 -546 -1095 1372 -569 -1353 451
2045D51L51k468J983J132j900n5K218j449j423J893K0k207J257J157k057J27K357
$$ 451 802 -1666 317 1449 -451 -506 1712 263 -1160 733 753 -1454 -197 960 -1097 -970 1387
2062A387j105j362K175j96j753P45J503k128o61K350o46j959K302L29j666O65
$$ 1387 282 -1080 1095 899 -854 -109 1394 -734 -1395 955 309 -1650 652 981 -685 -20
2078b0J723k029o34K472j416j852J591Q00j959R21J853j840k68J958n87k164J872
$$ -20 1703 -326 -960 1512 96 -1756 -165 635 -1324 -403 1450 -390 -658 1300 713 -1451 421
2095D21Q03k183L20J929j411r60K138o13j370J400N52j988L61J935k017n26J819
$$ 421 1224 -959 -639 1290 -121 -1081 1057 444 -926 474 1026 -962 -601 1334 -683 -1209 610
2112F10o4j713J094R01j611q2K274j723n63J725n06j455J116J112j637K00J684
$$ 610 546 -1167 -73 828 -783 -865 1409 -314 -877 848 342 -1113 3 1115 -522 -322 1362
2129A362j551l57K060p72j869J152J105j949q9K004r83j458K645j026j485J354
$$ 1362 -189 -546 1514 742 -1127 25 1130 -819 -908 1096 113 -1345 1300 274 -1211 143
2145A43J335k426k13J494r70p89J774M70k277J500J170j734n4J979r82j239J568
$$ 143 1478 -948 -1161 333 -637 -1426 348 818 -1459 41 1211 -523 -577 1402 420 -819 749
2162G49k36j556P89J054j276l85K069j600n83J974l58j923J187J146j658l47J917
$$ 749 513 -1043 -254 800 -476 -861 1208 -392 -975 999 641 -1282 -95 1051 -607 -954 963
2179I63p86j331J305Q87j946P56J805j662r08J884j45j822J383O49j476j79J530
$$ 963 177 -1154 151 1038 -908 -152 1653 -9 -917 967 822 -1000 383 1032 -444 -623 907
2196I07j194o82J849p57j297J360R81k353N48J534j297j33J181l78j080R05M46
$$ 907 -287 -969 880 123 -1174 186 1167 -1186 -638 896 -401 -534 647 269 -811 94 540
2213E40j464l7J736j303n6J353k65j245J010P11j355K46J204r80r16J172K13j359
$$ 540 -924 -961 775 -528 -584 769 504 -741 269 980 -375 -129 1075 95 -821 351 564 -795
2231g95R89N86j208J17J331j290q40J728l17j221N88J149j547P0J536r61r49J468
$$ -795 194 780 -428 -311 1020 -270 -1110 618 301 -920 -332 817 -730 -660 876 -85 -1034 434
2249D34K56j590J058J001j471l04J444o55r52R02N4p10N50J353j685m55J617o47
$$ 434 690 -900 158 1159 -312 -616 828 173 -779 123 177 -533 17 1370 -315 -770 847 200
2267B00j111J376L7j537R72R51j609l66J835k04j588J267Q11j982P84Q99q96l36
$$ 200 -911 465 502 -1035 -63 888 -721 -1087 748 544 -1044 223 1034 -948 -164 735 -161 -497
2285d97J422l39j932J677J29j371P75J298j564p22K197p05j193J133Q55j762M34
$$ -497 925 586 -1346 331 460 -911 -136 1162 -402 -1124 1073 368 -825 308 1163 -599 -165
2302a65J083j150q01J714k53j228R56N71j116m17J789r03p69J133N7j986J703
$$ -165 918 -232 -1033 681 428 -800 156 727 -389 -806 983 80 -689 444 501 -1485 218
2319B18O40j352J56J185j082l85J125k85j094O06J021j226j52J510j172k80R34
$$ 218 858 -494 -338 847 -235 -620 505 220 -874 -268 753 -473 -625 885 -287 -567 367
2336C67k00j168J196J75p44l31J314l58q37J041L81j564P57R53j415k4J197n08
$$ 367 167 -1001 195 370 -374 -705 609 251 -586 455 836 -728 29 982 -433 -457 740 232
2354B32q03Q26L56j431R41J195j562k54Q83j63j023O77L85p68L7P26n03m15Q56
$$ 232 -571 255 611 -820 121 1316 -246 -500 383 220 -803 -126 259 -509 -472 254 -249 -664 192
2373A92nn43N59K63p81j61J449j282o48J474m88q27R91L80j369R96Q56j392J80
$$ 192 187 -356 203 466 -315 -476 973 -309 -957 517 29 -798 193 573 -796 200 1056 -336 -156
2392a56M21K08j241R85L16j097k01J444n31n79J069k43q02N05P56j131j44J143
$$ -156 265 473 -768 217 533 -564 -765 679 148 -431 638 395 -407 98 854 -277 -421 722
2410G22r32l39R43o5r66L27Q70j399J52J052k31r10J359m8j355P28J345j462m8
$$ 722 -210 -549 394 329 -637 -310 560 -839 -687 365 134 -776 583 535 -820 -92 1253 -209 -257
2429b57J014p33n94Q23L33r58o4J182p21n14J602n99r11R07R5j284L02J159r42
$$ -257 757 24 -570 253 586 -372 -436 746 25 -489 1113 514 -397 510 605 -679 -377 782 -160
2448a60o44J054q0p53J217lj287O81M25q39j14Q30o79l85J142M50j415N90Q86
$$ -160 -804 250 170 -583 634 631 -656 25 450 -389 -503 327 -352 -737 405 855 -560 30 916
2467I16q95k99P72k23j099P78L93r23N14P47j010l47J184j61q60P92M24j095k90
$$ 916 21 -278 494 271 -828 -50 343 -580 -66 681 -329 -676 508 347 -513 279 703 -392 -682
2486f82J106m00j166J609k57o13L72N41p97q3R69j014m86R23J86r81R58J78m80
$$ -682 424 24 -1142 467 210 -403 -31 510 -287 -370 599 -415 -901 22 208 -773 185 363 -117
2505a17k2J153r06n08P21J74p29N1J053j430L76R88n92m55J040j40j153O69P81
$$ -117 -139 1014 108 -400 321 495 -234 -183 870 -560 -184 804 212 -243 797 657 -496 173 954
2524I54j193o49J291m00m67Q57J65j083N00P19p86o10J013k77r20R80K02o16r2
$$ 954 -239 -888 403 3 -464 393 558 -525 -25 694 -92 -702 311 34 -886 94 296 -320 -412
2543d12R05l90o40J454n91j063O21J10n63J62R34q22k53P72N42p45N04M09j401
$$ -412 493 103 -537 917 326 -737 -116 -6 -569 -407 527 -295 -548 224 766 21 525 934 -467
2562d67K55J066j240m82J034N8q89Q00N40m63n78J385j235m69J142J83j247M17
$$ -467 -212 854 -386 -868 166 224 -665 135 675 212 -366 1019 -216 -685 457 640 -607 -190
2580a90N26p54l3J575r53o32J047l63q48K32J047j127k80R53k24l11P89k99p91
$$ -190 336 -418 -451 1124 171 -461 586 223 -625 -393 654 -473 -753 200 -24 -335 454 155 -636
2599f36P43M04p42q4L80K1m15R5O97r83N22Q57q12l82P75l86o48M15M07j210K37
$$ -636 107 511 -231 -315 65 86 -329 -234 463 -520 2 859 47 -335 440 54 -594 -179 228 -982 -745
2620g45J438q97k19P12Pq12N38N65j248L82R04r99k56P66J40l85M50K28l27mL14
$$ -745 693 -204 -423 289 296 -516 22 587 -661 -279 625 -374 -630 136 276 -109 341 569 242 238 552
2641E52q06J02M41k47j187J163N13q53O48O68j074L4P96j00j187K98O00j040K87
$$ 552 -254 -152 289 42 -1145 18 531 -322 326 994 -80 -46 750 650 -537 -239 361 -679 -392
2660c92R38n82k82R68n3j003R46m6p68J8L79o11p63J775k98o82N01M80q17M21
$$ -392 546 -36 -318 650 597 -406 540 494 -274 -256 123 -488 -1251 524 226 -456 45 525 -292 129
2680A29M71o41o96P28k92k60M56M84m38J12P33l37p66M74J63j210O78L58o54K32
$$ 129 600 -41 -737 -9 -301 -561 -105 379 -59 53 786 449 -317 157 320 -890 -212 146 -508 -276
2700b76N78j25o20J044J28q65M07P5p61l51O02L2p93Q85M94o95J69J086q25j96
$$ -276 302 177 -443 601 729 -136 271 346 -415 -766 -164 -132 -925 -40 454 -241 -72 1014 189 -7
2720gO44l84j156O85J66m32L05Q35q22L04Q28k70j119L86N22j135J68N03o00L9
$$ -7 637 253 -903 -218 -52 -484 -179 656 -166 138 966 696 -423 -37 485 -650 -482 21 -579 -540
2740e40R99J99p37P41N49j266j01R12j338j85R98m40p29J166M74p12LQ54p58k59
$$ -540 459 658 -79 662 1211 -55 -156 756 -582 -767 231 -209 -938 228 702 -10 -7 847 89 -170
2760a70O70l95o19K92J64o20n7J260l15k19P16oj082L79L7q34J11J317o40o15
$$ -170 500 105 -514 -222 -58 -678 -735 525 210 -9 707 701 -381 -2 35 -799 -688 629 -11 -626
2780f26R17q4l05P34M3m84l58M62n97p76R92L37p45L58P14n86K81O34j072qK42
$$ -626 291 207 -98 636 679 195 -163 299 -298 -1074 -82 255 -490 -132 582 -4 277 911 -161 -169 73
2801G3k95n15L38M85p01O42Q73k89p09N58N8p36K54K33p89k0L83p3m15J027J24
$$ 73 -222 -737 -399 86 -615 27 900 611 -98 460 518 -218 36 269 -520 -540 -157 -230 -645 382 506
2822E06o93N7R79q72l53O62o28l34N19L72j96K65Q77q59k39N86q45Q5k29N46o55
$$ 506 -187 -130 849 -23 -376 286 -342 -676 -157 215 19 284 1161 302 63 649 -196 -111 -340 206 -449
2843d49o47J148k69j83Q93K00j383Q96L24r54K85N71j066j73J395m27m04N70P81
$$ -449 -1096 52 -217 -400 493 693 -690 206 530 -424 -139 432 -634 -807 588 161 -243 327 1108
2862A108r77q6J102j286m28P50k66n52L32P76n91J3O73k1l93K57q6r12N17M14
$$ 1108 131 45 1147 -139 -567 183 -83 -635 -303 473 -118 -105 568 547 154 411 325 -587 -70 344
2882C44r12k3R35m20q6R37m10l87J44N10j041j99P88o00q14J328k31K16N9J005
$$ 344 -568 -591 344 -76 -162 775 365 -22 122 632 -409 -608 180 -420 -1234 94 -137 79 138 1143
2902A143q41l55J062j262n02O53L28j152N09Q51o36J06J099k26q73N53L9l46q73
$$ 1143 302 -53 1009 -253 -755 -102 226 -926 -417 434 -202 -96 1003 777 -96 457 496 150 -723
2921g23N37l35j54N67M75n36O14O77j312L21l6k36q40Q79j92k62O10K57m55J05
$$ -723 -186 -521 -675 -108 367 -169 445 1122 -190 131 95 -141 -981 -102 -294 -556 54 311 -144 -39
2941c9O18n35p5K62j14q17N19O79j341P20L91J06n22Q34m46k03q4K38q72L33M91
$$ -39 579 44 -31 231 117 -700 -181 498 -843 -123 268 374 -148 686 240 37 -47 191 -681 -348 143
2962A43k32p31P48O87q30J074p13j80J63M37q61k76M73J57n81Q55J15j64j83M90
$$ 143 -89 -820 -72 615 -215 859 146 -34 129 566 -295 -571 -98 59 -522 333 448 284 101 591
2982E91k87o46O66n43n76L28P32m87L0O76l94j56P11J55j226L13J40l48LL85r3
$$ 591 304 -342 324 -219 -795 -467 265 -222 -192 484 90 -66 645 800 -426 -113 27 -321 -318 67 -26
3003b6n12N51K80k49M34N04q65j72L05l66o33M87P23q15O2Q86l14R2j06J89o30
$$ -26 -538 13 293 44 478 982 117 -55 250 -116 -749 -262 461 -354 -292 594 280 372 266 455 -175
3024a75k02O14j083L75M63k88J12L73N44n10L48qo41j22J51l40j12R56o17k87
$$ -175 -377 237 -846 -471 -8 -296 -184 189 733 223 571 563 -78 -200 -49 -389 -501 455 -162 -449
3044d49O29M56q30J90P54m99n14O26n59m28N47O13j119Q9Q33l50J79L46k57k87
$$ -449 180 636 -194 -4 750 251 -263 363 -196 -624 -77 536 -583 -494 339 -11 168 514 257 -30
3064c0k64L23q62M1R82k93R9O8L59l34M33l43k84k59L90k84o16R89j66l31M57
$$ -30 -294 29 -833 -792 190 -103 -4 64 423 89 522 179 -105 -364 26 -258 -874 115 -51 -382 75
3085G5M29k86m04Q31l67r77R47k42m00O6P21l88l25J171p13k53R14l71m63l40
$$ 75 504 218 -186 645 278 -699 248 6 -394 -328 393 5 -320 851 138 -115 799 428 -35 -375
3105c75J17k78k97R20k80kR39K7o32K70J81q14j59O26m35m83Q35K46p19P04K87
$$ -375 -258 -536 -833 87 -193 -195 744 771 139 409 590 -224 -383 243 -192 -675 160 406 -313 391 678
3126F78k36l07L76k27o59L95j24p96N77O27j89r9L53k73l37N96j24p88L29K03
$$ 678 442 135 511 284 -375 20 -104 -900 -323 304 115 16 369 96 -241 355 231 -557 -228 -25
3146b5j42l41O34N7r3q8Q83r32l67P63l35m16N74k95l11M48L54j90k48O98m78
$$ -25 -167 -508 126 183 90 2 885 -47 -414 349 14 -402 172 -123 -434 14 368 178 -70 628 150
3167A50R3K63l29o51J09J97m66j1J271m08l17M85L45r20k51M75p59K59L53o4o62
$$ 150 243 506 177 -474 -365 -168 -634 -645 626 218 -99 386 731 -189 -440 35 -724 -465 -112 -176 -838
3188h38L72J065o20L98m6m47J65J66k97m85P11Q9l05k43N04J5k31P17N1p57J46
$$ -838 -466 599 -21 377 331 -116 49 215 -82 -567 144 233 -72 -315 189 204 -27 690 741 -16 130
3209A30q2p58L65N20l10k94R73k91j04M10r7m56k79M19p33J1O24n56J66N67r0
$$ 130 48 -710 -345 175 -135 -429 544 253 149 559 462 6 -273 146 -587 -576 48 -508 -342 225 135
3230A35m95O66L6k34l16J97J47n24L45K08l45OO07j24l28M30j16p24O31l31m75
$$ 135 -360 306 342 108 -208 -11 136 -388 -43 165 -180 -174 433 309 -19 411 295 -429 202 -129 -604
3251f04l05J111m93J83J98N08n60L17K54o90K40n6l2q51P38L24q00Q30K69n36
$$ -604 -909 202 -291 -108 90 598 38 355 609 -81 159 103 71 -780 -42 282 -518 312 581 45
3271D5K66J98m79l16L2L2m72R1N20L3R5M51r7k88K56k22j98k57O56q92PL10q4
$$ 45 311 509 30 -286 -254 -222 -694 -603 -83 -50 45 496 399 111 367 145 -53 -310 346 -546 -539 -229 -313
3294c13J5O25q9j76P77l02o32m7j77Mo19P56J54l83M82Q46o89p9O28l49p69%N42
$$ -313 -298 327 238 62 839 537 -95 -142 -319 -315 -934 -178 -24 -407 75 921 232 153 781 432 -337 -337 205
3317B05p77M11q1M17n49Q11m37qL00K12j127J93N11m50l84N68M30l41L80M07m57
$$ 205 -572 -161 -242 175 -374 437 0 -8 292 504 -623 -430 81 -369 -753 -185 245 -96 284 691 234
3338B34K10O0q45m20Q59j70m37O16J54l43N2O44m85k84N24o28p4J85R1n73K44
$$ 234 444 504 -341 -761 98 -72 -509 107 261 -82 -30 614 129 -155 369 -259 -333 -148 -57 -630 -386
3359c86N32k01j92M27J79k65p5N3k29J94J69m81n04Q24J86m97M96K8j04K20N4
$$ -386 146 -55 -247 180 359 94 19 72 -157 37 206 -275 -779 45 231 -266 230 258 154 374 428
3380D28j75n66M59j20l95k84O26J72m51Q04m31k90L92j05l76Q5L13n02L7Q19k04
$$ 428 253 -313 146 26 -369 -653 -27 145 -306 498 67 -223 169 64 -312 -227 86 -416 -379 440 236
3401B36n13L91J94Q0l60K73o81j0K41l3j38L53k0q4M40J92n13k09M77j34n23O7
$$ 236 -277 114 308 388 28 301 -380 -390 -149 -182 -320 33 13 -71 369 561 48 -161 316 182 -341 -274
3423b74m4J65J76L71j82o9O2k64j31k02M25m75K25J84m14L17J83j32k24Q57P7
$$ -274 -318 -153 23 394 212 143 205 -59 -190 -392 33 -442 -217 -33 -447 -130 53 -79 -303 554 631
3444F31p65N8M33o99l29N96k79l28O46L61k38l94M56n0l2L67k49r27L77M86j91
$$ 631 -134 -76 357 -342 -671 -75 -354 -682 -36 325 87 -307 149 99 67 434 185 -742 -365 121 -70
3465g0k53M65k15k71Q08m22j07K4N3n84J82L86o56N13M45K13j80l0N18p50k23
$$ -70 -323 142 -73 -344 464 42 -65 -41 12 -572 -390 -4 -660 -147 298 511 331 301 819 69 -154
3486a54K10l00k08NJ79m21O44j02J77M5N10j62o37K66J5o43P5N70m94K94L65N6
$$ -154 56 -244 -452 -447 -268 -689 -45 -147 30 75 585 423 -214 52 67 -576 -501 69 -425 -131 234 290
3508B90j98M51k66l72O1K50j30n33K48J84l91Q70J14m72j81L21k73NJ22n84j32
$$ 290 92 543 277 -95 -34 216 86 -447 -199 -15 -406 464 578 106 -75 246 -27 -22 100 -484 -616
3529f16O47J47p2j80K64L1n19O42j20m01m27M06n73N79K28R0j63M82m27k88Q68
$$ -616 31 178 106 -74 190 221 -298 344 224 -177 -604 -198 -771 -192 36 126 -37 445 18 -270 598
3550E98l26o53L37j96j86K72m7P4j14K29O66m83k45P15q81M1L95k18m80M78J87
$$ 598 272 -381 -44 -240 -426 -154 -201 -127 -241 -12 654 171 -74 641 -240 -199 196 -22 -502 -24 163
3571A63k95r7O23n18J21K58L84j113J05M52n80j4P15k21m15P49j7l55L08j9n12
$$ 163 -132 -229 394 -124 -3 255 639 -474 -369 83 -497 -511 204 -17 -432 317 300 -55 253 234 -278
3592b78k13M28Q2m65O13n14M1N30M43l64PR2k94k29J14J44o18N07K37l57K47J03
$$ -278 -491 -63 19 -446 167 -347 -306 224 667 303 310 402 108 -121 -7 137 -481 26 263 -94 153 256
3614B56M3m61J05J56m55j7M64l56j75N51J33k84K66N96o48j90N10l94K0m18L17
$$ 256 299 -162 -57 99 -356 -373 91 -265 -440 111 244 -40 226 822 174 -16 494 100 120 -298 19
3635A9J16k05L75l42J46l0j7OP2p9m82O57k19l95j72N70j28K7L42j26O3m68M10
$$ 19 135 -70 305 -37 109 79 62 68 140 61 -421 236 17 -378 -550 20 -108 -81 261 135 198 -270 140
3658A40j79m16P00m14J54nj30RL21k0k50k27N49m09j58L1J26n40Q04J22j59m00
$$ 140 -39 -455 245 -169 -15 -20 -150 -141 180 160 -90 -317 232 -177 -335 -304 -178 -718 86 208 49 -351
3680c51J040m70j42P6j52l81r4O61n13j30N02M21m97N40M43q81K5J08m54M3K7
$$ -351 689 219 77 153 1 -380 -474 187 -326 -456 46 467 -30 510 953 72 97 205 -249 -206 -179
3701a79L14l25O21j45k00M50k25n4o33O16l34k73K57K43n48L72N9n7K95k14j29
$$ -179 135 -190 431 286 86 536 311 257 -376 240 -94 -367 -110 133 -415 -43 16 -41 254 40 -89
3722h9k81L10j86lj80M40k22l84R31l3o59O05J27p11M25jo59J20O90o21L86n2
$$ -89 -370 -60 -246 -249 -429 11 -211 -595 336 303 -356 249 376 -335 90 89 -570 -450 240 -381 5 -47
3744d7M13m26K15L01k62m65j60J0l22N26K42j45j30J42k1N7N18n59R2J19j31m79
$$ -47 366 -60 155 456 194 -271 -431 -421 -743 -217 25 -120 -250 -108 -129 -72 446 -113 -21 98 -33 -512
3766e12J39L75l60j14O55R6l98K86j65J52j01p1N8n75P78k77j48M49K9L7k69K90
$$ -512 -373 2 -358 -472 183 279 -119 167 2 154 53 -18 40 -535 243 -34 -182 267 296 333 64 354
3788C54n29l06J082q03M11m72M74k85K2N08k03k56K06o5n31N12j99j33M2L47p
$$ 354 -175 -481 601 -202 209 -263 211 -74 -52 456 253 -3 203 138 -393 119 -80 -213 -171 176 169
3809A69j63K85J10l90n6O58o83J05j73j9m38K18J003o56l8L73k9p6qk46n16N47
$$ 169 6 291 401 11 -45 613 -70 35 -138 -157 -595 -377 626 -30 -68 305 276 200 192 -54 -570 -23
3831b3o0j58J15L3o4l21P95k03j24j86K46j89J43J91o28K42L05L05p98K62M43
$$ -23 -83 -241 -126 -93 -157 -478 317 114 -10 -196 50 -139 4 195 -433 -191 114 419 -379 -117 326
3852C26k32l23P09q10m37Q14K17o30J93L27k44J69L65k22k9j05R7l67K1K92q71
$$ 326 94 -229 480 -330 -767 47 264 -366 -173 154 -90 79 444 222 193 88 185 -182 -161 131 -740
3873g40j59R94k14K8N47p41LJ44L03j72j42q0j48j79N33K14l53J88M90k87l04
$$ -740 -899 95 -119 -91 456 -285 -282 -138 165 -7 -149 -229 -377 -556 -23 191 -162 26 516 229 -75
3894g5J68j85k2j91N44p02L33L41p5r1K41MR3N5j91m00k58O47n12J00J84K98k38
$$ -75 93 -92 -114 -305 239 -463 -130 211 136 45 286 290 383 438 247 -153 -411 236 -276 -176 8 306 68
3917F8n0M22j94n53L52r2j86p9k12L38j19O87l38k08K42J13n95K76K35n37L99
$$ 68 18 440 246 -307 45 -47 -233 -312 -524 -186 -305 382 44 -164 78 191 -404 -128 107 -430 -31
3938c1k1l36O70m35L22l6K66m6r91R85l2l98R2J68o35K47M00l56P3J18L83o59
$$ -31 -52 -388 282 -153 169 133 399 353 -638 347 315 -83 9 177 -458 -211 189 -167 -94 24 407 -252
3960b52K2L55j42p13P23Q6l47K40J12n2p2M17m79j13k7o8k09L60M39m14j00K24
$$ -252 -230 125 -17 -730 -7 79 -268 -28 84 32 -40 377 -102 -215 -242 -310 -519 -159 280 -134 -234 -10
3982a0O5k34M69k3l67J52K05p31k80J178o03Q3P4Q83r49Q3q1j12l08J89M92n63
$$ -10 55 -179 290 267 -100 52 257 -474 -754 424 -179 -96 -22 861 -88 -5 -86 -198 -506 -317 175 -388
4004c88O64j6m65L31L20m46k68O53L54q85M43L8m01J60J73k85J60K44k07J2K9
$$ -388 276 260 -205 126 446 0 -268 385 739 -146 297 335 -66 94 267 -18 142 386 179 191 220
4025B20j46j43j83L19l9k94J80m04K99N49j83k84N83m1k14j48l5n23K87q9M22
$$ 220 74 -69 -252 67 28 -266 -86 -490 -191 358 175 -109 474 433 219 71 36 -487 -200 -289 133
4046A33n22K1O50k01k66M91j52n26L28r6J75L87K7n08j07M35n2l88L38j15p7L2
$$ 133 -389 -368 282 81 -185 306 154 -372 -44 -140 35 422 449 -59 -166 269 217 -171 167 52 -25 7
4068GJ45m57j36M27l3k04J97M43m73l17M08m27N21k2p4L1J87n8k26k98M77k78
$$ 7 152 -305 -441 -14 -47 -251 -54 389 -84 -401 7 -420 101 79 5 36 223 165 -61 -359 118 -160
4090a60J82J38k46J10L6Q4j10k16L77L0m46K08L77j47l69M17k86J86m20J67l74
$$ -160 22 160 -86 24 60 144 34 -182 195 225 -221 -13 364 217 -152 265 -21 165 -255 -88 -462
4111d62O09J23k45Q4J46k27J37l70M46o67j02M46j14j69N86K08k87J62j80Q4j35
$$ -462 147 270 25 109 255 28 165 -205 241 -426 -528 -82 -196 -365 221 429 142 304 124 208 73
4132G3K31j82m29L44J93n51N63L7j79K26j71K43o22L12l69O9j44K84j37n7J0J07
$$ 73 304 122 -307 37 230 -321 242 279 100 326 155 398 -224 88 -281 -212 -356 -72 -209 -266 -256 -149
4154a49L65j04J68l12R2K02p43N83R2M5o20Q12j99n2p7l1k44KN14l06l7J57j16
$$ -149 216 112 280 -32 60 262 -481 102 194 239 -381 431 232 180 103 72 -172 -170 344 38 1 158 42
4177D2n4M5k07M31k73Q3kk31J00o5J4M89k17k33p1K57j21K9L7K49m91o1J97j37
$$ 42 -12 33 -174 257 -16 67 65 -166 -66 -131 -117 372 155 -78 -149 108 -13 16 53 302 -189 -250 -53 -190
4201a90K48j93k45o8M70Q2l90L05P9k54L45J6kj94J17o3m17L58J63k97n9K87j0
$$ -190 58 -135 -380 -448 22 104 -286 19 98 -156 189 205 203 9 126 63 -354 4 167 -130 -189 98 88
4224H8j29j21M41k95K08J3j37P5J03k87j38K9K54l99J23M13n60N57N6n11k05M50
$$ 88 -41 -162 279 -16 192 205 68 143 246 -41 -179 -150 104 -295 -172 241 -319 238 294 -217 -422 28
4246B8L02n01R2K45m30L65l39K48j18K3L86o19O26l39Rq2J60n7k50N43k99l40
$$ 28 330 -171 -79 166 -264 101 -238 10 -108 -85 301 -318 308 -31 -22 -104 56 -1 -251 292 -7 -347
4268c47L78m0q7L10m16O1K97j79Q0q5j62P7p2j28L39j46J96P6j28J82l74J04R7
$$ -347 31 -9 -96 214 -202 -141 156 -23 57 -28 -190 -113 -185 -313 26 -120 76 152 24 206 -168 -64 33
4291C3k14K77j43j64K11L27o00N08m6l2m18M59j98p5l28L66k52j06R3K77l21L06
$$ 33 -181 96 -47 -211 0 327 -273 235 189 157 -261 198 0 -75 -403 -37 -289 -395 -302 -25 -346 -40
4313d0L11k57J16R8l64K76m08K93L92j62M5m44K36K7o05O26R1m60L26n8P5m04
$$ -40 271 14 130 228 -136 140 -268 25 417 255 300 -144 92 119 -486 140 231 -229 97 39 114 -290
4335b90N21l7l87K45O3m67M0O58k47J25o46Q04m22j9L50k39n65N52n6k80k23Q87
$$ -290 231 194 -193 52 115 -352 -312 346 99 224 -422 382 -40 -59 291 52 -513 39 -17 -297 -520 367
4357C67k24j88K93j56k30N4J89m57J43K78j70K49j02k57L62m7k70l48M37J16j87
$$ 367 143 -45 248 92 -138 -84 105 -352 -209 69 -101 148 46 -211 151 104 -166 -514 -77 39 -148
4378a48P3K62k39j8J16K9l22K0O51r5m69M7J92n5J19j59K30j97Q4j83j64J79O36
$$ -148 -75 187 -52 -70 46 75 -247 -227 424 329 -140 -93 99 44 163 4 234 37 121 -62 -226 -47 589
4401E89q88M31j80J0N08j70o42J60M46o11L29L9N37q47L18j86L00k70K50J59l72
$$ 589 -299 132 -48 -38 470 300 -342 -182 264 -347 -18 21 558 -289 29 -157 143 -127 123 282 -90
4422i0J74N7k49kO4J22l11L60Jk34J38mK39m95J59L5j5L68J40o97J73P9j43J64
$$ -90 84 141 -108 -110 -46 76 -235 125 126 -108 30 26 265 -230 -71 -36 -51 317 457 -240 -67 12 -131 33
4446C3K51k77K9L36n66L1Q3K14j24N1k52O20o49J55J76n10N61J37m55L12P3m96
$$ 33 284 7 36 372 -194 -163 -80 134 10 61 -191 429 -220 -65 111 -399 162 299 -156 156 229 -267
4468b67M30k32J40m0R1k08j5J4K13l02k90N24J85l22k24M15l2j20M2K92n03M22
$$ -267 163 -69 71 31 122 -86 -101 -87 126 -176 -466 58 243 -79 -303 112 80 -40 2 294 -209 213
4490B13Q8K5j77k29L9k22R7r3L07n9Q2m37K93J92k06Q0L02l13k36k7m51L46K88
$$ 213 301 326 149 -80 -41 -263 -166 -259 48 -11 71 -366 -73 119 -87 -7 295 -18 -254 -281 -732 -386 -98
4513i8L02q7k21J64L29n16M32n98j99L96j26p8K21K24k44M52l31J96l06K86n5
$$ -98 204 117 -104 60 389 -127 305 -293 -492 -96 -222 -300 -79 145 -99 353 22 218 -88 198 143
4534A43k96K12J46r1m41L1K97o5K36j90j95j43L89m24M56j86L48k52k68O29m36
$$ 143 -153 59 205 114 -327 -296 1 -64 172 -18 -213 -356 33 -391 65 -121 227 -25 -293 336 -100
4555a00k43J9N36n12M02R6m28R8J10N20o26J59J07J16j22L4J92m15J02l60K02
$$ -100 -343 -324 212 -300 102 198 -230 -132 -22 498 -128 31 138 254 132 166 358 -57 45 -315 -113
4576a13J93mJ51l42J18L6K30l33J44p3K16j59o16O74j07j55j24M28k79J9o3O49
$$ -113 80 76 227 -115 3 39 269 -64 80 7 223 64 -552 122 15 -140 -264 164 -115 -96 -159 490
4598D90m51J24j78j44n6K94L6m61K54N45q07N6L94j81N3J8K09N6k9K37m74m51
$$ 490 39 163 -15 -159 -215 79 115 -346 -92 453 -354 -298 96 -85 -32 -14 195 251 222 459 -15 -466
4620d66J087o28k68N1P07q81P90k53j82J71R3m01Q2J85O8k13m19Q00J01k52k74
$$ -466 621 -7 -275 -224 483 -398 392 139 -43 128 221 -180 -98 87 155 -58 -477 323 424 172 -102
4641a02j56R4R2J22M6M8J17o21J97k3K49k77J8J69K1j4Q8j87mK5J35m71R5L05
$$ -102 -258 -164 -72 50 96 144 261 -360 -163 -186 63 -214 -196 -27 -6 -20 68 -119 -123 -98 37 -434 -339 -34
4665c4k4K04K88l78n23N04m0k39J27m8j62K54L34k93J38J68n46N5K61L13n49Q3
$$ -34 -58 146 434 56 -467 37 -3 -242 -115 -163 -325 -71 263 -30 108 276 -270 -215 46 359 -190 -107
4687a07K79l29K67k83M2Ln6L61q3J25K02l59j47M27k42l66N44j19m96M14N10o53
$$ -107 172 -157 110 -173 -131 -128 -184 177 94 219 421 62 -85 342 100 -266 278 159 -337 77 587 -66
4709f6k27L01J8j46L22l21l8q3N74M3o17J74j2j04L6K37k56J42j0J04m72N48k67
$$ -66 -293 8 26 -120 202 -119 -157 -240 334 377 -240 -66 -78 -182 -146 91 -165 -23 -33 71 -401 147 -120
4732a20l9OL05m93M14J08k58k6J06j57L29m61P22o13J42J22O9l41K97r5l39L5
$$ -120 -159 -153 152 -341 73 181 -77 -103 3 -154 175 -286 436 -177 -35 87 156 -185 112 17 -322 -287
4754b87L34j36L4L00l72k46J47L63o66L20P61r34L88l2O2K74j07q6k08o5J55J22
$$ -287 47 -89 -55 245 -127 -373 -226 137 -529 -209 552 -382 6 -26 36 310 203 117 -91 -156 -1 121
4776A21J72J02m03k73L17K32o7l06O13o99Q5K30m29j60N97k2q7L48n51P9J61k
$$ 121 293 395 -8 -281 36 268 201 -105 508 -191 -106 124 -305 -465 132 110 23 371 -180 -101 60 58
4798E8k19K42j62o8j67J89j1j11J08N97k23j99J73j34j02q0K73k09p3p5M49m52
$$ 58 -161 81 -81 -149 -316 -127 -138 -249 -141 456 233 34 207 73 -29 -109 164 -45 -118 -193 256 -196
4820a96mJ73M47m83l2K51J6J58m0k1o23L42K82o69N31j4l17O9j54j37N59J86n27
$$ -196 -200 -27 420 -63 -95 156 172 330 290 269 -354 -12 270 -399 132 118 -199 -130 -284 -421 138 324 -203
4843b03J64Kn8j57J84j79K2R2L35j44l88L76K79p34K57J95k22L95l95K23M52k73
$$ -203 -39 -37 -95 -252 -68 -247 -225 -133 202 58 -330 46 325 -409 -152 43 -179 216 -179 44 496 223
4865B23k92J36k42K64K8j6L5m92J96J28L01k72K84P1n67J18k3N28p67K28K65J18
$$ 223 -69 67 -175 89 117 101 136 -356 -160 -32 269 -3 281 352 -215 -97 -120 408 -359 -131 134 252
4887B52J21J68m44j76M70j73l48j12O2k29Q13m54n6J95K96k76O1r2m20K23M2J40
$$ 252 373 541 97 -79 391 218 -130 -242 -180 -409 404 -50 -106 89 385 109 170 78 -342 -119 -77 63
4909F3Q8K89K95l60n46Q54n95j45K86k60L20k95k6L53n55L91m2l1j12m8l51O08
$$ 63 151 440 735 375 -171 683 88 -57 229 -31 289 -6 -32 321 -234 157 115 84 -28 -76 -427 181
4931A81q8n28K53M74m33k77N04J4j60kM96n34K21L13n21J23j37j37K24l16M83
$$ 181 93 -435 -182 292 -141 -418 86 100 -60 -62 434 -100 121 434 -87 36 -101 -238 -14 -330 153
4952A53k85L52q3J65n52K54J64M7K63n60Q5j72L97n89j11N20J56j87k28K99K52
$$ 153 -132 220 137 302 -250 4 168 215 478 -82 3 -169 228 -361 -472 48 204 17 -211 88 340
4973C40m42N73l57m51J65K63L23m45J99M0r9N3k32M03k30R8j68n0L52m45L45l56
$$ 340 -102 471 114 -337 -172 91 414 -31 168 208 109 162 -70 333 103 201 33 -17 335 -110 235 -121
4995a21K94l17K4N03o10J15J56K2j85L71m10l1p6J42N6M23l87m0l32K83L95n18
$$ -121 173 -144 -120 383 -227 -112 44 66 -119 252 -158 -189 -265 -123 -67 356 -31 -71 -403 -120 275 -243
5017b43L47r6p4k43N10j73N2l53M27J69m22K36k83j18N19m65K32j1K33o5m32K07
$$ -243 104 8 -66 -309 201 28 80 -273 154 323 -99 137 -146 -264 255 -210 22 11 244 179 -253 -46
5039d6J62L39m72l31oK21Q8K97k85J96l9K4l00L34l58K64l2j72L56m9k37K59k67
$$ -46 116 455 -17 -348 -354 -133 -45 252 -33 163 124 148 -152 182 -176 88 56 -116 240 191 -46 213 -54
5062e4K03K6k44K54j87j68M05j81n5J90l10K19m00O68o42J60j25N52m36L31l99
$$ -54 149 175 -69 185 -2 -170 235 54 -1 189 -121 98 -302 366 -276 -116 -241 311 -125 206 -193
5083a93J00L46j53L5m35K40N8j69K30j49J31j01K0j0J67o7j3J6M4j65K33j74j14
$$ -193 -93 253 100 135 -300 -60 -2 -171 59 -90 41 -60 -40 -50 117 50 37 53 97 -68 165 -9 -123
5106a23K84j80r5P7l9J58O7l54K84j05j29L10P9m74K16o29O33j0K40j36k89J40
$$ -123 161 -19 -114 -37 -76 82 149 -205 79 -26 -155 155 234 -240 -24 -653 -20 -30 210 74 -215 -75
$$ [...]
8191B07
##END NTUPLES=NMR FID
##END=
