##TITLE=1H_UK_23'
 THFd8
 8 sc, 
 9.12.2021
##JCAMPDX= 6.0         $$ Bruker NMR JCAMP-DX V2.0
##DATA TYPE= NMR FID
##DATA CLASS= NTUPLES
##ORIGIN= UXNMR, Bruker Analytische Messtechnik GmbH
##OWNER= root
$$ XWIN-NMR		Version 3.5
$$ Thu Dec  9 12:20:49 2021 Russian Standard Time (UT+4h)  she@DPX200
##.OBSERVE FREQUENCY= 200.131346
##.OBSERVE NUCLEUS= ^1H
##.DELAY= (6, 6)
##.ACQUISITION MODE= SIMULTANEOUS
##.ACQUISITION SCHEME= undefined
##.AVERAGES= 8
##.DIGITISER RES= 18
##SPECTROMETER/DATA SYSTEM= spect
##.PULSE SEQUENCE= zg30
##.SOLVENT NAME= THF
##.SHIFT REFERENCE= (INTERNAL, THF, 0, 15.7039)
##AUDIT TRAIL= $$ (NUMBER, WHEN, WHO, WHERE, WHAT)
$$ ##TITLE= Audit trail, XWIN-NMR		Version 3.5
$$ ##JCAMPDX= 5.01
$$ ##ORIGIN= Bruker BioSpin GmbH
$$ ##OWNER= she
$$ F:/spectra/data/she/nmr/H-F/1/audita.txt
$$ ##AUDIT TRAIL=  $$ (NUMBER, WHEN, WHO, WHERE, WHAT)
(   1,<2021-12-09 12:18:51.31 +0400>,<she>,<DPX200>,
      <created by zg, POWCHK disabled, PULCHK disabled
       configuration hash MD5:
       00 E9 B6 7A A2 85 ED C7 34 08 36 98 17 FE 4E 26
       data hash MD5: 16K
       2C 08 20 28 02 64 81 11 EA A4 6E 51 7C 6F F5 42>)
$$ ##END=
$$ 
$$ hash MD5
$$ DB C3 E6 0B D8 DD 56 4E 8E 79 27 CC 6B 63 81 1F
##$RELAX= 
##$RELAX= 
##$RELAX= 
##$RELAX= 
##$RELAX= 
##$RELAX= 
$$ Bruker specific parameters
$$ --------------------------
##$DU= <F:/spectra>
##$EXPNO= 1
##$NAME= <H-F>
##$PROCNO= 1
##$TYPE= <nmr>
##$USER= <she>
##$AMP= (0..31)
100 100 100 100 100 100 100 100 100 100 100 100 100 100 100 100 100 100 
100 100 100 100 100 100 100 100 100 100 100 100 100 100 
##$AQSEQ= 0
##$AQ_mod= 1
##$AUNM= <au_zg>
##$AUTOPOS= <>
##$BF1= 200.13
##$BF2= 200.13
##$BF3= 200.13
##$BF4= 200.13
##$BF5= 200.13
##$BF6= 200.13
##$BF7= 200.13
##$BF8= 200.13
##$BYTORDA= 1
##$CFDGTYP= 0
##$CFRGTYP= 5
##$CHEMSTR= <none>
##$CNST= (0..31)
1 1 145 1 1 1 1 1 1 1 1 1 1 1 1 1 1 1 1 1 1 1 1 1 1 1 1 1 1 1 1 1 
##$CPDPRG= <>
##$CPDPRG1= <>
##$CPDPRG2= <>
##$CPDPRG3= <>
##$CPDPRG4= <mlev>
##$CPDPRG5= <mlev>
##$CPDPRG6= <mlev>
##$CPDPRG7= <mlev>
##$CPDPRG8= <mlev>
##$CPDPRGB= <>
##$CPDPRGT= <>
##$D= (0..31)
0 1.2 0 0 0 0 0 0 0 0.06 0 0.03 0 0 0 0 0.0002 0 0 0 0 0 0 0 0 0 0 0 0 
0 0 0 
##$DATE= 1639037930
##$DBL= (0..7)
120 120 120 120 120 120 120 120 
##$DBP= (0..7)
150 150 150 150 150 150 150 150 
##$DBP07= 0
##$DBPNAM0= <>
##$DBPNAM1= <>
##$DBPNAM2= <>
##$DBPNAM3= <>
##$DBPNAM4= <>
##$DBPNAM5= <>
##$DBPNAM6= <>
##$DBPNAM7= <>
##$DBPOAL= (0..7)
0.5 0.5 0.5 0.5 0.5 0.5 0.5 0.5 
##$DBPOFFS= (0..7)
0 0 0 0 0 0 0 0 
##$DE= 6
##$DECBNUC= <off>
##$DECIM= 32
##$DECNUC= <off>
##$DECSTAT= 4
##$DIGMOD= 1
##$DIGTYP= 9
##$DL= (0..7)
0 120 120 120 120 120 120 120 
##$DP= (0..7)
150 150 150 150 150 150 150 150 
##$DP07= 0
##$DPNAME0= <>
##$DPNAME1= <>
##$DPNAME2= <>
##$DPNAME3= <>
##$DPNAME4= <>
##$DPNAME5= <>
##$DPNAME6= <>
##$DPNAME7= <>
##$DPOAL= (0..7)
0.5 0.5 0.5 0.5 0.5 0.5 0.5 0.5 
##$DPOFFS= (0..7)
0 0 0 0 0 0 0 0 
##$DQDMODE= 0
##$DR= 18
##$DS= 0
##$DSLIST= <SSSSSSSSSSSSSSS>
##$DSPFIRM= 0
$$ [...]
##$SUBNAM2= <"">
##$SUBNAM3= <"">
##$SUBNAM4= <"">
##$SUBNAM5= <"">
##$SUBNAM6= <"">
##$SUBNAM7= <"">
##$SUBNAM8= <"">
##$SUBNAM9= <"">
##$SW= 18.0517287032376
##$SWIBOX= (0..15)
0 0 2 0 0 0 0 0 0 0 0 0 0 0 0 0 
##$SW_h= 3612.71676300578
##$TD= 16384
##$TD0= 1
##$TE= 0
##$TE2= 300
##$TE3= 300
##$TEG= 300
##$TL= (0..7)
0 120 120 120 120 120 120 120 
##$TP= (0..7)
150 150 150 150 150 150 150 150 
##$TP07= 0
##$TPNAME0= <>
##$TPNAME1= <>
##$TPNAME2= <>
##$TPNAME3= <>
##$TPNAME4= <>
##$TPNAME5= <>
##$TPNAME6= <>
##$TPNAME7= <>
##$TPOAL= (0..7)
0.5 0.5 0.5 0.5 0.5 0.5 0.5 0.5 
##$TPOFFS= (0..7)
0 0 0 0 0 0 0 0 
##$TUNHIN= 0
##$TUNHOUT= 0
##$TUNXOUT= 0
##$USERA1= <user>
##$USERA2= <user>
##$USERA3= <user>
##$USERA4= <user>
##$USERA5= <user>
##$V9= 5
##$VALIST= <valist>
##$VCLIST= <CCCCCCCCCCCCCCC>
##$VD= 0
##$VDLIST= <DDDDDDDDDDDDDDD>
##$VPLIST= <PPPPPPPPPPPPPPP>
##$VTLIST= <TTTTTTTTTTTTTTT>
##$WBST= 1024
##$WBSW= 4
##$XGAIN= (0..3)
0 0 0 0 
##$XL= 0
##$YL= 0
##$YMAX_a= 101521
##$YMIN_a= -144354
##$ZGOPTNS= <>
##$ZL1= 120
##$ZL2= 120
##$ZL3= 120
##$ZL4= 120
##$ABSF1= 10
##$ABSF2= 0
##$ABSG= 5
##$ABSL= 3
##$ALPHA= 0
##$AQORDER= 0
##$ASSFAC= 0
##$ASSFACI= 0
##$ASSFACX= 0
##$ASSWID= 0
##$AUNMP= <proc_1d>
##$AZFE= 0.1
##$AZFW= 0.1
##$BCFW= 1
##$BC_mod= 2
##$BYTORDP= 1
##$COROFFS= 0
##$CY= 11.3945322036743
##$DATMOD= 1
##$DC= 2
##$DFILT= <>
##$DTYPP= 0
##$F1P= 2.36226072786647
##$F2P= -0.459571619588291
##$FCOR= 0.5
##$FTSIZE= 0
##$FT_mod= 4
##$GAMMA= 1
##$GB= 0.15
##$INTBC= 1
##$INTSCL= 1
##$ISEN= 128
##$LB= 0.24
##$LEV0= 0
##$LPBIN= 0
##$MAXI= 10000
##$MC2= 0
##$MEAN= 0
##$ME_mod= 0
##$MI= 1.114404
##$NCOEF= 0
##$NC_proc= 0
##$NLEV= 6
##$NOISF1= 3.799351
##$NOISF2= 2.8
##$NSP= 1
##$NTH_PI= 0
##$NZP= 0
##$OFFSET= 15.70392
##$PC= 1
##$PHC0= -15520.12
##$PHC1= 19.2008
##$PH_mod= 1
##$PKNL= yes
##$PPARMOD= 0
##$PSCAL= 0
##$PSIGN= 0
##$REVERSE= no
##$SF= 200.130013532006
##$SI= 16384
##$SIGF1= 3
##$SIGF2= 2
##$SINO= 400
##$SIOLD= 16384
##$SREGLST= <1H.CDCl3>
##$SSB= 0
##$STSI= 0
##$STSR= 0
##$SW_p= 3612.71676300578
##$SYMM= 0
##$S_DEV= 0
##$TDeff= 0
##$TDoff= 0
##$TI= <>
##$TILT= no
##$TM1= 0
##$TM2= 0
##$TOPLEV= 0
##$USERP1= <user>
##$USERP2= <user>
##$USERP3= <user>
##$USERP4= <user>
##$USERP5= <user>
##$WDW= 1
##$XDIM= 8192
##$YMAX_p= 0
##$YMIN_p= 0
$$ End of Bruker specific parameters
$$ ---------------------------------
##NTUPLES= NMR FID
##VAR_NAME=  TIME,          FID/REAL,        FID/IMAG
##SYMBOL=    X,             R,               I
##VAR_TYPE=  INDEPENDENT,   DEPENDENT,       DEPENDENT
##VAR_FORM=  AFFN,          ASDF,            ASDF
##VAR_DIM=   8192,          8192,            8192
##UNITS=     SECONDS,       ARBITRARY UNITS, ARBITRARY UNITS
##FACTOR=    0.0002768,     1,               1
##FIRST=     0,             0,               0
##LAST=      2.2672688,     0,               0
##MIN=       0,             -144354,         0
##MAX=       2.2672688,     101521,          0
$$ Real data points
##PAGE= N=1
##DATA TABLE= (X++(R..R)), XYDATA
0@%%%%%%%%%%%Qj6J6j6K4l2L2m0N6o5P3q9J10j33J53j77K08k41K78l20L68m19
$$ 0 0 0 0 0 0 0 0 0 0 0 0 8 -8 8 -8 16 -16 16 -24 32 -33 40 -49 61 -72 81 -96 112 -129 149 -171 197 -222
33b22M75n39O08o85P68q58R62j075J196j329J475j635J808j997K202k427K676
$$ -222 253 -286 322 -363 405 -453 509 -566 630 -699 776 -859 949 -1048 1154 -1273 1403
50A403k948L245l573L937m342M793n302N881o540P305q204R273j0575J2202j4300
$$ 1403 -1545 1700 -1873 2064 -2278 2515 -2787 3094 -3446 3859 -4345 4928 -5647 6555 -7745
65g745J7124k1169K7567l9893J07114j66808J20977J0476j46754J68188k09865
$$ -7745 9379 -11790 15777 -24116 82998 -83810 37167 47643 -99111 69077 -140788
76a40788J90343n9735p0149J66101j13643P1839l6274j5828Q2063j45531P8914
$$ -140788 49555 -10180 -80329 85772 -27871 43968 7694 -8134 73929 -71602 7312
87G312k396l2951M402J548P1049q8732N0640L5111o5622O6040q9000P4258r096
$$ 7312 4916 -28035 -23633 -22085 48964 -39768 10872 45983 -19639 46401 -42599 31659 22563
100B2563j09179J46007r0237J0961M0714p0689J29925j40062N4553Q7373j66559
$$ 22563 -86616 59391 -30846 -19885 20829 -49860 80065 -59997 -5444 81929 -84630
111h4630J32692o0899j894O1486j25713J39063o0026m4138Q7279o5954M7958n2518
$$ -84630 48062 -12837 -14731 46755 -78958 60105 79 -44059 43220 -22734 25224 -27294
123b7294K6585M0513q5293N9082n309k994j7268L883M4675o9777L9745r978l45
$$ -27294 -709 39804 -45489 13593 8284 5290 -11978 -8095 36580 -33197 6548 -3430 -3775
136c775K0369p0756J03041m9728l9598R4843p8355M7115k7347j4939P7165j20299
$$ -3775 16594 -54162 48879 -849 -40447 54396 -23959 23156 -4191 -19130 58035 -62264
148f2264P3282J4384p2360P9093o4603N4530j64p0971J04876o1459j1033L3844
$$ -62264 11018 25402 -46958 32135 -32468 22062 21898 -49073 55803 -5656 -16689 17155
160A7155l2033L1875m9915L2998J8642m6176L4995l598J2344k4130O474K9849
$$ 17155 -14878 16997 -32918 80 18722 -27454 7541 3943 16287 -7843 -1369 28480
172B8480m3859J8384j3426J9701q848m2841Q1551n3658n636M8253n0390N1931
$$ 28480 -15379 3005 -10421 9280 432 -42409 39142 -14516 -20152 28101 -22289 29642
184B9642m8639J2548N0700r2898O7651j2334k8103M5382o1127O8361k7708m0489
$$ 29642 -18997 -6449 44251 -48647 19004 6670 -21433 23949 -37178 31183 3475 -37014
196c7014Q2143o0830J4546Q676j8724L3893n1503L2717J0125l3281K3203p880
$$ -37014 45129 -15701 -1155 7521 -11203 22690 -28813 3904 14029 -19252 3951 -3929
208c929J7748k3202L461K6432k8894Q843n962J9723j6085k0827N1636m0445O562
$$ -3929 13819 -9383 -5922 20510 -8384 459 -5503 14220 -1865 -22692 28944 -11501 -4939
221d939J5216k2100L6790n0027K7327K4799o2207N1220j8979k930J8788m3170
$$ -4939 10277 -11823 24967 -25060 2267 27066 -35141 16079 -2900 -5830 12958 -30212
233c0212O0756l6439j8679N6929m9749K3385o482q006L3883n0712L2400Q411k9696
$$ -30212 30544 -5895 -24574 32355 -17394 5991 -491 -8497 25386 -25326 7074 15485 -14211
246a4211K0496j0573J5877j8081k722K4478k1955L374j612J5172j3136j2877L4005
$$ -14211 6285 -4288 11589 -6492 -9214 15264 -6691 -3317 -4929 10243 -2893 -15770 18235
259A8235k6247P417j85l586K3592m4625L4153O742l8103L7878k2811J4693k158
$$ 18235 -8012 -595 -780 -4366 19226 -25399 8754 15496 -22607 15271 -7540 7153 4995
272D995k6980N1761m0845o55L0246l2962K3978k0986Q809K0452m3228L3007L44
$$ 4995 -21985 29776 -11069 -11724 18522 -14440 9538 -11448 -2639 17813 -25415 7592 7936
285G936j7312J3373r374J7806j7993j815K0029j5344J14p66J4315j3020p325K2513
$$ 7936 -9376 3997 -5377 12429 -5564 -7379 12650 -2694 -2580 -3346 10969 -2051 -9376 13137
299A3137j7123P282r315P480J3410l9316L5521n513k0772K6260k4503K6986j6679
$$ 13137 -3986 3296 -6019 1461 14871 -24445 11076 5563 -15209 11051 -13452 13534 -3145
312c145j4438M5176m2902J4138J0570j8934K4173l2736K4777O418l4503L3282
$$ -3145 -17583 27593 -15309 -1171 9399 -9535 14638 -18098 6679 13097 -21406 11876
324A1876j1626n14R47p792K2583k4952M968J2003j0946J868p025J9023j3852m865
$$ 11876 250 -264 683 -7109 15474 -9478 -4510 7493 -3453 -1585 -8610 10413 -3439 -8304
338h304J7813j2197R343j5305J4105P230l3207L3539j3174o678J4311k2386L3756
$$ -8304 9509 -2688 6655 -8650 5455 12685 -20522 13017 -157 -6835 7476 -14910 18846
351A8846k7169k610L4145l8693K1091n752n164J9366l6312L2367m514k2621K8081
$$ 18846 -8323 -10933 23212 -15481 5610 -142 -5306 14060 -22252 10115 5601 -17020 11061
364A1061j6432J1602q337m088K2615k6406R525M843n271J586j0172K0798j4491
$$ 11061 -5371 6231 -2106 -6194 16421 -9985 -460 4383 -888 698 -9474 11324 -3167
377c167k882J2453q661Q557j6934J5845K620k4552K6699j3435L399K185j3415
$$ -3167 -6049 6404 -2257 6300 -10634 5211 7831 -16721 9978 -3457 -58 2127 -11288
390a1288L0350k9306O371J9172k6925J9878j5018P855Q769k9212L1934j1685r573
$$ -11288 19062 -10244 -3873 15299 -11626 8252 -6766 1089 9858 -19354 12580 895 -8678
403h678J5944j3721J5784j6458K512J6217k1500R963o56K633k074p887J9124j3363
$$ -8678 7266 -6455 9329 -7129 -4617 11600 -9900 63 -593 2040 -34 -7921 11203 -2160
417b160Q10M124k210N399j7898J9226m065j4005J8022j2123J1086r017l843K2446
$$ -2160 -1350 2774 564 5963 -11935 7291 3226 -10779 7243 -4880 6206 -2811 -6654 15792
431A5792k7671J1712N554j2782J3282j7088J7251j528j7307K5182j3646J661K739
$$ 15792 -11879 -167 5387 -7395 5887 -11201 6050 4522 -12785 12397 -1249 412 3151
444C151o767J4181j9473P698P845j3622P873m324Q565o203n071J5250j2543L443
$$ 3151 -3616 10565 -8908 -1210 6635 -6987 886 -3438 5127 -1076 -6147 9103 -3440 3
458Cj930K331L152j5768J9091o871n498J0806r734J4675j5090K828J6148k4803
$$ 3 -1927 404 3556 -12212 6879 8 -5490 5316 -4418 10257 -4833 -2005 14143 -10660
472a0660J4765l913l364Q066j7658K1651q595r076J8109j3476P906o108j73J1454
$$ -10660 4105 192 -3172 4894 -12764 8887 292 -8784 9325 -4151 3755 -2353 -2526 8928
486H928j9681J1939J559o789N646n645J1468q722k268J1539r888L893m952M612
$$ 8928 -10753 1186 2745 -4044 1602 -4043 7425 -1297 -3565 7974 -1914 1979 -2973 1639
500A639J936j3522J5541o082l031N858o584J2340j4383M061J1133j7721J2004
$$ 1639 3575 -9947 5594 -488 -3519 2339 -4245 8095 -6288 -2227 8906 -8815 3189
513C189n438K028N278j5541K0526j0147n152J2921j2167J0264j0248L073R721
$$ 3189 -2249 -221 5057 -10484 10042 -105 -5257 7664 -4503 5761 -4487 -1414 8307
526H307j7162J2129k121k267K664o791J2567j0675k74P389o940M663o739P996
$$ 8307 -8855 3274 1153 -1114 1550 -5241 7326 -3349 -3623 3766 -3174 1489 -5250 2746
540B746M05r699J2404n714N06N66m183R872j3352M826O845j1130Q123n030N114
$$ 2746 3151 -6548 5856 142 648 1214 -2969 6903 -6449 -1623 5222 -5908 2215 -2815 2299
555B299J124j0565J4644p990k522O091o923P962r833M223P235j2639J0214k699
$$ 2299 3423 -7142 7502 -488 -3010 3081 -3842 4120 -5713 -1490 5745 -6894 3320 621
569F21J324J11o244J2106j0456J64M854n450M835q116Q464L70q468J0816o623
$$ 621 1945 2056 -4188 7918 -2538 -2374 2480 -2970 1865 -6251 2213 2583 -5885 4931 -1692
584a692L460k118k813J0053j3435O253K859o672P087p265Q931k455p620J2364
$$ -1692 1768 -350 -3163 6890 -6545 -292 2567 -4105 2982 -4283 4648 2193 -5427 6937
598F937q436J653M37l377P523j0546O169K604p322O716m612N015k654m272J0121
$$ 6937 -1499 154 591 -2786 4737 -5809 360 2964 -4358 2358 -2254 2761 107 -4165 5956
613E956r057K413K126k853N098q789Q150k41p158Q475o105M535l435k548R697
$$ 5956 -3101 -688 1438 -1415 3683 -5106 3044 2803 -4355 4120 -1985 2550 -885 -3433 6264
628F264j1873N977J200m653O506q757R539l403o396J0719q457M977k432j351Q746
$$ 6264 -5609 368 1568 -3085 3421 -5336 4203 800 -5596 5123 -3334 1643 -789 -2140 6606
643F606j2142Q482o97m432O140p962Q083n622k163Q967j0115O328k719J59N225
$$ 6606 -5536 2946 2249 -2183 3957 -4005 4078 -1544 -3707 5260 -4855 1473 -1246 -1087 4138
658D138j0223R762l213l531O131o892P134n291l51P466r334O787k109o11L856
$$ 4138 -6085 3677 464 -3067 3064 -3828 3306 -1985 -2336 5130 -4204 2583 474 -137 3719
673C719p906Q575m617l040O517o884N917m834P52O041r651Q008k766j180M316
$$ 3719 -4187 4388 -229 -3269 3248 -3636 2281 -2553 -1801 4240 -5411 2597 -169 -1349 2967
688B967p482R218o122r81O875q641P328m598J109M723r526R720n003o67L689o944
$$ 2967 -4515 4703 -1419 -2400 4475 -4166 3162 -1436 -327 4396 -5130 4590 -413 -1080 2609 -4335
704d335Q659p758J913M646p834P746n467K679J860o381Q354n984J349K893n383
$$ -4335 4324 -3434 -1521 3125 -4709 3037 -2430 249 2109 -4272 4082 -1902 -553 2340 -3043
719c043O867o505L168K571o638O689m567K034J148m950P361o678J830K688n171
$$ -3043 3824 -2681 487 3058 -3580 3109 -1458 576 1724 -3226 4135 -2543 -713 1975 -3196
734c196N958n627L177K150o541P509n204J846J558m599P297p108L014K102n386
$$ -3196 2762 -2865 312 2462 -4079 3430 -1774 72 1630 -2969 4328 -2780 234 2336 -3050
749c050O197n906M127o8n084Q067p073L643l90l521O907p929N704o83m289O783
$$ -3050 3147 -2759 1368 1300 -3784 4283 -2790 853 463 -3058 3849 -4080 1624 941 -3348 3435
765C435o551N046j493k884O709p172M494r08k401M983o776N620j695k914N609
$$ 3435 -3116 1930 437 -2447 4262 -2910 1584 676 -1725 3258 -3518 2102 407 -2507 3102
780C102o018M544k174j580N471o844N137j368k113M737n970N352k299j876N177
$$ 3102 -2916 1628 -546 -2126 3345 -3499 1638 270 -1843 2894 -3076 2276 -23 -1899 3278
795C278o070N056k265j471M801o834N887k596j712M598o021N461l231q80N123
$$ 3278 -2792 2264 -1 -1472 3329 -3505 2382 -214 -1926 2672 -3349 2112 -1119 -1999 3124
810C124o771N582k400o26M256o560O366l438q81M378o115N837m245R63L702o484
$$ 3124 -3647 1935 -465 -1091 3165 -3395 2971 -467 -1348 3030 -3085 2752 -1493 -530 3172 -3312
826c312O318m037N32K802n465N873m292L61L058n299N748m069J545K826n419O042
$$ -3312 3006 -1031 -499 2303 -3162 2711 -1581 -1220 1838 -3461 2287 -1782 -237 2589 -2830 3212
842C212l868Q40K222n081N555m527J201K081m988N469l860J498K079m459N425
$$ 3212 -656 184 2406 -2675 2880 -1647 -446 1635 -3353 2116 -1744 -246 1833 -2626 2799
857B799l876P89J890m636N467m750J860J932m327N680m051K224O91l792N661n156
$$ 2799 -1077 -288 1602 -3034 2433 -2317 -457 1475 -2852 2828 -1223 1001 1692 -2100 3561 -1595
873a595K139P26l630N098n497L174Q02m225N746m819K728O21l968N411n242K812
$$ -1595 544 1270 -2360 2738 -2759 415 1217 -3008 2738 -2081 647 1268 -2700 2711 -2531 281
889B81M11l034M758m553L018j09k829M951m826L113n23k464M797n517L472o68
$$ 281 692 -2342 2416 -2137 881 772 -2057 2894 -1932 1181 658 -1806 2991 -2526 946 278
905B78k366M302m877L562r12k130M613m677L398r15j528M118n120L921j223j996
$$ 278 -2088 2214 -2663 899 -13 -2143 2470 -2207 1191 276 -1252 2866 -2254 1667 444 -1552
921a552L998m745L628j531j150M127n085L988j287j670L466m720L932j840j279
$$ -1552 2446 -2299 1329 -202 -1352 2775 -2310 1678 391 -1279 2187 -2533 1399 -441 -1720
936a720L185m287M151k135n3L189m433M485k337l30K682m831M233k957k49L418
$$ -1720 1465 -2822 1329 -806 -859 2330 -2103 2382 45 -285 2397 -2434 1799 -1158 -1407 2011
952B011m774M473k443K1L006m562M670k882j45K781n104M597k902M33K507m421
$$ 2011 -2763 1710 -733 -712 2294 -2268 2402 -480 -625 2156 -2948 1649 -1253 -820 1687 -2734
968b734M847k828P55K123l920M395l730O88K192m295M340l538J550J405l650M589
$$ -2734 2113 -715 40 2163 -1757 2638 -1092 -404 1788 -2507 1833 -1705 -155 1250 -2400 2189
984B189l705J831J226l820M831m197J747J339l937N045m013J754J238l927M801
$$ 2189 -1516 315 1541 -2279 2552 -1645 102 1441 -2496 2549 -1464 290 1528 -2399 2402
999B402l580J249J423l549M363l775J376J411l591M018l320J695N82k817M272
$$ 2402 -1178 71 1494 -2055 2308 -1467 -91 1320 -2271 1747 -1573 122 704 -2113 2159
1014B159l799K009N89k819M634m580K766L67l220M461m764K720Q2k849M674m718
$$ 2159 -1640 369 958 -1861 2773 -1807 959 1326 -1894 2567 -2197 523 605 -2244 2430 -2288
1030b288K800L03k763M519m604K900p52k236M251m080K603m36j597L692m055L009
$$ -2288 512 815 -1948 2571 -2033 867 115 -2121 2130 -1950 653 217 -1380 2312 -1743 1266
1046A266m46j905L157l634K815j368j279K828l592L253j291p16K798m176L702
$$ 1266 820 -1085 2072 -1562 1253 -115 -1394 1434 -2158 1095 -196 -912 1886 -2290 1412
1061A412j367j341K803l768L699j359j159L136l782L267j198j084K739l553K855
$$ 1412 45 -1296 1507 -2261 1438 79 -1080 2056 -1726 1541 343 -741 1998 -1555 1300
1076A300j216j221K703l318L118k069o5K249l579L280k233M82K038l400L751k945
$$ 1300 84 -1137 1566 -1752 1366 -703 -768 1481 -2098 1182 -1051 -569 1469 -1931 1820 -1125
1092a125N37K298l850M404l157J040J787l939M260l154R86J191l404M122l350
$$ -1125 -588 1710 -2140 2264 -893 147 1934 -2005 2255 -899 87 1278 -2126 1996 -1354
1107a354J038J396l177L754k661Q33J190k774L298k545R74R48k307L184k946J360
$$ -1354 -316 1080 -2097 1657 -1004 -171 1019 -1755 1543 -1002 -28 920 -1387 1797 -1149 211
1123B11R52k538L048k759J511M62k507L373l078J459M89k834M256l665K018P19
$$ 211 1163 -1375 1673 -1086 425 887 -1620 1753 -1325 134 623 -2211 2045 -1620 398 1117
1139A117l258M048l241J632Q74k904L805l092J381Q44k608L191l146J611O18k462
$$ 1117 -2141 1907 -1334 298 1172 -1732 2073 -1019 362 1206 -1402 1789 -1357 254 872 -1590
1155a590L051l207K373l70j605L156l577K539n03j321K868l654L115r03j806L163
$$ -1590 1461 -1746 627 257 -1348 1808 -1769 770 267 -1054 1814 -1840 1275 372 -1434 1729
1171A729l528L143j087j185K852l429K347n35j635K497k614K072n92j318K809
$$ 1729 -1799 1344 257 -928 1924 -1505 842 307 -1328 1169 -1445 627 35 -1283 1526
1186A526k555J638n15q49K193k942K218l89j252K165k400K424j390m86K250l087
$$ 1526 -1029 609 94 -755 1438 -1504 714 325 -927 1238 -1162 1262 -128 -614 1636 -1451
1202a451K760j523m84K286l722L323j882l39K245k985K995j497l19K524l169K447
$$ -1451 1309 -214 -698 1588 -2134 1189 -693 -1032 1213 -1772 1223 -274 -593 1931 -1238 1209
1218A209j459j0J639l146L059j686K0J474k209K471j621k8J270k422K357j676
$$ 1209 -250 -260 1379 -1767 1292 -394 -374 1100 -1109 1362 -259 -287 983 -1439 918 -758
1234g58O19M40j785K756k305R11J166j837K512k435J016N78k275K687k111P05
$$ -758 -139 301 -1484 1272 -1033 -122 1044 -793 1719 -716 300 878 -1397 1290 -821 -116
1250a16J015k593L185k217N84J516k731K753k289P17O87k419L060k129R18P40
$$ -116 899 -1694 1491 -726 -142 1374 -1357 1396 -893 -176 511 -1908 1152 -977 -59 681
1266F81j880K943k632J527J63j865K404k473J963m50j609K704l143K211k36j482
$$ 681 -1199 1744 -888 639 802 -1063 1341 -1132 831 381 -1228 1476 -1667 544 308 -1174
1282a174K809l296K263l04j710K960k829J772k85j238K549k495J369P1j516K442
$$ -1174 1635 -1661 602 298 -1412 1548 -1281 491 206 -1032 1517 -978 391 462 -1054 1388
1298A388k375J534j29j162K029k266J457j43j399K166k674J847l80q98K034k780
$$ 1388 -987 547 418 -744 1285 -981 476 333 -1066 1100 -1574 273 -107 -1005 1029 -1751
1314a751K353k55j020K220k620J828o35j099K447l076K465r00p87K363k721K119
$$ -1751 602 347 -673 1547 -1073 755 120 -979 1468 -1608 857 -43 -830 1533 -1188 931
1330I31n71j049K305l015J735o50p57K056k647K346p32m21J618k142K289j460
$$ 931 360 -689 1616 -1399 336 -314 -1071 985 -1662 684 -48 -469 1149 -993 1296 -164
1346a64k26J518k549K280j502K91J210j961K151j447J01J316k153K221j842J3
$$ -164 -390 1128 -1421 859 -643 -352 858 -1103 1048 -399 -298 1018 -1135 1086 -756 -743
1362g43J289j745J841j198L88R81j757K207j513J20J040j861J969j703N82Q28
$$ -743 546 -1199 642 -556 -168 813 -944 1263 -250 -130 910 -951 1018 -685 -103 725
1378G25k172K341j551M77Q83j840K223j772Q34M79j675J907k047J501L01j818
$$ 725 -1447 894 -657 -180 703 -1137 1086 -686 148 627 -1048 859 -1188 313 614 -1204
1394a204K721k201Q83M76j660K166k133J098M01j517J988j740R73L6j357J991
$$ -1204 1517 -684 199 675 -985 1181 -952 146 547 -970 1018 -722 251 287 -1070 921
1410I21j912J073Q5j169K184k212J722l33j227K318k295J363l70j241K150j973
$$ 921 -991 82 167 -1002 1182 -1030 692 359 -868 1450 -845 518 148 -1093 1057 -916
1426i16J083J38j114J973j937J279J96j854K422k432J503m57j079K181k074J545
$$ -916 167 305 -809 1164 -773 506 702 -1152 1270 -1162 341 -116 -1195 986 -1088 457
1442D57j77r35J935k106J333j92j270K148k213J381k21j159K171k336J800o08
$$ 457 280 -655 1280 -826 507 315 -955 1193 -1020 361 140 -1019 1152 -1184 616 8
1458Hp30J642j863J582q10n00J286j778J795p55l78J478j811J503n83m20J379
$$ 8 -722 920 -943 639 -171 -671 615 -1163 632 -123 -501 977 -834 669 86 -334 1045
1475A045j784J317o99m11J503k194J584q52mJ425k035J646o38m07J096j406J393
$$ 1045 -739 578 -121 -532 971 -1223 361 -491 -495 930 -1105 541 -97 -504 592 -814 579
1492E79p34j63J112j643J790j193R5P98j390J628j163j04Q58j476J812j349qJ114
$$ 579 -155 -318 794 -849 941 -252 -157 641 -749 879 -284 -388 470 -1006 806 -543 -551 563
1510E63j852J924j055N7R73j402J656j110Q1P00j360J907j529L41J095j762J722
$$ 563 -1289 635 -420 -363 610 -792 864 -246 -165 535 -825 1082 -447 -106 989 -773 949
1527I49j253M4O32j142J649j415N24L13j198J841j430L63M34j502K293j857Q15
$$ 949 -304 -260 372 -770 879 -536 -12 301 -897 944 -486 -123 311 -1191 1102 -755 60
1544F0K80j287J959j473Q20O0j069J399j469J020j22q89J717j943J106p2q56J483
$$ 60 340 -947 1012 -461 359 419 -650 749 -720 300 178 -711 1006 -937 169 97 -759 724
1562G24j644J230l62n58J301j595J309j08q58J592j719J013j2j066J739j857J060
$$ 724 -920 310 -52 -610 691 -904 405 297 -561 1031 -688 325 313 -753 986 -871 189
1579A89j17p73J370j571J332l45m51J247j710J023N0j002J515j472R88M9p40J274
$$ 189 72 -701 669 -902 430 85 -366 881 -829 194 244 -758 757 -715 273 322 -418 856
1597H56j576J134m34k73J033j253J077o20o02J375j837J610n91m93J336j414J546
$$ 856 -720 414 -20 -293 740 -513 564 -56 -658 717 -1120 490 -101 -594 742 -672 874
1614H74j184j54J404j567J174p19m88J125j308J269m31m96J268j141Q06l78k02
$$ 874 -310 -464 940 -627 547 -172 -660 465 -843 426 -5 -501 767 -374 432 54 -148
1631a48N36j171J171r51O7P73j093J436j003L80M62p75P82o54J03N97j653J641
$$ -148 388 -783 388 -563 -496 277 -816 620 -383 -3 459 -316 466 -188 -85 512 -1141 500
1649E00p82j64J050j244J396j203L58O51j189J150q55m8P36j062J250j084M76
$$ 500 -282 -446 604 -640 756 -447 -89 562 -627 523 -332 -380 356 -706 544 -540 -64
1666f4L74r48J131r43R02k8r10J207r77Q14k25r12J176j009O63j87n70Q97r39
$$ -64 310 -638 493 -450 452 424 -486 721 -256 558 333 -579 597 -412 251 64 -506 391 -548
1685e48Q83j56r72J444j192P32L32o71J061j482P73Q7p93J153r90N40Q9r01J078
$$ -548 335 179 -793 651 -541 191 523 -148 913 -569 204 291 -502 651 -339 201 290 -611 467
1704D67q86M88j87n13J071j291Q21J7n06J122j112J000n75j83R33j217J047o10
$$ 467 -419 69 -118 -631 440 -851 -30 -13 -519 603 -509 491 -84 -267 666 -551 496 -114
1722a14l49J010j461J455n15l39J058j313J387r05j87J157j802J004k26j99N95
$$ -114 -463 547 -914 541 26 -313 745 -568 819 -86 -273 884 -918 86 -140 -339 256
1739B56j080J218l91k61P82j108J179m50l08N08j057J076n64J33L80o74R41q81
$$ 256 -824 394 3 -258 524 -584 595 145 -163 345 -712 364 -200 -67 313 -361 580 -301
1757c01J30Q24j225J183q92K21O07j285J279p60j30R13j220J502p73l72J028j343
$$ -301 -171 653 -572 611 -281 -60 547 -738 541 -219 -349 564 -656 846 73 -299 729 -614
1775f14R41l93J23N39j490J231m60rK96q31J150r68J54M80q07J265r87M86O2q30
$$ -614 327 -66 57 596 -894 337 -123 -132 164 -667 483 -485 -331 149 -658 607 -380 106 168 -662
1795f62J116j036L23L06n23R53j025Q42Oo53J029r59M47l3r06J120m35lJ10l86
$$ -662 454 -582 -259 47 -476 477 -548 294 300 -353 676 -283 164 131 -775 345 -90 -93 17 -369
1815c69Q72q07M80K82o52Q85r90N71l25l81Q58q84M60L38o74J111j375J064j63
$$ -369 503 -304 176 458 -194 691 -299 272 -53 -434 424 -460 0 338 -336 775 -600 464 301
1834C01q75J181j423R36m73o5Q68j174P83J5m95J354j443J097n25n31J079j416
$$ 301 -574 607 -816 120 -353 -418 450 -724 59 74 -421 933 -510 587 62 -469 610 -806
1852h06J211o14k06J074j379J252M12j062J69n49R56j137L88N80r78R49k8l18
$$ -806 405 -209 -415 659 -720 532 944 -118 51 -498 458 -679 -291 289 -689 260 232 -86
1870h6Q44j107Q12m38j50Q79j463J216m76k17P11j032R24m99m06R15r02P49m67
$$ -86 758 -349 463 25 -125 754 -709 507 31 -186 525 -507 417 -82 -488 427 -475 274 -193
1889a93k41R80j074Q98n40m7Q84j188Q50l29j1N28r75J128j006J60N39p16P44
$$ -193 -434 546 -528 370 -170 -217 667 -521 329 0 -11 517 -458 670 -336 -176 363 -353 391
1908C91p61J78O21j301J320j012M00O37r76J079r22M08K24o95R60q24M27J33r04
$$ 391 -370 -192 429 -872 448 -564 -164 473 -503 576 -346 62 286 -409 551 -273 154 287 -617
1927f17J201r48L26M43r51R64n60L26o9n87R01q86L29M70j055J465j198O48J28
$$ -617 584 -364 -38 405 -546 418 -142 184 115 -472 429 -457 -128 342 -713 752 -446 202 330
1946C30p86R76o02J55K71o85J129j088M77N49j112Q76r82N81L91n87O81j038N98
$$ 330 -456 520 -82 73 344 -341 788 -300 177 726 -386 490 -492 89 480 -107 574 -464 134
1965A34K11j454J895j228O74l42n09J693r73M8L3m88P50j018Q37k52l37Q58j130
$$ 134 345 -1109 786 -442 232 -110 -619 1074 101 149 182 -306 444 -574 263 11 -326 532 -598
1984e98J428p04o99J363j356Q88l25J9O50j077O61l56k42R98j119P81m22j14O53
$$ -598 830 126 -573 790 -566 322 -3 16 666 -411 250 -106 -348 650 -469 312 -110 -224 429
2003D29r32K23m1M38m0j159J292l25j79O20r61R53o9l57K40p46J085m73j28N99
$$ 429 -503 -280 -321 117 77 -1082 210 -115 -294 326 -635 318 249 -108 132 -614 471 -2 -130 469
2023D69r28O75p02J82J139j230M85k95J38O79r25P54q07J19L92n81J064p59K5
$$ 469 -459 216 -486 -304 835 -395 90 -205 -67 612 -313 441 -366 -247 145 -436 628 -131 -106
2042a06O65j083Q59p27J16O98j012J056n73l92Q96o22L73l97L27J58q54J094o53
$$ -106 559 -524 335 -392 -276 422 -590 466 -107 -499 397 -225 148 -249 78 236 -618 476 -177
2061a77j2N36q26R38n96j54R24o46P85j448Q32J61p28J134p39L51J0p40Q22l98
$$ -177 -189 347 -479 459 -137 -291 633 -13 772 -676 156 317 -411 723 -16 335 345 -395 427 29
2081B9k87M95m87N88o51L29J01o65J068o44P6J92m55Q77p68K28K08n59O87p24
$$ 29 -258 237 -250 338 -313 16 117 -548 520 -124 -48 144 -311 566 -202 26 234 -325 362 -362
2101c62P83l56n10J138j056L93J02o69J000r46M91Q1n64P21l97O66r35R3M71o6
$$ -362 421 65 -445 693 -363 30 132 -537 463 -483 8 89 -475 246 -151 515 -420 -327 144 78
2121G8j65K21j93M2k13M30ln88J036r78P61n45j2N82q84N34n4l37P01n96O78r08
$$ 78 -87 134 -59 -17 -230 200 197 -391 645 -333 428 -117 -129 453 -431 103 49 -288 413 -183 495 -413
2143d13k43J174j065P65j25k40M08n42M34j80k17M68n15Q00o26l03Q09o23L70
$$ -413 -656 518 -547 218 93 -147 261 -281 153 -27 -244 224 -291 509 -117 -420 389 -234 136
2162A36l51jL76m93O11m13J05K65n20N44r26P60L14n28M05k99p0K41n39O03l34
$$ 136 -215 -216 160 -333 278 -135 -30 235 -285 259 -667 93 407 -121 284 -15 -85 156 -383 220 -114
2183a14k22N80n60N01k43M6J87o81J008n73J09n9j70N47p32N35K0l32O30p83M77
$$ -114 -336 244 -316 185 -58 -12 175 -506 502 -71 38 -21 -191 356 -376 159 179 -153 477 -306 171
2204A71m6n11N46m86L06Q1k39K89k79K97J09p11Q35m95L45R0o92O73l00l4J65
$$ 171 125 -386 160 -326 -20 61 -178 111 -168 129 238 -473 362 -133 212 302 -390 283 -17 -51 114
2225A14m26O67j13o00Q59j041L82jO30l37o25Q90p53L90k2l78Q84j032Q15l87
$$ 114 -312 355 242 -358 501 -540 -158 -159 471 134 -491 399 -354 36 14 -364 520 -512 303 -84
2245h4j38N18m39L78j24m00O55n65K31l1J9M49p55M10k70j41N96m41K73j15l70
$$ -84 -222 296 -143 235 111 -289 366 -199 32 1 20 469 -286 124 -146 -287 309 -132 141 26 -344
2266c44N04n61L93j18K0J73k61M97k26j35K27m99L60J41p84P87l73L32n2j46L66
$$ -344 160 -401 -8 -126 -106 67 -194 303 77 -58 169 -330 30 171 -613 174 -199 133 81 -65 301
2287C01o98M62k19L3M77l08n66O32o10M83l78P83n06k11n2N09L50o79j95P37r81
$$ 301 -397 65 -154 -121 356 48 -518 114 -496 -13 -391 392 -114 -325 -377 132 482 -197 -392 345 -636
2308f36R72l91M7M21n85M51l42J12L28n89L78k62K86j42j39K48j71k86J62lM35
$$ -636 336 -55 -8 413 -172 279 -63 49 377 -212 166 -96 190 48 -91 157 -14 -300 -138 -141 294
2329B94m48m5J87k95M26l65K39J09k84M30n76K12L90o45O46l8q4K1l47M62q91
$$ 294 -154 -199 -12 -307 119 -246 -7 102 -182 248 -328 -116 274 -371 275 237 153 174 -173 289 -602
2350f02O3N21p7N49p59M09J20j303J242p50Q05o5k38K90l85K81K3n11N49k80L19
$$ -602 -539 -18 -95 454 -305 104 224 -1079 163 -587 218 153 -85 205 -180 101 124 -387 162 -118 201
2371B01J35m31L0k44M68j03k34O07j188J160l28K02q0m77M76j60k86M64m62K70
$$ 201 336 -95 -65 -309 159 56 -178 429 -759 401 73 275 195 -282 194 34 -252 212 -250 20
2391B0Q1k23K42l39L24r9m00O05m82N29k48j87M38m72M36k41j98O88p27K66Nk01
$$ 20 101 -122 120 -219 105 6 -394 211 -271 258 10 -177 261 -211 225 -16 -214 474 -253 13 18 -183
2413a83M68k94K72l28j51O64n44K26k40q6L37n07M52k00j32L01k89P28q10L47
$$ -183 285 -9 263 -65 -216 448 -96 130 -110 -196 141 -366 86 -114 -246 55 -234 494 -316 31
2433C1L08q02Q63p08K63j6L6K2k06J95L07m98O26l94j19K06j20M9l33L43q1j56
$$ 31 339 -463 400 -308 -45 -61 -25 -3 -209 -14 293 -205 421 27 -92 114 -6 43 -290 53 -28 -184
2455a84M09k30j16L38o49O40k68r7L84l34L48k26m3J76k57K11j8l65k48M81n48
$$ -184 225 -5 -121 217 -432 208 -60 -157 227 -107 241 15 -28 148 -109 102 84 -281 -529 -48 -596
2476e96L51N89j80m39N26n30N18j03k87M26n16J20L48j16M9L47j108L98L8N32
$$ -596 -245 344 164 -275 251 -279 239 136 -151 275 -241 -121 227 111 160 507 -601 -203 -165 367
2496C67l40R3n3l72M86m00K74P4n34N22m22N59j26m05M12m26K97K31n83L09q8
$$ 367 27 120 67 -305 181 -219 55 129 -405 117 -305 254 128 -277 135 -291 6 237 -346 -37 -125
2517a25J58k78q2P03m29K81n7j35K23o65M84j96nL88l94N8N5k93M49l41J52K42
$$ -125 33 -245 -327 376 -53 228 171 36 259 -406 78 -118 -123 265 -129 -71 -16 -309 140 -201 -49 193
2539A93k70K04n61N12j22k7J47l01M08j05j60J30O9j31J12k51O29o67L89l08j46
$$ 193 -77 127 -434 78 -44 -71 76 -225 183 78 -82 48 117 -14 98 -153 476 -191 198 -110 -256
2560b56K84k32K90n4p2k5k13M45j92K0L32o17K75K0p4K80m65O28l64j46N1l80
$$ -256 28 -204 86 32 -40 -65 -278 167 -25 -5 327 -290 -15 5 -69 211 -254 374 10 -136 -85 -465
2582d65P16l4j42o5n5j8J58j0M61j199J078k22j95L71j009P26N47l09r7o11M68
$$ -465 251 217 75 10 -45 -63 95 85 546 -653 425 203 8 379 -630 96 643 334 237 -374 94
2603I4r9l57J176j168R08j183Q27j46l04Q47o87M48q19J79L88j004P48P04l38
$$ 94 -5 -362 814 -354 554 -629 198 52 -252 595 -92 356 -463 -284 104 -900 -152 552 214
2622B14j09l5K96q9r1j2j42K05n46P5K27m19K74p6M7J23m10M75m20J09l4M51J48
$$ 214 105 70 366 277 186 174 32 237 -309 -234 -7 -426 -152 -228 -181 -58 -468 7 -413 -304 -338 113 261
2645B61L65q67P57m98Q4j23m0N18n09J53k10j43N43l12j89J01RL51k64k53J43
$$ 261 626 -241 516 18 102 -21 -61 457 -52 101 -109 -252 291 -21 -210 -109 -100 251 -13 -266 -123
2666a23J95q6k94K28K48j76K37l99L30o1k87M67m78L93l30%M80n55K09J19k59
$$ -123 72 -14 -308 -80 168 -8 229 -170 160 99 -188 279 -199 194 -136 -136 344 -211 -2 117 -142
2687a42J13j85L50m62K93k06K36L38j54m08L27k60R0J24Lqm58N57k87O04m45j43
$$ -142 -29 -214 136 -326 -33 -239 -3 335 181 -227 100 -160 -70 54 57 49 -409 148 -139 465 20 -123
2709a23L1j47L48J68m05qN9p9K22l00J23J61j17K67m84L71N4j71J87j75L29l66
$$ -123 -92 -239 109 277 -128 -136 -77 -156 66 -234 -111 50 -67 200 -284 87 141 -30 157 -18 311 -55
2731e5o4P48m74k2o7o9L6k88NP5M47l87M24k58m74L40K07J5J98m62O2N14k90l5
$$ -55 -119 629 155 133 66 -3 33 -255 -250 -175 272 -115 309 51 -423 -83 124 139 337 -125 -63 451 161 126
2755A26k3R1j74j10J36k74N59m08J6N9j47R0J29l60M38m52M24q5j46L05j89K03
$$ 126 103 194 20 -90 46 -228 331 -77 -61 -2 -149 -59 70 -290 148 -304 120 35 -111 194 5 208
2777B08o6k40K63k26m2M66o80M88k0o50N79p7j8k72P1L12j79P33n18J70j29k58
$$ 208 142 -98 165 -61 -103 363 -317 171 151 -499 80 3 -15 -287 -216 96 -83 650 132 302 173 -85
2799h5Q0m96P21J76j8o8m63R74p24J48n16l00Q27k21o9Q0rK10k18k06L57m46J10
$$ -85 -5 -501 220 396 378 310 -153 821 97 245 -271 -571 256 35 -34 46 37 247 29 -177 180 -266 -156
2822a56L39j10K24l91K2o0k3L30l28L93k84L3N3k06j7J65qM8r3N9o1J00m9j34
$$ -156 183 73 297 -94 -72 -132 -155 175 -153 240 -44 -11 42 -164 -181 -16 -24 24 -69 -10 -71 29 -20 -154
2846a54K51j88j45M95j34q4m9j25m0Q4L08k94j70J88k01M86k63j41J99O8M7l4
$$ -154 97 -91 -236 259 125 41 -8 -133 -173 -89 219 -75 -245 -57 -258 228 -35 -176 23 91 138 104
2868A04k47J43j91L24p9k32K01l3R8r9K54o3j94R9m47M45k04l9J8J50p0M15m84
$$ 104 -143 0 -191 133 54 -178 23 -10 88 -11 243 180 -14 85 -362 83 -121 -160 -142 8 -62 353 -131
2891a31K58l08J86o0R8K78k27k9p3j12L57k56pJ64q6q0J0K68j28K7N5l46K97J19
$$ -131 127 -181 5 -55 43 321 94 65 -8 -120 237 -19 -26 138 52 -28 -18 250 122 149 204 -142 155 274
2915B74k33R1k44K58k06k11O89o26J08K47m06L18j90K51j89J49L8k70J0J29r3
$$ 274 41 132 -112 146 -60 -271 418 -208 -100 147 -259 59 -131 120 -69 80 118 -152 -142 -13 -106
2936a06k0r9K42j51J39J3l45K61qP6M3j93O6J20j33L03l35R7J0j22M72l73M8Q0
$$ -106 -126 -225 17 -134 5 18 -327 -66 -74 2 45 -148 -82 38 -95 208 -127 -30 -20 -142 330 -43 5 85
2960H5l09J50K32P1m1l46M30j97Mj42J55o0mk37J54j23L24l53L60r3k77L58j30
$$ 85 -224 -74 158 229 188 -158 272 75 79 -63 92 32 28 -209 -55 -178 146 -207 153 60 -217 141 11
2983A1j7J49k49N43m27K7L4l47L93j7l4j91J91n2r5K32j06J93o0k70l6O6k0J45
$$ 11 -6 143 -106 437 10 37 71 -276 117 100 66 -125 66 14 -81 151 45 238 178 -92 -128 -62 -82 63
3007F3k07R8J40J64j65l62K68k23M23r7n51L63j23J08K47j43O0Q9k04K3rj34J66
$$ 63 -144 -46 94 258 93 -269 -1 -224 199 102 -449 -86 -209 -101 146 3 63 152 -52 -29 -38 -172 -6
3030fj66M09l52K81k83K5r2J40K40l85J67N6j47K14q6rL6j95L34j39j17J66l28
$$ -6 -172 237 -115 166 -117 -92 -184 -44 196 -189 -22 34 -113 101 15 6 42 -153 181 42 -75 91 -237
3053b37L59m41M85J12l82L40l56K29k1q3J26J1R7j36j16O1j37L68m03K20j02J2
$$ -237 122 -319 166 278 -104 236 -120 109 88 5 131 142 239 103 -13 48 -89 279 -124 96 -6 6
3075FM1k5p8j7R5J60j22J08k17K4K22k41l9K70l81J83L73m93%m3J22m9r1J78N0
$$ 6 47 22 -56 -73 22 182 60 168 -49 -25 197 -44 -83 187 -194 -11 362 -131 -131 -174 -52 -101 -192 -14 36
3100C6j84qL88R4r0k72k4l06K24j47K24O5qK2q8J11r1o2J85j78OOL6K54l33L78
$$ 36 -148 -156 232 326 236 -36 -60 -366 -142 -289 -65 0 -8 14 -74 37 -54 -116 69 -109 -103 -97 -61 193 -140 238
3126B38k92o0J30j70L53j43j59P9L9Q1q2l30N57l47K99n69P1N79l78K57k42Q1
$$ 238 -54 -114 16 -154 199 56 -103 -24 15 96 14 -316 241 -106 193 -376 -305 274 -104 153 -89 -8
3148hk5N2J48j75n1l8n5L75l07J76J35l62J16j69J7L86l23L01l52j37M10n26N75
$$ -8 -33 19 167 -8 -59 -97 -152 223 -84 92 227 -135 -19 -188 -171 215 -108 193 -159 -296 114 -412 163
3171A63k73kK39l42J95J23n8o2L1J18j45K1K3j83K26J67R9k86j39K44q0j26J97
$$ 163 -110 -112 127 -215 -20 103 45 -17 14 132 -13 8 31 -152 74 241 340 54 -85 159 79 -47 150
3194A50k74J14L2J10J15k61L8r0Q0j42l7K15j33o4j52J47L95m15QR7j99N52m70
$$ 150 -124 -10 22 132 247 -14 24 -66 14 -128 -165 50 -83 -147 -299 -152 243 -172 -164 -67 -266 286 -184
3217a84O9J67j3p2r7R4O7M5kj57J23n10k70N59k91P13J94l14j78Q4j48K12j14
$$ -184 -115 52 39 -33 -130 -36 31 76 74 -83 40 -470 -740 -181 -472 241 435 121 -57 27 -121 91 -23
3240b3J40j09K76O5k26M5k20K09l19N4L67l79J15O4k29L76n49Q3O8N76p77M77
$$ -23 117 8 284 349 123 168 -52 157 -162 -108 259 -120 -5 59 -170 206 -343 -260 -192 384 -393 84
3262H4p4R6r4K87k34j39J82l6l70R1K92j00L4M3j84J80o5j85M45k13j75j12K44
$$ 84 10 106 12 299 65 -74 108 72 -298 -207 85 -15 19 62 -122 58 -7 -192 253 40 -135 -247 -3
3285cP5k60N22k10l82L53L5k06L5J34pN8p2k35J9J57n3J06R3p5R5j88O5k65K66
$$ -3 72 -188 334 124 -258 95 130 -76 -41 93 86 144 72 -163 -144 13 -40 66 159 84 179 -9 56 -209 57
3310E7j09P9k55J60r3K17k38N03l18l10L11L17m65J84l4K27j56O5m65K88L3mJ39
$$ 57 -52 27 -228 -68 -161 56 -182 321 3 -307 4 321 -144 40 6 233 77 142 -323 -35 -2 -6 133
3333A33k92L3k0N1J46J23k43j21K83P6j02L7J44k03m7jJ63j11l24K82o3J84j85
$$ 133 -159 -126 -146 -95 51 174 -69 -190 93 169 67 104 248 45 -2 -3 160 49 -275 7 -56 128 -57
3356e7O7K12l90j77N14l66l9K09j15K99o7q8k0k5K32k41J00r9n2K76l5rq6j31
$$ -57 10 222 -168 -345 169 -197 -236 -27 -142 157 90 2 -18 -43 189 -52 48 -51 -103 173 138 129 43 -88
3380h8K89M3j90j16J37M30j34k82k41L53j25j15P9K3R1k91J41J8k13K38J14M3
$$ -88 201 244 54 -62 75 505 371 89 -152 201 76 -39 40 63 154 -137 4 22 -191 47 161 204
3402B04j82j18Q4K45p2j37r5J81k28j07L02J1k82J77M2J08k39k23M98l63K19q2
$$ 204 22 -96 -12 233 161 24 -71 110 -118 -225 77 88 -194 -17 25 133 -106 -329 169 -194 25 -57
3424e7N0m8J32l1l07K97n9Q9L7k06k47L34k36L35k70J35K81j2j43k97O2L51k21
$$ -57 -7 -55 77 46 -261 36 -23 66 103 -103 -350 -16 -252 83 -187 -52 229 217 74 -223 -161 190 -31
3447c1K01j63K26o9m56J70J14J70l25k7R1j03L24m80N27r4n4j9j48J74j8N5J85
$$ -31 170 7 233 164 -292 -122 -8 162 -163 -190 -99 -202 122 -358 169 75 21 2 -146 28 10 65 250
3470B50j53m0j03r7K51o1J86P4k89J59k13J00m1M3N1j21J8K12k58k0j17N15l09
$$ 250 97 57 -46 -143 108 47 233 307 18 177 -36 64 23 66 117 -4 14 226 -32 -52 -169 346 37
3493C7k0J63l11J47n8j1K29n1l03J69j71K07j99K96q7j49J7Q2RJ67j10o4j35L12
$$ 37 17 180 -131 16 -42 -53 176 125 -178 -9 -180 27 -172 124 37 -112 -95 -13 -4 163 53 -11 -146 166
3517A66j02L6o4l48K41o0j8J50j20J89J57m15J94j78K45J03k70np2O8K11j78Q1
$$ 166 64 100 36 -312 -71 -131 -149 1 -119 70 227 -188 6 -172 73 176 -94 -99 -171 -103 108 -70 11
3540A1r0J65r9p3J91l09mJ14j3J16J20M0j98p1J47j59p8kK98k52J14M7r2K70m94
$$ 11 -79 86 -13 -86 105 -204 -208 -94 -107 9 129 169 -29 -100 47 -112 -190 -192 106 -146 -32 15 -77 193 -301
3565c01P3M28k08m4K89k39pj40L20l31O3J0J14j68K63p8r1J36j12P8q9Q8J30j86
$$ -301 -228 200 -8 -52 237 -2 -9 -149 171 -160 -97 -87 27 -141 122 44 -47 89 -23 55 -34 54 184 -2
3589bj91M32j69j72J02j53P0J0J21j64J39o0J50j27K2j36J44K37m23J48L0k78
$$ -2 -193 239 70 -102 0 -153 -83 -73 48 -116 23 -37 113 -14 8 -128 16 253 -170 -22 8 -270
3611b70M88j07j04k68R4K37J23j10l2o9J82j5k45J74j60k32K87J06l83K57L1r5
$$ -270 218 111 7 -261 -167 70 193 83 51 -18 164 149 -96 78 -82 -314 -27 79 -304 -47 -16 -111
3633a11J45j05J26j64j69K68J34j9r2p2J24J40k58J68k44L38kp2j19O7k38M9K37
$$ -111 34 -71 55 -109 -278 -10 124 105 13 -59 65 205 -53 115 -129 209 207 135 16 83 -155 -106 131
3656A31r4j30M38k91o4J42k43J71J80j70j5qk3k0J02j00j51L70k73qK25o7l50
$$ 131 37 -93 345 54 -10 132 -111 60 240 70 55 47 24 4 106 6 -145 225 -48 -56 169 102 -248
3679b48K39p9oL1J04k65K95k27P9O1p6j3O5P8K54l59o0K17r6N1k4n1M1p2K80j61
$$ -248 -9 -88 -94 -63 41 -224 71 -156 -77 -16 -92 -105 -40 38 292 -67 -127 90 -6 45 21 -30 11 -61 219 58
3705E8O2J51j31j66j9j82L51k95J66j07J69J3r6J41J26l29K53l45L01j13J28M9
$$ 58 120 271 140 -26 -45 -227 124 -171 -5 -112 57 70 -26 115 241 -88 165 -180 121 8 136 185
3727A85j30N6j49R7l7l7K66l01j12L64n61K36M7K83j47k24K60k39J28L20m99L13
$$ 185 55 111 -38 59 22 -15 251 -50 -162 202 -359 -123 -76 207 60 -164 96 -143 -15 305 -194 119
3749A19k25J3K51j35j03J34O0j54j10L08j00Lk06p7J85j32K94m5k09K99k13J16
$$ 119 -106 -93 158 23 -80 54 114 -40 -150 158 58 61 -145 -222 -37 -169 125 80 -129 170 -43 73
3771G3J49m61J58j55J34L45k21l6k8p1J31n2J5O1p6k09N8J44J86P6j27k34J63
$$ 73 222 -239 -81 -236 -102 243 22 -14 -42 -113 18 -34 -19 42 -34 -243 -185 -41 145 221 94 -140 23
3794B3L0j20N1j9r9J50k34M13k85Q2QR6Q6k13pL6J08j70Q8j32J13j37o7L39k55
$$ 23 53 -67 -16 -35 -134 16 -218 195 -90 -8 0 96 182 -31 -38 -2 106 -64 24 -108 5 -132 -199 140 -115
3819a15J3O2k98R8J20J9n2K45k80K52Q1j80Ml5J49k12K82m24K76j53J06j5k23
$$ -115 -102 -40 -338 -240 -120 -101 -153 92 -188 64 145 -35 -31 -66 83 -129 153 -271 5 -148 -42 -57 -280
3842b80L77o7O4N5L2Pj85j47J27J82q2J03l1k15N6r4K26j67K82M4n21K13o6j0
$$ -280 97 30 94 149 181 188 3 -144 -17 165 83 186 155 -60 -4 -98 128 -39 243 287 -234 -21 -87 -97
3866i7M8j4L1j3l9J24K50l33J66j14J86j39J67j94K3m9j37K08p6J07j53m6r0J69
$$ -97 -49 -63 -32 -45 -84 40 290 -43 123 9 195 56 223 29 52 3 -134 74 -2 105 -48 -94 -184 -15
3890a5P5R0m88K41k17L68K4j99L46k04k18L14n1q8P6j16k57M12J5K02j63l82K74
$$ -15 60 150 -338 -97 -314 54 78 -121 225 21 -197 117 66 -22 54 -62 -319 93 108 310 147 -235 39
3913C9j35p2n0M4L32k04J72L0k61K96k04m3K75l00j33J28PJ59j7m7R4q2j32J33
$$ 39 -96 -168 -218 -174 158 -46 126 156 -105 191 -13 -56 219 -81 -214 -86 -79 80 63 16 110 28 -104 29
3937B9k55L12o3k2rm1j95J13J39o8j22L4J77K5l28L36j01l9Q0j02J83j66J17m5
$$ 29 -226 86 23 1 -8 -49 -244 -131 8 -60 -182 -148 29 54 -274 62 -39 -78 2 -100 83 -83 34 -11
3961a1j32J13L1q9L0Ok1j62K72j31M6J86j61j76M07j37j67o4N1J96j94LJ71p5
$$ -11 -143 -30 1 -88 -58 -52 -73 -235 37 -94 -48 138 -23 -199 208 71 -96 -160 -109 87 -107 -104 67 -8
3985hm0J52j24k66K87j58R9K48j50j23K33J5k54J99N3q7j75K18n1k65K91j40J28
$$ -8 -48 104 -20 -286 1 -157 -58 190 40 -83 150 165 -89 110 163 76 -99 119 68 -197 94 -46 82
4008H2K6o2J38n2k3j01RK27k87K5P5k75N46l17l5Pj3J43r4j37J57p1P3k3J7l18
$$ 82 108 46 184 132 109 8 17 244 -43 -18 57 -218 328 11 -24 -17 -30 113 19 -118 39 -32 41 18 35 -283
4034b83M44o8j13O0J25j02j78O6mJ05r7n8J36K5j25j6J54j79p2N3J52r7J99P9
$$ -283 161 93 -20 40 165 63 -115 -49 -53 52 -45 -103 33 58 -67 -83 71 -108 -180 -127 25 -72 127 206
4058B06l05J34k77Q5J49n6l3K49j23m2j59J3K89l19O7O1j16K28j72R7j12J20R
$$ 206 -99 35 -242 -157 -8 -64 -97 152 29 -13 -172 -159 130 -189 -122 -61 -177 51 -121 -24 -136 -16 -7
4081gJ24j00r5K62j27p9J28q7l5O9nJ54k48o4J61j53L1j61Q7K09j68n2O4N6l9
$$ -7 117 17 -78 184 57 -22 106 19 -16 53 48 202 -46 -110 51 -102 -71 -232 -145 64 -104 -156 -92 -36 -75
4106g5K27k88m7K37j61m9j23L7K71j21J57j68O0O8j0j62L65j76p5j18L9K27k14
$$ -75 152 -136 -183 54 -107 -156 -279 -242 29 -92 65 -103 -43 25 15 -147 218 42 -33 -151 -112 115 -99
4129i9K85l32L85l50L40k33J50l8k18K62K0l16K05j39n9M0k4K0K27j66R3k27o4
$$ -99 186 -146 239 -111 229 -4 146 108 -110 152 172 -144 61 -78 -137 -97 -121 -101 126 -40 53 -174 -238
4152b38J96N9j40q0K83K2k65pJ68J08j83R3o5K4N1M78n51M9m8MJ09R3k97K74k69
$$ -238 -42 17 -123 -203 80 102 -163 -170 -2 106 -77 16 -49 -25 26 504 -47 2 -46 -42 67 160 -137 137 -132
4177a32K04j68J28Q0j7r6J03Q4k54L9L29k17m3P3rl6j04K60k46k73K73o9J25R7
$$ -132 72 -96 32 112 95 -1 102 186 -68 -29 300 83 40 113 104 68 -36 224 -22 -295 -22 -91 34 131
4201A31j38J96k32L6Q8k5nr4J4l1m5n3K1R0Q5j5j89J95j18O1K16j36j54JM50m32
$$ 131 -7 189 -43 -7 81 56 51 -43 -29 -60 -105 -158 -137 -47 38 23 -166 29 -89 -28 188 52 -102 -101 349 -83
4227h3J74J09k19j3j37q9M46l67J50j01j50L54M3k41K12N8Q7k31k44K23m5m0J65
$$ -83 91 200 -19 -32 -169 -258 188 -179 -29 -130 -280 74 117 -124 88 146 233 2 -242 -19 -64 -104 61
4250F1k73K26o8l3Q5j03K70p0qj87K52Q3j47l5Mk30K22l58L23J91m9j36k6J81
$$ 61 -212 14 -54 -87 -2 -105 165 95 87 -100 152 235 88 53 57 -173 49 -309 14 205 156 20 -6 175
4274A75k99oK93j86p6J43q0J84k96k2J96j50K92k52J47J37p6j74K34n23N19k06
$$ 175 -124 -130 163 -23 -99 44 -36 148 -148 -170 26 -124 168 -84 63 200 124 -50 184 -339 180 -26
4296b6Q9j92J65j11j3K01j49J52l5L8l9j52%L35n62L14j56J01J23P4K00m82J3
$$ -26 63 -129 36 -75 -88 113 -36 116 81 119 80 -72 -72 263 -299 15 -141 -40 83 157 357 -125 -112
4319a12M4pJ84j54o5M06l66l2K84qj58L7Qk28N5L23j43m5L10k76k23p6J35l70
$$ -112 -68 -75 109 -45 -110 296 -70 -102 182 174 16 53 61 -167 -112 211 68 23 333 57 -166 -242 -107 -477
4343d77L93po4M8O6M0K06j81J90r6k13L09j98M%Rj9J26k63K8o0K69l3n2j59K63
$$ -477 -84 -91 -155 -107 -41 -1 205 24 214 118 -95 214 16 20 20 29 10 136 -127 -99 -159 110 77 25 -134 129
4369A29k00O9J33k39J92p3J42r4j48J90o6J69q7j74K39M5j85K2m7j36Q0k40L11
$$ 129 -71 -2 131 -108 84 11 153 59 -89 101 35 204 117 -57 182 227 42 64 17 -119 -39 -279 32
4392C2j78M7J11p7J25k10J70o4oo0M8K82l31J01O1O8r3k75J72k21L64j9j59J46
$$ 32 -146 -99 12 -65 60 -150 20 -44 -50 -110 -62 220 -111 -10 51 119 26 -249 -77 -298 66 47 -112 34
4416C4Km7j15j27K72n0j29M3J14l5J32j48r6J61l3K7J56p8K93k73j48N5Lk27K87
$$ 34 36 -11 -126 -253 19 -31 -160 -117 -3 -38 94 -54 -150 11 -22 5 161 83 376 103 -45 10 13 -214 73
4441G3m3j14K03N2n5J02k83M6J88l61J44k0j5J3K45k42k3J49j83K71j12r5k6L16
$$ 73 30 -84 119 171 116 218 -65 -19 169 -192 -48 -68 -83 -70 175 -67 -90 59 -124 147 35 -60 -86 230
4465B30j92j69J48j41o1R5O6n9l6m4L11k05K49k02L9J83Qk46L30m18O3K34Q6m57
$$ 230 38 -131 17 -124 -185 -90 -24 -83 -119 -163 148 -57 192 -10 29 212 220 -26 304 -114 -51 183 269 -188
4489a88J39j38K78k83L31j59J54j49Q8L3m9j87J87o8M2J70j40k0l57L93j35N4
$$ -188 -49 -187 91 -192 139 -20 134 -15 73 106 57 -130 57 -11 31 201 61 41 -316 77 -58 -4
4511dM8k08M20k62oj9j8J41l4P9j45j11J65j39n5o6J84R3n25M96J24q9J94k85
$$ -4 44 -164 256 -6 -12 -31 -49 92 58 137 -8 -119 46 -93 -148 -214 -30 63 -462 34 158 69 263 -22
4535b2J95m31K00J84j35J35o5k1n7J83j25Q9r2q6K5j46M23r8j12j79K02J1n5K2
$$ -22 173 -258 -58 126 -9 126 61 40 -17 166 41 130 38 -48 -23 -169 254 156 44 -135 67 78 23 45
4559D5J28p6p6Q1j13r7k4K42m19N08l52K46J97j72k18%J27Q6j78J29j81J2K92
$$ 45 173 97 21 102 -11 -108 -132 110 -309 199 -153 93 290 118 -100 -100 27 113 -65 64 -117 -105 187
4582A87j28K5o5J06ll3m15K20o1J36j91K58N8k4p2j58n4L90j93N2j27L1R0l1J
$$ 187 59 84 19 125 122 89 -326 -106 -167 -31 -222 36 94 70 -2 -160 -214 176 -17 35 -92 -61 29 -2 -1
4607aK08j51k17K18R2j47j62R3j7k7J51j23K7J05o7J39k17m9R3r9P7q9P3J11m
$$ -1 207 56 -161 57 149 2 -160 -67 -84 -111 40 -83 -56 49 -18 121 -96 -145 -52 -151 -74 -163 -90 21 17
4632A7J85j14j20L40k86J73j53n2m1j56L25P5j47j19J3J63j7j04J32p3j8kK48
$$ 17 202 88 -32 308 22 195 42 -10 -51 -207 118 193 46 -73 -60 103 86 -18 114 41 23 21 269
4655B69j9l73K61l07J10L8N0J47m30K31L00j77l5j73j5OJ06K47k7j45o0LL17m32
$$ 269 250 -123 138 -169 -59 -21 29 176 -254 -23 277 100 65 -108 -123 -117 -11 236 209 64 4 7 324 -108
4679a08OR5K03j67m0J72Nk24O2L10k21j27k22M14l52K63j10J16m3k2J08q2M0k41
$$ -108 -102 -7 196 29 -11 161 166 -58 4 314 93 -34 -256 158 -194 69 -41 75 32 10 118 36 76 -165
4703a65L48j81K55j93J43k21J64j20k29J85J69m32L61j13q0L8j23L38j58P8j53
$$ -165 183 2 257 64 207 -14 150 30 -199 -14 155 -277 84 -29 -109 -71 -194 144 -14 64 -89
4724h9k3k7k4J87r4J77n6j19K63q2j12K8j0j71K45J6n8M9n7k59J69O9j35N4m6
$$ -89 -112 -139 -163 24 -70 107 51 -68 195 113 1 29 19 -152 93 109 51 100 43 -216 -47 22 -113 -59 -105
4749a05K01K1L4j41j64L66j41k07J17Q0Kj8Rj23LMj34K48r4K5J31l50L22j09O5
$$ -105 96 117 151 10 -154 212 71 -136 -19 61 63 45 54 -69 -66 -62 -196 52 -42 -17 114 -236 86 -23 42
4774D2L46j70k85j15Q1o7J96M1j55J23O5o6J35m05J99J29k14J52N6r0J17j44j49
$$ 42 388 218 -67 -182 -101 -168 28 69 -86 37 102 36 171 -234 -35 94 -120 32 88 -2 115 -29 -178
4797a78K72j03K8J98l80K52j32J76k79K08j31j10L39M3j08J5o6J24j54k8N3nJ38
$$ -178 94 -9 19 217 -163 89 -43 133 -146 62 -69 -179 160 203 95 110 44 168 14 -14 39 34 172
4820A72j76P0k7k50J00K93j68J75l27%K42r9K44j32Q2k27j06M7J7Q4q5j09K86
$$ 172 -4 66 39 -211 -111 182 14 189 -138 -138 104 5 249 117 199 -28 -134 -87 -70 14 -71 -180 106
4843A06p6o5J7o2q5Q1J80J34q7j00k11K25j12LNr5J09J32K8m04RN18l35R0J47
$$ 106 30 -35 -18 -80 -165 -84 96 230 143 43 -168 57 -55 -52 -47 -142 -33 99 127 -277 -268 250 -85 5 152
4868A52j13l8M4M6j66R2j03K50k81L13j88j84J90K8N1l5P1k53J14n0k46M99r3
$$ 152 39 1 45 91 -75 17 -86 164 -117 196 8 -176 14 42 93 58 129 -124 -10 -60 -306 193 100
4891A00J03k84M0P3j66J61l8R7J89l23J85o0rk01J26P2n9Q9j20rK3J7k58K19j44
$$ 100 203 -81 -41 32 -134 27 -11 86 275 -48 137 77 68 -133 -7 65 6 95 -25 -34 -11 6 -252 -33 -177
4916a77K70l2J52k9k42Q2M8j40K96m45K91n3j77L22l06K55L6l12K52q9j26n0L6
$$ -177 93 61 213 184 -58 24 72 -68 228 -217 74 21 -156 166 -140 115 151 -161 91 2 -124 -174 -138
4939a38J23M5L9k89R0K26L1r1m4M9k00L04j08j08R4N9j40K15J42l98K28k22n3
$$ -138 -15 30 69 -220 -130 96 127 36 -8 41 -159 145 37 -71 23 82 -58 157 299 -99 129 -93 -146
4962a46O4J92j51j08J50J59k76q4L36k1k82J92o9j6p1j4J79M2L8J45l07NM8k4
$$ -146 -82 110 -41 -149 1 160 -116 -200 136 115 -167 25 -44 -60 -131 -145 34 76 114 259 -48 -43 5 -19
4986a9L2q6J88r2j33Q0r7N9j56L73J47j45j37j75J91m9l1Q4j19l8K45l31J99K3
$$ -19 13 -73 115 23 -110 -30 -127 -68 -224 149 296 151 14 -161 30 -19 -50 34 -85 -123 122 -209 -10 13
5010A3p5j04J94q8jJ43k5J08k14n7Q7O2J10m2j72j63M80l67L39m33L64q1o2J79
$$ 13 -62 -166 28 -60 -61 82 57 165 -49 -106 -19 43 153 111 -61 -224 256 -111 228 -205 159 78 16 195
5034A95k99L03j12k56J70L2m2N3L1m6p9k85L79j02K21n5k08L29N9j91J7l28J73
$$ 195 -104 199 87 -169 1 33 -9 44 75 29 -50 -335 44 -58 163 108 -100 229 288 97 114 -214 -41
5057d1J37j38JJ26J06r0k6n0J59m59K80j81L07k07K27n5o6j4J98m6k63J89n6k5
$$ -41 96 -42 -41 85 191 101 75 25 184 -275 5 -176 131 -76 151 96 30 16 214 168 -95 94 38 13
5081A3J2q8J84K0j12p1P1K42l99L58k76m8L8J68l50K26L1L27n32J50J6J00J39
$$ 13 25 -63 121 141 29 -42 29 271 -128 230 -46 -94 -56 112 -238 -12 19 346 -186 -36 -20 80 219
5104B19p4j03j41j16J37jP8j43J15j7R5q8K0J55j30m7L5l32L31j57O9k16K58L6
$$ 219 145 42 -99 -215 -78 -79 -1 -144 -29 -46 49 -39 -19 136 6 -41 -6 -338 -7 -164 -95 -311 -53 -17
5128a7p3J25Kk73J75J00p2o5j41K47J27m35M42k32K8K06k25N30l61j21jJ8J45
$$ -17 -90 35 37 -236 -61 39 -33 -98 -239 8 135 -300 142 -90 -62 144 -81 449 88 -33 -34 -16 129
5151A29K4k16k4J54n9L6p2M7j03J44o9o6J46K98l52p9R5l9K8RJ72k40j73L90o1
$$ 129 153 -63 -87 67 8 44 -28 19 -84 60 -9 -75 71 369 17 -62 33 -6 22 31 203 -37 -210 180 119
5176A19k36K10J1j66J62n7p1K43k83j03J42j15J35j06P4M3j21r4O2J90j25l7J13
$$ 119 -117 93 104 -62 100 43 -28 215 -68 -171 -29 -144 -9 -115 -41 2 -119 -213 -151 39 -86 -123 -10
5199a0lr6p4K3J35m9J84k77J14k5K1K27j43J18k48l9K34ln7K96k46k70L64k56
$$ -10 -13 -109 -183 -160 -25 -74 110 -167 -53 -78 -57 170 27 145 -103 -142 92 89 32 328 82 -188 176 -80
5223h0j01M3R1L8K44k69k62L15J5J19m7j07n6J83r3j08J28m0R7O9m40K49K13j9
$$ -80 -181 -138 -47 -9 235 -34 -296 19 34 153 106 -1 -57 126 33 -75 53 13 110 179 -261 -12 201 182
5247A82k60Q8p6rj15J91J4j74K61j24Mj40L9J94j11N0m3jK9k32J45m6J99J47l43
$$ 182 -78 10 -66 -75 -190 1 15 -159 102 -22 -18 -158 -119 75 -36 14 -29 -30 -1 -233 -88 -134 65 212 -131
5272a31K57l57K89P6Rk20J28m60L94j47M21l88NJ10kM12o10J89l0q3L51k79Nk84
$$ -131 126 -231 58 134 143 -77 51 -409 -15 -162 259 -129 -124 -14 -16 396 -214 -25 -55 -138 213 -66 -61 -345
5296c45M01N3M1j82J12N5j31N8n9Q6n8J01j98r5J0j06K10J80j76j80O7J65m9r4
$$ -345 56 109 150 -32 80 135 4 62 3 89 31 132 -66 -161 -151 -257 -47 133 -43 -223 -156 9 -40 -134
5320a34K9J78j52n2P3P4j92M10K9k99O5K44j73k80L53L6k06qJ74l0l57J75k1o9
$$ -134 -105 73 -79 -131 -58 16 -176 234 263 -36 29 273 100 -180 173 209 3 -5 169 139 -218 -43 -64 -133
5344a33J38j6j1J05j73O1PN7r8J50n8n4J30J0k35J50J05j98K02k81NK26j48J07
$$ -133 5 -11 -22 83 -90 -29 -22 35 -63 87 29 -25 105 115 -120 30 135 -63 139 -142 -137 89 -59 48
5368D8q5k30L09K03l22M05k87l32M32n1l5J19m03K48k18K40M0k08M25m38K41M
$$ 48 -37 -267 42 245 -77 328 41 -291 141 90 55 174 -229 19 -199 41 81 -127 298 -140 101 105
5390A05j70J31m8J35l55L80l4j79J20J45l08K05k54j22J91J40j88j8P7J09K9r9
$$ 105 -65 66 18 153 -202 178 144 -35 85 230 -78 127 -127 -249 -58 82 -106 -124 -47 62 91 -8
5412hj50k3Q2J07j42P4L7l2K72k96J24J61j46r5M8j37M07k19j82L73l5l58K12
$$ -8 -158 -181 -99 8 -134 -60 -23 -55 217 -79 45 206 60 -35 13 -124 283 64 -118 255 220 -138 74
5435G4n2J17nk64J31k6j25L29l30MJ90j3J92m32M75k93l3M3j66J17P7J99j62n9
$$ 74 22 139 134 -130 1 -25 -150 179 -151 -147 43 30 222 -210 265 -28 -61 -18 -184 -67 10 209 47 -12
5459a2O2l1j52L5M98m48J42j60K6j97K64K05j07o7j40J49j41L7m3J07N9k41O9
$$ -12 50 19 -133 -98 400 -48 94 -66 -40 -237 27 232 125 58 -82 67 -74 -37 -80 27 86 -155 -86
5482h6O9K71j07l00K32j82J72j54K10j80k1k38L97j44n5J2J66K9j71m1J34N1n0
$$ -86 -17 254 147 -153 79 -103 69 -85 125 -55 -76 -314 83 -61 -116 -104 62 91 -80 -121 13 64 14
5505A4J8l9J84j57m1j63M0J14j2M0q3L53j06l84K71p4j32J76R5j3J1o9j07L1l23
$$ 14 32 -7 177 20 -21 -184 -144 -30 -42 -2 -85 268 162 -222 49 -25 -157 19 114 101 112 43 -64 -33 -356
5530c56M89j31J08k5j14r2K21l19K78j56m6K2Q4j78K50r7K23l36K63l43Q4P2J1
$$ -356 133 2 110 85 -29 -121 100 -219 59 -97 -143 -121 -37 -215 35 -62 161 -175 88 -255 -171 -99 -88
5553h8m0N7QL6j17O0MN5N8kj95K23j98J7J71O2j22J08Km0J67p2k18j46K53j23
$$ -88 -128 -71 -63 -27 -144 -84 -80 -25 33 31 -164 59 -139 -122 49 111 -11 97 99 59 226 154 -64 -210 43 -80
5579h0K39k66J05P6k75J23k27L83q2k9ol6J97j56J63k48J20k81J81m0L9J35k82
$$ -80 159 -107 -2 74 -201 -78 -305 78 -4 -33 -39 -75 122 -34 129 -119 1 -280 -99 -139 -100 35 -247
5602b47M27l04M58j96k99J19L2L20k52j75J57K45j04k21N8J11j69Q6j29K63j17
$$ -247 180 -124 334 138 -161 -42 -10 310 58 -117 40 285 181 -40 18 129 -40 46 -83 180 63
5623F3j04M8j31K31r8k8J21j02j75K35J37k77K16j61K40k34J57j80J11k6j97K16
$$ 63 -41 7 -124 107 9 -19 102 0 -175 60 197 -80 136 -25 215 -19 138 -42 69 43 -154 62
5645F2l00L16m6KJ51L3j61j2l7ok45J69K11J30k90J99k03P9j91N25n74J96J05
$$ 62 -238 78 32 34 185 218 57 45 8 2 -243 -74 137 267 -23 176 -27 52 -139 386 -188 8 113
5668A13k70M3K44j08j64l4P8K71j27J0J03L7L4k25R9Kj37J92m7p9N3j68K9J35
$$ 113 -157 -114 130 22 -142 -176 -98 173 46 56 159 196 230 5 104 106 -31 161 114 35 88 -80 -51 84
5692H4j06N6j63Q7k02P4J00J88k76o9J43J46o5j19L03k04Q1j06j31J70J77k7j76
$$ 84 -22 34 -129 -42 -244 -170 -70 118 -158 -227 -84 62 -3 -122 181 -23 58 -48 -179 -9 168 141 -35
5715c5J45k56P1O1j8pJ42q8M1j61J48N4j45J02j23j72P2J54J03j69R6Q3r1k7j23
$$ -35 110 -146 -75 -14 -32 -39 103 15 56 -105 43 97 -48 54 -69 -241 -169 -15 88 -81 15 98 7 -20 -143
5740a43p2R3P1J27k25K00o1P9k3O0k87K61j57J09J20L6m2n16J65m4L40j50N6j24
$$ -143 -215 -122 -51 76 -149 51 -10 69 46 106 -181 80 -77 32 152 188 146 -370 -205 -249 91 -59 -3 -127
5764a27J20R3J61o8k27j78L39Q7j70R4J6J23k50N6J9k05O5K58J03n55J66L10q5
$$ -127 -7 86 247 179 -48 -226 113 200 30 124 140 263 13 69 88 -117 -52 206 309 -246 -80 230 145
5787A45r2m7n7J87k10R6K39k42J11j00q4J26J49m67L75j4j52m5K10jj86n7P5n
$$ 145 53 6 -51 136 -74 22 261 19 130 30 -54 72 221 -246 129 115 -37 -82 128 127 -59 -116 -41 -46
5811d6m2J50j31R2n3k74M18o1k19J56N1Q0P3l40M0L20j86j95O8K95l78o3M96j39
$$ -46 -88 62 -69 23 -30 -304 114 53 -166 -10 41 121 194 -146 -106 214 28 -167 -99 196 -182 -245 251 112
5835A12r2j11m8P7r6K83k82J65k3l0j10N5K3Q7P1M5o1l6K71m00J87MJ94J9l36
$$ 112 20 -91 -139 -62 -158 125 -157 8 -15 -45 -155 -100 -77 10 81 126 65 29 300 -100 87 91 285 304 -32
5860c2lr1KL32j60p3j0J06m9p3J53k55L18jl3m3Ql7M4j07j30J25J15k33K82j91
$$ -32 -35 -126 -124 208 48 -25 -35 71 22 -51 102 -153 165 164 131 88 96 59 103 -4 -134 -9 106 -127 155 -36
5886c6J88k39J06J87l57K53P9j89Q1N2k67L19Q0k02j53J81k3O3k8R4j39l08L46
$$ -36 152 -87 19 206 -151 102 181 -8 73 125 -142 177 257 55 -98 83 60 123 95 189 50 -258 88
5909H8m3lj05j5J93j25j4RJ74j54P1j70L45j93k99l7K67J53j96J94K09k93l09
$$ 88 45 42 -63 -78 115 -10 -24 -15 159 5 76 -94 251 58 -241 -278 -11 142 -54 140 349 56 -253
5932b53K03R9k16L03j79K13j73J12j57j40J66N3N1k26J49L0J06j87n8R0m3J22
$$ -253 -50 49 -167 136 -43 170 -3 109 -48 -188 -22 31 82 -144 5 35 141 -46 -104 -14 -57 65
5954F5o6K47j82r8p9J30K29n11L27l41N32q4l71L55j99j01J63j49N2P6P9R9k2
$$ 65 -1 246 64 -34 -113 17 246 -265 62 -279 253 169 -202 153 -46 -147 16 -133 -81 -5 74 173 151
5977A51j28J81j34k8o6J84r6j39K09j91K18k85M5o1j44L20k52J84k2q8J98J30
$$ 151 23 204 70 42 -24 160 64 -75 134 -57 161 -124 -79 -140 -284 36 -216 -32 -54 -142 56 186
5999A86l45L00j74K3q5R7q4R9p2R9L5l9j13K0J03k04J22J26J2k48N5J67Qk12K38
$$ 186 -159 141 -33 -10 -95 2 -82 17 -55 44 79 40 -73 -53 50 -154 -32 94 106 -142 -87 80 88 -124 114
6024A14n1j41p8K66j11L3Lpp0J72k79J25k20K76P6P9n4l14J20J58j94q1L75k08
$$ 114 63 -78 -156 110 -1 32 35 28 -42 130 -149 -24 -244 32 108 187 133 -181 -61 97 -97 -178 197 -11
6048a1J80p9k15R9R8k44K29J8mo9L1M6N2j36p0J53M0L9k08K29j11j01J34j23k75
$$ -11 169 90 -125 -26 72 -172 57 75 71 2 33 79 131 -5 -75 78 118 157 -51 178 67 -34 100 -23 -298
6073b98L91j93K49k44LK7n2M18l17J45l41O7K20j34N6J18k18J25M7j8j40Q2k22
$$ -298 93 -100 149 -95 -92 -65 -117 301 -16 129 -212 -145 75 -59 -3 115 -103 22 69 51 -89 -7 -229
6096b29J52j28J70qJ98k9Mk03J98j03R2j39j9K2j08K55j19J55k3o3J37j19n9k98
$$ -229 -77 -205 -35 -43 155 126 130 -73 125 22 114 -25 -44 -22 -130 125 6 161 138 75 212 93 34 -264
6120b64J49J17N9o1p7rN9J44j20r3K85r3k11K73j90j74K49j60O8J3j68M48k60
$$ -264 -115 2 61 0 -77 -86 -27 117 -3 -96 189 96 -115 158 -32 -206 43 -117 -49 -36 -204 244 -16
6143a6M4j31j72OM16k04Q7j19L4R0p4r5qk1J21q9N7j06J49O2r4r6J96o6L10n21
$$ -16 28 -103 -275 -269 147 -57 30 -89 -55 35 -39 -134 -142 -163 -42 -131 -74 -180 -31 31 -63 -159 37 -29 281 -240
6169b40J84lQ3Jo6l8K1J71QK5r6L0N9k32Q6P9l6L54l38o3J49k17l8K2K2J96j62
$$ -240 -56 -59 24 25 -41 -79 -58 113 121 146 50 80 139 -93 -7 72 36 390 52 -11 138 -79 -117 -95 -73 123 -39
6196c9q0l0L41m27J76P1n3K9j44K68q2r0K80J1k40J38K9M5q7r8q4R9j27Qj00L90
$$ -39 -119 -149 192 -235 -59 12 -41 -12 -156 112 30 -60 220 231 -9 129 158 203 116 18 -66 33 -94 -86 -186 204
6222B04k09l6l3K09J5q1j29J15j90J70j27l3J57R0k26jK80j60j20J40Kk34J72
$$ 204 -5 -41 -74 135 150 69 -60 55 -135 35 -92 -125 32 122 -104 -105 175 15 -105 35 37 -197 -25
6245b5P1k25K72j17q6M3n2J94j65q3m0K86k0K28k89j40O2J24j24K46r4J89l03
$$ -25 46 -179 93 -24 -110 -67 -119 75 -90 -173 -213 73 53 281 -8 -148 -86 38 -86 160 66 255 -48
6268d8O4j25L0J18Q1j06M3o0J59O9k62M4j18L53j42l4j40Q5K7n8j43K96J37j04
$$ -48 16 -109 -79 39 120 14 57 -3 156 225 -37 7 -111 242 100 66 -74 11 38 -20 -163 133 270 166
6292A66j21n0M8j55J52J10L3j97o7P9P0Q2K7k44R3j58K10r0Q8j8M7k89L23L2j45
$$ 166 45 -5 43 -112 40 150 183 -14 -81 -2 68 150 177 -67 26 -132 78 -12 76 58 105 -184 139 171 26
6317B6L8j78L50k89J19k02l3K40j93J8Q2k2M94o16L73k82NL27o2l23M2Rj64L16
$$ 26 64 -114 236 -53 66 -136 -169 71 -122 -104 -22 -44 450 -166 207 -75 -70 257 195 -128 -86 -77 -241 75
6341G5k07L8L02m6K7k88J09K14l33p5L99j45N2L9j01l4k6O3n0K57l04J10k41K27
$$ 75 -132 -94 208 162 189 -99 10 224 -109 -184 215 70 122 161 60 26 0 63 13 270 -34 76 -165 62
6365F2j95O6J37K4k45J26j7J72j94m07M67j08J14j08O6K30j81K0m9k8J88k31J7
$$ 62 -133 -67 70 94 -151 -25 -42 130 -64 -471 -4 -112 2 -106 -40 190 9 29 -20 -48 140 -91 -74
6388g4J31J19k87J56K9j75l7P0P1k10K11J78k51J05r0M8m4k6p5K83j10j32J84
$$ -74 57 176 -111 45 74 -101 -138 -68 3 -207 4 182 -69 36 -54 -6 -50 -76 -151 132 22 -110 74
6411G4n3r4M3J42Lj51l0K24L3l46l4M99l62M2M4J59k67L21k91m5J50k61J14r3
$$ 74 21 -73 -30 112 115 -36 -66 158 191 -155 -189 310 -52 -10 34 193 -74 247 -44 -89 61 -200 -86 -179
6435a79L05m7K35j96j44j31r9O4J59j71K60k2j77J46M6l7r6K24j60j07J03M9j77
$$ -179 126 79 314 118 -26 -157 -256 -192 -33 -204 56 34 -143 3 49 12 -84 140 -20 -127 -24 25 -152
6458a52K26j53L18l58m2o7M32J2k53R7r8J11j8J60k46K46j96M0r8K33k29j46N1
$$ -152 74 -79 239 -119 -161 -228 204 216 -37 60 -38 73 55 215 -31 215 19 59 -39 194 -35 -181 -130
6481a30J89k02L35K7k16j51J12P8j20K77kl18K67k13j6pK1nK30P7k28k47L25J4
$$ -130 59 -143 192 219 3 -148 -36 42 -78 199 197 -121 146 -67 -83 -90 -69 -74 156 233 5 -242 83 97
6505I7q5R1k56K20J9j43k6j22K02J07j84M8J55j34j3J89k91J92L34l69K7j48L52
$$ 97 12 103 -153 67 86 -57 -83 -205 -3 104 -80 -32 123 -11 -24 165 -126 66 400 31 58 -90 262
6528B62k91Kj95K57J66M5l78PJ82p3j10R4J58k68m3J68j70N9K30k65KM81l83J47
$$ 262 -29 -27 -222 35 201 246 -132 -125 57 -16 -126 -32 126 -142 -185 -17 -187 -128 102 -163 -161 320 -63 84
6552H4l70L98J08L8n73M83q7j89P6J73m38J65J41j66K53k50K19k64J84j90L39
$$ 84 -286 112 220 258 -315 168 81 -108 -32 141 -297 -132 9 -157 96 -154 65 -199 -15 -205 134
6573A34j83j69K21J15j39N1J48j29k9q1p7pK7J80N5j62K2j5m4Kk53M67n3j04L09
$$ 134 -49 -218 3 118 -21 30 178 49 20 -61 -138 -145 -118 62 117 -45 -23 -38 -82 -80 -333 134 81 -23 286
6598B86l62p6K03q4Kk8j8P7M6PJ1l9j4k0J4N0O5j04J89j70j53J71l1P4j52J09
$$ 286 -76 -152 51 -33 -31 -59 -77 0 46 53 64 25 11 -9 5 55 120 16 205 35 -118 53 22 96 -56 53
6624E3k82M12l09J40k62M61k71m8J35j07J11j36O4J65l19R4J46K7qn8Q8J25j00
$$ 53 -229 183 -126 14 -248 213 -58 -106 29 -78 33 -103 -39 126 -193 -99 47 74 66 8 96 221 121
6647A21J7k29r2J45j8J57j3q2J34j52L1k5r9k0O9K45n0j24n4n36N45J05j4J6m6
$$ 121 138 -91 -183 -38 -56 101 88 6 140 -12 19 -6 -105 -125 -56 189 139 15 -39 -575 -30 75 61 77 31
6672C1q8J47j03j30J50p5j62rK86j42K67j27pk56K29J18J26L1l26k45K04k5J78
$$ 31 -57 90 -13 -143 7 -68 -230 -239 47 -95 172 45 38 -218 11 129 255 286 -40 -285 -81 -106 72
6695G2j66N5R4r0q9J12J08j05J45k70l2L11J27k40L65l54n5P0J93k20J67l44J56
$$ 72 -94 -39 55 -35 -124 -12 96 -9 136 -134 -166 145 272 32 397 43 -12 58 251 31 198 -146 10
6718A0R0l17J95J4PM7o2qJ79m4j5k19j4J6J33L3j93J51j58n8J51Q8J77l00L14
$$ 10 100 -217 -22 -8 -1 46 -16 -24 155 111 96 -123 -137 -121 12 45 -148 3 -155 -213 -62 26 203 -97 217
6743B17k22J33k30j1K7j63J62K9J84k22LR3j34n9J49O5k21J20K97k68L24k85J99
$$ 217 -5 128 -102 -113 -86 -249 -87 -58 126 -96 -93 0 -134 -193 -44 21 -200 -80 217 -51 273 -12 187
6766A87j74k7L4K3l9lP6k77J34J57j59J31m0KM6j08k42N1J86j65J92j23K06l8
$$ 187 13 -14 20 43 4 1 77 -200 -66 91 -68 63 23 25 71 -37 -279 -228 -42 -207 -15 -138 68 30
6790C0J6j32k1M64m26J90Q0pk63l8J76k0l30J91R7k08L22k83j0L9q1J77J04k9
$$ 30 46 -86 -107 357 -69 121 201 194 -69 -107 69 49 -281 -90 7 -201 121 -162 -172 -133 -214 -37 67 38
6814C8ko4Q0n8J14k11J48p7J77j68k6j6j24J94r3J99l14J19Q7k04J74M9J49j53
$$ 38 36 -28 52 -6 108 -103 45 -32 145 -23 -49 -65 -189 5 -88 111 -203 -84 3 -201 -27 22 171 18
6838A8K50k93K9K0J37j07J08L7L6j49j20J37k24p7mN89l36J2k54K5J9m4J58r1
$$ 18 268 -25 4 24 161 54 162 199 235 86 -34 103 -121 -198 -202 387 51 63 -191 -166 -147 -191 -33 -124
6862a24j6K87l40L54j93J69k78o8J72R5j37K08k9L9j57O0j11m1K87j47j17j1K29
$$ -124 -140 147 -193 161 -32 137 -141 -209 -37 58 -79 129 100 139 -18 42 -69 -110 177 30 -87 -98 131
6885A31k33j43M07l30K20j06J25m7p7Q8q9Oj59J64N5p7L6O8J66k69p6L67m43O3
$$ 131 -102 -245 162 -168 52 -54 71 24 -53 35 -54 -48 -207 -43 12 -65 -29 39 205 -64 -140 227 -216 -153
6909a53L11k41o5O9J09p3J39j26M7O6p4Q1j06k07K93J67k25k46J7J48R3j64R7
$$ -153 158 -83 -148 -79 30 -43 96 -30 17 83 9 90 -16 -223 70 237 12 -234 -217 -69 24 -140 -43
6932d3J58m17L69j62J16R2k21N2j12J24J2L9J87j10m24L39l29N96n11K79k1Pj31
$$ -43 115 -302 67 -95 21 113 -108 -56 -168 -44 -32 7 194 84 -340 -1 -330 266 -245 34 13 20 -111
6955a11R5q1L65j1k08m7P7l87K82R4K5r3NK21k24m6j60N7L01j78J75o4n8k9K9
$$ -111 -16 -97 268 257 49 2 79 -308 -26 68 93 0 5 226 2 -44 -204 -147 154 -24 151 87 29 0 29
6980B9n3oJ08L7J34j23m9K6M5q7j28j22K34qK0j03Q4KK7j07Q1N9j03q7j04K68
$$ 29 -24 -30 78 115 249 126 77 103 148 61 -67 -189 45 37 57 -46 38 40 67 -40 41 100 -3 -90 -194 74
7006G4k0j94Q1k5N6J19j71K74k15o8m6J39j93N04l20N8J95m47J61J50l43K17j7
$$ 74 54 -140 -59 -84 -28 91 -80 194 -21 -89 -135 4 -189 315 -5 53 248 -199 -38 112 -231 -14 -31
7029c1om1R2j63n4J68j08K43j49L1q5J41P4K03m00J38K61m76M9j35K63m0K92l44
$$ -31 -37 -78 14 -149 -203 -35 -143 100 -49 -18 -103 38 112 315 -85 53 314 -162 -113 -248 15 -25 267 -77
7053g7K54m98K05P3j47K81j26k0OJ90k87J91j8J5o9M0j31K36o8j1j55J80K7j14
$$ -77 177 -321 -116 -43 -190 91 -35 -55 -49 141 -146 45 27 42 -27 13 -118 118 50 39 -116 64 91 -23
7077b3JnJ36o1j19K86j87J50k74O9M4o2L2p5J03L6q7n3m8MJ73q5K33k39l5P8L45
$$ -23 -22 -27 109 48 -71 215 28 178 -96 -27 17 -45 -13 -88 15 51 -36 -89 -137 -133 40 -45 188 -51 -86 -8 337
7104C37l32k08K90j16j36K73j42P2L3P8J01l77J24Ol4J62k06J61P3n7j04O7l0
$$ 337 5 -203 87 -29 -165 108 -34 38 71 149 250 -127 -3 3 -31 131 -75 86 159 102 -2 65 35
7127C5J35m6j0k82J60m4P8j55J43J07m3q3m1r7l1nk9K60j7j05J24M0n6J9j33n4
$$ 35 170 124 114 -168 -8 -52 26 -129 14 121 78 -5 -46 -143 -174 -179 -208 52 35 -70 54 94 38 57 -76 -130
7153a30L37l23j67L21o2K14j08j20q5J00j0J47k43J86j46j9K65k95L42j5k85K42
$$ -130 207 -116 -283 38 -24 190 82 -38 -123 -23 -33 114 -129 57 -89 -108 157 -138 204 189 -96 146
7175A46j90K06l1N6l03O8K00l09M23k53O6j76K16j86P8k62M65Kj46o4Q3j18j23
$$ 146 -44 162 131 187 -116 -48 152 -157 266 13 79 -97 119 -67 11 -251 214 216 70 6 89 -29 -152
7198a52K72l1j99j32J62O8k19N05p5j98M5j03L02k46j00J94j87m0L36k50L25k08
$$ -152 120 89 -110 -242 -80 -12 -231 274 199 1 46 -57 245 -1 -101 93 -94 -134 202 -48 277 69
7220F9K4P2k76O6L7Njk26J37J75j08oj63J25O7q8J72R8j0o5l4K3j83j39L5J86
$$ 69 93 165 -111 -45 -8 -3 -4 -230 -93 82 -26 -32 -195 -70 -3 -91 81 179 169 104 70 93 -90 -229 -194 -8
7246hl2l4L15k24J25j77J2J36m8j48M5j29K86J1j40J94k24JK06k49j74MK68j38
$$ -8 -40 -74 241 17 142 -35 -23 113 65 -83 -38 -167 119 130 -10 184 -40 -39 167 -82 -256 -252 16 -122
7270a22LJ07q3L63m40J57j55L22o8k99L04j19j69M5K18j48m6O2K36r8m0n3j03
$$ -122 -119 -12 -95 268 -172 -15 -170 152 84 -215 89 -30 -199 -154 64 -84 -130 -68 168 70 30 -23 -126
7293a26j84M11l09K1Q2K55m4p9J54j24j23K5L0q9J10m5J09q9j17J38K2K9j13j65
$$ -126 -310 101 -208 -187 -105 150 106 27 181 57 -66 -41 -11 -100 10 -35 74 -15 -132 6 28 57 -56 -221
7317b21K79O6j47J03j40J88p9k02R1O6J89M8j93o9k38L30m22L27J53o6J33l61
$$ -221 58 124 -23 80 -60 128 49 -153 -62 4 193 241 48 -21 -259 71 -351 -24 129 63 196 -165
7339a65J51l5Jk1J71j66J65k09L23l43J64J68k49o7m1J73N0j49J15K0r3o0p6Q3
$$ -165 -14 -49 -48 -69 102 -64 101 -108 215 -128 36 204 -45 -112 -153 20 70 -79 36 56 -37 -97 -173 -90
7363i0O3J64l23P2p3J82J29k21L09k05J40L3k65m0J99k95J61q0Q8J26R1l83J00
$$ -90 -27 137 -186 -114 -187 -5 124 -97 212 7 147 180 -85 -125 74 -221 -60 -140 -52 74 165 -218 -118
7386a18K33k62J09r8M22k34q9j06L16k25K29j10p1j09r7J08R3O9j09j2j18K73
$$ -118 115 -147 -38 -136 286 52 -37 -143 173 -52 177 67 -4 -113 -210 -102 -9 60 -49 -61 -179 94
7408I4k24R2M6m34M50L4J67o3j05J05J19j69j96K50k37q4K86k57Q0k01K72l9q8
$$ 94 -130 -38 8 -426 24 58 225 162 57 162 281 112 -84 166 -71 -155 131 -126 -46 -247 25 -14 -102
7431a02J37O2k53J41p1j40L40k82R8O6Q3j9pK0RL0o3q7Qj29lK85O7QK3k73J67
$$ -102 35 97 -156 -15 -86 -226 114 -168 -70 -4 79 60 53 73 82 112 49 -38 -30 -159 -162 123 190 198 221 -52 115
7458A15K00n27K10q2J21J5m7P9q6M6j00k34J96N4N1J27M8j80j8J23l16K77M2k1
$$ 115 315 -212 -2 -84 37 52 5 84 -2 44 -56 -290 -94 -40 11 138 186 6 -12 111 -205 72 114 93
7482I3Q5l71J25N1M0n8J67j63L80l18k87M4K93j20j8m2j03L32k89L5j6j98M11
$$ 93 178 -193 -68 -17 23 -35 132 -31 349 31 -256 -212 81 -39 -57 -99 -202 130 -159 -124 -140 -338 73
7505G3k63L28j15l2J3J4k28M50l50J62PRr9o9J35k1k70K36m9L46l69O0Nk02J57
$$ 73 -190 138 23 -9 4 18 -210 240 -110 52 59 68 -31 -100 35 14 -256 -20 -69 277 -92 -32 -27 -229 -72
7530g2LJ10k14J59r1J76K0k8n1J37p8L9K6l3k09K39j66pN7k9j45M66l78R6o3o0
$$ -72 -69 41 -173 -14 -105 71 91 63 12 149 71 110 136 103 -106 133 -33 -40 17 -12 -157 309 -69 27 -36 -96
7556i6Q3m3Q6J02j15j16R1J72k59J58m9jj69L16Qj62J24j03J68m18L13j10p3J72
$$ -96 -13 -56 30 132 17 -99 -8 164 -95 63 14 13 -156 160 168 6 130 27 195 -223 90 -20 -93 79
7580G9R6j66M1J09r2j78L82l54Q7J42m5K1j77N7m1M0j16O5k8m5M2Q9J76j87o0
$$ 79 175 9 50 159 67 -111 271 -83 4 146 101 122 -55 2 -39 1 -115 -50 -78 -123 -81 8 184 -3 -63
7605f3K35p8P8k1k65j13K60L0N3k08P5J32l18j6J13JMr6J58RM6j1N1r8j21J85
$$ -63 172 94 172 151 -114 -227 33 63 116 -92 -17 115 -203 -219 -106 -105 -101 -197 -39 -30 16 5 56 -42 -163 22
7631B2J5L8j64J43qj5N1k48M09k06k02J14J9J97j1j41M8k64J29K68p1r5j02J43
$$ 22 37 75 -89 54 46 31 82 -166 243 37 -165 -51 -32 165 154 13 61 -203 -74 194 123 28 -74 69
7655F9K3j87K2OP4l04M54l20K62j77j39N7K66m4p4P2m5j56J84j1J4o0j02K17k00
$$ 69 92 -95 -73 -67 7 -297 157 -163 99 -78 -217 -160 106 62 -12 60 15 -141 43 32 46 -14 -116 101 -99
7680i9j62P9K50k64K13j43K87Kn1p0J21M2k30j05K02j40P1L11m72L08Rj65k8r
$$ -99 -261 -182 68 -196 17 -126 161 163 112 42 163 205 -25 -130 72 -68 3 314 -158 150 159 -6 -34 -43
7704d3j3o7L52l50n8k66N26j08P4m2N1k10L3J21L1N0j02K65l34J00J01P5m46M40
$$ -43 -56 -123 229 -121 -179 -445 81 -27 47 5 56 -154 -121 0 31 81 -21 244 -90 10 111 186 -260 180
7728A80l57K78j48L3J38k20N2Q4J11O3k19p4p1J80m7k3Q0L4j3p4o3J77n2o6J99
$$ 180 -177 101 -47 -14 124 -96 -44 40 151 214 -5 -79 -150 30 -17 -40 40 74 61 -13 -76 101 49 -17 182
7753A82k09k9kl33J86J73m5O1N6O0l2Ll10L66l73J52J75L40l92n7k6J51p6M8j5
$$ 182 -27 -56 -58 -391 -205 -32 -77 -16 40 100 68 71 -239 127 -246 -94 81 421 29 -28 -54 97 21 69 54
7778E4j22M1j02J13J13k00P4Q2J47p5l12m5NJ22K49j95J4K0J42k46J3J19o3K06
$$ 54 -68 -27 -129 -16 97 -103 -29 53 200 125 -187 -232 -227 -105 144 -51 -37 -17 125 -121 -108 11 -52 154
7802A54k87K18j53j5Q8M3p5K5k10M30k24j06J2J07pl1M2j98K48Jk47J26k5M6P
$$ 154 -133 85 -68 -83 5 48 -27 -2 -212 218 -6 -112 -100 7 0 -31 11 -187 61 62 -185 -59 -84 -38 -31
7827c1K6L5Jl0n4K26j75p7o7K3J18K8q9mK04l88M05k54K20q5L2m2K44m32J38R5
$$ -31 -5 30 31 1 -53 173 -2 -79 -146 -123 -5 23 -66 -70 134 -254 151 -103 117 32 64 22 266 -166 -28 67
7853F7k70R8R9J43j17J70l10P2J13J74k96m6J76n8j54Q6rq8M0P8J94o3K7K9j49
$$ 67 -203 -105 -6 137 20 190 -120 -48 65 239 -57 -103 73 15 -139 -53 -62 -150 -110 -32 162 99 126 155 6
7878FNO8J47k77n8L13nk25Q5j80o4J78J56p8J15j17Q2m14M30j57M3q3J04M3q4
$$ 6 11 79 226 -51 -109 204 199 -26 59 -121 -185 -7 149 71 186 69 151 -263 167 10 53 -30 74 117 33
7903C3J8j0r9LJ85k59J38q1l9J65Q1P0l8l54M14j20p6N1l10L73o6j01J8N2K9k34
$$ 33 51 41 -58 -55 130 -129 9 -72 -111 54 135 205 167 -187 227 107 31 82 -228 145 79 -22 -4 48 77 -157
7929a57J34j7rP3q9p7J68o4J0m8P1J18j94N2j8j16p8J65K4R6j16o4L07j73k3J89
$$ -157 -23 -40 -49 24 -65 -142 26 -38 -28 -76 -5 113 -81 -29 -47 -163 -241 -76 -52 44 -72 -136 171 -2 -25 164
7955A64l31J72O4k70K04q8K22K17l15M6n7Q0mj20mO8k67K33j83K74N4k25N7L7
$$ 164 -167 5 69 -201 3 -85 137 354 39 85 28 108 104 -16 -20 48 -219 14 -169 105 159 -66 -9 28
7979B8J1J12p6RJ46j26m8J76l24J53r9m6K24l70K83j47l2K21p1k21J17J80k31
$$ 28 39 151 75 84 230 104 56 232 -92 61 -38 -84 140 -230 53 -94 -126 95 24 -197 -80 100 -131
8002a31R7L4Qq6l0O6J63j12j16Q0j25N6J72l8k0J69q3l03K80o9J5n0J0J92k81
$$ -131 -34 0 8 -78 -108 -42 121 9 -107 -27 -152 -96 76 38 18 187 104 -199 81 12 27 -23 -13 179 -102
8027a02J93j30J23q2K44k95K51j37k06O7J69j13j03P6k15K81J60j82J24k24J13
$$ -102 91 -39 84 2 246 -49 202 65 -141 -74 95 -18 -121 -45 -260 21 181 -1 123 -101 12
8048A2R4J24k61Q3nj14L46p6j74P8j14N6N0q1L4J7j71n7K82j46k30M29j75j16
$$ 12 106 230 -31 52 47 -67 279 203 29 107 -7 49 99 18 52 69 -102 -159 123 -23 -253 176 1 -115
8072a15M7J05l1m9%Q3m18L01J81N3j39k3M7r9q5L2J26o2j2J83j76OP1j31J83q5
$$ -115 -68 37 6 -43 -43 40 -378 -77 104 157 18 -5 42 -57 -142 -110 16 -46 -58 125 -51 -45 26 -105 78 -7
8098gO6o4l3J07m9l0j23J70k46l2J38K0P4P4o8M7r4k36K10J81j47J73J51k68n5
$$ -7 59 -5 -38 69 20 -10 -133 37 -209 -241 -103 -83 -9 65 -3 44 -50 -286 -76 105 -42 131 282 14 -41
8123d1J02R0N9k57M5Jj22j01K1K41k1R1j55J5p9J93J46m51L07M4j55J20L6l03
$$ -41 61 151 210 -47 -2 -1 -123 -224 -203 38 17 108 -47 -32 -111 82 228 -223 84 128 -27 93 129 -174
8147a74K95p5K9m11K36P6Ol1K45k05m6K56k55J62l5r5m0q6p1O6J50j08K47k20
$$ -174 121 46 75 -336 -100 -24 -18 -49 196 -9 -55 201 -54 108 73 -22 -62 -148 -219 -153 -3 -111 136 -84
8171h4K51j90m4LP1j06l2K05O4Q4m39K72q3J58o6k77L22j75n2J96
$$ -84 167 -23 -67 -64 7 -99 -131 74 138 222 -217 55 -28 130 64 -213 109 -66 -118 78
8191G8
$$ Imaginary data points
##PAGE= N=2
##DATA TABLE= (X++(I..I)), XYDATA
0@%%%%%%%%%%%%Mj2J6j6J6k2L0l2M0m8N5o3P2q7R9j12J28j47J68j89K13k40K69
$$ 0 0 0 0 0 0 0 0 0 0 0 0 0 4 -8 8 -8 8 -14 16 -16 24 -24 31 -32 40 -47 52 -60 68 -79 89 -100 113 -127 142
35A42l01L38l77M18m64N15n71O31o98P70q46R34j030J132j245J370j508J659j831
$$ 142 -159 179 -198 220 -244 271 -300 331 -367 403 -443 491 -539 593 -652 718 -790 869 -962
54i62K029k251K504k800L148l562M066m694N497o555Q016j0153J3534j9600L3354
$$ -962 1067 -1184 1320 -1480 1668 -1894 2172 -2522 2975 -3580 4436 -5717 7817 -11783 21571
69B1571j08284k1875K07612k43378J81315q3915K2531J25796j94958J82119o1590
$$ 21571 -86713 -108588 99024 -144354 36961 -46954 -24423 101373 -93585 88534 26944
80B6944m8562O6459j00415J05432j02250P462Q6299q0749L8093m015N2338m4098
$$ 26944 -21618 44841 -55574 49858 -52392 -44930 41369 -39380 -1287 -5302 47036 2938
92B938k6402R1061r6093L8407k1430j7263P6562j34081J07958J1076r3385J15181
$$ 2938 -23464 67597 -28496 9911 -11519 -28782 47780 -86301 21657 32733 -60652 54529
104E4529q7026P3776l1754p5397J67393j62366M5362O5921j10486J16675j04551
$$ 54529 -32497 41279 9525 -65872 101521 -60845 -15483 50438 -60048 56627 -47924
115d7924N5311M9456j30085J16718m4087q659J6083l6015P7969q1684K3289M1361
$$ -47924 7387 56843 -73242 43476 -611 -9270 6813 -29202 48767 -32917 -9628 31733
127C1733m4086J3095j8374M8283m7910l086M4208m3438M3948n4118M5630K7688
$$ 31733 -12353 742 -17632 30651 -17259 -20345 23863 -19575 24373 -29745 15885 43573
139D3573j02514J04437m0922k7149M6765o6652Q4305o9092q225R6212j07882O3038
$$ 43573 -58941 45496 4574 -22575 24190 -42462 41843 -27249 -35474 60738 -47144 15894
151A5894n371k5435O1502r6509P3870N16p4616P2386l5042J4362j0103q028N2837
$$ 15894 10523 -14912 46590 -49919 23951 24467 -50149 22237 -12805 1557 -8546 -16574 36263
164C6263n6342K1667J6672j4929j857j7006L9475l7091k489J8978j2013K1257
$$ 36263 -20079 1588 18260 3331 1474 -15532 23943 -13148 -15637 3341 -8672 12585
176A2585m7699N6129R8o0614P6488m4050R337Q709m3289P6791p3593J2658N4575
$$ 12585 -35114 21015 21113 -39501 36987 -7063 2274 10983 -32306 44485 -29108 -16450 38125
189C8125p3495N6961l2617J1411L3858q1529P8773k2575l9552N1655l8263K9903
$$ 38125 -35370 21591 -11026 385 34243 -47286 31487 8912 -30640 21015 -17248 12655
201A2655k3323m243M4455m8550J9679O537k801j620j7166L5701k5493m761J2700
$$ 12655 -10668 -14911 29544 -19006 673 7210 4409 2789 -14377 21324 -4169 -8930 3770
214C770j541N819l2832M2802j0653l0879M2571l0749K1910j4468j6254N6103o2613
$$ 3770 2229 8048 -24784 18018 7365 -23514 19057 -11692 10218 -4250 -20504 35599 -27014
227b7014K2583K5756m2695L9387l5930K7053J1213n7706O6351k7995j6585L2306
$$ -27014 -4431 21325 -21370 18017 -17913 9140 20353 -37353 28998 1003 -15582 16724
239A6724l3154L6232l0140k477M0063m5217J7769L629l323J978j8315L0492j6124
$$ 16724 -16430 19802 -10338 -12815 27248 -17969 -200 3429 106 2084 -16231 14261 -1863
252a863p963J2060J243J997k2624L0961r683j6281K1505j7559K2256k4444O67
$$ -1863 -9826 2234 3477 5474 -17150 13811 4128 -12153 9352 -8207 14049 -10395 -9728
265i728L8034n0683K6789M831j8660K4093l6432L6370p314l5817N0389k9551L091
$$ -9728 28306 -22377 4412 9243 -9417 14676 -21756 14614 7300 -28517 21872 -7679 -4588
278d588R695j7935L4305l6099R404K6523l4843J7139l295M206j128j6308K5860
$$ -4588 5107 -12828 21477 -14622 -5218 21305 -13538 3601 306 4512 3384 -12924 12936
291A2936j2140p607P347M502j463j7022K3603q861q181R032r217K1139k9774J0860
$$ 12936 796 -6811 536 5038 3575 -13447 10156 1295 -6886 2146 -7071 14068 -15706 -4846
305d846K4932m0502K8235q235r75J3816l4941M3592j9932j9678L8096l0988J7958
$$ -4846 20086 -20416 7819 -416 -1391 12425 -22516 21076 1144 -18534 19562 -11426 6532
318F532j0013n485L1202m1775K1749J0346k2732J5413j3145J6593j0189j2088
$$ 6532 -3481 -8966 22236 -19539 2210 12556 -10176 5237 -7908 8685 -1504 -13592
330a3592K4955j4664O97n96Q459N70j7888K2866r275k429Q89n176K0769l2772
$$ -13592 11363 -3301 -2604 -3200 5259 5829 -12059 10807 1532 -897 -8 -5184 15585 -17187
344a7187J6869J3239k9054K5604j7420J3198K654k9719M3890k7289n354K3172
$$ -17187 -318 12921 -16133 9471 -7949 5249 7903 -21816 22074 -5215 -10569 12603
356A2603k5561K4950k2896O607K3859l8742K7047k192r297J0387j7037K3390j6076
$$ 12603 -12958 11992 -10904 -4297 19562 -19180 7867 5675 -3622 6765 -10272 13118 -2958
369b958p182J9953j3929M986p289J1713k94j7015K0555r128J389m146n90J7521
$$ -2958 -10140 9813 -4116 870 -6419 5294 5000 -12015 8540 -588 801 -3345 -3935 13586
383A3586k8583J7655N688j6854J7223j8059J9704p385j9274L4848k6759N125P452
$$ 13586 -14997 2658 8346 -8508 8715 -9344 10360 2975 -16299 18549 -8210 -3085 4367
396D367j3573K2464k7594J5872J1354k8441K3513r980L016J097j3267K4278j7953
$$ 4367 -9206 13258 -14336 1536 12890 -15551 7962 -2018 998 2095 -11172 13106 -4847
409d847k09J2119q016N209j0876J4020l739j1584J3133p549N532j0311N532J2044
$$ -4847 -5056 7063 -953 4256 -6620 7400 3661 -7923 5210 -2339 3193 -7118 -1586 10458
423A0458k3487J7744k725m235P180j5721K3080j5385p533K2926k0624J1201m597
$$ 10458 -13029 4715 1990 -2245 4935 -10786 12294 -3091 -10624 12302 -8322 2879 -1718
436a718n66J4860k4961J9152K04j5168J4159j1425J0110p461o062J9065j6566
$$ -1718 -2284 12576 -12385 6767 6971 -8197 5962 -5463 4647 -2814 -8876 10189 -6377
449f377M845L505j141K900j1420J4995o677o587Q440n539P820j2785R258P523
$$ -6377 -1532 1973 832 3732 -7688 7307 630 -5957 2483 -3056 4764 -8021 1237 8760
463H760j7500J5583p007L511o11j2870K3016k0081Q15J3731j5851J4107j2587
$$ 8760 -8740 6843 -164 3347 2736 -10134 12882 -7199 -6384 7347 -8504 5603 -6984
476f984P919Q472k1782K0412o832n049P162r921J4518j3449P01J4056j4102P062
$$ -6984 935 9407 -12375 8037 1205 -3844 3318 -6603 7915 -5534 -4833 9223 -4879 2183
490B183k443L555L24j1095J4022o940l091L713l107P748j2622Q532N146j2921
$$ 2183 -260 3295 3619 -7476 6546 -394 -3485 228 -2879 4869 -7753 779 5925 -6996
504f996J1218o277N226k269r018J8609j6058K941Q014r998J1738j3749R511M838
$$ -6996 4222 -2055 3171 902 -8116 10493 -5565 -2624 5390 -4608 7130 -6619 2892 7730
518G730j8222J7471q500J93L119q447J5583j4778L092R043j1003P063o453P069
$$ 7730 -10492 6979 -1521 -1328 1791 -6656 8927 -5851 -2759 6284 -4719 2344 -4109 2960
532B960j435r501J3470o792Q90L87m91P264j2458Q404J458q448O962o482P057
$$ 2960 1525 -7976 5494 -1298 -408 -21 -512 6752 -5706 2698 4156 -4292 2670 -3812 3245
547C245m930m774J4272j1956L502L390m257P398j1910Q949J331j2149J1505o185
$$ 3245 -1685 -6459 7813 -4143 -641 2749 -1508 5890 -6020 2929 4260 -7889 3616 -2569
561b569L190p33m562J3082j2389L899N597p850N782q159P748k093q716J1751o816
$$ -2569 621 -112 -4674 8408 -3981 -82 5515 -2335 3447 -4712 3036 943 -7773 3978 -2838
576b838L190j957K94Q095j2564Q674l59n238N287p195R306o835k494J1273j0460
$$ -2838 352 -1605 -1311 6784 -5780 2894 2535 -2703 2584 -4611 4695 -2140 -4634 6639 -3821
591c821N771j887j58N755j2363J0757k256o811P646o209O209m603j716R923j0436
$$ -3821 1950 63 -95 5660 -6703 4054 1798 -5013 2633 -3576 2633 -1970 -3686 6237 -4199
606d199N012Q43k550L750p809Q968l652n027Q437o005M329m062P75O905j1302
$$ -4199 813 1656 -894 2856 -4953 4015 363 -4664 3773 -2232 2097 -1965 -1190 5715 -5587
621e587P428j001k758M350p576R700n825k631R529r571O347l843J100N229j1774
$$ -5587 1841 840 -1918 2432 -5144 4556 -1269 -3900 5629 -3942 2405 -1438 -338 4891 -6883
636f883J1017l108l452N994p351R465p674m89Q256j0837P387m321R93L585r399
$$ -6883 4134 1026 -2426 3568 -3783 5682 -1992 -2481 5775 -5062 2325 -1996 -1003 2582 -6817
651f817J1387n986j178N828o694P913p771K864N197j0122Q420m350J304K321o796
$$ -6817 4570 -1416 -2594 3234 -3460 4453 -3318 -454 4743 -5379 3041 -1309 -5 2316 -4480
666d480J0056o847M15M684o758O003o032K744L099r017R011m356L91K769n198
$$ -4480 5576 -1271 -856 3828 -2930 3073 -2959 -215 2884 -6133 2878 -1478 -1087 1682 -3516
681c516Q614p505J417N069p751P103n881L314K062q448J0589o641J363L063o582
$$ -3516 5098 -2407 -990 4079 -3672 3431 -2450 864 2926 -5522 5067 -1574 -211 2852 -3730
696c730Q631q536L796K671p896Q204o476L940M96n909R759q011L526J568m860
$$ -3730 4901 -3635 161 2832 -5064 3140 -3336 604 1100 -4809 4950 -3061 465 2033 -2827
711b827P050p600N452o5n691P641o447M092q53l234P075p842L997P70m392N807
$$ -2827 4223 -3377 2075 2010 -3681 3960 -2487 1605 752 -2482 4593 -3249 748 1518 -2874 2933
727B933o831N512j054m086P056o259L480N2k926O279p516M838P18m892O059o339
$$ 2933 -3898 1614 560 -3526 3530 -2729 751 803 -2123 4156 -3360 1478 2196 -2696 3363 -2976
743b976N084j752l483O998p223M492q37k565N838p711O455k000l273O238o739
$$ -2976 2108 356 -3127 3871 -3352 1140 303 -2262 3576 -4135 2320 320 -2953 3285 -3454
758c454N834l369p57N944p969O438k630j250M591p109O801l885j022N006o652
$$ -3454 2380 -989 -1746 4198 -3771 2667 37 -1213 3378 -3731 3070 -815 -1837 3169 -3483
773c483N738l571K15M007o602O130k866p95L593n780O334m191j1M410n908N035
$$ -3483 2255 -1316 -1101 2906 -3696 2434 -432 -1227 2366 -3414 2920 -1271 -1282 3128 -2780 2255
789B255k758k47L140n601O112l730k17L454n325N511m147L52L900o397O131l775
$$ 2255 -503 -750 2390 -3211 2901 -829 -1046 2408 -2917 2594 -1553 -1201 2699 -3698 2433 -1342
805a342N98L002n762O977m913P84L620n769O302n142J553K521n950O506m815J872
$$ -1342 -744 2258 -3504 3473 -1440 -656 2964 -2805 3497 -1645 -92 2429 -3521 2985 -1830 42
821D2J586m844O599n480K045J733m758N915n413K625J139m890O720n031K596J084
$$ 42 1628 -3216 3383 -2097 -52 1681 -3077 2838 -2575 50 1189 -3701 3019 -2012 584 1668
837A668l795N976n496K744O00m185N087n177K851M17l844N777n056K683R59l494
$$ 1668 -2127 3849 -1647 1097 1697 -2488 2599 -2578 273 690 -3154 2623 -2433 250 1209 -2285
853b285N227n195K933K09l635N110m995L355J99l010N563n222L092O2k948M691
$$ -2285 2942 -2253 680 889 -2746 2364 -2631 724 923 -2087 3476 -1746 1346 1408 -1540 3151
869C151n519L674r34k997N011n440L877p71k349N103n647M382r87k610M649n278
$$ 3151 -2368 1306 372 -2625 2386 -3054 823 52 -2297 2806 -2841 1541 554 -2056 2593 -2685
885b685M060j182k036M861n505M148j363j445M066n360M238j795j421L760n189
$$ -2685 1375 193 -1843 3018 -2487 1661 298 -1147 2919 -2441 1797 2 -1419 2341 -2848
900b848M337k270r92L905n059M205j779o51L455m879M612k090p01L337m812M341
$$ -2848 1489 -781 -1773 2132 -2927 1278 -501 -1152 2303 -2576 2036 -54 -755 2582 -2230 2111
916B111k733m07L135m884M877k615m53K949m432M641k710k81K688m374L975k896
$$ 2111 -622 -1029 2106 -2778 2099 -516 -969 1980 -2452 2189 -521 -802 1886 -2488 1487 -1409
932a409N26K283m379N134l070O58K256l599M469l689J136J388l913M235l808J441
$$ -1409 -883 1400 -2979 2155 -915 -257 1999 -1600 2869 -820 316 1704 -2209 2026 -1782 -341
948c41J468l985N343l747J347J598l751M836m053J255J694m415M900l813J576
$$ -341 1127 -2858 2485 -1262 85 1683 -2068 2768 -1285 -30 1664 -2751 2149 -1664 -88
963h8J541l554M735l987K047R76l545M390m317K374K52l450M729m416K655M98
$$ -88 1453 -2101 2634 -1353 694 1670 -1875 2515 -1802 572 824 -2626 2103 -2313 342 840
979H40k957M695m731L139j03k754M518m839K967r1k746M957m813K841J03l027
$$ 840 -2117 2578 -2153 986 883 -1871 2647 -2192 775 684 -2062 2895 -1918 923 1026 -2001
995b001M628m775L000q0k872M333m263K752l15k414M093l963K306J07k199L561
$$ -2001 2627 -2148 852 772 -2100 2233 -2030 722 407 -2007 2086 -1877 429 536 -1663 1898
1011A898l736L154q24j792L716m167L253j444j578L616m817L888j233j840L882
$$ 1898 -1838 1316 492 -1300 2416 -1751 1502 58 -1520 2096 -2721 1167 -66 -1906 1976
1026A976m512M131j402j703L817m342L435j665j109L372m518M073j477j000L172
$$ 1976 -2536 1595 193 -1510 2307 -2035 1400 -265 -1374 1998 -2520 1553 76 -924 2248
1041B248l877L325j753n70K548l686L276k459L4J962l234L581k148K30J874l153
$$ 2248 -1629 1696 -57 -627 1921 -1765 1511 -948 -914 1048 -2186 1395 -753 -523 1351 -1802
1057a802L720k859O30J816l713L904k508O61K050l780M119k973L19K290l835L603
$$ -1802 1918 -941 -311 1505 -2208 1696 -812 -151 1899 -1881 2238 -735 -416 1874 -1961 1642
1073A642k336k0K100l657L625k059J69J669l166L897k534N74J467l099L606l184
$$ 1642 -694 -714 1386 -2271 1354 -705 -536 1133 -2033 1864 -670 -96 1371 -1728 1878 -1306
1089a306J915Q22l265L897l310J788N54k814M066m362K502M61l045L998l952K469
$$ -1306 609 1431 -1834 2063 -1247 541 1095 -1719 2347 -2015 487 948 -2097 1901 -2051 418
1105D18L93k883M113l507J588L30k112L621l551K411J4k111K845k861K004o24
$$ 418 811 -2072 2041 -1466 122 452 -1660 1961 -1590 821 835 -1276 1569 -1292 712 88
1121H8j255L092l345J692l09j461L059l490K840p19j726L608l771K919j158j529
$$ 88 -1167 1925 -1420 272 -37 -1498 1561 -1929 911 192 -1534 2074 -1697 1222 64 -1465
1137a465L907m208K809m03j971L700m213K913l91k333L635l417K145p23j550L054
$$ -1465 2442 -1766 1043 640 -1331 2369 -1844 1069 678 -1655 1980 -1437 708 -15 -1565 1489
1153A489l193K402n03j304K669l347L077j560o23K560l287L070k118L39K261m065
$$ 1489 -1704 698 195 -1109 1560 -1787 1290 -270 -893 1667 -1620 1450 -668 -329 1932 -2133
1169b133L921k123k25K113l519L424j907p28K907l041K403j480l98K127k975K977
$$ -2133 1788 -335 -560 1553 -1966 1458 -449 -1177 1730 -1311 1092 -388 -786 1341 -1634 1343
1185A343j161n02J308k054K105j213n37K044k906K373j077K65J098k772K817k144
$$ 1343 182 -320 988 -1066 1039 -174 -711 1333 -1573 800 -277 -12 1086 -1686 1131 -1013
1201a013N60J387k735K997k419Q73J446k856L507k359P84J034k920L816k720L00
$$ -1013 -453 934 -1801 1196 -1223 -350 1096 -1760 1747 -612 172 1206 -1714 2102 -618 -318
1217c18J699k883K705k204Q99J000k338K888k339J089O8j214K031k482J513J94
$$ -318 1381 -1502 1203 -1001 -102 898 -1440 1448 -891 198 266 -948 1083 -1399 114 308
1233C08j256J944k053J722q2j740K590k314J517o1j604K390k564J322N96k069
$$ 308 -948 996 -1057 665 583 -1157 1433 -881 636 575 -1029 1361 -1203 119 715 -1354
1249a354K917k836J753J6k042L438k990J076M08j656K830k883J788J13j356K372
$$ -1354 1563 -1273 480 496 -1546 1892 -1098 -22 386 -1270 1560 -1323 465 578 -778 1594
1265A594k560J944p68j065K226k867K164p74r84K490l169K807j035r80K576l372
$$ 1594 -966 978 210 -855 1371 -1496 668 -106 -1090 1400 -1769 1038 3 -977 1599 -1773
1281a773K837j412o56K734l305K588j077m18J977k890K542j142j092K355k281
$$ -1773 1064 -348 -1004 1730 -1575 1013 -64 -482 1495 -1395 1147 5 -1087 1268 -1013
1296a013J718j067k29J912k326J711p71q74J645k276K338j251j71J735k193K266
$$ -1013 705 -362 -591 1321 -1005 706 -65 -939 706 -1570 768 -483 -654 1081 -1112 1154
1312A154j143j29J968l034K351j467j27J726k955K642j682P4J954k787K492j456
$$ 1154 11 -118 1850 -1184 1167 -300 -427 1299 -1656 986 -696 -622 1332 -1455 1037 -419
1328d19l12J826k726K489j379k56J675k067K103j153K45J142k286K606j947O20
$$ -419 -731 1095 -1631 858 -521 -777 898 -1169 934 -219 26 1168 -1118 1488 -459 161
1344A61O34j973J992j743P17Q09j891K301k130R97R58j769K229k059O17M69j382
$$ 161 795 -1178 814 -929 -212 597 -1294 1007 -1123 -126 832 -937 1292 -767 -150 319 -1063
1361a063K166j898J046M75j364J924j771Q28K83j520J924k022J240K35j710K316
$$ -1063 1103 -795 251 726 -638 1286 -485 343 626 -894 1030 -992 248 483 -1227 1089
1377A089j942R52K90j336K098k052J224n3j206K153k155J615p17q11K297k301
$$ 1089 -853 99 389 -947 1151 -901 323 270 -936 1217 -938 677 -40 -851 1446 -855
1393h55J428k48j196J937k237J491j72j306K280k242J558j56j067J812k115J597
$$ -855 573 325 -871 1066 -1171 320 148 -1158 1122 -1120 438 282 -785 1027 -1088 509
1409E09n15p72J871k063J768q35l18J808k487J837j247Q8J391k623K443j068m51
$$ 509 -6 -778 1093 -970 798 -37 -355 1453 -1034 803 -444 -356 1035 -1588 855 -213 -664
1426f64J963k427J730p88m07J664k381J860o16n01J751k190J721o99l34J707k295
$$ -664 1299 -1128 602 -186 -593 1071 -1310 550 -66 -567 1184 -1006 715 16 -318 1389 -906
1443i06J834r68n02J717k619K136j320l4J594j876J826j186N2J366k284K241j276
$$ -906 928 -40 -542 1175 -1444 692 -628 -662 932 -944 882 -304 -252 1114 -1170 1071 -205
1460b05k45J216k055K155j097K60R86j896K097j445KJ165k040J743j260n0J393
$$ -205 -450 766 -1289 866 -231 29 1015 -881 1216 -229 -227 938 -1102 641 -619 -669 724
1477G24j833J702j053J77R06j554J770j385K97R65j633J824j269L82N57j485J922
$$ 724 -1109 593 -460 -283 623 -931 839 -546 -249 716 -917 907 -362 20 577 -908 1014
1494A014j544O69M35j693K462j902L78R44j697J770j654J162n0j295J927j420
$$ 1014 -530 139 574 -1119 1343 -559 -181 763 -934 836 -818 344 294 -1001 926 -494
1510d94L21O17j138J711j743J135jj190J786j334O00n3j035J626j472P82O2j084
$$ -494 -173 444 -694 1017 -726 409 408 -782 1004 -330 270 217 -818 808 -664 118 180 -904
1528i04J804j710J078j20q72J599j756J194k86o62J707j630J055j48r18J521j886
$$ -904 900 -810 268 148 -724 875 -881 313 27 -635 1072 -558 497 349 -569 952 -934
1545i34J728p29n55J386j896J516m59m73J153j733J481l77p64J554k004J687o46
$$ -934 794 65 -490 896 -1000 516 57 -416 737 -996 485 108 -656 898 -1106 581 -65
1562f5l82J195j327J215n74m69J335j724J437p75l71J471j904J248n79j07J192
$$ -65 -447 748 -579 636 62 -407 928 -796 641 -134 -505 966 -938 310 -269 -376 816
1579H16j790J462n41n25J379j599J360p33k66J207j454J500q50m35J503k158J970
$$ 816 -974 488 -53 -578 801 -798 562 -171 -437 770 -684 816 -34 -469 1034 -1124 846
1596H46q44l24J341j589J064j013M9J187j696J452j114L43R63j371J460j162M85
$$ 846 2 -322 1019 -570 494 -519 -470 717 -979 473 -641 -298 665 -706 754 -408 77
1613G7O58j387J665j341mJ030j360J175r90M00N46j243J572q75K8P16j387J132
$$ 77 735 -652 1013 -328 -332 698 -662 513 -477 -77 469 -774 798 -77 -49 667 -720 412
1631D12r18L29N75j176J439p21J82M31r81J019q68L18L70j048J241j097M23M86
$$ 412 -506 -177 398 -778 661 -60 122 553 -428 591 -277 41 411 -637 604 -493 -70 416
1649D16r91J355j156N88o6q42J394j272O85J23p52J315j319Q40q0o43J012j029
$$ 416 -575 780 -376 212 146 -696 698 -574 111 234 -518 797 -522 318 238 -405 607 -422
1667d22Q43k87l91J139j454Q82k53n61Q83j115J149m81l00R45j429J230n48k50
$$ -422 421 134 -257 882 -572 310 57 -504 379 -736 413 -68 -368 577 -852 378 -170 -420
1685d20J008j224J146m52n61J485j667J278q04j33J321j444N50R4m32R89j449
$$ -420 588 -636 510 58 -503 982 -685 593 -211 -344 977 -467 83 177 -255 734 -715
1702g15Q75j96o08J030j187R96m89M6R94j070Q76n03j03J019j835J434q19k88
$$ -715 160 -36 -644 386 -801 195 -294 -248 746 -324 552 49 -54 965 -870 564 -255 -543
1720e43J050j562J671r15J64Q01j343J328r83K05O08j240J289r73j29Q06r12J179
$$ -543 507 -1055 616 -299 -135 666 -677 651 -332 -127 481 -759 530 -443 -572 234 -678 501
1738E01o10O3O28j127J041o72K77n8r68J206p79M92M15q99J111p70K03J84j047
$$ 501 -109 -46 582 -545 496 -176 101 43 -925 281 -498 -6 409 -490 621 -149 54 238 -809
1757h09J354j005K85M11r37J077o72J85R80j246R84q73L68L66q35J071j375L89
$$ -809 545 -460 -175 236 -701 376 -296 -111 869 -377 607 -266 102 468 -367 704 -671 -282
1775b82N05q44J021r57L25P68j113J012r77P50Q0m97R15j071O22j53l03Q43j214
$$ -282 223 -621 400 -557 -232 536 -577 435 -542 208 288 -209 706 -365 257 104 -199 644 -570
1794e70P47r9p65J281q57N79l63l45J236j375R49k05m40L62l94P00r86m8P94r12
$$ -570 177 78 -687 594 -263 316 -47 -392 844 -531 418 213 -227 135 -259 441 -545 -593 201 -711
1814g11J686o35m23N40p00M53k78n47Q87j076J035m31k98J028r71Q33n07j80J001
$$ -711 975 340 -83 457 -243 210 -68 -615 272 -804 231 -200 -498 530 -441 392 -115 -295 706
1833G06j651J241m05l68J010j209J105p09P7R98j511J306n52k92J047j624J248
$$ 706 -945 296 -109 -477 533 -676 429 -280 -203 795 -716 590 38 -254 793 -831 417
1850D17r61L03N96r08J139p00n3L34q03J124o84M27R65k041J305r72L97Q74j110
$$ 417 -544 -241 355 -553 586 -114 -167 167 -636 488 -196 231 1196 -845 460 -512 -115 759 -351
1869c51R78o59k12Q13j525J579q70K17L17j226J326n94k44Q55r31R79o28j22P24
$$ -351 627 -32 -244 569 -956 623 -247 -30 287 -939 387 -207 -451 404 -527 452 -176 -298 426
1888D26p87J075r07J52N22p42J036j264M60N56j089J026j083P69J92p01J017j070
$$ 426 -361 714 -193 -41 481 -261 775 -489 -29 527 -562 464 -619 150 342 -359 658 -412
1906d12O45M7r01J253j208O95L49j341J601j112O69o3p30Q74n54M59R4q19J055
$$ -412 233 280 -621 632 -576 119 468 -873 728 -384 285 222 -508 366 -188 271 365 -454 601
1925F01j035N00Oo33J206j020O30pn83P56r80Q80l28m51J039j095R52m30j83O78
$$ 601 -434 66 72 -561 645 -375 255 248 -335 421 -559 321 -7 -458 581 -514 438 8 -175 503
1945E03j019Q85k79n68R92j336J505r23m60J427j365R57j65n18R38r09L92j1l87
$$ 503 -516 369 90 -478 514 -822 683 -240 -700 727 -638 319 154 -364 574 -335 57 46 -341
1964c41J190l99o24l01Q8N35k82Q26j48p57P02r46R70p63J03M48o58R11n48n5
$$ -341 849 450 -174 -475 -387 148 -134 692 544 -213 489 -457 513 -250 -147 301 -357 554 6 -49
1984d9N63j244J102n29O2J39o59J254q24J5O24r09O15k35j34L79j113J214l21
$$ -49 514 -730 372 -157 -95 44 -615 639 -185 -170 454 -455 160 -75 -209 170 -943 271 -50
2003e0k2j20q02J032J23n49O41p98J096q01J91R18j839J516q18L91K93q31Q83
$$ -50 -72 -192 -994 38 161 -388 253 -545 551 -250 -59 859 -980 536 -282 109 402 -429 454
2022D54o66j6L41p78J272j113M89K06r69J123o28L17L19r61J098p85K28O26r77
$$ 454 -212 -228 113 -665 607 -506 -17 189 -780 343 -285 32 351 -610 488 -297 -69 557 -420
2041d20P09q43K87M60m93O49P3k64O9r80J616j416N23j09m43J071r55N68N0o77
$$ -420 289 -554 -267 193 -300 349 422 158 227 -753 863 -553 -30 -139 -582 489 -466 102 152 -525
2061e25R64p11M17M0m15N82o36J016p17r08J200m03l9L91o30J34m13O13N7j07
$$ -525 439 -272 145 185 -230 352 -284 732 15 -893 307 -96 -135 256 -374 -240 -653 -40 17 -90
2081i0M12r14P33j64n12J126j046P02k79k59O95p59O11j65m94R50q08L31K3m48
$$ -90 322 -592 141 -23 -535 591 -455 247 -32 -291 404 -355 256 91 -403 547 -261 70 93 -355
2101c55O89o00J55p8k96P22r60R58k92j55Q04r45P05j24l05L50q6k5o70L64O85
$$ -355 334 -266 -111 -189 -485 237 -723 235 -57 -212 592 -353 352 228 -77 273 187 162 -508 -144 541
2122E41o32M46p17J59N88p30N52k82k85Q01r87O97k84k68N37k23l06k15L43P02
$$ 541 -91 355 -362 -203 385 -345 207 -75 -360 441 -546 151 -133 -401 136 -87 -393 -608 -265 437
2142D37q46P02l16j43L01l73O51o54j43O19m92M75l59o6L20n13N60m29P6M13p12
$$ 437 -409 293 -23 -166 135 -238 413 -241 -384 235 -257 218 -141 -207 113 -400 160 -269 -193 220 -492
2163d92R51l72p9N38p95N72l54j23M19q53P63l04k5L28o11P35m34n4M05m73N78
$$ -492 459 87 8 546 -249 323 -31 -154 265 -588 175 -129 -154 174 -437 298 -136 -190 215 -258 320
2184C20n96J85N2m13P27m73M44k00m11O17n26L94m4m76P30o05L20N3k00M84q44
$$ 320 -276 -91 -39 -452 275 -198 246 46 -365 252 -274 120 76 -400 330 -275 45 98 -102 382 -462
2205d62M52L2n14O88m66K25K00k55N35k99L5j04k92L18l54M02q5l51O83p72O86
$$ -462 -10 22 -492 196 -270 -45 155 -100 435 136 171 67 -225 93 -261 141 56 -295 388 -384 302
2226C02n51L3L31o31O2k4p0N76j03J54k55k47Q36p38L26o3N5N02r95O84k64k33
$$ 302 -249 -216 115 -516 -454 -478 -548 28 -75 79 -176 -423 413 -325 1 -62 -7 495 -500 184 -80 -313
2248c13N84p21O88l94j25N62r54J052l76K00J98p03L29j16j25K39j74M03j89l4
$$ -313 271 -450 238 -156 -281 281 -673 379 3 203 401 -302 27 -89 -214 25 -149 254 65 31
2268C1K01o21P68m08n9M05n96M74j92q1L14m53J76o53N97K2k92P27n25J41O21
$$ 31 232 -389 379 -29 -88 317 -279 195 3 -78 236 -217 -41 -694 -97 -75 -367 360 -165 -24 597
2289E97j101M98m74O26J05r44O69o28R6J415j897P39J01L86R0n48J058o59m7J72
$$ 597 -504 -6 -480 146 251 -693 -24 -652 -556 859 -1038 -299 -198 188 278 -270 788 129 82 254
2309B54n50P21p28L44K72m87N45o05M42K15p74N37m93L26J95n86J66l1L45M2k30
$$ 254 -296 425 -303 41 313 -174 371 -234 208 423 -351 186 -307 19 214 -372 -206 -237 108 150 -80
2330h0N55l99k9J90o48O97p26M76k86R8K66k46J86J37j57M22r00O51M8l81l5j012
$$ -80 475 76 47 237 -411 286 -440 36 -250 -152 114 -132 54 191 34 456 -444 207 255 -126 -161 -1173
2352a173J478n01J41K79l82L19j89k09L93l78L85q9j81O73q72L34J21l5Q8m55
$$ -1173 305 -196 -55 224 -158 161 -28 -237 156 -222 163 74 -107 566 -306 28 149 114 202 -253
2372b53M43R7k90M72r65O43n32Q30p64J72R34j016L63k75j14L55J56m61M78m12
$$ -253 190 287 -3 469 -496 147 -385 445 -319 -147 787 -229 134 -141 -255 100 256 -205 273 -139
2392a39L16k58P2M65p04M54q5m23M96n06N57j33q0Q1m99M04j42O3L75n24O19o50
$$ -139 177 -81 -9 456 -248 206 121 -302 194 -312 245 112 32 113 -386 18 -124 -61 314 -210 409 -241
2414b41J33M57m58K13j84j92L90m35M23q9n2K24n91P67j75k74M67o88M66k42m6
$$ -241 -108 349 -109 104 -80 -272 118 -317 106 17 -35 189 -402 365 190 -84 383 -305 161 -81 -127
2435a27M4r4N04o14J41N60q39P72n34K56J84m45K87l78J77L01m27K60k75K68J2
$$ -127 -83 -177 327 -287 -146 414 -425 347 -187 69 253 -192 95 -283 -106 195 -232 28 -247 21 33
2456C3m19O46m26L2P0l80P30l68J12l60K20N20n52J63K62l02P10J50n34l14j78
$$ 33 -386 260 -166 -134 -64 -444 286 -82 30 -330 -110 410 -142 21 283 -19 691 841 307 -7 -185
2477a85P33p40M02l38J4K34k96K76J86o32Q59p86K51P2l23L60p46R28r5l18K46
$$ -185 548 -192 210 -128 -114 120 -176 100 286 -346 513 -273 -22 50 -273 87 -659 269 174 -144 102
2498A02m48P02o70K92M41o08M83k28k92L29l53J91j4k82M50j88J46P0j69J81o41
$$ 102 -346 356 -314 -22 419 -189 294 66 -226 103 -250 -59 -73 -355 95 -93 53 123 -46 135 -506
2519e06L05M88l44N86r76N38l4m2O0l11N52l15j55L16l76M91m29j33M18l21K83
$$ -506 -201 287 -57 529 -447 91 57 15 75 -236 316 1 -154 162 -214 277 -152 -285 133 -188 95
2540I5k31r3O08m91K22o8R9p5p9K24K3m70N25n25M01n6m9k5j79K93k54l1K49n84
$$ 95 -136 -229 379 -112 110 42 141 66 -13 211 234 -236 289 -236 165 109 60 35 -144 149 -105 -136 113 -471
2564d71L94j70J37M76q01M24k2P6J21k13K28k34j45M89n41M31m22K88M7j88Lj5
$$ -471 -77 -247 -110 366 -435 -11 -33 43 164 -49 179 -55 -200 289 -252 179 -243 45 92 -96 -93 -108
2586a08M4M11k08n8j65j29N32j016P68j8l47O2k3N61m91J65O37r54M65m22J08
$$ -108 -64 347 139 81 -84 -213 319 -697 71 53 -294 -232 -255 306 -185 -20 617 -337 128 -294 -186
2607a86n4r9R7m94P4K32N94L58q23L28L3o85N69J50k43O36p26N0N3k10O45l32
$$ -186 -240 -339 -242 -736 -662 -430 164 522 -301 27 60 -625 -56 94 -149 487 -239 -189 -136 -346 299 -33
2629c3M27j054P19q7m4L6j01J19j54k6M83q31N92O50m04J01j55j32P6l25J92k23
$$ -33 394 -660 59 -28 -72 -36 -137 -18 -172 -198 285 -546 46 696 292 393 238 106 182 -143 49 -174
2651a74O3J63j98L46o8J84l05j01L32l45K79o4k23N24n63K35j16r0K58j38J78
$$ -174 -111 52 -146 200 132 316 11 -90 242 -103 176 112 -111 413 -150 85 -31 -121 137 -1 177
2672A77r2Q1j10j15J8n2J98R2k56R2j27JJ39j36P8j8q6K74m78M07N3l63M28j75
$$ 177 85 166 56 -59 -41 -93 105 197 -59 33 -94 -93 46 -90 -12 -30 -116 158 -320 87 140 -223 205 30
2696C0J53l62K43k03k0L35j12k3j80o21J387n92m0%j41L80k18M4m0M4K62j46q9
$$ 30 183 -179 64 -139 -159 176 64 41 -139 -760 627 35 -5 -5 -146 234 16 60 20 64 326 180 91
2719I1K8l58N63n17L35j98P6P6j92J55J00l12K50p92O69J90m76O85n35M12l36
$$ 91 119 -239 324 -193 142 -56 20 96 -96 59 159 -153 97 -695 -26 164 -312 373 -162 250 -86
2740h6q5M64M18j093M47q16K66P02K42j93n61j61j60Q05n8n95M09J03k29M3j63
$$ -86 -171 293 711 -382 65 -751 -485 217 459 266 -295 -456 -616 189 131 -464 -55 48 -181 -138 -301
2761c01M26k29K60j35L2L2j02P9r8O9Jk65K34r5n3L75m23M22r3n28M85j59o7L8
$$ -301 125 -104 156 21 53 85 -17 62 -36 33 34 -231 3 -92 -145 230 -193 229 136 -392 93 -66 -133 -95
2785i5k7M7o4J46R8m1m9o6L74m00L82N95j298M65p60Q42Qq9j39K73n48J35J1N
$$ -95 -122 -75 -139 7 105 64 15 -51 323 -77 305 900 -398 67 -693 149 157 68 -71 202 -346 -211 -200 -195
2809a95L30k12j79J95J86j26m2K91o36O13m65K08K61p32O87k14l0K77k23J36m72
$$ -195 135 -77 -256 -61 125 -1 -43 248 -388 225 -240 -32 229 -503 184 -30 -60 217 -6 130 -342
2830c42J86K80l33M59k40j18K03j17K25k22K07l58J27K03k52K37j49l15M83Rk61
$$ -342 -156 124 -209 250 10 -108 95 -22 203 -19 188 -170 -43 160 -92 145 -4 -319 164 173 -88
2851h8RM1J2j43R9J45k10L10l64J20O1n8J12k45L65j02j37M55l74rL22m08n4K30
$$ -88 -79 -38 -26 -169 -70 75 -135 175 -189 -69 -8 -66 46 -199 166 64 -73 382 8 -1 321 -87 -141 89
2875H9k11K76k58K28l26J40M8M4J63j59r6j2j26L56k23J73l10K14l6q0L47l28
$$ 89 -122 154 -104 124 -202 -62 -14 30 193 34 -62 -74 -200 156 -67 106 -204 10 -26 -106 241 -87
2897h7k34J43J6J69J7j06M53l33j10J08k42K95q2r1P0j68K12j24J4M46k82J93
$$ -87 -321 -178 -162 7 24 -82 371 38 -72 36 -206 89 7 -84 -14 -182 30 -94 -80 366 84 277
2919B77l35k6J29j44L6R1J38N7l81J51j48K10J01l28K27k41K86k88P9K99l36J4
$$ 277 -58 -84 45 -99 -63 28 166 223 -158 -7 -155 55 156 -172 55 -186 100 -188 -109 190 -146 -132
2941a32Pl3L66l53L50j75l20N87n00L45l53J38K10j92m2Q5P6Q1l42L61j10m2J19
$$ -132 -125 -158 208 -145 205 30 -290 297 -203 142 -211 -73 137 -55 -97 -12 64 145 -197 164 54 12 131
2964A31k76J75j41L48L2m22J64rq8K52j69J08j09MJ04k34Q6pl4K37j66J89k30
$$ 131 -145 30 -111 237 269 -153 11 2 -86 166 -3 105 -4 0 104 -130 -44 -51 -85 152 -14 175 -55
2987e5Jj23nK48Pj79L3J6M0o6J18jj10K70k31m6Q6l5j11M5k29J65J78j37R0q4
$$ -55 -54 -177 -182 66 73 -106 -73 -57 -17 -83 35 34 -76 194 -37 -83 3 -32 -143 -98 -327 -162 16 -121 -31 -115
3013a15J78k45L54j26o7J31m02L91N1j34k6M6N2o4j51K8q8L24j81J19r7k7L33
$$ -115 63 -182 172 46 -21 110 -292 99 150 16 -10 36 88 24 -127 -99 -187 137 -44 75 -22 -49 284
3036B84m21L10o6j20J48j32OJ60m52M86k29k9j69L7L46qk29J96r9L35n82J98p7
$$ 284 -137 173 107 -13 135 3 9 169 -283 203 -26 -55 -224 -187 159 151 -78 118 19 354 -228 -30 -107
3059a07K3L26m45L91k27j01J73J79l51J48l3l2P9j55J7L1l3K42o3nk21L34j05
$$ -107 -84 242 -203 188 -39 -140 33 212 -139 9 -24 -56 23 -132 -115 -84 -117 125 62 57 -164 170 65
3082F5J14N7m71L84l02M83k88M0P6k71J77l17K60n8J66J03j96j23J49r4J4R1k4
$$ 65 179 236 -235 149 -153 330 42 82 158 -113 64 -253 7 -51 115 218 22 -101 48 -46 -32 59 35
3105C5J26l02J33k63K87R0k41J6J82l48K97M0K31k22L6p0k39K90j10k12J57J10
$$ 35 161 -141 -8 -271 16 106 -135 -119 63 -285 12 52 283 61 97 27 -212 78 -32 -244 -87 23
3127B3J87j55k33J92k19L49j27j2J03l9k29L10j29q1l76L64n1J76J52j79j1k64
$$ 23 210 55 -178 14 -205 144 17 5 108 69 -160 150 21 -60 -436 -72 -123 53 205 26 15 -249
$$ [...]
8191G5
##END NTUPLES=NMR FID
##END=
