##TITLE=1H_UK-THF
 THF d8
 8 sc, 
 7.2.2024
##JCAMPDX= 6.0         $$ Bruker NMR JCAMP-DX V2.0
##DATA TYPE= NMR FID
##DATA CLASS= NTUPLES
##ORIGIN= UXNMR, Bruker Analytische Messtechnik GmbH
##OWNER= root
$$ XWIN-NMR		Version 3.5
$$ Wed Feb  7 14:37:04 2024 Russian Standard Time (UT+4h)  she@DPX200
##.OBSERVE FREQUENCY= 200.1313
##.OBSERVE NUCLEUS= ^1H
##.DELAY= (6, 6)
##.ACQUISITION MODE= SIMULTANEOUS
##.ACQUISITION SCHEME= undefined
##.AVERAGES= 8
##.DIGITISER RES= 18
##SPECTROMETER/DATA SYSTEM= spect
##.PULSE SEQUENCE= zg30
##.SOLVENT NAME= THF
##.SHIFT REFERENCE= (INTERNAL, THF, 0, 15.7039)
##AUDIT TRAIL= $$ (NUMBER, WHEN, WHO, WHERE, WHAT)
$$ ##TITLE= Audit trail, XWIN-NMR		Version 3.5
$$ ##JCAMPDX= 5.01
$$ ##ORIGIN= Bruker BioSpin GmbH
$$ ##OWNER= she
$$ F:/spectra/data/she/nmr/H-F/1/audita.txt
$$ ##AUDIT TRAIL=  $$ (NUMBER, WHEN, WHO, WHERE, WHAT)
(   1,<2024-02-07 14:36:01.45 +0400>,<she>,<DPX200>,
      <created by zg, POWCHK disabled, PULCHK disabled
       configuration hash MD5:
       00 E9 B6 7A A2 85 ED C7 34 08 36 98 17 FE 4E 26
       data hash MD5: 16K
       F8 F5 D3 C0 EC 3E 3C 13 3B C2 C5 3F CC CC A9 FD>)
$$ ##END=
$$ 
$$ hash MD5
$$ 7E 13 82 C2 53 F2 C8 49 65 1C C3 4E 60 49 45 5E
##$RELAX= 
##$RELAX= 
##$RELAX= 
##$RELAX= 
##$RELAX= 
##$RELAX= 
$$ Bruker specific parameters
$$ --------------------------
##$DU= <F:/spectra>
##$EXPNO= 1
##$NAME= <H-F>
##$PROCNO= 1
##$TYPE= <nmr>
##$USER= <she>
##$AMP= (0..31)
100 100 100 100 100 100 100 100 100 100 100 100 100 100 100 100 100 100 
100 100 100 100 100 100 100 100 100 100 100 100 100 100 
##$AQSEQ= 0
##$AQ_mod= 1
##$AUNM= <au_zg>
##$AUTOPOS= <>
##$BF1= 200.13
##$BF2= 200.13
##$BF3= 200.13
##$BF4= 200.13
##$BF5= 200.13
##$BF6= 200.13
##$BF7= 200.13
##$BF8= 200.13
##$BYTORDA= 1
##$CFDGTYP= 0
##$CFRGTYP= 5
##$CHEMSTR= <none>
##$CNST= (0..31)
1 1 145 1 1 1 1 1 1 1 1 1 1 1 1 1 1 1 1 1 1 1 1 1 1 1 1 1 1 1 1 1 
##$CPDPRG= <>
##$CPDPRG1= <>
##$CPDPRG2= <>
##$CPDPRG3= <>
##$CPDPRG4= <mlev>
##$CPDPRG5= <mlev>
##$CPDPRG6= <mlev>
##$CPDPRG7= <mlev>
##$CPDPRG8= <mlev>
##$CPDPRGB= <>
##$CPDPRGT= <>
##$D= (0..31)
0 1.2 0 0 0 0 0 0 0 0.06 0 0.03 0 0 0 0 0.0002 0 0 0 0 0 0 0 0 0 0 0 0 
0 0 0 
##$DATE= 1707302160
##$DBL= (0..7)
120 120 120 120 120 120 120 120 
##$DBP= (0..7)
150 150 150 150 150 150 150 150 
##$DBP07= 0
##$DBPNAM0= <>
##$DBPNAM1= <>
##$DBPNAM2= <>
##$DBPNAM3= <>
##$DBPNAM4= <>
##$DBPNAM5= <>
##$DBPNAM6= <>
##$DBPNAM7= <>
##$DBPOAL= (0..7)
0.5 0.5 0.5 0.5 0.5 0.5 0.5 0.5 
##$DBPOFFS= (0..7)
0 0 0 0 0 0 0 0 
##$DE= 6
##$DECBNUC= <off>
##$DECIM= 32
##$DECNUC= <off>
##$DECSTAT= 4
##$DIGMOD= 1
##$DIGTYP= 9
##$DL= (0..7)
0 120 120 120 120 120 120 120 
##$DP= (0..7)
150 150 150 150 150 150 150 150 
##$DP07= 0
##$DPNAME0= <>
##$DPNAME1= <>
##$DPNAME2= <>
##$DPNAME3= <>
##$DPNAME4= <>
##$DPNAME5= <>
##$DPNAME6= <>
##$DPNAME7= <>
##$DPOAL= (0..7)
0.5 0.5 0.5 0.5 0.5 0.5 0.5 0.5 
##$DPOFFS= (0..7)
0 0 0 0 0 0 0 0 
##$DQDMODE= 0
##$DR= 18
##$DS= 0
##$DSLIST= <SSSSSSSSSSSSSSS>
##$DSPFIRM= 0
$$ [...]
##$SUBNAM2= <"">
##$SUBNAM3= <"">
##$SUBNAM4= <"">
##$SUBNAM5= <"">
##$SUBNAM6= <"">
##$SUBNAM7= <"">
##$SUBNAM8= <"">
##$SUBNAM9= <"">
##$SW= 18.0517328524113
##$SWIBOX= (0..15)
0 0 2 0 0 0 0 0 0 0 0 0 0 0 0 0 
##$SW_h= 3612.71676300578
##$TD= 16384
##$TD0= 1
##$TE= 0
##$TE2= 300
##$TE3= 300
##$TEG= 300
##$TL= (0..7)
0 120 120 120 120 120 120 120 
##$TP= (0..7)
150 150 150 150 150 150 150 150 
##$TP07= 0
##$TPNAME0= <>
##$TPNAME1= <>
##$TPNAME2= <>
##$TPNAME3= <>
##$TPNAME4= <>
##$TPNAME5= <>
##$TPNAME6= <>
##$TPNAME7= <>
##$TPOAL= (0..7)
0.5 0.5 0.5 0.5 0.5 0.5 0.5 0.5 
##$TPOFFS= (0..7)
0 0 0 0 0 0 0 0 
##$TUNHIN= 0
##$TUNHOUT= 0
##$TUNXOUT= 0
##$USERA1= <user>
##$USERA2= <user>
##$USERA3= <user>
##$USERA4= <user>
##$USERA5= <user>
##$V9= 5
##$VALIST= <valist>
##$VCLIST= <CCCCCCCCCCCCCCC>
##$VD= 0
##$VDLIST= <DDDDDDDDDDDDDDD>
##$VPLIST= <PPPPPPPPPPPPPPP>
##$VTLIST= <TTTTTTTTTTTTTTT>
##$WBST= 1024
##$WBSW= 4
##$XGAIN= (0..3)
0 0 0 0 
##$XL= 0
##$YL= 0
##$YMAX_a= 49323
##$YMIN_a= -54285
##$ZGOPTNS= <>
##$ZL1= 120
##$ZL2= 120
##$ZL3= 120
##$ZL4= 120
##$ABSF1= 10
##$ABSF2= 0
##$ABSG= 5
##$ABSL= 3
##$ALPHA= 0
##$AQORDER= 0
##$ASSFAC= 0
##$ASSFACI= 0
##$ASSFACX= 0
##$ASSWID= 0
##$AUNMP= <proc_1d>
##$AZFE= 0.1
##$AZFW= 0.1
##$BCFW= 1
##$BC_mod= 2
##$BYTORDP= 1
##$COROFFS= 0
##$CY= 11.3945322036743
##$DATMOD= 1
##$DC= 2
##$DFILT= <>
##$DTYPP= 0
##$F1P= 15.7292609196834
##$F2P= 12.9074282941183
##$FCOR= 0.5
##$FTSIZE= 0
##$FT_mod= 4
##$GAMMA= 1
##$GB= 0.15
##$INTBC= 1
##$INTSCL= 1
##$ISEN= 128
##$LB= 0.24
##$LEV0= 0
##$LPBIN= 0
##$MAXI= 10000
##$MC2= 0
##$MEAN= 0
##$ME_mod= 0
##$MI= 1.114404
##$NCOEF= 0
##$NC_proc= 0
##$NLEV= 6
##$NOISF1= 3.799351
##$NOISF2= 2.8
##$NSP= 1
##$NTH_PI= 0
##$NZP= 0
##$OFFSET= 15.70392
##$PC= 1
##$PHC0= -24590.75
##$PHC1= 3.452683
##$PH_mod= 1
##$PKNL= yes
##$PPARMOD= 0
##$PSCAL= 0
##$PSIGN= 0
##$REVERSE= no
##$SF= 200.130013532006
##$SI= 16384
##$SIGF1= 3
##$SIGF2= 2
##$SINO= 400
##$SIOLD= 16384
##$SREGLST= <1H.CDCl3>
##$SSB= 0
##$STSI= 0
##$STSR= 0
##$SW_p= 3612.71676300578
##$SYMM= 0
##$S_DEV= 0
##$TDeff= 0
##$TDoff= 0
##$TI= <>
##$TILT= no
##$TM1= 0
##$TM2= 0
##$TOPLEV= 0
##$USERP1= <user>
##$USERP2= <user>
##$USERP3= <user>
##$USERP4= <user>
##$USERP5= <user>
##$WDW= 1
##$XDIM= 8192
##$YMAX_p= 0
##$YMIN_p= 0
$$ End of Bruker specific parameters
$$ ---------------------------------
##NTUPLES= NMR FID
##VAR_NAME=  TIME,          FID/REAL,        FID/IMAG
##SYMBOL=    X,             R,               I
##VAR_TYPE=  INDEPENDENT,   DEPENDENT,       DEPENDENT
##VAR_FORM=  AFFN,          ASDF,            ASDF
##VAR_DIM=   8192,          8192,            8192
##UNITS=     SECONDS,       ARBITRARY UNITS, ARBITRARY UNITS
##FACTOR=    0.0002768,     1,               1
##FIRST=     0,             0,               0
##LAST=      2.2672688,     0,               0
##MIN=       0,             -54285,          0
##MAX=       2.2672688,     49323,           0
$$ Real data points
##PAGE= N=1
##DATA TABLE= (X++(R..R)), XYDATA
$$ [...]
2100A065j492k03J436r82m18J609j199r54J887m62j134J414k17j582J551M61j584
2117h04J110M17j445P85Q19j349RJ374j358k7J452j148m69J315q15o74J575o10
2135A57j229J467l62q66J346J12j534J170L70j596Q22R69j568N13J122j452J25
2152d34J360j281j12J379j195m40J491p36p38J612n64j331J502n4j658J514L95
2169G10j609J068M68j467O14J012j245L62P07r89k43J620j345k95J414j191l79
2186g88J467n42r43J426l48q97J023pj492J252O23j533P82P01j344J95J322j348
2204d51j14J538j356l34J682j045o66J378m62j022J581k92j408J344K03j525J156
2221B07K93j170P74N46j301N09Q78r66J0R78j200k25J301r65m45J630q97o28J315
$$ plain form
2100 1065 -427 -630 806 -176 -594 1015 -184 -1138 749 287 -847 567 350 -1232 319 780 -804
2117 -804 306 723 -722 63 882 -467 -458 916 -442 -469 983 -165 -634 681 -134 -808 767 157
2135 157 -1072 395 33 -833 513 625 -909 261 631 -965 -143 826 -742 -229 893 -559 -434
2152 -434 926 -355 -467 912 -283 -723 768 32 -706 906 342 -989 513 459 -1199 315 710
2169 710 -899 169 637 -830 -216 796 -449 -87 620 -369 -612 1008 -337 -632 782 -409 -788
2186 -788 679 137 -806 620 272 -625 398 391 -1101 151 774 -759 23 724 -620 -425 897 -451
2204 -451 -565 973 -383 -717 965 -80 -746 632 170 -852 729 437 -971 373 576 -949 207
2221 207 500 -670 104 650 -651 -142 736 -230 -220 758 -442 -667 634 -331 -776 854 -43 -671 644
2240F44l90j112J480l41j053J072M1j354J273M75j455L61J004j219L00J233j311
2257c52j81J321j232OJ196q49n31J290q00n79J593m98j024Q49K50j369J233K53
2275E76j243M97P53j216M39J022j432M24R81j193j33J298j011m42J414o62q30
2292g58J456m53j072J107J41j242J166L09j342R08M30j425Q28O92j289K87J073
2309H16j290o0J195p59p33J408m80q08J178l05q48J168j95q75J081j22j189J101
2327B83L01j299M63P86j203M20R66j143R8J144j273k38J362p82m31J024l27o00
2345d49R40r3j276R97J75j031R60M35j510P44Q81j493P83O06j074m5J058j142
2363e34J27J354j270m28J643q10p40J027l32o85R70j57r17Q86L47j024O51O09
$$ plain form
2240 644 254 -858 622 281 -772 300 341 -1013 260 735 -720 -359 645 -574 -274 959 -352
2257 -352 -533 788 -444 -438 758 -91 -622 668 -132 -711 882 384 -640 209 459 -910 323 576
2275 576 -667 -170 583 -633 -194 828 -604 -180 801 -392 -525 773 -238 -680 734 72 -758
2292 -758 698 245 -827 280 421 -821 345 654 -688 220 650 -775 53 745 -544 -257 816
2309 816 -474 -534 661 -98 -831 577 97 -711 467 162 -686 482 287 -588 493 371 -818 283
2327 283 584 -715 -252 534 -669 -249 717 -426 -328 816 -457 -695 667 -115 -546 478 151 -449
2345 -449 491 398 -878 119 294 -737 223 658 -852 -108 773 -720 63 669 -405 -450 608 -534
2363 -534 -407 947 -323 -751 892 82 -658 369 37 -648 322 165 -752 134 481 -543 108 717
2381G17j272N44O23j117M71M25n10k26J112q54l86R20o47k94J350p07p53J089
2399D85l37o82R88j31r56R72J76j090O86M49j037J75R25r73J53R43j114J7R83
2418F32n72j002J563n10p57R49j74o94R44n1j155J186l7j023Q54M83j329P17P02
2437G26j257L00R51r10k08Q29m13l39R40o12m81R52k33r35J209k16q03O63K18
2456C81q33N44O23j373O19N91q20R5Q73r53l14R92p14l6J054q51l41J194n31p50
2476e50Q70L3r62R12J5q83O36R2n47K55Q21r86r8Q01q57J50J111j055q6J231r32
2497b9m48J048n87l31Q55k65r17J107j44p50M50O23j487J136L03j118N69O29j087
2516d43L01N66q40J56R46p65m64J123n08q74J087k69o00J109o5r06O97L05j277
$$ plain form
2381 717 -555 -11 612 -505 -34 391 -119 -345 767 -87 -473 447 -200 -494 856 149 -604 485
2399 485 148 -534 454 323 -633 339 515 -575 111 560 -477 -302 623 -350 -197 746 -368 -351 632
2418 632 60 -942 621 111 -646 303 129 -565 379 328 -827 359 322 -701 153 636 -693 24 726
2437 726 -531 -231 720 -190 -398 431 18 -321 619 7 -474 478 245 -690 519 303 -500 163 381
2456 381 -452 92 715 -658 -39 552 -268 -173 700 -253 -567 425 -289 -325 729 -122 -463 731 200 -550
2476 -550 320 353 -609 303 318 -565 71 163 -384 -129 692 -294 -392 409 -448 -298 813 -242 -328 903 -29
2497 -29 -477 571 -16 -347 508 243 -674 433 289 -461 -11 612 -875 261 564 -554 15 644 -443
2516 -443 -142 424 -416 -260 686 -79 -543 580 72 -802 285 16 -584 525 460 -446 251 556 -721
2535g21M75P02r76P20K58r68K95O71p67j05J150j019p9O34l12m29Q63l72n79R85
2555D26j13r51J022K3j014P81M02j352R61K58o44K35M61p83O1Q01q19p4P90o37
2575a66m75R13l08l95P65l12n85O01J60p15N05M83j113Q87M17j094K69P00r54
2594d17J57O61o13k48Q78m78l89O53j16p31Q53J16p05P75r5j225J007M33j106
2613e90P71L69r74M24O49p87K35L86q25k01J144r21j90Q86m11n97J147o08l15
2632d08P35J40j153P56J95q51O48O54q89J80M27o39p6P94o86k67Q84o38k94J040
2652E52p67j6O81l10n66Q16j48o68P86Q2r83N17J91o81M52M51q12K51N69o71K25
2673d9O59j068J6Q99q67k50J129l60n20P86j25o95O01J85q73R55o7q85O10M83
$$ plain form
2535 -721 -246 456 -520 200 458 -510 -215 456 -311 -416 734 -285 -364 270 -42 -471 392 20 -559 426
2555 426 313 -638 384 407 -607 174 576 -776 185 443 -201 34 495 -288 -227 574 -245 -319 471 -166
2575 -166 -641 272 -36 -431 334 22 -563 38 198 -517 -12 471 -642 245 662 -432 -163 537 -417
2594 -417 -260 401 -212 -460 418 -60 -449 204 88 -643 210 326 -379 396 301 -924 83 516 -590
2613 -590 181 550 -424 0 649 -138 97 483 -342 -543 601 -320 -510 376 -35 -632 515 -93 -408
2632 -408 327 467 -686 70 265 -586 62 716 -173 7 434 -205 -281 513 -173 -440 444 -194 -488 552
2652 552 -215 -231 450 140 -426 390 242 -426 360 442 -541 -24 167 -514 -62 389 -423 -172 397 -274 -49
2673 -49 610 -458 -442 457 -410 -660 469 109 -411 375 250 -445 156 341 -532 423 356 -529 81 564
2693E64j020L73P22r72K95O97q23k05R54p70l29R78o75M1N34l09m30O06J5o14
2713c68O46J05p73N13K89r99N59M51r13L05P43n90j95P83o53j26Q65n08o20R61
2733D75k74p32R74m47n58R64k17p36Q02J40p74L32P10j054L54N82q29J34N32n70
2753a92j10R55o39m64P63k70k90O63k58m34P35n2p65N13L2m68J68M97o91K62M81
2774D36q55L15N32p03Q9Q24p76j96P79m87l18Q35n18n33J112k30p25L77K86n61
2794c17K14O35j135O29M80q21N2Q55j014J60R89q80k77P42l61k45Q05k85p42P28
2814B12M0q98R02P0p94Q06M9q69O45J45r42N88N43p10J95N33r01J08O30n81M7
2835a82M68k34p77R75k18o25J025m66k87N43j1o04K48L76o07M35L18q69L17R20
$$ plain form
2693 564 -456 -83 639 -333 -38 659 -164 -369 585 -185 -514 464 -211 -170 364 55 -375 231 246 -368
2713 -368 278 383 -390 123 412 -587 -28 423 -490 -185 558 -32 -227 556 -97 -223 642 134 -486 475
2733 475 201 -531 443 -4 -562 402 185 -551 251 391 -383 -51 659 -395 -41 541 -288 -154 378 -192
2753 -192 -302 653 14 -450 313 43 -247 416 158 -276 459 407 -358 155 187 -281 -113 384 -307 -45 436
2774 436 -419 -104 428 -275 -186 638 -138 -334 445 -42 -360 475 -43 -576 536 306 -419 -42 244 -317
2794 -317 -103 532 -603 26 506 -315 -263 592 -422 -262 727 -153 -430 312 -49 -294 511 226 -516 212
2814 212 252 -646 256 326 -468 338 387 -482 163 308 -634 -46 497 -213 -18 515 -386 -278 352 -229 -182
2835 -182 286 52 -725 250 32 -593 432 -34 -321 222 211 -393 -145 231 -376 59 377 -492 -175 745
2855G45j112L46J57l10j41N07j09m67O68l27k08N57l47k79N03K85p89M64M27j240
2875f70O81K69m56K65L51p13J1P35j029J77R52p19j84N18k31l53O83j32o53O35
2895A37O9l00J21K22o47N20J14n91K81O16p44n1O60n71k42P07n98JL01n9m11O65
2917B00k98k23N81N4p51O20M6p21N10M49o46J78L62p09K57M28p72L77L60o25p8
2938d01Q76m43k85M60j59m86R81k20n08K84L11q22N18J10o11O33K1n29J44O96
2958E70r13J00O86o23p0N67k18l55N42k28m02O17k08p57J078o3q84O91J46p81
2978e05Q26Ro47J77P39p02j0N08n50j5O72o01k68P81l83j27N32o14k15N76O4o80
3000d33M77R5n75M96P5p37O94K24p86K62O24n43M0L76m77J15K21r1k07L94j63
$$ plain form
2855 745 -367 -21 136 -174 -315 192 83 -384 284 -43 -251 306 -41 -320 183 468 -321 143 570 -670
2875 -670 11 280 -176 89 440 -273 -262 473 -556 -379 573 -146 -330 188 -43 -396 287 155 -498 137
2895 137 206 -94 27 249 -398 122 236 -355 -74 542 -202 -253 407 -164 -406 301 -297 -296 5 -54 -465 200
2917 200 -98 -321 260 314 -437 183 229 -492 18 467 -179 -1 361 -348 -91 337 -435 -58 302 -323 -401
2938 -401 475 32 -253 207 48 -438 543 323 -185 99 410 -412 106 216 -395 238 259 -270 -126 570
2958 570 -343 -243 443 -180 -250 317 99 -256 286 58 -344 273 65 -692 386 323 -561 130 276 -505
2978 -505 321 330 -317 -140 599 -103 -113 395 -155 -170 502 -99 -367 414 31 -96 436 -178 -393 183 247 -433
3000 -433 44 139 -436 60 135 -602 92 316 -470 -208 416 -127 -87 289 -188 -73 148 57 -150 244 81
3021H1n35Q28l66m40M71J19m00L36K81r04M67J77m93L04M61p59M15M65o26j25
3041b43N80n15k92N95j00n21P15q8p64R13j88o24Q33j68p65O19M65q94L31M31
3061C20p96M30L15m72rN21l75k90P75n21m5M45k20n07O85j95p35O53L93n22K53
3082A03K53o96K05L87n56L46K58m78j82M39k1m25O64k36m95O66j40m26O42j05
3102B03n66O10j85n22N04N1l01N71J2m43m2M93m70j85M18j05j41L83l28l72O47
3123B32j8n97O72j58m13N39j07o15L63N12m32J36r7k09M52L0l88n3K58n73K51
3144b15M27m84QO46n40q9N23O6n85M75n7n35O32j9n97O04no50M09L47o27R8N87
3167D19m33k79N03n17K63L30l93j92N27j44o84P92L0o71P53j08o57M87J06o82
$$ plain form
3021 81 -454 374 8 -432 39 158 -242 94 375 -529 -62 115 -378 -74 387 -372 43 508 -118 -243
3041 -243 337 -178 -470 125 25 -496 219 131 -633 280 92 -532 301 133 -632 -13 452 -442 -111 320
3061 320 -476 -46 269 -203 -212 309 -66 -356 419 -102 -147 298 78 -429 256 61 -674 -21 372 -150 103
3082 103 356 -340 -135 252 -304 42 300 -178 -360 79 58 -367 297 61 -434 232 92 -334 308 203
3102 203 -363 247 62 -460 44 95 -206 365 377 -66 -108 385 -85 -270 148 43 -98 285 -43 -415 232
3123 232 214 -383 289 131 -282 257 150 -465 -102 410 -22 114 17 -192 260 290 -98 -151 107 -466 -215
3144 -215 212 -272 -264 382 -158 -247 276 342 -243 232 175 -360 272 253 -344 260 255 -395 14 361 -266 -168 419
3167 419 -14 -293 210 -307 -44 286 -107 -299 228 84 -600 192 222 -449 304 196 -461 26 132 -550
3187e50M13L97n98M95L71q11L48L17l68k49O46n65l13P60p4n58O69k34o47Q09
3207B58j78l89K04M54o00L07K41n71J26O52m91l69M99j23K0M40o96J18L75j40
3227A37o52P78m47k68Q16k81m74K95J90n52K96M65o56N12L1m94M33J96o20j73
3247d68P83m56j91N99l47k12M75k24k61M62p9k85K67L13p99N04J37l00L4K56l57
3268a49J18M21p26M7M82j57j74L64j71n27O57l09j59N96j75l23L26l07l13O34
3288A55j14l67K69K19m16L41K09o75J25N71n35J34K96q6k47J43q8k05O82l28n14
3309d31N80p4m75N94j07m56K73N96q00K04K88m78J18M61l30O2L21o29J34P21l61
3330B11l84L17o5l70M31J26n23N98j88l66L59K8m05N38j38l97K48J82m87k8R22
$$ plain form
3187 -550 -137 260 -338 157 528 -283 65 382 14 -235 411 -154 -467 293 219 -339 330 96 -551 258
3207 258 80 -309 -105 349 -251 56 297 -274 -148 504 13 -356 143 20 40 480 -216 -98 277 137
3227 137 -515 263 -184 -452 364 83 -391 -96 94 -458 -162 303 -353 159 190 -304 129 325 -295 -468
3247 -468 315 -141 -332 267 -80 -292 183 -41 -302 160 81 -204 63 376 -423 81 218 -82 -48 208 -149
3268 -149 -31 390 -336 -289 193 36 -138 226 55 -472 185 -124 -283 313 138 -185 141 -166 -479 155
3288 155 41 -326 -57 162 -254 87 296 -379 -254 317 -218 -84 212 126 -121 22 -66 -271 411 83 -431
3309 -431 149 75 -400 194 87 -369 -96 500 -300 -96 192 -286 -168 293 -37 25 346 -283 -149 572 211
3330 211 -173 144 79 -291 140 266 -257 341 153 -213 146 174 -231 307 169 -228 20 202 -285 -313 609
3351F09q44J8R0L2l29O66k62k17M98o7m25M53k0o29N24J5n4RJ25m48K26J53n0
3374G3j5N91n38q5K54o18j9O24L5p41N62l7m26K42L40m76L97L2m45J32M93m91
3396a16J91L61n63k00O01k85k52M38l28j61M15j5l32M54l14j1L82N1m10L6L16
3417B58m38J60K09l88J80M14o06K03K92n60K41J93o21K32L42k59j98N28j47k15
3437a80K14k8m01M77n8m33O88l6o11K45M46n73j2M75l07k32N78l78j39N66m95
3458a94K07K69j13l13L44k84N8Q9N4l71K20o7j27M34K08o05L05O1k90j40M32l29
3480a52j57Q41p41k02N41k28j61N11m86J97K75k95R0K25n5l94q4N69o87L27K53
3501A87m09J49L04k30o7L70m97J36K64k66q6N02m10J8K85q9m87M23L7l57L32J92
$$ plain form
3351 609 -235 -217 -127 -95 -424 242 -20 -237 261 194 -231 222 202 -427 97 112 58 67 192 -256 -30 123 73
3374 73 58 649 111 26 280 -338 -357 267 302 -439 123 86 -340 -98 242 -234 163 195 -250 -118 375 -116
3396 -116 75 436 -127 -327 274 -11 -263 175 -153 -314 101 86 -246 208 -106 -117 265 316 -94 -58 258
3417 258 -180 -20 189 -199 -19 395 -211 -8 284 -276 -35 158 -463 -231 111 -148 -346 182 35 -180
3437 -180 34 6 -395 82 24 -409 279 243 -368 -123 323 -250 -262 213 -94 -326 252 -126 -265 301 -194
3458 -194 13 282 169 -144 200 -84 -26 63 117 -254 -34 -101 -228 206 414 -191 114 175 -115 -255 177 -152
3480 -152 -309 532 -209 -411 130 -98 -259 252 -234 -37 238 -57 33 258 203 -191 -275 294 -393 -66 187
3501 187 -222 -73 231 1 -66 304 -193 -57 207 -59 -145 357 -53 -35 250 161 -326 97 134 -223 109 301
3523C01n63J92K76l10M7K67l35O0K45l35J20J31j67j27L50l08J46J1o5o5L20L9
3545B30n16M24n7l76K00L62o57L41L23l99J12J54l14l12O03k03J21K76l95l82
3565d65N77J2m21N58l88J5K43k7j31RK85o09N12j56k07J47L34p47K98L70k59p3
3587a23L40k66j78L59j57j62L56k16j1N2J45m39L49J24m55M00P8m27N4M33m13
3608a57q6N50l51k64N50j73k24L16J04l80L50J04o32O00j68k10R8J26k52J51J84
3629B36m70K66j77Q5O5P7l74K38L42l86k04M91l55j49L37J29l42M09l75j4N41
3650C70k30k79l3K33l60K03K83l05k21O25n45J99M56l61MJ56K9m22L20m25q7O22
3672B32k08k68N16k54k14L37%n36M6O58n55O8M04p08K72O18k59l83M60j29l05
$$ plain form
3523 301 -262 -70 206 -104 -57 210 -125 -65 180 -155 -35 96 -71 -198 152 -156 -10 1 -64 -129 191 230
3545 230 -286 138 81 -295 -95 267 -390 -49 274 -125 -13 141 -173 -485 118 -85 36 312 -83 -465
3565 -465 112 124 -297 261 -127 -112 131 104 -27 -18 267 -342 170 14 -193 -46 288 -459 -161 209 -50 -123
3587 -123 217 -49 -227 132 -25 -187 169 -47 -58 -6 139 -300 49 173 -282 118 196 -231 -177 256 -157
3608 -157 -243 307 -44 -308 242 69 -155 161 265 -115 235 339 -293 307 139 -71 27 153 -99 52 236
3629 236 -234 32 -145 -60 5 82 -292 -54 288 -98 -302 189 -166 -315 22 151 -191 218 -157 -171 370
3650 370 140 -139 -172 61 -299 -96 187 -118 -339 286 -259 -60 396 35 39 195 224 -198 122 -303 -390 232
3672 232 24 -244 272 18 -196 141 141 -395 -349 309 -246 -178 226 -482 -210 408 149 -234 226 97 -208
3693b08M64m37K4K10N8k28J18M9l92M62L12p62L54K60m24j00M01m80L89J44l12
3714i8j97N57m08J05M81m40j0J79o6k31J81K3l26L29J92l20L18Lp21O24p6m21
3736c22L31M6j02j12L76k53j54M22l76n8J25R3k05K90L8l46N56l05nj54K86m0
3758A31k60K35l33L03K70m82J36K94l44k0N05l83j49L59l31k43M80o2k43M05k34
3779C4j19J71l4p6RJ59k13J8K84m34J77j05k64J15L31m52J79N96k92j50L20l70
3801a16r2M20k20l51L93q8o4K46M3m23K24nj79K73L65n64J2M49o30j11O15j70
3823B7k84M16l08M3L55j69k14M31l16k90K39K51l53J68N09p82K29L04m22K2M81
3844C37m68J64J08q7L4J0k38L4K73J97n92L23k5j96J53Q0n01L46N8l79K19K46
$$ plain form
3693 -208 256 -181 -157 53 111 -117 1 50 -342 120 432 -330 24 284 -140 -240 161 -319 70 214 -98
3714 -98 -295 262 -146 -41 440 0 -10 169 103 -128 53 76 -250 79 271 -49 269 272 -449 175 99 -322
3736 -322 9 55 -47 -159 217 -36 -190 232 -144 -202 -77 16 -189 101 139 -207 349 44 39 -115 171 131
3758 131 -129 106 -227 76 346 -136 0 294 -50 -70 435 52 -97 262 -69 -312 168 106 -137 268 34
3779 34 -85 86 52 -24 -15 144 -69 -51 233 -201 -24 -129 -393 -278 53 -399 -220 376 84 -66 254 -116
3801 -116 -208 212 -8 -359 34 -54 -118 128 171 -252 -28 -33 -212 61 426 -138 -126 323 -307 -418 197 27
3823 27 -257 159 -149 -106 249 80 -134 297 -19 -309 -70 181 -172 -4 505 -277 -48 256 -166 -144 337
3844 337 -131 33 141 54 88 98 -140 -106 167 364 -228 95 70 -126 27 107 -394 -48 10 -369 -150 96
3866I6p6k30M34k15j4K47l97j3n7K57k42M78J36m89J07Q4l45K10J08j43J81J99
3888C16m67P3L08m05J07L57l37J04rj03k22M00J34l06L28j28m20M30Kl00K10J01
3910A73m23L16J67o68M67K71k18o7L37n42j2K83p5%JJ34l36L71k58j39K79j83
3932a22q3L97J36l07l3J32k58m5L18l08J85j65j33K18K53j88l05N27l18j06M60
3953B55k23k31M00j51j15K79j7m14K18k23J11K0K72j92O9J06l13J67K42n28M54
3974A86j01j75M1Q4j05MQ3J07k41j9J53k80M87j13n51K41K57m43J42M04l72j55
3996c66N74j40j96K29j05r2K79k03r4N65k40k49J11M4j33P5L2j99M38k35l3J35
4018A97K07n74O2M50n03P4J17j92j71P10j93k74K52J0m16L82o2m26L99k0k22J66
$$ plain form
3866 96 20 -210 224 9 -5 242 -155 -168 -225 32 -210 268 404 -85 22 106 -239 -29 79 -64 117 316
3888 316 -151 -78 230 -175 -68 289 -48 56 47 -56 -278 122 256 -50 278 150 -270 160 162 -138 72 173
3910 173 -250 66 233 -435 32 303 85 18 355 -187 -199 84 9 9 10 144 -192 179 -79 -218 61 -122
3932 -122 -205 192 328 21 -12 120 -138 -183 135 -173 12 -153 -286 -68 185 -3 -308 219 -99 -205 255
3953 255 32 -199 201 50 -65 214 197 -217 1 -222 -111 -91 181 -11 58 164 -149 18 260 -268 186
3974 186 85 -90 -49 35 -70 -66 17 124 -117 -136 17 -263 224 111 -440 -199 58 -385 -243 161 -211 -366
3996 -366 208 68 -128 101 -4 -96 183 -20 -114 451 211 -38 73 117 -16 59 91 -108 330 95 62 197
4018 197 404 -170 -108 342 -161 -87 30 -162 -333 377 184 -90 162 172 -244 138 76 -350 49 29 -193 -27
4040b7J45k14N6J20l58L16M0l52J76K08k37p9N55p05J56K88r7o6M87m87l52O43
4062B16j56j27K94j74k08L78L6m19j05M04j15P9j03j09J27qk61Q4K20m0m70O34
4084A77k63l12P58o23J66K50j85M9j09L16k97J66j96j00L45Q3l11J4J06k14K01
4105B1J24m49J58N31k14m52M13j86k96L68l3j37Q0P0j4n9J8k06M8N91m25j07K17
4128F1j78R0Q3k50j5K35j6k27N29k46j8J94J07m43J60O7n33L90K19m58K59Ok45
4151b29J10M64l91n7K23j95j3L48l48j78N79k73k38J94K05n58L20J56k84K87Q7
4172B09l25L49J7m64K95Nm27M14P3k33O5J15k45R0L61k89m6Kp8k88N53N2l62L42
4196A85n0l57J42J94l87P5K94k94K95L2l68M06J88m61k5K90k26r4J40j93J28Q5
$$ plain form
4040 -27 118 -96 -40 80 -278 38 78 -274 -98 110 -127 -206 349 -356 -200 88 -9 -75 412 -75 -427 216
4062 216 60 -67 227 53 -155 223 259 -160 -265 139 24 103 0 -109 18 10 -251 -167 53 13 -457 177
4084 177 -86 -398 360 -263 -97 153 -32 17 -92 224 -73 93 -103 -203 142 225 -86 -72 34 -180 21
4105 21 145 -304 -146 385 171 -281 132 -54 -350 18 -15 -152 -72 -2 -16 -75 -57 -263 -215 376 -49 -156 61
4128 61 -117 -27 56 -194 -209 26 10 -217 312 66 48 242 349 -94 66 133 -400 -10 209 -249 10 16 -229
4151 -229 -119 345 -46 -103 120 -75 -88 260 -88 -266 313 40 -198 -4 201 -357 -37 119 -165 122 209
4172 209 -116 233 250 -214 81 86 -341 73 146 -87 -22 93 -152 -62 299 10 -36 -34 -112 -400 153 205 -157 185
4196 185 135 -222 -80 114 -273 -198 96 -198 97 129 -239 167 355 -106 -131 159 -67 -161 -21 -214 -86 -1
4218ak72l24N58O3l76L28O0q0R0k3m7j09L25k01R6J8l30J41Q6j32o7L52l17O9
4242i3K42J83k80K24l3l62K87J88m71m9M2J45J26J29k56j57L08k72ML01k50n7
4264a01K49k76j40M80k62j08N3K05k22L12J15o01J88K1M9r9J5l9P8K36j09m05
4286c61K82M1o5L17j76JK83j25k98J88J4l80M17N3l54K12R2k85K78m5j84RL52
4309B66m24kJ21j06J0L36k80l52O04j59j27O60m18l06K28Q1k19J47P8k23K08o2
4331F1r3j36M73l82j76N22k63j72M36j33l68K61m9p6J58R9m17K85K68m74K12J15
4353A51n47N51l10O2j34L29j23J03K62m46K55k4J83m27L39j48j44K12k04j97M77
4374B20j12k53R7J26n7J13O4m03L00J17k72O0J66n30J62L27k53p3L46l4j50K40
$$ plain form
4218 -1 -273 -597 -39 24 -352 -24 36 -44 46 23 -24 -133 192 -9 87 105 -225 -84 2 -130 -197 155 -162 -93
4242 -93 149 332 52 276 243 -119 168 356 -115 -164 -122 23 149 278 22 -135 173 -99 -95 206 -44 -101
4264 -101 148 -128 -268 212 -50 -158 -105 100 -122 190 305 -296 -108 -87 -38 -137 -122 -161 -83 153 44 -361
4286 -361 -79 -38 -103 214 38 39 322 197 -101 87 101 -279 138 191 -163 49 141 -144 134 89 -95 -86 266
4309 266 -158 -160 -39 -145 -135 201 -79 -431 173 14 -113 547 129 -177 51 132 -87 60 138 -85 123 61
4331 61 -32 -168 305 -77 -253 269 6 -166 270 137 -231 30 -19 -95 63 162 -255 30 298 -176 36 151
4353 151 -396 155 -155 -93 -227 102 -21 82 344 -102 153 129 312 -115 224 76 -68 144 -60 -257 220
4374 220 108 -145 -48 78 21 134 198 -205 95 212 -60 0 166 -364 -202 125 -128 -201 145 111 -39 201
4396B01q6j35L71l50j01oJ32J82m58J86r0J07J19k08M77k33j19pJ09j03j44J46
4418a0J42l28K47o6l2J37J32k11K12j53k54L9K71l16J37j4L4L2J35l51O3L98m65
4441b21K11L07j94l70M43j0m40L13k33q0O63k40k85M82l88j6P3Pk64L16J48l20
4463i8l1K17l09J64J64j34k30N59k27j40m0n7k42N59k03j79L12J12m04L44k13
4484g6j56J68J93j40j38J51k35J34L07l85r9L99j19q1P1M1m1J67m23J40P2R1j00
4507e9K35J78n45k7J63j54p8K00r0j03M97k21K00R6l17RK05O4m86M82j31j88K36
4530A66j24j17J04J07j85K89l99l4J10M4q3J33K50m18J41J36j99j82K75p4P4K72
4552B86m77M3J96K75n18K72J4j65K43k78N3OJ65k5l54M38k93m3K04J11j98J40
$$ plain form
4396 201 115 -20 351 1 -100 -106 26 208 -250 -64 -154 -47 72 -136 341 108 -11 -18 91 -12 -156 -10
4418 -10 132 -196 51 -15 -47 90 222 11 223 70 -184 -145 126 -190 -53 -67 -33 -1 134 -217 -154 244 -221
4441 -221 -10 297 103 -267 176 166 -274 39 -194 -274 389 149 -136 346 -42 -58 15 22 -242 74 222 -98
4463 -98 -129 88 -221 -57 107 -27 -257 302 75 -65 -105 -162 -404 155 -48 -227 85 197 -207 137 -76
4484 -76 -232 -64 129 -11 -149 2 -233 -99 208 -177 -276 123 4 -77 -6 35 -6 161 -262 -122 -50 41 -59
4507 -59 176 354 -191 -218 -55 -209 -287 -87 -177 -280 217 -4 196 292 -25 -16 189 253 -233 249 118 -70 166
4530 166 42 -75 29 136 -49 240 -159 -193 -83 -39 -122 11 261 -157 -16 120 -79 -261 14 -60 14 286
4552 286 -191 -148 48 323 -195 77 91 -74 169 -109 -56 -50 115 90 -264 174 -119 -162 42 153 -45 95
4574I5j66l28N18o2j11M73m90n7J44p4j68J47L3l35L43j03j98M24L8k56j27L96
4596A36l96J14K13j34o8N63m24O3l9M6j64M8k14M4M76L7l41J66J98n50L10J32
4618B16k42n2K56k42o8K04j52J7P0O7k25L53k31j49J15L18l12n7O9n1J82J3m0
4641E9j06M27n33J4L91l22k6K50k9k17K51j38l6L51m88K19J62l13J06O2n6k50
4663b22J99K91l34j35L14j71p1K28p8q6J66j29j56R2J92j05O4q9l11M17k11j10
4685b45O5K66k86R3N1j31K4L58m35KL63k21o4L55n67K35M09j59j23k8L2k63L29
4708F0j66p0J42J00o5q0K69k43J99l9l80J99K60l89L6K16k47Q1L65m10J59K4R3
4731A14l19J32L44n57M05O7j64M3J4k73N13j75k90K68o5j61J88Q3l30K35L9q0
$$ plain form
4574 95 -71 -399 119 57 -54 419 -71 -128 16 -58 -226 -79 -46 -381 -38 -141 -339 85 123 -133 -260 136
4596 136 -260 -146 67 -67 -135 428 4 67 28 74 -90 -42 -256 -212 264 301 -40 126 324 -226 84 216
4618 216 -26 -78 178 -64 -132 72 -80 -63 7 74 -151 202 -29 -178 -63 255 -57 -114 -45 -96 86 99 59
4641 59 -47 380 -153 -139 252 -70 -96 154 125 -92 159 21 -15 336 -152 67 229 -84 22 84 28 -222
4663 -222 -23 268 -66 -201 113 -58 -129 99 21 -65 101 -28 -184 -92 100 -5 59 -30 -341 76 -135 -245
4685 -245 -180 86 -200 -107 -56 -187 -163 195 -240 -238 125 -96 -160 195 -372 -137 272 113 -10 -38 -6 -269 60
4708 60 -106 -176 -34 66 1 -79 190 -53 146 107 -273 -74 186 -203 -167 49 -198 -117 248 -162 -3 21 114
4731 114 -205 -73 271 -286 119 186 22 65 79 -194 319 144 -146 122 57 -104 84 167 -163 72 111 31
4753C1K8rj89n5M99l22l12M43J9l20L43j21l47K18J19j22R8K69l00O2Kk20PM32
4777B53k54j93M11j50q0L32k66j55K62k74j93L14J77l53K73k11r5K17L35p52K30
4798a72K60j74K77k69J13q0K57k08m18O81l52J7j22J75J36R2k45j83J61P5k84
4819b63L42j3r3N6K22l13J33m6R4m34K93j28K10J23j26j12L79k57k68M06J15m69
4841a49K34j13j04L50Kk37mJ14j01N4J77l28j31N63l08j36L98j36l63L72l57j93
4863c96N74j47k91J88K35l14M90n9o48N42j94j24J98%j76n8L25j23J01K73l27
4884F9j86J99j00q0N27m31p6K13j48j01K11K96m07j18K48j48j06L22m48O3M77
4905B76n44J16M13l19O9K54l09m1J29L1k14L02j02k54K56l8l73L05N0k18O2K49
$$ plain form
4753 31 59 50 -139 -194 305 -17 -329 114 133 -187 156 35 -312 -94 25 -97 1 270 -30 32 34 -186 -179 253
4777 253 -1 -194 217 67 -13 319 53 -102 160 -114 -307 7 184 -169 104 -107 -202 15 350 -402 -172
4798 -172 88 -86 191 -78 35 -45 212 4 -414 267 -85 -68 -190 -15 121 213 -32 -215 -54 21 -263
4819 -263 79 66 -27 29 251 -62 71 25 119 -315 -22 -150 60 183 57 -55 324 67 -201 205 320 -149
4841 -149 85 -28 -132 218 220 -17 -21 93 -8 46 223 -105 -236 327 19 -117 281 145 -218 154 -203 -396
4863 -396 178 31 -260 -72 163 -151 339 280 -368 174 -20 -144 54 54 -122 -180 145 22 123 396 69
4884 69 -117 82 -18 -98 429 -2 -78 135 -13 -114 97 393 -14 -132 116 -32 -138 184 -264 -201 276
4905 276 -268 -152 261 -58 11 265 -44 -85 44 75 -139 163 61 -193 63 25 -348 -43 7 -211 -149 100
4927A00m2J5Q0o0l99M52j80j54N15j97l19N17k19l03N4J84j75J63J40l79J22K27
4949A42j52k14N23m72P9K56j15k45L38j61Q7J04k35P7J29r2j68J16J46j46J31
4970A28K5l04K91Rl53L46k03j73J83K97j45l28O05o12L7M80m12L05Mk77j40K47
4992A0Q8l78M12j66k72M73j28j24J91M9k64M71k78k62J62J33J0j36J67j79m3J62
5014I8q7k04J48n3mK48K43n37M02j86k41M04j41k78K11M42p60M09n0k08J91R7
5036A44j21k82J74J6j18M32j30k79K17J27l05J93j97O4J42Nk11R6K16k86rO1M5
5059fK86k30j53J11J73l38q7K01K02O0q4j35j17P5K28l69M15k6n22L93o6P6QK46
5083C41n44L74J29n49J03L43l61L73j95J87Kj57J41k63K18M5j45j67P5k59J04
$$ plain form
4927 100 58 73 153 93 -306 146 -34 -188 327 130 -189 328 109 -194 -140 44 -131 32 172 -207 -85 142
4949 142 -10 -224 299 -173 -94 162 47 -198 140 -21 66 170 -65 12 141 49 -119 -3 143 -3 128
4970 128 153 -151 140 149 -204 142 -61 -234 -51 246 101 -227 378 -234 -197 283 -129 176 180 -97 -237 10
4992 10 98 -280 132 -34 -306 167 39 -85 106 155 -109 362 84 -178 -16 117 127 -9 158 -21 -64 98
5014 98 11 -193 -45 -98 -102 146 389 -148 254 68 -173 231 90 -188 23 465 -295 114 64 -144 47 144
5036 144 23 -259 -85 -69 -187 245 115 -164 53 180 -125 68 -129 -65 77 82 -129 -33 183 -103 -112 -51 -6
5059 -6 280 50 -103 8 181 -157 -244 -43 159 219 135 0 -117 -42 186 -183 232 206 -316 77 11 87 95 341
5083 341 -203 171 300 -249 -146 197 -164 209 14 201 203 46 187 -76 142 187 42 -125 -50 -309 -205
5104b05J96K8rj87k22N99j82j42K57kk48M0J30j73O6K52k47O3O9p3j62K44k58
5127a66j35K91j14o7J81p3p5M88m20J3M5J56k46L6K73k71q3J45J15k40L97k56
5149fL8J22r9k32o4L37j03L06q6l08R1Q6l10J54J74j70l4L62k50j25K41Pl12J35
5173d6k15J74K17j18j76K18J57l16K24M9k03J62j32j26L91k65K03k34L03k54O5
5194G8j7J72m17L48l43K4L59k38RJ61k77j77J64K71k81L02K3k18J80j7r3m2m9
5217g8j50K65Q3j95j4M64l92J25J72k30j92J89k3l46N61k66n0l0k7OK02J6j18
5240b8LL08l85K7J62j14N5O2J3j35J70j48P1K9l04k2M39l58J24J85rk01L0P3m18
5265c71M15J8r8J9J09j01Q0M9l12K77P3j58k77J93J67l33L52r7j31M08j2m04M31
$$ plain form
5104 -205 -9 19 10 -177 -399 200 18 -124 133 131 -117 -77 53 -120 -54 198 -49 14 83 10 -152 92 -166
5127 -166 -301 -10 -124 -191 -10 -83 -158 330 -90 -77 -32 124 -122 -86 187 -84 -167 -22 93 -147 250 -6
5149 -6 32 154 55 -177 -241 96 -7 299 213 -95 -4 82 -228 -74 100 -70 -104 258 8 -117 124 131 -181 -46
5173 -46 -261 -87 130 12 -164 54 211 -105 119 168 -35 127 -5 -131 260 -5 198 -36 267 13 78
5194 78 61 233 -184 164 -179 -155 204 -34 -25 136 -141 -318 -154 117 -164 138 161 -57 123 106 13 -29 -78
5217 -78 -228 37 120 -75 -89 375 -17 108 280 50 -142 47 24 -322 239 -27 -77 -107 -134 -128 74 90 -28
5240 -28 -25 283 -102 -75 87 -27 28 90 103 -32 138 -10 61 90 -214 -236 203 -155 -31 154 145 -56 -26 47 -371
5265 -371 44 62 -36 -17 92 -9 71 120 -192 85 158 0 -277 -84 83 -250 102 5 -126 282 270 -134 297
5288B97l80k31K32K24k64K7J46j37L8K3r1l6L19j41j05M49l93k65N67k26j83M34
5310C04j63k24J2K00p4J07P9j80J28jj72q4K50k28J2o9RJ27L4j33J23J26M2k86
5334f1N9o8k04L55qj14J36p0k31R8M97n26p1K94J79k29J35l21l13O89j55k05K16
5357H2j08k43K50P1k89J62J65k10L08k69J20k6j96R4j4K48k88J17J54l80L39R7
5379A84j99Q3J52R5l35Q5M8k82M85k41l42L09M0k97NK62k28L66N9m14p3L59m6
5402G5k20L00m3k87K79m9k07K83Pj82P8L5j04L06j05p0K35k9m03J13K00m64K40
5425a2K50k54P6Lm7o7J37Q4n6O6k73K87l67J04l1k61M06r3Q5l25J40J55J23j03
5449B7J3r4J83j03r4J08j5O2k61o9L84o1m30O54l57r0rJ38j15J79P6lm6J06l20
$$ plain form
5288 297 -83 -314 -82 142 -122 -95 51 -86 -48 -25 -116 -152 167 26 -79 370 -23 -288 279 53 -130 304
5310 304 141 -83 -71 129 55 162 241 61 189 188 16 -68 182 -46 -34 -103 -94 33 67 -66 57 183 225 -61
5334 -61 -2 -70 -274 81 73 -41 95 25 -206 -108 389 -137 -208 86 265 36 171 -150 -463 226 71 -134 82
5357 82 -26 -269 -19 52 -237 -75 90 -120 188 -81 39 13 -183 -89 -103 145 -143 -26 128 -252 87 184
5379 184 -15 68 220 315 -20 65 113 -169 316 75 -267 42 82 -215 -210 52 -176 190 249 -165 -238 121 75
5402 75 -145 155 112 -175 104 55 -152 131 138 -44 34 69 -35 271 166 96 331 302 -101 12 212 -252 -12
5425 -12 238 -16 60 63 16 -51 86 170 114 180 -93 194 -173 -69 -100 -361 45 -48 37 -288 -148 7 130 27
5449 27 40 -54 129 26 -68 40 25 87 -174 -243 141 80 -350 304 -53 -143 -152 -14 -129 50 126 123 77 183 -137
5474a37j9L32j74o4R0j68K27K60n33P0K78q4j94K85j63k04L64j13k45O11k71n3
5496I5j09K7R0j05K77l76M44l19q5J40R9k32N4j8j1OK73k81j2K07j0k79K55k21
5520i1j03L21p4j44O8j04Q6J4L2m4j4N85m72k87M65m19J04L68l21J67J26j89j81
5543a07L74k41j8K30j66l24N7J06j48K73oM3j59K17k70N1L16k84l4R6O4j59J93
5566A04o3j95K72l68J20Jo1K2K52p5k32N61k86l32J25K91r2R1q8j73J67N1j5M
5590H1R8k81j10M89l06L4J94r8k95K17L37m87J70n6j3J80J38m70J02J23Lr3J64
5613A21k01j06K85j56N6l4J56k14L95j97j19L0J69j75j51K76%l60K35O1k68K96
5635I9l24L12j91J48K3K69k90k53K54J60n61M21N3l81M22j58l4m2K19l88K79N2
$$ plain form
5474 -137 -156 176 2 -62 28 -140 87 347 -186 -116 162 78 -116 169 6 -198 166 53 -192 419 148 95
5496 95 -14 13 103 -2 275 -101 343 24 -61 79 178 -54 0 -18 -29 -23 250 -31 -43 164 154 -125 130 -91
5520 -91 -194 127 53 -91 -23 -127 -41 -27 5 -39 -53 532 60 -227 238 -181 -77 291 -30 137 263 74 -107
5543 -107 267 26 8 238 72 -252 -195 -89 -237 36 30 73 -86 131 -139 -88 228 -56 -90 6 70 -89 104
5566 104 41 -154 118 -250 -130 -129 -190 -168 84 9 -223 338 52 -280 -155 136 44 135 47 -126 41 92 77 81
5590 81 179 -102 -212 277 -29 5 199 101 -194 23 360 -127 43 -13 -26 154 292 -178 -76 47 50 -43 121
5613 121 -80 -186 99 -57 -1 -35 121 -93 302 105 -14 16 185 10 -141 135 135 -225 10 71 -197 99
5635 99 -225 87 -104 44 67 336 46 -207 47 207 -354 67 120 -261 161 3 -31 -73 146 -242 37 89
5657H9%L9j40NL7K15Rm50L77o3l63O22l26j39J85j02O6o7R5k03j9R5j24K32m4
5682B6k80L42K25l23p8J76k40L40K7l31jL20j97K81r4j07m40N19nk63L72m6r4
5705A29k47K37l65J2J58q7K53J9k08k5J21j69j13L48Q2j85J25J26k77L33k75n5
5727f3K27r2l06M50l22m2pK71j06P2R1k70J97lj31r2K41K69o74K79R6j50J89q2
5751D2k23R9J72o4N1n9r9j10L37Q3j88j2k27J83M65m81j34K91q1j73K77j04l23
5774b78M38O3m63K96K87l16k24K6J47O2L0l72L30O1k27K0Q0o2o7L94j82j50R4
5797a3M4j92N55l93j98K87J20q2k31K89k07N5J45l49J84Q9l22L75n7j01k86N42
5819B54k78r7L62l37J21J75j13j81L89l94L82j50j46j33J60O4j19K54l42M06k29
$$ plain form
5657 89 89 128 -12 -7 30 245 254 -196 181 118 -245 377 51 -88 97 -5 61 -6 89 -114 -133 -38 -162 70 26
5682 26 -254 88 313 -10 -88 88 -152 188 215 -116 -117 203 6 287 193 86 -354 165 160 -103 269 223 129
5705 129 -118 119 -246 -234 -76 -163 90 109 -99 -124 -3 -172 -285 63 145 -40 85 211 -66 267 -8 -63
5727 -63 164 72 -234 216 -106 -148 -155 116 10 82 173 -97 100 97 -34 -126 115 384 -290 -11 85 -65 124 42
5751 42 -181 -82 90 26 77 18 -81 -191 146 229 41 29 -198 -15 450 -31 -165 126 45 -128 149 45 -278
5774 -278 160 223 -240 56 343 27 -197 -171 -24 38 68 -304 26 87 -140 -120 -40 -102 -169 225 43 -107 -13
5797 -13 31 -161 394 1 -197 90 210 128 -103 186 -21 34 179 -170 14 103 -219 156 99 -2 -288 254
5819 254 -24 -121 241 -96 25 200 87 -94 295 -99 283 133 -13 -146 14 78 -41 213 -129 277 48
5840D8J56l26J56m8k41J14L64l0m45J71J6j10K2J10k7O2j09N0M18n12Q2q7J56
5863a0m28L66K78m89L20k58L61j22J03j71j80L26M2p9K2j11Mk1K86k53P7j73M7
5886f3j2L6j7J96j23q8J8Q3J55l9J73m15n4K93k12J79J62J1l21J46P1k26j25J77
5910EK4J92l2m74M53j1k3j47J71k96L45r1o1q7M63l71K2K41k53Q5j51J42l10L64
5934B00k43j63J83L8r4J45J87n91L34j17M7J11R0m0l28R57o81k35M96l92k9J67
5956D2l07P2L27m8k12J45Rj16K42j46P5q4j61m3L96k01Q9j41M17l35l05L80k27
5979a32J0J41J49m76K83J40j05j47lJ93j00J40j25M3J03n2ml08r3L07J37j46l4
6002g9L67k18L3N2j00j59L69j36j14L0k95J49L4K61n41M2L12k87J30K95l20J05
$$ plain form
5840 48 204 -122 34 -14 -255 -141 223 193 -252 -81 -65 -175 -153 -43 -70 -8 -117 -67 351 -161 -79 -166 -10
5863 -10 -438 -72 206 -283 37 -221 140 18 121 -50 -230 96 138 59 81 -30 -26 -47 239 -14 63 -110 -63
5886 -63 -75 -39 -56 140 17 -71 -53 30 185 146 319 -96 -150 143 -69 110 272 283 -38 108 179 -47 -172 5
5910 5 29 221 189 -285 168 157 134 -13 158 -138 207 116 55 -32 431 60 82 323 70 155 4 146 -164 200
5934 200 -43 -206 -23 15 -79 66 253 -338 -4 -121 -74 37 127 87 -241 716 35 -200 296 -96 -125 42
5956 42 -265 -193 134 86 -126 19 28 -88 154 8 83 -1 -162 -205 191 -10 79 -62 355 20 -285 95 -132
5979 -132 -122 19 168 -308 -25 115 10 -137 -140 53 -47 93 -32 11 114 62 58 -250 -343 -36 101 -45 -79
6002 -79 288 70 103 155 55 -104 265 129 15 45 -250 -101 -67 194 -347 -305 7 -280 -150 145 -175 -70
6024g0N6j5J44KQ9k77L21m25K8L84k92MQ8q9n8L10j3m23K86q1O9Ml5M3oK05m34
6051a85J98K37j71k55J17r0j73O00k13l09K03j7j18K57k26K21j28No9nn4N4J63
6074D2M7l47L7K33j07k39L12J23l9N2l36K23j70P1j00J49J37k72K11ok44K04J72
6097A53m17K83j65m2K20j48J68l81K54J55j1n5r8n5R0Q5r4P7Q6k04J78k38L71
6120B12j49Q1k62J34J2k49J51J19j23Q3R3l93J64n3K22m4J35j72k72L87k43J22
6142d5K62j03k10J8nk37L84M8j25j72M12l43L23k84r4J60J19j08K52J07j73l07
6164a21M19k59j91K91k12J37R8k4m9J6J26l53P6r8k52L95J52j54O8J7R0m44K53
6187a9J85n23L44j1K5L11j04k06K33k83K2r6J75j73L66j76k80J53K76j53k40J17
$$ plain form
6024 -70 -14 -29 115 117 206 -71 250 -175 -147 237 -55 -51 37 -52 -110 200 187 -236 50 -31 38 42 7 50 44 249 -185
6051 -185 13 250 79 -176 -59 -149 -322 278 65 -244 -41 -58 -176 81 -145 76 -52 -47 -116 -121 -175 -121 42
6074 42 89 -258 -221 12 -95 -334 -22 101 62 114 -222 1 -169 -98 -198 -49 88 -184 27 21 -223 -19 153
6097 153 -264 19 -146 -188 32 -116 52 -329 -75 80 69 14 -84 -139 -49 36 -58 19 105 -99 79 -159 212
6120 212 63 144 -118 16 28 -221 -70 49 -74 9 102 -291 -127 -180 42 -2 133 -39 -311 76 -167 -45
6142 -45 217 114 -96 -78 -83 -320 64 112 -13 -185 227 -116 207 -77 -171 -11 108 0 252 359 186 -121
6164 -121 298 39 -152 139 -73 64 162 138 89 105 231 -122 -46 -144 -396 -1 151 -3 65 82 172 -272 -19
6187 -19 166 -357 -13 -24 1 312 208 2 235 -48 -26 -122 53 -120 246 70 -210 -57 219 66 -174 -57
6209e7j32K84k9j98p7K3J7J41K33k16k6J98o7J08mj86j03J63m1j47j4N4j56J87
6233d5R9p2q5J46K48k80L6j54K44m8M6j94L3O2l10N57l12j31J32J00r7J7J42l04
6257a70N5K14nK8j86k1R4j81L31j47j50J16k2P4j2m45N26j89J08O0N9l60L70M4
6281A91l43J74J43j04j50J58J4k51J64J10j30J62l29P0K86j42k14M49o8n01L64
6302E3j49J31j93L91l59NL71k15k19M05m31L03l1j40O3M1K4k95N09k32k09N11
6324C34l45Pj60J54Q9r6qj79K69m9Jq9J83o5j05M09k41Q7k01j41K34k49O7r7L80
6349A89l02L0j14n3K76q5K88j79K57j67l41J10L03l71J87n7m9l9L59K8l80N2L9
6372a9k0K18l12J05q1R9k19J8Q4r5J66r1J00J15L1j17J14r6J08k16J69j11o3J76
$$ plain form
6209 -57 -189 95 66 -132 -209 -186 -169 -28 205 -11 -37 161 94 202 198 12 -91 72 31 -116 -130 -76 -232 -45
6233 -45 54 -18 -103 43 291 11 47 -107 137 89 135 -59 -26 36 -274 283 -29 -160 -28 72 -25 -8 134 -170
6257 -170 -115 99 94 122 -64 -85 9 -172 159 12 -138 -22 -44 30 18 -427 99 -90 18 78 137 -223 147 191
6281 191 -152 22 165 61 -89 69 83 -168 -4 106 -24 138 -191 -121 165 23 -191 258 190 -311 53
6302 53 -96 35 -158 233 -126 -121 250 35 -184 221 -210 93 62 -78 -15 26 50 -245 264 32 -177 334
6324 334 -11 -4 -164 -10 79 -17 -25 -204 65 16 17 -72 111 46 -59 350 109 196 -5 -146 88 -161 -94 -191 189
6349 189 -113 -83 -197 -250 26 -59 229 50 307 140 -201 -91 212 -159 28 -29 -78 -117 242 270 -110 -58 -19
6372 -19 -39 179 -133 -28 -109 -10 -229 -211 -127 -222 -56 -147 -47 68 99 -18 96 0 108 -108 61 -50 -113 63
6396F3K71k42j32l11K90J75k62o5J64j52J13K44j68j77K73j07k87K18L56l49L9
6417d6l8J65j45K39j92n3J73j75J31Q3j61j70L21k63J33J39Qj33J58lk81J88J20
6440A98l66J86m3n1M9j43R9j50N39l84Q1K3M7L4J74l30K0N7Q4j84n6P1R1N7j82
6465g9j3N6J55l46M56l7m07m0N44m05j11K6N0J70j99K05j00J29J8k50L27J59m32
6488a24M09l15J26j94P9N1j6m0r9J65K93k45K06q4l12K27j11R7j56r4L09j15r8
6511d1R9Nj08R0m0L61j35j7j90J31j34k99N65k11l11L08n7k13K30j30N6J99j68
6534a0j15J62K57j24l0j67l51L76J05l0N7k43K40k34N4K09n9r9j87K69M3l10O2
6557a25j03K75m13J75J92J40k7j63n9k6M09l09m6j5K43l53L01j21J40k2j92rJ34
$$ plain form
6396 63 334 92 -40 -351 -61 114 -148 -213 -49 -201 -88 156 -12 -189 84 -23 -310 -92 264 -85 -46
6417 -46 -84 81 -64 175 -17 -70 103 -72 59 142 -19 -189 132 -131 2 141 149 16 174 171 -110 78 198
6440 198 -168 18 -25 -76 -27 -170 -71 -221 318 -66 15 38 85 119 293 -37 -17 40 124 -60 -116 -45 46 103 -79
6465 -79 -92 -36 119 -227 229 192 -215 -255 289 -116 -227 -201 -151 19 -180 25 -75 54 72 -178 149 308 -124
6488 -124 285 -30 96 -98 -19 32 16 -24 -123 42 335 90 296 212 -100 127 16 113 -43 -137 172 57 -41
6511 -41 58 63 -45 45 5 366 231 214 24 155 21 -278 287 76 -235 73 16 -197 33 -97 -41 158 -10
6534 -10 -125 37 294 170 140 -27 -378 -2 103 73 130 -113 127 -107 -53 156 97 -2 -189 80 123 -187 -125
6557 -125 -228 47 -366 -191 1 141 114 -49 -108 -134 275 -34 -80 -95 148 -205 96 -25 115 93 -99 -108 26
6580B6q0M1L2j90J09q1R6o2K08l23J28R8k5Q3j17j81O6n5L97l39M54J1k14l38
6604b56K71J70R5k50O8l08N21k23k00J04j09Q4j55J78O5j65J39J25j6k0k63K37
6626I2nj93K76l98J4J32R9q2LJ70l8l33O85m90k55M38j23O8n7M4r8N4L09l05l31
6651c24L98j9l4n4r1K43m2k31j67M98k04n0J33L2j04J76P7l71M1K09j02p2J87
6674A29j67M4J3j60r0M73k47k46M91m1m06J48j6m4J56m7k57N28m17J22J57k36
6696a13M5R2j59L83k40K14j28k64jj47J72j3J71J26j75M8j17K22m58K26J02J4
6718@J9nM39n92M60k24j44j45J41roO9j22L3O4J21j72J84l6l64J85K50j94KK28
6743A82q4k4k38K07J65P3l65K50n5k91K04N8j38K75j15j96N4k40N8Q6L22q4j84
$$ plain form
6580 26 -54 -13 19 -171 -62 -143 -47 -109 99 -224 -96 2 -23 60 -57 -238 -172 -227 170 -169 285 296 82 -256
6604 -256 15 185 280 30 98 -210 311 88 -112 -8 -117 -33 -188 -10 55 -110 29 154 138 118 -145 92
6626 92 87 -106 170 -228 -214 -82 17 -65 -62 108 70 -263 422 -68 -323 115 -8 60 3 47 -51 3 312 7 -324
6651 -324 74 55 21 -33 -124 119 77 -154 -321 177 -27 -77 56 88 -16 160 237 -134 -93 116 14 -58 129
6674 129 -38 6 19 -141 -231 242 -5 -251 240 199 -207 -59 -75 -119 37 -10 -267 261 -156 -34 123 -113
6696 -113 -68 24 -135 248 8 222 94 -170 -171 -318 -146 -159 12 138 -37 11 -106 116 -342 -116 -14 0
6718 0 19 14 453 -139 321 97 -47 -192 -51 -60 -66 3 -119 -86 -22 99 -73 111 75 -289 -104 146 -48 -46 182
6743 182 98 74 -164 43 208 281 -84 166 111 -180 24 82 -56 219 104 -92 -38 -278 -220 -134 188 104 -80
6766h0m1rJ64j64K32j24N4k01N0K74L7l93o5J12J38j15P7J62k07J40j67J14O5
6789E3j72j32M82k01kn8Q8k6j50R9K25j59J31k40N9J16j98P7L6%k56O7J37O0k7
6814Il7k33J51O7O3j35L09p6J33m88R8J71MJ26o6q2k21O6J14j00J57J58j14L1
6838A05p2k2l10J76R8k4R7j22p6R2J60k08K65pm31K10J70P6m53L04L8l04L25k45
6862a58Q5j11OK14o1j38L37r0j65j80K44J69k09K75j38N9K17n58M9L2J18r0M9
6885d4J41N8k82N9M5l11M05k29N7j5K97k66K62l42PK11O6l11o0J78m8K4M42n05
6909a61J97M7k84J32j63M2m5K80j58J35pN4j39J33j20lL6k6j75J89M8K22k02k44
6933b12K65j48J24r1q8P2j55K06O9K57l44K61k2l26K27p2k74M44n5j74K09Q4p7
$$ plain form
6766 -80 -121 -130 34 -130 102 -22 32 -169 -119 155 192 -201 -266 -154 -16 -131 -54 108 -99 41 -126 -12 53
6789 53 -119 -251 231 30 28 -30 58 32 -118 -19 206 47 178 -62 -3 113 -85 -8 28 28 -228 -161 -24 36 9
6814 9 -28 -261 -110 -43 20 -115 194 118 251 -237 -139 32 36 162 96 14 -207 -141 -27 -127 30 188 74 105
6838 105 33 11 -299 -123 -25 -49 48 -74 -150 -58 102 -106 159 152 -279 -69 101 177 -276 28 66 -238 87 -158
6862 -158 -73 -184 -178 36 -25 -163 174 84 -81 -261 -17 152 -57 218 80 139 356 -202 -153 -121 -3 -93 -44
6885 -44 97 155 -127 -68 -23 -334 71 -158 -101 -116 181 -85 177 -165 -158 53 119 -192 -252 -74 -122 -98 344 -161
6909 -161 36 83 -201 -69 -232 -190 -235 45 -113 22 15 69 -70 63 -57 -60 -24 -50 -225 -36 12 234 32 -212
6933 -212 53 -95 29 -62 -150 -78 -233 -27 42 299 -45 216 194 -132 95 23 -251 193 138 -36 173 257 180
6956A80j49j1j87M08k32j64l0K50j84j79M97l29j07M44l49J33n1l2P9N6k05q9
6978b51L90j17j55J10J96j40N1p7L4q7j07P7J3Q9q0R2N8k45J26M3j3J0r3L8k60
7003b98L17J67p4M4k7j47p1Jj27K50j91R0R0j22Oj76L53K3k15Q9k23K07L03j73
7027I6j41K85L7k98k0L5l2N0J03k44K10Q8k33J60n4pj69M39j45l17J79j21kJ86
7051H5k8k78O63p13J04R9J60l21K45k02j1J04npK21P0p2k39M9R4L7K56m7m69J67
7076c8n8j57K31o3j49M00r8q0J89j63j7J23l1l09K77k80K65k08K2K29o9o4J20
7099G2J18r4j70k53M19P8k16K50l82K91j85r0J45J19j07m17O02j10j27J05j99
7120a51r8J75P0n3N7K69k66J4l35r0N70k45l2m4Q8J09j55O9R7k37N9K0L11j74
$$ plain form
6956 180 31 20 -167 241 9 -155 -185 65 -119 -298 199 -130 -237 207 -142 -9 -60 -92 -13 43 -162 -251
6978 -251 139 22 -133 -23 173 33 84 7 41 -46 -153 -76 -63 26 -54 38 96 -149 -23 20 7 17 -76 -38 -298
7003 -298 19 186 112 156 129 -18 -89 -88 -215 35 -156 -66 24 -98 -92 -268 85 108 -107 -18 -241 -34 269 96
7027 96 -45 240 277 -21 -41 -6 -38 12 115 -129 81 169 -64 96 42 35 -134 305 160 -157 22 -99 -101 85
7051 85 57 -221 442 -271 -167 -68 92 -229 16 -186 -197 -93 -98 -105 116 186 114 -125 -76 18 55 311 264 -205 -38
7076 -38 -96 -253 -22 -85 -234 166 68 -12 177 14 -3 120 89 -220 57 -223 42 -166 -144 85 16 -48 72
7099 72 190 96 -74 -327 92 170 -46 204 -178 113 -72 -162 -17 102 -5 -422 180 70 -57 48 -151
7120 -151 -249 -74 -4 -57 0 269 3 17 -318 -408 162 -83 -115 -159 -71 38 -117 -48 49 -188 -129 -109 202 28
7144B8K12k87p1K76k50J40j34L1r9K46q6K5J06p0J79l82P8K14k10l9j14K84J57
7167B34l12KK17j24r4K23k24J59M7J33l06Mj00K36N7O4l05J15R9j10j21K87n26
7190c45M77p7N4k69J10L4k7o7p4L57j17nO3j5j51L47j20q7n8J21l90J72J06m6
7214go6K99r1k08k17J81R6n2L26m27J21J99j31j42j86K46p7MK8j17L31j28J08
7237I0K93k44L4k84Q9J37P7k40L4J83rn15K13K63k58r0L26j68K4N1J03K19j29
7260A99k99J02P4r0LK0j8j57O3L46l04Q1l8J42qk08n9J90k26R5J6Rk88K35K90
7285A70j52o6o3R0N1M8J34k99J24O9L8j30p2o3K04J54k99n2K35p6J52j64k00l1
7309a98K56N2M2n8j66P1j35J13m9K70k01j44J70k26K88j61M6J02j1J5j51J26j41
$$ plain form
7144 28 240 -47 -118 158 -92 48 -86 -55 -154 92 6 31 137 67 246 -136 -58 156 -54 -93 -207 77 234
7167 234 -78 -76 141 17 -77 146 -78 81 128 261 -45 -41 -141 95 152 216 -89 26 125 15 -106 181 -345
7190 -345 132 55 109 -160 -50 -16 -43 -110 -184 173 56 51 114 99 -52 295 175 88 30 151 -239 -67 39 -7
7214 -7 -73 226 135 -73 -290 -109 -13 -65 261 -166 -45 154 23 -119 -305 -59 -136 -132 -104 -221 110 -18 90
7237 90 383 139 173 -111 -22 115 192 -48 -14 169 160 -355 -142 121 -137 -227 99 -69 -45 6 109 328 199
7260 199 -100 2 76 -14 -11 9 -9 -166 -103 243 -61 20 -18 124 116 -92 -151 39 -187 -92 -76 -67 -355 -120 170
7285 170 18 -48 -111 -21 30 78 212 -87 37 106 144 14 -58 -121 83 237 -62 -114 121 45 197 33 -167 -198
7309 -198 58 110 152 94 -72 -1 -136 -23 -72 198 -3 -147 23 -203 85 -76 -30 72 61 76 -75 51 -90
7332i0R9o5j6k2j94M00j04k61M21l29N4L10j71%j89J91j91QK29l1k06K71l22O1
7356a47L44j74j44K75k42N9j70J61J96j97Q4M7j83J60P9m0L4k98K23m08N20m23
7378b44K01R4j13mk50M39n9o2j90L33K48m21J53M2k34p0K32M0M6k55l8M9O4j39
7402a38Q7q8K89k3l6l30J94K55k46q5K88k44O5N1r6J7K39l30P9mJ60j82K4J38
7426H4k23PK50J1l51M42l66K56j94r7J96q1p3P6J60l70K07N3L28l0j99j59JJ67
7450I5j3k18j1K90m3m9j02P2J49q8p0p1J28J49k09J46n1k33J08Jj74J95K61j68
7474I4n6J7k24l4M54j63K7j94o7P0l4J56k45L0J22K08k32N5o4K17k57j34N30m59
7498a83Q6Q9J9M8Kk20J49p8J48j81K65j60J32n4K2l35K08q4J2J82j06O1n2%j02
$$ plain form
7332 -90 9 -56 -72 -94 -288 112 8 -253 168 -161 -107 203 32 32 -157 34 -157 -149 80 49 -157 114 -208 -147
7356 -147 197 23 -121 154 -88 -29 -199 -38 158 -39 45 92 -91 69 148 108 142 -156 67 -341 179 -244
7378 -244 -43 51 -62 -66 -316 123 64 2 -188 145 393 -28 125 167 -67 -137 95 135 181 -74 -112 -63 1 -138
7402 -138 -51 -139 150 127 91 -239 -45 210 -36 -121 167 -77 -12 39 -57 -40 199 -131 -52 -56 104 -78 -54 84
7426 84 -139 -132 118 129 -222 220 -146 110 -84 -181 15 -66 -139 -63 97 -273 -66 -13 315 285 86 -73 -72 95
7450 95 82 -136 -147 143 100 51 -51 21 170 82 12 -59 69 218 9 155 104 -129 -21 -20 -194 1 262 94
7474 94 38 55 -169 -203 251 88 115 -79 -146 -76 -110 46 -199 -169 -47 161 -71 -16 -80 137 -120 -254 276 -183
7498 -183 -97 -8 11 59 61 -159 -10 -88 60 -121 144 -16 116 62 84 -251 -43 -127 -115 67 -39 22 -30 -30 -132
7523a32M00l94k1J26Q6m9r2KR5p4R9Kl26K87n7J3K48j19j61j76L16j88J09M80
7547D74n29L8j5p5j43L29j31KJ20o3p1J17l58J78J81M8p8j46J48j04J44l49o4
7570c47J13J79N3k35K23Q5m7p1M8R4M7j07qJ8K03k81M1n5L2k7K1j12J3L17j89
7595H%j30j24K1M33j73j97Q6K43q0q4l2O8r6J81nnj70j60K23j4j01L37k66Q5o4
7621a6mk51O8K09pj2k4K56l77K17J7KKk37J56K2QN6r1K54k99l6R1j47Q9J17k61
7648a98K79L2j12M8K04k75M0p3o2R7j5m4J98m0l07M12l19J50O4j78P3l2K22o3
7672A01j22M0J40k25l09L21J23J39o8j31O4j72M4J92k44j60K57K2o8K01j36O8
7694G7j85J02j75J01J38J60m7Q2r2n6j51P6j56J68j05K24k65J41O9k72R2jQ8p1
$$ plain form
7523 -132 268 -126 -147 -21 65 16 -76 -74 21 -53 46 48 -278 9 -48 -35 213 94 -67 -243 73 -115 -6 474
7547 474 -55 -17 -32 -107 -250 79 -52 -50 70 7 -64 53 -305 -127 54 102 24 -122 26 -78 66 -283 -347
7570 -347 -234 -55 -2 -237 -14 71 24 -47 1 95 142 35 27 45 248 -33 8 -47 -15 -42 -21 -133 -120 197 8
7595 8 8 -122 -246 -225 208 35 -162 -76 167 87 3 -29 39 -57 124 119 114 -56 -216 7 -7 -108 229 -37 48 -16
7621 -16 -20 -271 -203 6 -1 -13 -37 219 -158 59 76 78 80 -157 -1 21 29 85 -6 248 -51 -87 4 -143 -54 63 -198
7648 -198 81 113 1 49 253 -22 18 -55 -117 -20 -35 -79 119 79 -228 184 -135 15 79 -99 -26 -58 164 101
7672 101 -21 19 159 -66 -375 -54 69 208 140 9 73 -99 -55 137 -107 -267 -10 12 -56 145 9 77
7694 77 -108 -6 -181 -80 58 218 171 253 161 105 -46 30 -126 42 -63 161 -104 37 106 -166 -74 -75 13 -58
7718e8J32q4R0k82K70k74LK57m7m1j60L8L68l83M07k94l6L08L6l84nK45k47L99
7742B58j27l24K51jj27j8J79K09l25J35o9j88L6m5L17k42J07j5j67O5Pj64K79
7765C1j2j7J99k37J0j17q5K69j41M10m69J35K32m75K09l11L11N4p4J05K03l54
7787a24O0K76j22J81l10j91J00J46J63j09k42K75m4K1R6k16k1m0K62j00O1K0P5
7810B17j97K30k22j87M61m15lK33o3j17K6O8j73J81J7o9K74l20O0j58J97o8P2
7833D4m6L1J98r8k25L3m6J49j13J96k78K61k00J85J2P1O5l24j53K86j70P2P1j72
7857a51r1K30J31j28j44O7M1j20J59q0J75n8r6J48j33J56k07j5J79j00j34K06
7879C5k6p8K30j07k1m4j29J56j50K27r9k64J41J89J24k26O9J51l44K12p7k3j53
$$ plain form
7718 -58 74 -10 80 -202 68 -206 -203 54 7 -34 -194 -156 212 -171 236 -58 -94 214 250 -134 -139 106 -141 258
7742 258 131 -193 58 57 -70 -88 91 300 -25 110 41 -147 -111 -156 161 -81 26 11 -156 -91 -84 -248 31
7765 31 19 2 201 -36 -26 -143 -228 41 -100 310 -159 -24 208 -267 -58 -369 -58 -4 -78 27 230 -124
7787 -124 -64 212 90 271 -39 -230 -130 16 179 70 -172 103 59 80 176 -40 -61 -101 161 61 122 142 217
7810 217 20 250 28 -159 302 -113 -116 117 54 -63 -37 31 -142 39 56 -13 261 -59 1 -157 40 -28 44
7833 44 -2 29 227 129 -96 -63 -109 40 -73 123 -155 106 -94 91 103 174 239 -85 -238 48 -122 -50 21 -151
7857 -151 -242 -12 119 -9 -153 -86 -45 -165 -6 -86 89 31 -65 83 -50 106 -101 -116 63 -37 -171 35
7879 35 9 -69 161 54 33 -11 -140 16 -134 93 -6 -270 -129 60 184 -42 27 178 -166 46 -31 -54 -207
7902b07k9J35j66q9L59L8k86K72l7j6k21Q8R6j07l7K61j65K53j06M1L9q5j01J
7926f9R0n9J82p5j21m4o6J83j61Q7Q7L7l4j27R8k26K05R5O6n2q2k11K79j5j81
7951a14j66L82p2q9J82k23K10J15l55M9K44r4j86K28k17J47j52pN4J19L8PJ11
7974B11l53j4J29O3K76k50j25j79K61j54L18l52L15r6j44P8Q5j06O1j26o9K20
7996D9j57J61j3k43J92P3j09J02j66J85j32J79j40j92J57K40k46J73j4j95J22
8017B6J79j63j94J70O1q4K27k13k7N6j64Q0J53j24j79J05l8J55m1j2R9L3Q4k59
8041g0J29k30J4J17J7j51K31l3K7l17K75l3Q9j4l33J34M5L04n24M79j84o8l2k9
8065a57K41l91L37p8R5j79p4J20J15j55o7L51k81L1P9j84l3kJ21J91j0J0j58J39
$$ plain form
7902 -207 -236 -101 -267 -356 3 41 -245 27 -10 -26 -247 -159 -63 -170 -207 54 -111 142 36 77 116 31 -70 -69
7926 -69 21 -38 144 69 -52 -96 -162 21 -140 -53 34 71 37 -90 8 -218 -13 82 148 96 14 -197 82 67 -114
7951 -114 -280 102 30 -59 123 -100 110 225 -130 -81 163 69 -117 111 -106 41 -111 -118 -64 55 93 100 211
7974 211 -142 -156 -27 36 312 62 -63 -242 19 -135 183 -169 146 50 -94 -16 69 -37 24 -102 -171 49
7996 49 -108 53 40 -203 -11 62 -47 55 -111 74 -58 121 -19 -211 -54 186 -60 113 99 -96 26
8017 26 205 42 -152 18 79 -5 222 9 -18 38 -126 -46 107 -17 -196 -91 -129 26 -15 -27 72 105 189 -70
8041 -70 59 -171 -157 -40 -23 -174 57 24 51 -266 9 -24 65 51 -282 -148 -103 201 -323 156 -28 -96 -128 -157
8065 -157 84 -307 30 -48 47 -132 -206 -86 29 -126 -193 158 -123 -92 -13 -197 -230 -232 -111 80 70 80 -78 61
8089F1j55P0j04K00m3K77k19j49K57j02j94J2J17k05K40k16K12J8J60k29j29J97
8111G6J01j86L7N2j31j2J25j84%L01k44J52j26L6L4p3J02k4K7J29o6l44L37k00
8135h1J98k11O8q6L8J1K8P5m5l1J03k31l5m9J60K02j10N7k6j83J00j00k7M85m24
8160a14J93k05L5Q1q5J29P5j21o6J36o2O3j88K67J13k66j83J70J76j60K5O2j26
8183e1j3j57J89n8J97k06J10J42
$$ plain form
8089 61 -94 -24 -128 72 29 306 87 -62 195 93 -101 -89 28 -177 63 -153 59 77 237 8 -121 76
8111 76 177 -9 28 80 -51 -63 62 -122 -122 179 -65 87 -39 -3 31 -42 60 36 63 192 126 -218 119 -81
8135 -81 117 -94 -26 -112 -74 -63 -35 40 -5 -36 67 -164 -199 -248 -88 114 4 61 35 -148 -48 -148 -175 310 -114
8160 -114 79 -126 -91 -10 -95 34 109 -12 -78 58 -4 59 -129 138 251 -15 -198 -28 148 -12 13 75 -51
8183 -51 -64 -221 -32 -90 107 -99 11 153
8191A53
$$ Imaginary data points
##PAGE= N=2
##DATA TABLE= (X++(I..I)), XYDATA
0@%%%%%%%%%%%%%%%kJ0j6J6j6J6k4L2l2M0m8N2o1P3q3R3j07J22j39J58j79K02
37A07k26K51k80L13l48L87m30M75n27N83o42P08p78Q57r45J042j149J268j402
56g36J553j726J924k155K427k755L163l680M360n300O700r027J3859m5050O3196
71B6753N421p9804O5399j5993j260J0110l9791M2620J3058o0331L7325R004j1392
84A119j581k5875N2731m626p6053P6433R105p1056N1008l794j9433L6756n1998
97b7264K1087M8499p1342J3025M5797l3737l044l810K1482J0894n7085L8165L0296
110C2963o0352K8761P067k0642L7650m6690K812O7663p1533p000O7679m3168r570
123a4360J9064o453J8570l1439L33M3027l7373k755J9458j3507K2971l1346p663
$$ plain form
0 0 0 0 0 0 0 0 0 0 0 0 0 0 0 0 0 -2 8 -8 8 -8 8 -16 16 -16 24 -24 28 -33 40 -43 50 -57 65 -74 84 -95 107
37 107 -119 132 -148 165 -183 204 -226 249 -278 305 -337 371 -407 450 -495 547 -602 666 -736
56 -736 817 -909 1015 -1140 1287 -1468 1695 -1985 2375 -2925 3775 -5252 8607 -36443 26753
71 26753 32174 -47630 17769 1776 516 10626 -29165 13455 26513 -33818 3507 12511 1119
84 1119 -462 -26337 26394 21768 -54285 22148 31253 -39803 11205 7411 -12022 24734 -27264
97 -27264 -6177 42322 -29020 -15995 29802 -3935 -6979 -10789 10693 21587 -35498 2667 32963
110 32963 -27389 1372 8439 -12203 25447 -21243 -18431 49232 -22301 -29301 38378 -4790 -14360
123 -14360 4704 -1749 16821 -14618 -14285 28742 -8631 -11386 8072 -5435 17536 -13810 -21473
136b1473O4800n5461k2636P1812l8840j7857L3058k1733J8504o067k9832M5810
148B0085j0007l2569K7483Q03P72j4654r435M8211l2484l1095O0785k3476k4079
161a9660L3440k3663J5541R211m6004M3435J1656n3227K9764J6113k0496j12n645
174i647K5189q699l3349L9727j885k7090K3672j4904R853J5145m7917L4500K6494
187C1089o0584K4677K8235l4337Q907L26K639J2448l0038J4285J9362k5586O323
200b254M26M438J1396l7244K2395L1398n4601J4605L4416l6768R325O082j1461
213g847K4136k3374q449L6020k0625j3290J6715J768J926k1532J0155K8926l9238
226a4709J792L3828k8542M730Q498j7800K8288j5917k3879M4750j3688k8898K8293
$$ plain form
136 -21473 43327 -12134 -34770 37042 -1798 -19655 13403 -8330 10174 4107 -25725 20085
148 20085 10078 -22491 4992 5795 6567 -8087 -17522 30689 -1795 -32890 27895 4419 -19660
161 -19660 13780 -9883 5658 14869 -31135 12300 23956 -29271 493 16606 -3890 -4002 -9647
174 -9647 15542 6843 -26506 13221 11336 -15754 7918 -6986 2867 18012 -29905 4595 31089
187 31089 -29495 -4818 23417 -10920 -2013 -1687 952 13400 -16638 -2353 17009 -8577 -2254
200 -2254 -1828 2610 14006 -23238 -843 30555 -24046 -9441 24975 -11793 -2468 3614 -7847
213 -7847 16289 -7085 -15534 20486 -139 -13429 3286 5054 6980 -14552 -4397 24529 -14709
226 -14709 -12917 20911 -7631 -2901 5597 -12203 16085 168 -23711 21039 7351 -21547 6746
239F746N85q584l561n97K0528j8339j1218K7476j3132l660O932j3174K3904j0147
253C759k9163M3149n579l6770L1802K649j7254Q713o677J1094J323k1153J7022
266B915N810j3204K035k242J5179o321k5905L4101J612l6237K7341N351k0090
279i655J4753j0094L348J6068k7053O388K2239k0225l481R212N426m283j7252
292a4609K0450P566k9060J6262Q744j6566J2452r839r12K2934k7809j836L2303
305B0080k2718r869J9373l078m038o161O232J1023j7764J858J1777q297M295p217
319d504n61K1749k4632o449L4223k0723j3679K4202p983l956K707n915J2895n104
333B270j1929J3068J652n822m635L196J5263j8375p681K8988j5315j4112K2244
$$ plain form
239 6746 7331 -1253 -4814 -5411 15117 -3222 -14440 13036 -96 -3756 3176 -9998 13906 3759
253 3759 -25404 17745 12166 -24604 7198 9847 -7407 1306 -5371 5723 7046 -14107 2915
266 2915 8725 -4479 -2444 -4686 10493 4172 -21733 12368 13980 -22257 5084 10435 -9655
279 -9655 5098 -4996 -1648 14420 -12633 -6245 15994 -4231 -7712 1500 6926 2643 -14609
292 -14609 5841 13407 -15653 609 9353 -7213 5239 -4600 -5512 17422 -10387 -12223 20080
305 20080 -2638 -12507 6866 3788 -250 -6411 -179 10844 -6920 -5062 6715 -1582 2713 -4504
319 -4504 -5065 16684 -7948 -14397 19826 -897 -14576 9626 1643 -2313 394 -5521 7374 2270
333 2270 -9659 3409 5061 -761 -5396 -2200 13063 -5312 -12993 15995 680 -13432 8812
346H812q096l372P075j3057J2963M767k2131J3354J0632j5758j109Q065N166j0499
360c188o009J8921o735j2914J4761m250j892O079j4369J2438R453k6592J2051
373b246J6614k1061L33J1975l444l728l210P450K047r157L432J990O52J222j1882
388i013J2072R028k5332R729J8374k2147J649J2655q758K722j626l338J0419o095
402C39p112Q755K984o061o315J0964N344j9061P094J5168j7989J834R988r227
416c295N917j921q874J5775l724j5072J4267M708j3047M66R209K3j0584L981R071
431F900r100m01M855n061P090l613r992J7692l156j8266J6948M527j5938N721
445a794N989l866j961k54L573J89k972q81J611O137p303o827J6648l983j6487
$$ plain form
346 8812 716 -2656 4419 -8638 4325 9092 -13039 315 10947 -4811 -5920 2145 7311 -3188
360 -3188 -9197 9724 2989 -9925 4836 586 -1306 4773 -9596 2842 12295 -14297 -2246
373 -2246 14368 -6693 -6360 5615 2171 -1557 -4767 2683 4730 -4427 -995 995 1647 2869 -9013
388 -9013 3059 12087 -13245 -3516 14858 -7289 -5640 7015 -1743 979 -647 -3985 6434 339
402 339 -6773 1982 4966 -1095 -7410 3554 8898 -10163 -3069 12099 -5890 -4056 5932 -3295
416 -3295 2622 701 -8173 7602 3878 -11194 3073 7781 -5266 -4800 4409 4432 -6152 -2171 6900
431 6900 -2200 -2601 2254 -2807 4283 670 -9322 8370 5214 -13052 3896 8423 -7515 -1794
445 -1794 4195 329 -1632 -1886 1687 1876 -1096 -1977 -366 5771 -1532 -8359 8289 4306 -12181
460a2181J6424L155j5015P705K856n030M641m577p88Q714o515n647Q907L350r936
475c937j226J2298m763j1265J2213J585j0379P241r29l540P965q283k058J3737
489H659q909q108J3415k89j0446L915O969n209m169N845j67l130K980l585J413
504h16P025j0885p05J5124j0955p365J5189l566r272P610J046l591J438j061J31
519f53L235k362m469O116L809j1394K214J2325j1080m608J3280n241n753P352
533B771l351k97M317o808J367Q007p491m143R861n35r745N413P048r193j054P923
549D090m713j283M634n528L308M076j0068M065R191j1251j950J1533n101o141
563e138O637J552n359J697K089k867K768l90n510P023J831j1013O659P463j2121
$$ plain form
460 -12181 4243 7398 -7617 88 2944 -2086 2555 -2022 -2810 5904 -611 -6258 2649 5999 -3937
475 -3937 -5163 7135 2372 -8893 3320 4905 -5474 1767 838 -2702 5263 -3020 -5078 8659
489 8659 -250 -8358 5057 4768 -5678 -1763 5206 -3 -4172 1673 1506 -1624 1356 -2229 -816
504 -816 6209 -4676 -5381 9743 -1212 -8577 6612 3046 -6226 1384 2430 -1161 277 -784 -653
519 -653 2582 220 -4249 1867 5676 -5718 -3504 8821 -2259 -6867 6413 1172 -4581 2771
533 2771 -580 -877 3440 -3368 -2001 6006 -1485 -5628 4233 3698 -6047 -634 6414 -2779 -3833 4090
549 4090 -623 -1906 2728 -2800 508 4584 -5484 -1419 7772 -3479 -5429 6104 1003 -5138
563 -5138 1499 3051 -2308 -611 1478 -1389 1379 989 -4521 2502 4333 -6680 -21 7442 -4679
578d679J176R488p022k300O133l330n99L057l890P15N376n363l072Q827j944r039
594f466Q122L805j0354L516O081p531J986L265n325L953J818p332M401N186q625
609c500J87Q952n634n210Q402n64o532M872R54m411M329j202m494P004n98q348
625e793P496L415j0253L684O555p014r94O105l566j265L551k843n80M925m781
640a358k259Q450l829o701Q843L27q712N747L245o439K604K462m743L289J278
655B204n447L644L689p673J391P592o200l607Q335k354n906O086n22m029M671
670A874j324l531N735j495n872O711J616q250M329M652p178P40N848m935o19M270
686B571l804k46M740m570j360P120n071m013Q094j861o414O664J148o186L368
$$ plain form
578 -4679 -3503 5985 -1037 -3337 2796 -534 -1133 1924 -1966 -1251 4125 -1238 -4310 4517 2573 -6466
594 -6466 1656 5461 -4893 -1377 4704 -2827 -841 2424 -2901 1052 2870 -4462 -61 5125 -3500
609 -3500 -3313 5639 5 -5205 3197 2633 -3899 973 1927 -2484 1845 643 -3851 3153 2555 -5793
625 -5793 1703 5118 -5135 -1451 5104 -1910 -2904 3201 -365 -1630 1921 -922 -1502 3423 -1358
640 -1358 -3617 4833 1004 -5697 3146 3473 -5239 508 3753 -2686 -82 2380 -2363 926 2204
655 2204 -3243 401 4090 -3583 -2192 5400 -800 -4407 3928 1574 -4332 1754 1232 -2797 1874
670 1874 550 -2981 2754 1259 -4613 2098 3714 -4536 -207 4445 -2733 -1993 3855 -1080 -1699 2571
686 2571 -1233 -1479 3261 -1309 -2669 4451 -620 -4633 3461 1600 -4814 1850 2998 -3188 180
701A80K272m859K932J409m886L512K957p081K361N919o973q92P371m352l496O426
717B800k061l587M888j680l041N089j849m002N844j56o595N040L213p277K382
732i92M435n260P4M646m300O4M172m449j67N328m735k145O902k835m841O241J28
749B266n796M270J466m889L261J458m741L249K034n908K926M295o546K43O322
764C910m897k014O232l258k762N200k046l034N023k101l423N838j064n556N481
779A529J210o302L421L436n815J468M111m945O79M185m669J22M934m815j136N914
795C327l641l087O104j798m499N407j95m395L956M50m637L699J552n350L325L074
811C292o009J442N046n673l40N639m205j435M959k860k392N164k361l127N395
$$ plain form
701 180 2452 -2407 525 1934 -2952 560 3517 -3564 -1203 4716 -2257 -3149 4222 -130 -3626 2800
717 2800 739 -2848 2040 360 -2681 2408 559 -3443 2401 2245 -4350 690 3903 -3374 -992
732 -992 3443 -1817 -1743 2903 -1397 -1333 2839 -1610 -1777 3551 -1184 -3329 3573 738 -4103 2138 2266
749 2266 -3530 740 2206 -2683 578 2036 -2705 544 2578 -3330 -404 3891 -2655 -2412 3910
764 3910 -987 -3001 3231 -27 -2789 2411 365 -2669 2354 253 -3170 2668 1604 -3952 1529
779 1529 2739 -3563 -142 3294 -2521 -1053 3058 -1887 -1208 2977 -1692 -1570 3364 -1451 -2587 3327
795 3327 -314 -3401 2703 905 -3594 1813 1618 -2777 1179 1629 -3008 691 2243 -3107 218 3292
811 3292 -2717 -1275 3771 -1902 -2242 3397 -808 -2243 2716 -144 -2536 2628 267 -2860 2535
826B535j553m250N079L78n750M169K611o114K444L251n049J396L613m702R11M160
842C129m949l55N527m050k265N905k702l755N989j275m478M801Qm416M188N63
858A865m841L409K262n566K267L690n260R12M590m661n20M700l666j377M615k455
874c6k276M805k061l598N241n22n037M669Q07n100L409K146m923K242L034n149
890b349J607L627m879P88M305m538n68N314l750k250N384k022l590M874r44l888
906b879M412K43m753M107J370n427L424K627n536J766L660n062O10M542m135p81
922a812M542l491j545N049k908k835N548j658l763M615l34m499M058J097m746
937b682L106J800m549J972K967m632J217L788m494n64N067m004j230M964l002
$$ plain form
826 2535 982 -3268 1811 2189 -3561 608 3219 -2895 -451 2800 -2249 -853 2760 -1942 -1031 3129
842 3129 -1820 -2175 3352 -698 -2963 2942 240 -3515 2474 1199 -3279 1522 1530 -2886 1302 1865
858 1865 -2976 433 2695 -2871 -604 3086 -2174 -1262 3328 -1333 -1853 2847 -819 -2196 2419 -36
874 -36 -2312 2493 432 -3166 2075 1553 -3484 1185 1992 -3108 301 2447 -2476 -234 2800 -2349
890 -2349 -742 2885 -1994 -1206 3099 -1439 -2007 3307 -443 -2693 2691 669 -2921 1953 1009 -2879
906 -2879 1533 1776 -2977 1130 2500 -2927 497 3124 -2412 -646 3014 -2048 -1438 3104 -1031 -1812
922 -1812 2730 -761 -2306 2743 -165 -3000 2548 890 -2873 1742 1408 -3091 967 2064 -2682
937 -2682 424 2224 -2325 -353 2614 -2018 -801 2987 -1507 -2071 2996 -1008 -2238 2726 -276
952b76k414N148j764l262M723r56m101M129O13m526L333J610m867K604K716n105
968b395J773L599m511J29M425m364m90M549l425j577M836k376k682M511j003l911
984b912M670k16m468L851R70m359K747K055m698J941L163m577P57L795l945n93
1000a819M703l389j862M781k236k621M782j738l302M478o47l832L686O86m200
1015b530L422J227m468K173K765m488J078L461m063j77M293l749q28M403k847
1030c28j982M576j944k925M387q04l647L938O1l780K750J726m571K815K156m607
1046b179J547L247m170K43L888l590q23M325l108j460M504k383k506M420j491
1061D64k936M138k54m096L627Q38m144K438J975l973J571K853m169P13L646m105
$$ plain form
952 -276 -2690 2458 694 -2568 2155 1199 -2902 1227 1840 -2686 647 2257 -2610 -6 2710 -2395
968 -2395 -622 2977 -1534 -1405 3020 -1344 -1834 2715 -710 -2287 2549 173 -2509 2002 999 -2912
984 -2912 1758 1542 -2926 925 1895 -2464 283 2338 -2360 -419 2744 -1833 -1076 2719 -1226 -1819
1000 -1819 2884 -505 -2367 2414 178 -2443 2339 601 -2701 1777 1130 -2702 984 1670 -2530
1015 -2530 892 2119 -2349 -176 2589 -1899 -821 2640 -1423 -1600 2693 -1056 -1884 2519 -328
1030 -328 -2310 2266 322 -2603 1784 980 -2667 1271 1332 -2448 302 2028 -2543 272 2428 -2179
1046 -2179 -632 2615 -1555 -1312 2576 -1014 -1837 2488 -620 -2080 2424 41 -2465 1955 464
1061 464 -2472 1666 1412 -2684 943 1781 -2363 75 2050 -1923 -352 2501 -1668 -955 2691 -1414
1077a414oM143l508j129M074k188k110M076j316l300M418o99l534L628N38l994
1093b321K622J643m316K568K235m268J118L085l852R5L870l311q72M162l087j588
1109b217M307j779k682M207r51l601M268j42l826L096J177m407K570K339m455
1124b096J441L155m336Q59L253l393m53L968k875j525M370k439k114L973j132
1139F56l052L880l67l646L647M00l803K368J860l851J561K540m050J021L130l452
1155a158k14L772l037j214M090k464j781L898j469k702L790n91l096L511J0l678
1171b333K708J370l740J776K454l884R54L100l714J96L489l237q55M221k908j523
1187a926M035j778k255L532q71l005L514j85l327K779J271l884K087J995l834
$$ plain form
1077 -1414 -1420 2723 -785 -1914 2160 -28 -2138 1938 622 -2678 1740 1041 -2493 1135 1673 -2321
1093 -2321 301 1944 -2372 196 2431 -1837 -719 2366 -1486 -1391 2479 -832 -1704 2458 -629 -2217
1109 -2217 2090 311 -2371 1836 885 -2716 1552 1410 -2416 680 1857 -2550 20 2359 -2096
1124 -2096 -655 2500 -1836 -977 2276 -1117 -1570 2398 -477 -2002 2368 -71 -2185 1788 656
1139 656 -2396 1484 1117 -2529 1118 1518 -2285 83 1943 -1908 -347 2193 -1857 -836 2294 -1158
1155 -1158 -1372 2400 -637 -1851 2239 -225 -2006 1892 423 -2279 1511 920 -2176 1335 1345 -2333
1171 -2333 375 1745 -1995 -219 2235 -1649 -695 2405 -1309 -1113 2376 -861 -1716 2505 -403 -1926
1187 -1926 2109 331 -1924 1608 737 -2268 1246 1061 -2266 513 1784 -2100 -13 1982 -1852
1202a852J217L175l893R3L457l240l31L526k595j202L840k159k045L530j008k605
1218b092L417l75l139K977N69l363K241J634l740J659K115l644R23L030l565m8
1234a401L561k812r03L627k206j881L943j408k501L214l27l157L511O7l505K609
1250D31J171l582K078J899l668J077K866l368j22L368l197k29L319k188j599L567
1266A823j801j892L540q40k991L150K08l273K682O56k921J873J350l169J443K086
1282A924l301M21K864k788k30L031k245j513L885j998j946L506j266k305L058
1297A097j21l144K977Q21l509K516P90l386J990J927l563R71K539l153L13K840
1313A905k522n87L176k192j440L269j216k385L211p69k601L300J4l114K694Q30
$$ plain form
1202 -1852 -635 2540 -1353 -1260 2197 -1043 -1374 2152 -443 -1645 2195 36 -2009 1521 513 -2092
1218 -2092 1325 950 -2189 788 1357 -2006 235 1869 -1871 -212 1903 -1741 -818 2212 -1353 -1401
1234 -1401 2160 -652 -1555 2072 -134 -2015 1928 520 -1981 1233 906 -2251 1260 1327 -2178 431
1250 431 1602 -1980 98 1997 -1671 -594 2272 -1096 -1218 2150 -1047 -1276 2043 -145 -1744 1823
1266 1823 22 -1870 1670 830 -2161 989 1197 -2076 606 1262 -1659 214 1564 -1605 -162 1924
1282 1924 -1377 -956 1908 -880 -1110 1921 -324 -1837 2048 50 -1896 1610 344 -1961 1097
1297 1097 976 -2168 809 1630 -1879 637 1427 -1959 31 1958 -1605 -634 1905 -1248 -935 1905
1313 1905 -617 -1204 1972 -220 -1660 1609 393 -1992 1219 450 -2151 1149 1163 -1951 743 1573
1329A573l663K337J768l738J332K341l106M85K736k813l77K934k321r36L099j688
1345c7j762L247j102k241L050k04l133K792Q38l528K394J398l402J573K147l540
1361a510R25K388k442o81L076k534p84L618k205j526L036p94k424L025o07k362
1377a801K532M75l029K195J143k891J132K062l397P91K588k827K23K644k411n85
1393a156K986k077j091K740j475j813L102o30k558L058Q0k981K346O78l017J989
1409A81J371l059J339J974l130N00K638k596o39L151j995j238L295j757j771L067
1425A331p84k283K790j17k459K361M69k901J629J571k999J151J786k920O87K432
1441A744k657j79K803k556o82L022j562j558K838q40k056K607l08k431K425J55
$$ plain form
1329 1573 -2090 247 2015 -1723 -391 1950 -1156 -671 2065 -748 -1125 1809 -512 -1448 1651 -37
1345 -37 -1799 1448 346 -1895 1155 951 -2182 610 1448 -2080 314 1712 -1690 -117 2030 -1510
1361 -1510 -585 1803 -639 -1320 1756 -778 -1562 2056 -149 -1675 1361 567 -1857 1168 561 -1801
1377 -1801 731 1206 -1823 372 1515 -1376 -244 1818 -1579 -788 1800 -1027 -804 1840 -571 -1156
1393 -1156 1830 -247 -1338 1402 -73 -1886 1216 586 -1972 1086 1166 -1815 531 1209 -1808 181
1409 181 1552 -1507 -168 1806 -1324 -824 1814 -782 -1421 1730 -265 -1503 1792 35 -1736 1331
1425 1331 547 -1736 1054 937 -1522 839 1308 -1593 36 1607 -1392 -241 1545 -1375 -688 1744
1441 1744 -913 -1092 1711 -845 -1527 1495 -67 -1625 1213 373 -1683 924 616 -1815 610 765
1457G65k671K308P28k772J410J925k945Q66K100k926L5K938k657j86K572j965
1473d75q00K715j242j596K633p97k093K545Qk576K311M77k765J584J540k704J043
1490a92J821k574L00K373k532m06L144k470q32K913j458j559K786r06j656K267
1506A019j78k628K434M08k845K240J113l231J447J907l202R96K013k360O5K347
1522A545k112n84K868j684j263K636j091j993K743l60k151J894M54k773K252Q26
1538A207k587J379J378k442P69J982k738J97K387k142k84K445j810q20K354j140
1554A35j575K445o07k036K511M9k559K281M38k395J621J204k740J001J823k618
1570a022L17K430k439l99K768k030p83K693j516j461K729q97k038K353j18k383
$$ plain form
1457 765 -1906 402 1130 -1642 -232 1693 -1252 -386 1714 -1212 -1177 1761 -896 -1082 1490 -475
1473 -475 -1275 1440 198 -1398 1235 438 -1655 890 898 -1678 633 1110 -1655 -71 1469 -1235 -192
1490 -192 1629 -945 -645 1728 -804 -1210 1934 -536 -1368 1545 87 -1472 1314 408 -1248 1019
1506 1019 841 -1787 647 1055 -1790 450 1563 -1668 -221 1686 -1516 -520 1493 -867 -802 1545
1522 1545 -567 -1151 1717 33 -1230 1406 315 -1678 1065 705 -1446 448 902 -1871 381 1207
1538 1207 -1380 -1 1377 -1065 -296 1686 -1052 -855 1532 -610 -894 1551 -259 -1079 1275 135
1554 135 -1440 1005 398 -1638 873 922 -1637 644 1082 -1313 308 1512 -1228 -227 1596 -1022
1570 -1022 -705 1725 -714 -1113 1655 -375 -1158 1535 19 -1442 1287 390 -1648 705 587 -1796
1586a796K441N60k585J814P16k522J160J623k643P70K282k865M23J934j869m61
1602a018K574j703j215K581j237j207J951j38j908K283N6k501J807N45k240J259
1618a11J554k733Q76J788k459O47J803j803k05K267k070o52K634j387j561K390
1634I78n14k011K425k03k051J736Q42k504J619Q63k514J002J670k725P40K156
1650A509k097j01K412k270o66K503j577r68K467r77j735K477l44j905J766N63
1666A057k463J721P24k330J220J477k370L44K039k241J31K326k053l20J994j691
1682d35q72K634j398j436K574m05k146K323k18k008J839N25k587J889Q53j982
1698h50N96J359j952K17K038k147j01J959j578o93K264r85j512K398q19j637K330
$$ plain form
1586 -1796 645 1205 -1380 434 1150 -1372 -212 1411 -1232 -462 1820 -1045 -622 1312 -557 -1018
1602 -1018 1556 -147 -1362 1219 -18 -1225 726 588 -1320 963 1019 -1482 325 870 -1370 -111
1618 -111 1443 -1290 -414 1374 -1085 -438 1365 -438 -643 1624 -446 -1098 1536 149 -1412 978
1634 978 464 -1547 878 675 -1376 360 1202 -1302 317 1180 -1334 -332 1338 -1387 -647 1509
1650 1509 -588 -689 1723 -547 -1213 1290 -287 -1255 1212 235 -1500 977 633 -1272 494 1057
1666 1057 -1406 315 1039 -1291 -71 1406 -964 -620 1419 -822 -691 1635 -418 -738 1256 -435
1682 -435 -1307 1327 -71 -1507 1067 662 -1484 839 621 -1387 452 977 -1610 279 1132 -850
1698 -850 -254 1105 -847 -630 1408 -739 -840 1119 -459 -1152 1112 127 -1385 1013 194 -1443 887
1715H87l83j955J832O53k334J479R99k237Q89J442k152K43K039k247J32J992j636
1732c57o75K147j043j214K288r95j245J804l44j661K043k9k161J828M51k122J313
1749B8J377k629J022J490k198K86J725j633l55K162j539r73K404j056j470K376
1765A017p23j780K170k0j881J432P09j849R78J054k199J056J425k232Q6J943j588
1782d02l86K041j333q68J948q55j252J927l17j779K036l04j733J949J35j813J124
1799A18J037k553J216J224k173P54J812j983j93J850j599n44K347j496p37K085
1815A165j028j266K033m06j805J587O18k062J411M35j733J409N64j816j6K072
1831A162k046L00J752j780q0K075j503j268K520r45j487K081n65j475J936k17
$$ plain form
1715 887 504 -1451 381 1034 -1300 179 1178 -1059 -170 1272 -880 -637 1402 -845 -713 1279 -357
1732 -357 -1032 1115 72 -1142 1146 151 -1094 710 366 -1295 748 719 -1442 386 837 -1285 28
1749 28 1405 -1224 -202 1288 -910 -624 1101 -532 -887 1275 -264 -1237 1167 111 -1359 1017
1765 1017 294 -1486 684 664 -1217 215 924 -925 53 1107 -1092 -36 1389 -843 -757 1186 -402
1782 -402 -788 1253 -80 -948 1000 145 -1107 820 503 -1276 760 456 -1277 672 807 -1006 118
1799 118 1155 -1398 -182 1042 -1131 -377 1435 -548 -741 1109 -490 -1034 1313 -183 -920 1165
1815 1165 137 -1129 904 498 -1307 280 898 -1164 247 682 -1051 358 922 -894 -910 1162
1831 1162 -884 -584 1168 -612 -692 1383 -120 -1388 1132 187 -1300 781 216 -1259 677 460
1847D60j602J802J27k105J346Q44k116J018J482k052L54J486j796K81J804j593
1863b60m88J777j197q94J701l28j535J794k67j864J989K18j872J277Q35j978R15
1880a77J388k104P21J450j851k01J721j335n65K100j258q04J708p16j101J911
1896H87p45j478J803K09j928J581P22j961R35R25j771N26J583j850K0J550j402
1913c94j27J525j288n40J769q11j145J918l31j584J826l63j368J543J24j807J246
1930A93O47j849Q55J411j993K80J507j655o4J628j221o36J854q00j135K018o74
1947C66j391J754l82j390J423J43j546J276N07j681P85J304j943M68J373j460
1963c94j26J681j788j1J675j066j078K071j157j028K254o82j191J811m66j756
$$ plain form
1847 460 -1142 660 787 -1318 28 872 -1244 -226 1256 -796 -442 1044 -752 -471 1333 -260
1863 -260 -748 1029 -168 -1062 639 311 -1224 570 303 -1561 428 646 -1226 51 886 -1092 -177
1880 -177 1211 -893 -172 1278 -573 -774 947 -388 -953 1147 -111 -915 793 77 -1024 887
1896 887 142 -1336 467 676 -1252 329 1051 -910 25 950 -821 -295 1288 -562 -542 1008 -394
1913 -394 -521 1004 -284 -824 945 134 -1011 907 576 -1008 818 455 -913 630 754 -1053 193
1930 193 840 -1009 -154 1257 -736 -456 1051 -604 -668 960 -261 -897 957 157 -978 1040 366
1947 366 -1025 729 347 -1043 380 523 -1023 253 760 -921 -136 1168 -775 -307 1066 -394
1963 -394 -520 1161 -627 -638 1037 -29 -1107 964 -193 -1221 1033 351 -840 971 505 -1251
1979a251J561M83j722J040P80j714N56J381j955N37J297j540j60J485r76n51J676
1996I27p73j300J622l51j156J839l89j361J559L4j696J548M40j673N69J129j883
2013i15N70J409j422k66J789j461m39J453p73q63J683l29j173J523n39j161J560
2030F46M1j801J523L87j657R30P67j784P53R69j459K56J272j352m6J364o94q13
2048f98J495p09j031J570j19j366J480J4j762J253P87j629O56Q82j700P38J085
2065I46j614K27J390j423k90J427r68k96J602r14r88J833p41j163J655k59j658
2082a234J522L82j694J237M23j321O31P63j505N66J174j467MJ579j527m60J818
2099H91j040n96J613m52j591J867l36j077J454l9j456J056N03j671O66J006j548
$$ plain form
1979 -1251 310 793 -929 111 891 -823 -267 1114 -841 -304 993 -547 -707 778 -198 -749 927
1996 927 154 -1146 476 125 -1031 808 419 -942 617 651 -1045 503 943 -730 -161 968 -915
2013 -915 -345 1064 -358 -624 1165 -296 -735 718 -55 -918 765 436 -737 786 247 -914 646
2030 646 687 -1114 409 796 -861 69 836 -948 -195 774 -685 -429 843 -509 -555 809 115 -698
2048 -698 797 88 -943 627 508 -858 622 636 -1126 127 914 -715 -59 823 -877 -139 946
2065 946 -668 -441 949 -474 -764 663 -305 -601 1001 87 -901 932 191 -972 683 424 -1234
2082 -1234 288 670 -1024 213 636 -685 -54 709 -796 -230 944 -523 -519 1060 -467 -927 891
2099 891 -149 -745 868 416 -1175 692 356 -721 733 694 -762 294 797 -874 -208 798 -750
2116g50Q12Q55j516K87J401j613m4J375j167m11J401n15o48J476n53j110J249
2133E29k26r38Q75N80j864J289N43j486M89J084j567L22J141j291K03J035r79
2150b61l72J477p15r18J358l52j260J726m36j182J272K20j359J007O55j594Q80
2167A46P73j385L92J040j394j58J346j067j66J188o18o69J310p78q17J376j37
2184C82j388J567k10j104J012K08j232O04R47j461O05P28p57l45J277j146k45
2201e58J303j040o50J723p29q41J404n71r09J510j25j466J387K10j502P53Q99
2218G98j472R31N04j190K08J051j275L4J041j074r5J241q59p13J422p75n90J269
2236D56L6j392J321J2j379R80O58j461M97Q08j122M57J197j701R3J093r59m8J070
$$ plain form
2116 -750 62 917 -599 -312 1089 -524 -568 807 -360 -771 630 115 -533 943 390 -720 529
2133 529 303 -635 240 820 -1044 245 788 -698 -209 875 -692 -370 771 -520 -317 718 -261
2150 -261 -633 844 129 -789 569 217 -1043 683 247 -935 337 557 -802 205 860 -734 146
2167 146 919 -466 -74 966 -428 -586 760 -307 -473 715 97 -572 738 -40 -857 519 382
2184 382 -1006 561 351 -753 259 467 -765 -161 786 -675 -70 658 -99 -444 833 -313 -558
2201 -558 745 -295 -945 778 49 -792 612 41 -868 642 517 -949 438 648 -854 -101 798
2218 798 -674 257 761 -429 -221 830 -445 -411 630 -444 -539 702 -157 -870 552 -223 -813 456
2236 456 492 -900 421 433 -946 34 692 -769 -272 536 -586 -129 1068 -633 -540 553 -406 -454 616
2255F16n98r55J557m83q06J085j57j245J513q6j476J075L87r60Q24K05r76M87
2273GO78j249J52J034j051O4Q58p18m66J540q36q47J358j63j158J265L4j475J325
2292C52N5j089O85M06j097N95R42j173j00J166j210J32J279j239q3Q34p17m86
2310g48J491o80p40J333m96j123J305p4j114R96M95j353Q86L57r33K88J010j267
2328c67q5J152j285J82J413j052n04R91k55r75J503m98j207J503j90j113R54M71
2346F38j396R80N89j377M37Q08j386J69J131q62k63J253q18n95J396p53o86J259
2364E24j92j011J319n15q88R17L33j187Q94K26r85N47Q61j016K7Q59r18r5J230
2383I30r53n10J374q11o19J145l62j078J404j38r96J030Kr83Q68M94j447N82R76
$$ plain form
2255 616 18 -937 620 137 -669 416 259 -986 527 441 -1035 40 427 -533 291 496 -480 7
2273 7 685 -564 -412 622 -429 -365 493 -225 -691 849 13 -834 524 361 -797 468 502 -973 352
2292 352 407 -682 3 409 -688 -93 849 -324 -424 742 -468 -336 943 -296 -379 455 -262 -748
2310 -748 743 63 -677 656 160 -963 342 268 -846 150 645 -708 178 535 -398 -110 900 -367
2328 -367 -452 700 -585 -403 1010 -42 -546 445 190 -785 718 220 -987 516 326 -787 167 638
2346 638 -758 222 811 -566 -129 679 -707 -538 593 -269 -532 721 -97 -692 704 -49 -735 524
2364 524 332 -679 640 125 -763 154 487 -700 194 420 -565 -18 843 -173 -146 713 -205 -300 930
2383 930 -23 -533 841 30 -589 556 194 -884 520 382 -614 416 418 -565 303 797 -650 -68 908
2402I08j554L78R94j257K63Q06r05QJ121j034l87J389n55o73Q69j62q06J229l27
2421C05j092R05J95q53O66N92j244N62O54j002R0Q13j001j32J084p36l27R86m67
2440bm74R79k42q91Q43J74j143R96K24j188O48M51p96L22N96j037L30R80j080
2459c10j98J366j076j32R92o41o42J421q03n03R33j17j181J318j79j110J238J14
2477D90p15K47N35j030L49Q21r75pR48r26l14J417j136q8R96o43n18R94l22p41
2497f18J170l35r50J000N4r87Q87M04j265J63J113j265M56R17q07m07J260j140
2515c50J09Q95m05q19J024k75p75R37j80r11J071Q7j049O38O01j368O34P84q41
2534a93J24N60n84l21J167r80k20J023p47p32J329l65o04J089l54p62O72L88q07
$$ plain form
2402 908 -646 -268 726 -531 -268 538 -367 -359 762 -272 -659 730 175 -498 371 209 -597 632 305
2421 305 -787 118 313 -540 126 718 -526 36 690 -312 -222 591 -410 -542 542 -194 -521 465 -2
2440 -2 -476 503 261 -630 213 387 -756 240 464 -724 -76 375 -421 -99 497 -540 -210 770 -310
2459 -310 -508 858 -218 -350 642 1 -641 780 -23 -526 407 290 -891 427 248 -862 376 490
2477 490 -225 22 557 -473 -124 697 -278 -285 663 -263 -577 840 -296 -384 612 -31 -549 445 123 -618
2497 -618 552 217 -733 267 321 -666 221 625 -640 -477 636 -629 -173 744 -63 -470 790 -350
2515 -350 -241 654 249 -570 454 179 -596 341 161 -750 321 408 -641 -3 598 -770 -136 648 -193
2534 -193 -69 491 -93 -414 753 -227 -447 576 -171 -903 426 61 -543 546 192 -570 102 490 -317
2553c17J70N47j173Q74M26j194P94N06j127N27P48q49m96J139o95l08Q33m96m28
2572e19P99K9r24P39k8p04Q18K68j051P85L12q17m3J073j445M15P13p55J30R49
2592G44q28l39R86n39n11R74l47p79R05K45j108P88M23j138P70J45p10M15M51
2611E47j128L08J039j055j43Q61n95j19O68l40p17J128n52n40R84m25n75J095
2629D41o7j084N30N54o04L39N21j028J02Q37q59K18N31q74P6R53p20m48R82k51
2649A49o74Q45j69o99P83J3n84L66L68p76M33K68q20L67P39p72n2P33q64Q8P66
2670E08p69j62P46k17p67J058m09o52J156n09m63R14k0q32L74K96n32J52N85p28
2690b71o0R15p01j84Q90q69j62J078q74P0O13m02n68P19k17m74Q15j68m93M61
$$ plain form
2553 -317 -147 400 -773 101 527 -667 127 633 -494 33 781 -68 -564 575 -120 -428 405 -91 -519
2572 -519 280 309 -615 124 96 -608 210 478 -573 212 524 -293 -336 737 -708 -293 420 -335 -205 744
2592 744 -84 -423 563 24 -487 487 140 -639 266 511 -597 191 614 -524 246 391 -319 96 547
2611 547 -581 -273 766 -289 -432 429 -166 -285 383 43 -674 454 -98 -638 346 -79 -654 441
2629 441 374 -710 -180 374 -230 109 630 -398 -296 541 -318 -100 431 -443 -367 586 -134 -582 400 149
2649 149 -525 320 151 -548 235 248 -336 30 398 -378 55 323 -497 -130 609 -163 -215 518 -346 -258 508
2670 508 -261 -423 323 106 -661 397 -12 -664 492 -17 -480 434 414 -418 -44 252 -280 -128 457 -271
2690 -271 -331 584 -117 -301 589 -280 -442 636 -238 -168 445 43 -525 194 -23 -497 318 150 -343 118
2710A18J18r90R66K79p85M28L25o98J50N55o99k57Q81l81k40O50j33p81Q73l32
2730D7p43J094l02o37O74J29q62O65M42r43L94N36r36J33Q85j027K4J094r53j63
2750d49P10m17l04J016m31m25O24k27p57R59j69n67N13M30j061P07M03j108L32
2769b21P78o98j32R02p87N9Q01o95m50R58m66m80P10j17n25M71K11p20N55J15
2789B69o00M96L91r25J76O10n89J32N24p90JQ88q08j41R32n85n41R24o4p86P39
2810B53j50o04P48q2p10N20L18n16J30O54r16L5P69p42N9O71o37m28R60l67m98
2831e33R25o57KP48j42n57K56J95o09M88L00j060M93O04p14J51P01q32j24Q27
2851D62o40j13P39l75m98O83l25m88J075k99n29M10O3n21M30K71p27N79K71o05
$$ plain form
2710 118 236 -754 212 491 -294 134 459 -239 -89 466 -233 -490 391 10 -230 420 287 -494 379 47
2730 47 -696 398 96 -541 133 262 -600 65 507 -436 -42 494 -442 -309 576 -451 -427 667 -286 -449
2750 -449 261 -156 -460 556 125 -300 324 97 -660 299 130 -437 76 506 -555 152 555 -553 -221
2769 -221 557 -141 -273 629 -158 -99 702 7 -443 515 49 -431 279 162 -363 108 319 -401 154 269
2789 269 -331 165 556 -369 -193 417 -172 -40 484 -306 -305 583 -225 -366 566 -19 -560 364 300 -486 253
2810 253 103 -501 247 165 -545 -25 293 -223 -93 561 -355 -320 449 -293 -234 437 -200 -628 332 -35 -533
2831 -533 392 -265 -263 485 343 -214 42 237 -372 116 416 -644 -151 453 -261 -110 591 -241 -365 462
2851 462 -178 -291 448 73 -425 258 -67 -555 520 221 -308 102 165 -356 74 345 -382 197 468 -137
2871a37Q7L81n48j25P89o72j46O90m56q8M44k52l41N23k9n86P59j9o34M88K78
2892D06q49L70L88q93M11Q19q29J26K98n18N4O48o51m5N20l42m31Q94k63m16O27
2913C24L0p02L71M18j032N27L93p62M71K68n31p2O63p00K67N18o57k9N40k07l85
2934b87M88m96j66O53m4o40O67J05o07O12O0o27L38K34o60K90N28n89K84K04l26
2955B1o5N00n95j95O67l87j78M63N4q68O42Q2n19M76K60q36N15L66p90L03N98
2976E14q26JN30j83j20M30m75o7P53o21k25M76k47l23P27k79o87O98K35p71O32
2997A72Q5o51L75L83m98j23P69n87j86Q70o95l44P83l23m92P17k06k66M27k59
3017d9j33K52P1m21L52L4m48K69N26o49K4P03p24N6O77r31J31P54l91k10M14m12
$$ plain form
2871 -137 -50 331 -217 -342 447 -225 -371 319 -137 -225 219 -33 -374 149 120 -466 293 274 -360 128 406
2892 406 -443 -73 315 -578 -167 652 -177 -51 247 -271 -217 431 -220 -265 255 -87 -518 376 113 -303 324
2913 324 354 -348 23 441 -591 -64 329 -433 38 306 -225 -297 366 -334 -67 451 -206 -235 305 98 -287
2934 -287 201 -295 -461 192 148 -492 175 280 -327 285 345 -282 56 290 -370 -80 448 -141 143 347 21
2955 21 -44 456 -139 -334 333 -54 -232 231 285 -583 59 141 -378 98 358 -478 37 403 -387 -84 514
2976 514 -312 -311 219 36 -84 346 -129 -196 557 -64 -289 187 -60 -383 344 65 -622 76 311 -460 172
2997 172 257 -394 -19 364 -134 -257 512 -75 -261 609 -86 -430 353 30 -462 255 49 -217 210 -49
3017 -49 -182 70 141 -280 72 106 -342 -73 453 -196 -172 531 -193 -137 540 -391 -260 494 103 -107 307 -105
3039a05l83P32l20k19M43p9m65M16J84n18L43J27n78K43O90p81J83K73l90J51
3059e3O00m57n18O97l86j67L32J73n34P58n00j62N44J12p40K99N23p40N7K55o02
3080e09L43M37l09j65L79m50L02L17n49J13L30j17l53M58O9n41K32O10o81NK16
3101A37n77L59K80l27L04L41q32O7O60m45k14N13m37j69R50p84j92P34k50n74
3121d56O25r4m51L51N1l54R1N56n47L83k00k7P2J76l57j03N78k97j63O05l84n63
3143e08O74j51l45M93P3n19L11q2k95M66J53m70L38K5l08p0L98m18N7N87l39m25
3165c55O06l30k58M44k94j21M26L7o76N79R7n18N56J76p00P01k18n15K10M39o31
3186c45J67M63l02k56L86j73l34R78o01l17O24j91l81L38K38p03N92j13k93L67
$$ plain form
3039 -105 -488 244 -76 -295 148 69 -396 20 204 -314 29 156 -422 -179 511 -270 -87 186 -204 -53
3059 -53 547 90 -428 269 -117 -284 48 221 -313 445 -55 -217 327 439 -301 -2 521 -219 -162 93 -509
3080 -509 -166 271 -38 -203 176 -274 28 345 -204 -91 239 122 -231 227 296 -245 -13 597 -84 -79 137
3101 137 -440 -81 199 -128 176 517 -315 -248 412 -33 -247 266 -171 -340 610 -174 -366 368 118 -456
3121 -456 169 75 -376 -25 26 -328 -237 319 -228 155 -45 -72 0 176 -181 -284 294 -3 -166 439 55 -508
3143 -508 166 15 -330 163 236 -283 28 -54 -349 117 270 -200 138 163 -145 -215 183 -235 -178 409 70 -355
3165 -355 251 -79 -337 107 -187 -308 118 155 -521 58 155 -363 193 369 -331 370 152 -363 -153 286 -345
3186 -345 -178 285 -17 -273 113 -60 -394 584 -17 -334 290 99 -282 56 294 -409 183 70 -223 144
3206A44R0j54M7L96r53K81L78m69m7P40m38l27N85k47m15M64J79m11N49l25q06
3227g39R59k45m67O68K43n42K9M04k77o3J1j06j44N01n53M5O59k58m56O09Nr27
3249f44Q53j70n68O17j54k58K88O83p26J29K67l35j97P01o66p6Q40q63J3M81j68
3270D7j69O02k93m56L45K0j77J45K30o44M40K64o11J04M22n17M8K92l78L69K49
3291C32l10l15M69k96l57P40m76k89R36j17n09K88j96k03M09q5m9L27j47k24Q1
3312IN69p99J20J38j3l26O46l46j07M47k15l10K44N0l10L60j6m37L61J13n14L89
3334E3J89m68J17L83n84L66K95m25j34N70m81l04O91k85k12K88R6k82K30J08l31
3355a20J56m5L3J66J59o01K28M17p44L45N61r74p8Q09o70K50J88m12J50O08l23
$$ plain form
3206 144 234 80 127 523 -430 -149 229 -240 -287 453 15 -312 273 26 -389 75 254 -157 392 67 -739
3227 -739 220 -25 -492 176 419 -123 -94 310 33 -30 -19 -125 -269 232 -321 -276 383 125 -331 278 283 -644
3249 -644 209 39 -529 88 -66 -324 -36 647 -79 50 317 -18 -215 486 -180 -256 584 -279 -266 215 47
3270 47 -122 480 187 -269 76 96 -81 64 294 -350 90 354 -257 -153 269 -248 -200 92 -286 83 332
3291 332 22 -293 176 -120 -477 263 -213 -502 434 317 -192 96 -100 -303 106 21 -28 299 152 -72 9
3312 9 578 -221 -101 37 24 -302 344 -2 -109 338 123 -187 57 107 -203 157 141 -296 65 178 -336 53
3334 53 242 -226 -109 274 -310 56 351 -74 -208 362 -119 -423 268 -17 -229 59 155 -127 103 211 -120
3355 -120 36 -9 24 190 349 -252 -24 393 -351 -6 555 -419 -497 312 -358 -108 80 -332 -182 426 103
3376A03l28O66m64l69L53o0k86M88L1l48M97K2o20M64L6l99L39J52n95J76N38
3397C96m76p0O96k85m84K77j08l9K63j63n0K77J5o34N91j02m15J96K29m12m1K76
3419f3o8Q1O4j80m1M80j19k70K56J20o09M33j69l68O69j35l70K65J94n09L06L07
3441B74o3l29N11m41O1K20l64l20O08j43q4J77r8l01N72p9m39L59n3l67K42K29
3463A72l33K61l7m39L53M14m58k2L14m31O2L35k50n3M97l69m13M67k58J24K89
3484B25m1l29N08m17k33J76K34k41N9J49m39J54M42m14n8N33n68O6M67l06j80
3505b13N27k70k72L65N4k89M86k52o02N58L26q07M74J03m84M1L32r7N5J4j57k9
3527a37K79j15k13N72o55J89K36j0k68K42L2j84m6K21n30K03K97k99J33K40l34
$$ plain form
3376 103 -225 441 -23 -392 -39 -99 -385 103 134 -214 283 305 -315 149 185 -214 125 277 -318 -142 396
3397 396 -80 -150 546 261 -223 54 -54 -93 170 7 -43 234 249 -385 206 104 -311 -115 114 -298 -339 -63
3419 -63 -131 -50 14 -166 -207 273 154 -116 140 260 -349 84 -85 -453 216 81 -289 -24 170 -339 -33 274
3441 274 211 -118 393 -48 13 233 -131 -451 157 14 -70 107 9 -292 280 201 -238 121 68 -299 -57 172
3463 172 -161 100 63 -376 -23 391 -67 -89 225 -206 -144 191 -59 -112 385 16 -397 70 -188 -64 225
3484 225 184 -145 363 -54 -287 -111 123 -118 -59 90 -349 -195 247 -167 -225 308 -260 -194 273 -33 -213
3505 -213 314 44 -228 137 191 -98 388 136 -466 92 418 -389 85 188 -296 -255 77 -20 35 49 -108 -137
3527 -137 142 27 -186 386 -269 -80 156 146 -122 120 152 -32 -78 143 -387 -184 113 -186 -53 187 -147
3548a47j77P28n51j49N87l46j70N85l90k30J49J55k03L42m24J42J6N82o95K92
3568I6k6j92J38K97l92L9L39m65JM86m25j82P53n87o5J78k40j10L33L27l96L40
3590B47j63m46M13J77m17J89J56o17M71L4j47L2j09K49j97J03J7l80P93j76j30
3611I9K9r9k61M79j76n68P61j44l36K54L10n32J97J83m00P7K46l42K86M4M7j86
3633c2L56m28k29L81k22J15J35j77P7j7n2j10K22Nl27M97Qk99J51M5q3L7K67j36
3657A84m05L83o6k75L78k14j67J79o7k16K86J57n84N00P4n73L49J13l45J45M11
3678B47l32J83p6j35RM77l60j31L76j89k46K68k39K0K49j23k21L26j40p0J8K08
3700A19m51L49K90q33M19L54m30k2K95j11j89K81k56j99O19j53Oj90J40k82J97
$$ plain form
3548 -147 -324 404 -147 -296 291 -55 -225 360 -30 -260 -111 44 -159 183 -241 -99 -83 499 -196 96
3568 96 70 -122 16 313 -79 -40 299 -166 -165 321 -104 -286 467 -120 -185 -7 -247 -357 -24 303 -93 247
3590 247 84 -362 51 228 -189 0 156 -461 10 44 -103 -71 -180 69 -128 -25 -8 -388 405 229 99
3611 99 128 29 -232 247 71 -497 264 120 -216 38 348 -184 13 196 -204 -127 119 -223 63 107 154 -32
3633 -32 324 -104 -333 48 -174 -59 76 -101 -24 -41 -93 -203 19 24 -303 194 202 -97 54 99 16 53 320 184
3657 184 -221 162 96 -179 199 -15 -182 -3 -70 -286 0 157 -427 73 147 -426 -77 36 -309 -164 247
3678 247 -85 98 22 -113 -104 373 13 -118 258 69 -177 91 -148 -128 121 -2 -223 103 -37 -107 -89 119
3700 119 -332 17 307 -526 -107 247 -183 -205 90 -21 -210 71 -185 -384 235 82 88 -102 38 -244 -47
3721d7J65m62M80P1m94L17K98o88M86m3k61L14k28l9J39J01k01j82L58j69R9K71
3743B85k36j60l0K84j55J75r7m10N20j45m28K25M16m67m9N20l88k54O29l45n8
3764a68M14j04l13K80j37j6L7Q0m07N29r2n36N66n4j99J40K72n24N1N86o82J80
3786i7K98j36j33Q7j88o1J77N2j37K60K29o08L41j68N0P5J6o4m1K19j00l31M90
3809B30m16L2N45n80J74J95l77j9K94N7m04L64j25m58M13L22o04J30M14k54p4
3830a41L16k95J21K0q5P6Pp8j91N51l77j69L55r2j20K96k8l46N12k77l63M37M0
3853A69l44K05O6j47k6K88m06J68K58k12k50M64j43j94J19q0k45O47k76m12M37
3874H6o1l71L08J77k91J20K35k8l16K84l82L15K03k90k2K26l59J1L98k13j27L91
$$ plain form
3721 -47 118 -344 136 207 -287 30 328 -360 126 83 -178 136 -92 -131 8 109 -92 -274 84 -85 14 285
3743 285 49 -111 -141 143 -12 163 66 -344 176 31 -397 -172 244 -223 -272 248 -140 -394 235 -110 -168
3764 -168 246 142 -171 109 -28 -44 -7 73 -334 195 103 -433 133 79 -120 20 292 -232 -181 405 -277 -97
3786 -97 201 65 -68 19 -169 -230 -53 -1 -138 122 351 -257 84 -84 -34 41 57 -7 -48 171 71 -260 230
3809 230 -186 -154 391 -189 -15 180 -197 -216 78 135 -269 95 -30 -488 -75 247 -357 -227 187 -67 -141
3830 -141 175 -120 1 21 -64 12 19 -59 -250 301 -76 -245 110 18 -102 194 166 -180 332 55 -308 129 169
3853 169 -175 30 96 -51 -77 211 -195 -27 231 19 -231 233 90 -104 15 -65 -310 337 61 -351 86
3874 86 25 -346 -38 139 -152 -32 203 175 -141 143 -239 76 279 -11 -33 193 -166 -155 243 30 -97 294
3896B94l65r5L42O6n03L69k5k43R2M51n75M68J08p85K59L36j41j33K44m08J41
3917a03J96j14r0L06l85OL20N9o11P02J7n42J82N9p4K34J25n23L25J93m35Q1J69
3940I7j17j19K41j2l46L17l6l24K55l6J0J43N8k93K18J60m38K49nr3l3N64q03
3963c43K16J96k51L08Q7j74k85O45m75k70M42j77j31L91n9k91L36J00k13P7P8
3984B07o57M39J26l27J55J39r2KN51k55j76L4k93l5K25k90L6L12J23m50R2L90
4006B56l37J87Ql49K52K84l60J02J68l84j05M55k63k0L17k77k4K10j22j82M33
4027B49k56l26N26j85k30L47Q6j22r2J5k03J57J46j83o9K34l63L90l4j42L6L74
4049C55m45l5L29l36p1J26M6m46M34J80k50J62K8j57j2K25j98j6P13n98m05O16
$$ plain form
3896 294 -71 -166 176 242 -261 108 83 -160 -68 383 -192 276 384 -401 -142 194 53 -80 164 -244 -103
3917 -103 93 -21 -111 195 -190 -184 136 195 -416 286 303 -239 -57 2 -72 162 287 -236 89 282 -153 -72 97
3940 97 -20 -139 102 90 -256 61 25 -299 -44 -80 -70 73 131 -162 56 216 -222 27 22 -71 -104 460 -343
3963 -343 -127 69 -182 126 213 39 -246 399 -76 -346 96 -81 -212 179 120 -171 165 265 52 129 207
3984 207 -450 -11 115 -212 -57 82 -10 -8 543 288 112 146 -147 -182 43 -247 -211 101 224 -226 -134 256
4006 256 -81 106 114 -235 17 301 -59 43 211 -173 -278 177 -86 -106 211 -66 -90 120 -2 -184 249
4027 249 -7 -333 193 8 -222 125 211 89 -3 12 -191 -34 112 -71 -140 94 -269 121 87 -55 -19 355
4049 355 -90 -125 204 -132 -203 -77 -31 -477 -43 137 -113 49 77 -80 -92 133 -65 -81 632 34 -371 245
4071B45k93j42M12j20k23L06J9l61M41m61J7K17j11k89L41K00m30M02J32j69j50
4092a7R2j29j6L29l44J6m2J77m55L90J4q3L45k04k00K47q6k27K38N3k30K85Q8
4115B41o17K57K83j64J50J29k45j85L35j47j91L14j24l28N93m57k02Q64m91j35
4135a20J75L97o42J93K03m32L39N0l20K09l3m00L30K66l20J67O3p9k80M34q9k15
4157a04J34k02k20M51L3k68K84k30k6K03k09j46L79J10m22J52K10k36P3K92k20
4178C8l77N31k21l16L64p7p3L77j68k84L51J3k00K04k93j83J10L74n45M48K81
4199C54m92j05M16k52j24N61m06j03L75j15l08L33L2k85L68j21k35L67j07l02
4219a49J99Nl08K41L93l90k03M88m59J24J32p3LJ4l2j23L15k30j72J41K68o2r1
$$ plain form
4071 245 -48 -190 222 102 -121 185 204 -157 284 -177 -160 57 -54 -343 -2 198 -232 170 302 133 -17
4092 -17 75 -54 -70 259 -85 -69 -111 66 -389 1 15 -68 277 73 -127 120 34 -193 45 98 -132 153 241
4115 241 -376 -119 164 0 150 279 34 -151 184 37 -154 160 36 -292 301 -156 -358 506 15 -120
4135 -120 55 452 -190 3 206 -226 113 163 -157 52 19 -381 -51 215 -105 62 125 46 -234 200 111 -104
4157 -104 30 -172 -392 59 92 -176 108 -122 -148 55 -154 -300 79 189 -233 -81 129 -107 -34 258 38
4178 38 -339 192 -29 -345 19 -58 -131 246 78 -206 145 158 -42 162 -131 -314 -204 170 -375 73 354
4199 354 -138 -243 173 -79 -203 358 -48 -151 224 109 -199 134 166 -119 249 128 -107 260 153 -149
4219 -149 50 55 -253 -12 381 -9 -212 276 -183 -59 73 0 3 17 -15 -138 177 -53 -225 -84 184 122 31
4242C1K45n18Q0K36k80K64O9l63l9K69l36J87L98l09k88L62j54lK26J6k07O9P
4265c8m06L91K39k53K27j85j29N1M43n79Q6J02j45L64j37k07q2J67Ok51N30o0
4287A34l83M24j34n4p8N9j35J57J73k62k68P77n25r1L28m01K45J22j02k34M88
4308B40k42M1nj04l01O55j45l83J70K40l27M94p8l41k8J80m47J60L53k41l1P0
4330g0K09l71L25j34k10K38J27j75J1K52l33R7k87K74L30j71n06M48Q5l25J75
4351a1J72m61L58j17m8M3J00j26j16L39l11R1O8j41J07K54l49R5J07K23m76O0
4373a39L95l34K51j62p4k04L33j55k0K49m22J76K52k22K4O49n45LK32k32k03M66
4395C18L5m23O7J66m00J64J54j52jM96n45m6K82l4k54M90l10l52N03k85q5L01
$$ plain form
4242 31 276 -242 -162 74 -206 58 127 -236 -275 -6 -342 -155 243 -66 -354 8 -146 -149 77 93 -114 -45 -38
4265 -38 -444 -53 186 -67 160 -25 -154 -103 340 -239 -153 -51 -196 168 31 -176 -258 -91 -85 -336 194 134
4287 134 -249 175 41 -13 -91 -32 -167 -10 163 -99 -367 410 -115 -206 122 -279 -34 88 -14 -248 240
4308 240 -2 39 34 -70 -371 284 139 -244 -74 166 -161 333 255 -86 -114 66 -381 -221 132 -109 -140 -70
4330 -70 139 -232 93 -41 -251 -13 114 -61 -50 202 -131 -34 -321 -47 283 112 -394 54 139 -186 -11
4351 -11 161 -300 58 -59 -107 -64 36 -90 -206 133 -178 -87 -19 -160 -53 201 -148 -53 54 277 -199 -139
4373 -139 256 -78 173 11 -63 -267 66 -89 -109 140 -282 -106 146 -76 -52 597 52 55 287 55 -148 318
4395 318 353 -70 -3 163 -237 -73 81 -71 -72 424 -121 -167 115 81 -173 317 7 -345 158 -127 -212 89
4417H9J95k33o4Kj28o5M36k79r1K94k22K5J63j20o6K92l99J82J62k95M7M04k78
4440E1l40L14n9j35J12K79l64R6J71k79J67J11l45K32J80l73K23L0m66M06p1k82
4462c42M6M90k58k11K40K40l63K78r7k4K15m4k51J32K54l85J57J12j4l80L78m54
4484b81J02N6J59o4K14l42%M16k35j81M94m37j06L48l46J2K53J82n29L94Q6k65
4506g0k3L43l94O4K75j52l10N01l58j46M16m57L21K22O2o64N50j43l52J36J86
4527GO5K28j41o16L61L09m27%M42k47P6J63m23L3J88j2k24L14l4r9J60j68lL1
4551a7m9j70J92j35J36j15N83m81K77Lj85j88K77M4j75J47q3l40M10p1l90N24
4573A94k00j37K70q4k31J16L24m95M74l07j31J84K66l31q9L56n48K79J08r3J78
$$ plain form
4417 89 284 51 -13 -11 -139 -204 232 -47 -138 156 -66 -41 122 2 -64 228 -171 11 173 -122 -75 329 51
4440 51 -289 25 -34 -169 -57 222 -142 -46 125 -154 13 124 -221 11 191 -182 41 71 -395 11 -60 -342
4462 -342 -296 194 -64 -275 -35 205 -158 120 23 -1 214 170 -81 51 305 -80 77 189 175 -205 173 -281
4484 -281 -179 -123 36 -28 186 -156 -156 260 25 -156 338 -99 -205 143 -203 -191 62 244 -285 109 195 -70
4506 -70 -93 250 -144 -80 195 43 -267 234 -124 -270 146 -311 10 232 294 -370 180 37 -315 -179 7
4527 7 72 300 159 -457 -96 213 -214 -214 228 -19 57 220 -203 -170 18 6 -218 96 62 -37 123 -45 -48 -17
4551 -17 -66 -236 -44 -179 -43 -158 425 -56 221 224 39 -149 128 172 -3 144 61 -279 131 60 -330 194
4573 194 -6 -143 127 43 -188 -72 252 -243 231 -76 -207 -23 243 -88 -177 179 -369 -90 18 -75 103
4594A03o4j70q0N89j37l45K70k23k35N49j73l55K34L22k28q0L71p15N02N4r9k68
4616a78K96k01j81L32%k04N99o48L1L06j70j32L99p3k10N7K12l54r7K11l7OJ33
4639I7l70J06L49l49J79lk37L89l4r4k07L08n8m05M71q9r3j04N27m72J96J2O6
4662A85k3j28k99J22L64l74J33K25l54M1L96n24j04N72l12j17K82Jl07L49O8k49
4684e3K51p9j17km6l16K09K38L1l17N0o9K58J36j86j8K23j51m10N79k57q0K24
4707I8J54m23L30J63m52o8L75l63J09L01rm47P30n57M6J41j61M2rj56J31M15l99
4730im9R1k16J7K48L1l02O0L32j95r0K71l18J72L97n00k96O11k06m82O30n01K89
4753a5L13k64m52L51L14m11J56K01l53L10J6k37R2o1KL4O4O0j29J80j82N6L04
$$ plain form
4594 103 39 -131 -211 378 241 -104 166 -57 -292 257 84 -271 -37 285 57 -23 348 -367 135 189 90 -178
4616 -178 118 -83 -264 68 68 -136 463 -185 -154 152 -18 -150 249 176 -34 23 235 -119 -216 -5 -42 -36 97
4639 97 -273 -167 182 -167 12 9 -228 161 127 33 -174 134 76 -329 142 53 -40 -144 383 -89 107 119 185
4662 185 162 34 -265 -143 221 -153 -20 205 -149 -108 288 -236 -340 232 -80 -197 85 86 -221 128 196 -53
4684 -53 198 119 2 0 -46 -362 -153 85 116 -201 -151 -220 38 174 -12 -30 193 42 -368 211 -46 -126 98
4707 98 252 -171 159 322 -130 -198 177 -186 -77 224 215 -232 498 -59 -13 128 -33 9 0 -156 -25 390 -9
4730 -9 -58 33 -183 -166 82 113 -189 -129 203 8 -82 189 -129 43 440 -60 -356 255 49 -433 197 -304 -15
4753 -15 298 34 -418 -67 247 -164 -8 193 -160 150 166 -71 21 -40 -38 -4 60 120 -9 171 -11 45 349
4776C49l02j74L44k74l65M28j00oR1L06k65r8K05k48j6K34j77M6J07j84OJ45l0
4799B2j53J79j10k19L92j37K85j45j4k38K26M2l55M66k92j82K88L1j56K34q6k46
4821a68J4K58J68m25L92l23R7j38j29L54l3l4k69N36l43j77P5K68k74J87j4j88
4843a66J23J91m37Q4O11l95q2K19k97J77J94j07l13J33K08k32K71k90j24J90K09
4864A67m1R4k41j22J18J79k47J57J71j50j61J25J19k49L65k26j84J53k26J1L79
4885A91k05j75N23l72j41J70P9l05J93J5j02J13J92j85k06M34m68J6K13K26m08
4906b02k2K65l07M59l02M5J87j47j28J58l5o6P3K45k14j84N07o42J79L93l24l3
4928i5K20k98k4K54n9m80O08j86o3K74o4m10L07L03l89m6NJ7K00k6k71K82P2j79
$$ plain form
4776 349 47 -127 217 -57 -422 6 -94 -100 -9 297 32 -66 139 -109 -125 109 -68 -22 85 -99 -93 52 22
4799 22 -131 48 -62 -281 111 -26 259 114 100 -138 88 130 -225 241 -51 -233 55 86 -70 164 78 -168
4821 -168 -154 104 272 -153 239 -84 13 -125 -254 100 67 33 -236 300 -43 -220 -145 123 -151 36 22 -166
4843 -166 -43 148 -289 -205 406 11 -71 148 -149 28 222 115 -198 -65 143 -89 182 -108 -232 -42 167
4864 167 126 220 -21 -143 -25 154 -93 64 235 85 -76 49 168 -81 284 58 -126 27 -199 -188 191
4885 191 -14 -189 334 -38 -179 -9 70 -235 -42 -27 -129 -16 176 -9 -215 219 -249 -233 -20 206 -202
4906 -202 -224 41 -266 193 -109 -64 123 -24 -152 6 -29 -95 -22 223 9 -175 332 -310 -131 262 -62 -95
4928 -95 125 -173 -197 57 -2 -482 126 -60 -123 151 87 -323 -16 287 -102 -148 -143 -126 74 48 -223 59 131 -48
4952d8j77J94j29J79N4o2k40O7L38m02K70J09m75L26O0j2J73q6l23M39l08r5Q
4975a40k6J63k32L91k20k40L52j58J30L33o57Q4O09l10j42J20P2l81K39O4k42
4996a91J30K48k82j01K90l03J8L51k80K6M33l71j0Q7N4k30K36q3l8L03k94oj43
5019a56K33k16P4K96k97K24j61oj21K4p8J17R6k20J63Q9p3j1L07l45l38M57j04
5042d6j38K20J26l88K88K21n26J57K37k25R9L9J48k15J86j47k59P9j87M79P1k97
5064g8j92K62k2l07J86K12l37M34j73j22J47J97j99k40N22m72L15L18o99j35M31
5085D8j20O8M7L5j92J84N7j44K34l5l26K42J05o66L83J70l08P9L45k82K18p0j82
5108a10J81J36m01Q7J70j69k34M29j91J67R6k6l58N25j87k05J94j35j61M42k53
$$ plain form
4952 -48 -225 -31 -160 19 73 11 -229 -162 176 -226 44 153 -322 4 64 52 225 139 -184 255 -53 -148 -140
4975 -140 -166 -3 -235 156 -64 -304 48 -110 20 353 -304 -220 389 79 -63 57 129 -252 -13 51 -191
4996 -191 -61 187 -95 -196 94 -209 -191 160 -120 -94 339 -32 -42 45 99 -131 105 22 -16 287 -7 -13 -156
5019 -156 77 -139 -65 231 -66 158 -3 -9 -130 -106 -184 -67 29 -191 -28 61 -12 -23 284 -61 -399 58 -46
5042 -46 -184 36 162 -226 62 283 -243 -86 151 -74 25 64 212 -3 183 36 -223 -144 -331 148 219 -78
5064 -78 -270 -8 -30 -337 -151 61 -276 158 -15 -137 10 207 8 -232 290 -182 133 451 -248 -383 48
5085 48 -72 -4 43 78 -114 70 127 -17 217 182 -144 98 203 -463 -80 90 -218 -139 206 -76 142 72 -110
5108 -110 71 207 -194 -107 63 -106 -340 89 -102 65 161 135 -223 302 115 -90 104 -31 -192 250 -3
5129cJ5j3K9M6k6J81k24qr9J73k19K79j50Ml5p8PN5K87l42O4j6K06j56L5K3J25
5156A60j37j79J14K72l99R7K86n64L53q0M3l65O39l09k82L07j53J79J10j07l7
5177e2o0K12m03K38N40p38K54K54m78O3L78m75J70K58k87o5L62m75j64P35l13
5198d6l26O03k78m02O15j16j05O0J75j61k12L61l46q2J85k5J26J10k76N4K92k72
5220f6R0n6K31k83L4K26l15M18j99k32N66J6k74Q7k76N7l2N1j13K62k81K21j04
5243B8J63l25K3L02j98l9L2l1M9R0K36l95M3J81k20J01J06l64J34N6J26k14O5
5266e1j10m2L64k05r0K6O8j43J94l5j68K36Q4l98M74k26J07k65J95n9K03m1j85
5289f7R5J33n2k49K17n0q7K85k05J6J47J17l79L6n4r2J44J14l32O09k35k78L28
$$ plain form
5129 -3 12 -1 28 74 48 229 5 -3 -102 71 -148 131 -19 -15 -50 -128 -121 -66 221 -121 -57 -73 133 -23 12 35 160
5156 160 23 -156 -42 230 -169 -72 214 -350 3 -77 -34 -399 240 -69 -351 -44 -197 -18 92 -15 -52
5177 -52 -112 100 -303 -65 475 -263 -9 245 -233 -170 208 -267 -97 161 -126 -191 171 -304 -468 267 -46
5198 -46 -372 231 -47 -449 166 50 -55 5 180 19 -193 168 -178 -260 -75 -100 26 136 -140 -86 206 -66
5220 -66 24 -32 199 -84 -50 176 -139 279 80 -152 414 430 156 243 -33 24 -8 43 -70 192 -89 132 28
5243 28 191 -134 -111 191 -7 -46 -14 -45 4 94 330 -65 -22 159 -61 40 146 -218 -84 -28 98 -116 -51
5266 -51 -161 -203 161 -44 -134 -108 -40 -183 11 -24 -192 44 128 -270 204 -22 85 -180 15 -44 159 118 -67
5289 -67 28 161 109 -140 77 27 -60 225 20 36 183 300 -79 -43 -97 -189 -45 69 -263 346 111 -167 161
5312A61k16k7o4J36oQ3Q8p1j40K54l70rK30j29J51q5J0j51N71k92J51j64o4l90
5336c43K51L85m19K5K10k15K6K12M8k04J75K9l69M19m23L30M0j81j43J45p4J94
5358A18j7J38l81Q1R7k30M85k25j22J78J09j82j38L25m59J85K03k33Q9J60q1l46
5380b46K47J46j89J69J45k77J13l08J23J79P8j31k02J62j07p6L58l21n9J05K50
5401A59k41Q6l1l3J48J50k97N9K31m78K50L16l38K8L37n18Q4L36j07L9j12J28
5423A96j44K8k71K82O9j60j58L77k22k85L46J24j05l6J2o6R5j2J4l29L86k12J37
5446F6K27m69J61M2m04K78K88Q6n97M73q0k80K48j4k63J84P4p6j33K14J97k25
$$ plain form
5312 161 -55 -82 -146 -10 -16 67 155 84 -56 198 -172 -181 49 -80 71 -14 -4 -155 416 124 275 111 47 -343
5336 -343 -92 293 -126 -101 109 -106 -80 132 180 -24 151 180 -189 230 -193 137 177 -4 -147 -2 -76 118
5358 118 101 239 -142 -61 36 -194 291 66 -56 122 231 49 -89 236 -223 -38 165 -68 21 181 100 -246
5380 -246 1 147 -42 127 272 -5 108 -200 -77 102 180 49 -153 9 -98 -174 184 -137 -196 -91 159
5401 159 -82 4 -27 -60 88 238 -59 0 231 -247 3 319 -19 9 346 -172 -88 248 141 180 68 196
5423 196 52 80 -191 91 160 0 -158 219 -3 -288 58 182 77 41 53 -13 82 70 84 -245 141 -71 66
5446 66 293 -176 -15 27 -377 -99 189 275 -322 151 71 -209 39 25 -238 -54 20 -56 -189 25 222 -3
$$ [...]
8191h5
##END NTUPLES=NMR FID
##END=
