##TITLE=1H_UK-9
 CDCl3, 108 sc, 
 2.9.2020
##JCAMPDX= 6.0         $$ Bruker NMR JCAMP-DX V2.0
##DATA TYPE= NMR FID
##DATA CLASS= NTUPLES
##ORIGIN= UXNMR, Bruker Analytische Messtechnik GmbH
##OWNER= root
$$ XWIN-NMR		Version 3.5
$$ Wed Sep  2 12:27:15 2020 Russian Standard Time (UT+4h)  she@DPX200
##.OBSERVE FREQUENCY= 200.1315066352
##.OBSERVE NUCLEUS= ^1H
##.DELAY= (6, 6)
##.ACQUISITION MODE= SIMULTANEOUS
##.ACQUISITION SCHEME= undefined
##.AVERAGES= 108
##.DIGITISER RES= 18
##SPECTROMETER/DATA SYSTEM= spect
##.PULSE SEQUENCE= zg30
##.SOLVENT NAME= CDCl3
##.SHIFT REFERENCE= (INTERNAL, CDCl3, 0, 15.7039)
##AUDIT TRAIL= $$ (NUMBER, WHEN, WHO, WHERE, WHAT)
$$ ##TITLE= Audit trail, XWIN-NMR		Version 3.5
$$ ##JCAMPDX= 5.01
$$ ##ORIGIN= Bruker BioSpin GmbH
$$ ##OWNER= she
$$ F:/spectra/data/she/nmr/H-F/1/audita.txt
$$ ##AUDIT TRAIL=  $$ (NUMBER, WHEN, WHO, WHERE, WHAT)
(   1,<2020-09-02 12:24:57.87 +0400>,<she>,<DPX200>,
      <continue with go, POWCHK disabled, PULCHK disabled
       configuration hash MD5:
       00 E9 B6 7A A2 85 ED C7 34 08 36 98 17 FE 4E 26
       data hash MD5: 16K
       10 EA E5 3D 46 AF D0 9B D8 5C 47 2A 29 6C 46 BC>)
$$ ##END=
$$ 
$$ hash MD5
$$ 3C 47 4E 93 65 AA AC 99 B2 D3 EC 35 A2 39 1B F8
##$RELAX= 
##$RELAX= 
##$RELAX= 
##$RELAX= 
##$RELAX= 
##$RELAX= 
$$ Bruker specific parameters
$$ --------------------------
##$DU= <F:/spectra>
##$EXPNO= 1
##$NAME= <H-F>
##$PROCNO= 1
##$TYPE= <nmr>
##$USER= <she>
##$AMP= (0..31)
100 100 100 100 100 100 100 100 100 100 100 100 100 100 100 100 100 100 
100 100 100 100 100 100 100 100 100 100 100 100 100 100 
##$AQSEQ= 0
##$AQ_mod= 1
##$AUNM= <au_zg>
##$AUTOPOS= <>
##$BF1= 200.13
##$BF2= 200.13
##$BF3= 200.13
##$BF4= 200.13
##$BF5= 200.13
##$BF6= 200.13
##$BF7= 200.13
##$BF8= 200.13
##$BYTORDA= 1
##$CFDGTYP= 0
##$CFRGTYP= 5
##$CHEMSTR= <none>
##$CNST= (0..31)
1 1 145 1 1 1 1 1 1 1 1 1 1 1 1 1 1 1 1 1 1 1 1 1 1 1 1 1 1 1 1 1 
##$CPDPRG= <>
##$CPDPRG1= <>
##$CPDPRG2= <>
##$CPDPRG3= <>
##$CPDPRG4= <mlev>
##$CPDPRG5= <mlev>
##$CPDPRG6= <mlev>
##$CPDPRG7= <mlev>
##$CPDPRG8= <mlev>
##$CPDPRGB= <>
##$CPDPRGT= <>
##$D= (0..31)
0 1.2 0 0 0 0 0 0 0 0.06 0 0.03 0 0 0 0 0.0002 0 0 0 0 0 0 0 0 0 0 0 0 
0 0 0 
##$DATE= 1599034704
##$DBL= (0..7)
120 120 120 120 120 120 120 120 
##$DBP= (0..7)
150 150 150 150 150 150 150 150 
##$DBP07= 0
##$DBPNAM0= <>
##$DBPNAM1= <>
##$DBPNAM2= <>
##$DBPNAM3= <>
##$DBPNAM4= <>
##$DBPNAM5= <>
##$DBPNAM6= <>
##$DBPNAM7= <>
##$DBPOAL= (0..7)
0.5 0.5 0.5 0.5 0.5 0.5 0.5 0.5 
##$DBPOFFS= (0..7)
0 0 0 0 0 0 0 0 
##$DE= 6
##$DECBNUC= <off>
##$DECIM= 32
##$DECNUC= <off>
##$DECSTAT= 4
##$DIGMOD= 1
##$DIGTYP= 9
##$DL= (0..7)
0 120 120 120 120 120 120 120 
##$DP= (0..7)
150 150 150 150 150 150 150 150 
##$DP07= 0
##$DPNAME0= <>
##$DPNAME1= <>
##$DPNAME2= <>
##$DPNAME3= <>
##$DPNAME4= <>
##$DPNAME5= <>
##$DPNAME6= <>
##$DPNAME7= <>
##$DPOAL= (0..7)
0.5 0.5 0.5 0.5 0.5 0.5 0.5 0.5 
##$DPOFFS= (0..7)
0 0 0 0 0 0 0 0 
##$DQDMODE= 0
##$DR= 18
##$DS= 0
##$DSLIST= <SSSSSSSSSSSSSSS>
$$ [...]
##$SUBNAM2= <"">
##$SUBNAM3= <"">
##$SUBNAM4= <"">
##$SUBNAM5= <"">
##$SUBNAM6= <"">
##$SUBNAM7= <"">
##$SUBNAM8= <"">
##$SUBNAM9= <"">
##$SW= 16.880792210976
##$SWIBOX= (0..15)
0 0 2 0 0 0 0 0 0 0 0 0 0 0 0 0 
##$SW_h= 3378.37837837838
##$TD= 16384
##$TD0= 1
##$TE= 0
##$TE2= 300
##$TE3= 300
##$TEG= 300
##$TL= (0..7)
0 120 120 120 120 120 120 120 
##$TP= (0..7)
150 150 150 150 150 150 150 150 
##$TP07= 0
##$TPNAME0= <>
##$TPNAME1= <>
##$TPNAME2= <>
##$TPNAME3= <>
##$TPNAME4= <>
##$TPNAME5= <>
##$TPNAME6= <>
##$TPNAME7= <>
##$TPOAL= (0..7)
0.5 0.5 0.5 0.5 0.5 0.5 0.5 0.5 
##$TPOFFS= (0..7)
0 0 0 0 0 0 0 0 
##$TUNHIN= 0
##$TUNHOUT= 0
##$TUNXOUT= 0
##$USERA1= <user>
##$USERA2= <user>
##$USERA3= <user>
##$USERA4= <user>
##$USERA5= <user>
##$V9= 5
##$VALIST= <valist>
##$VCLIST= <CCCCCCCCCCCCCCC>
##$VD= 0
##$VDLIST= <DDDDDDDDDDDDDDD>
##$VPLIST= <PPPPPPPPPPPPPPP>
##$VTLIST= <TTTTTTTTTTTTTTT>
##$WBST= 1024
##$WBSW= 4
##$XGAIN= (0..3)
0 0 0 0 
##$XL= 0
##$YL= 0
##$YMAX_a= 1474926
##$YMIN_a= -1300450
##$ZGOPTNS= <>
##$ZL1= 120
##$ZL2= 120
##$ZL3= 120
##$ZL4= 120
##$ABSF1= 10
##$ABSF2= 0
##$ABSG= 5
##$ABSL= 3
##$ALPHA= 0
##$AQORDER= 0
##$ASSFAC= 0
##$ASSFACI= 0
##$ASSFACX= 0
##$ASSWID= 0
##$AUNMP= <proc_1d>
##$AZFE= 0.1
##$AZFW= 0.1
##$BCFW= 1
##$BC_mod= 2
##$BYTORDP= 1
##$COROFFS= 0
##$CY= 11.3945322036743
##$DATMOD= 1
##$DC= 2
##$DFILT= <>
##$DTYPP= 0
##$F1P= 16.9975609425685
##$F2P= -3.02152046262296
##$FCOR= 0.5
##$FTSIZE= 0
##$FT_mod= 4
##$GAMMA= 1
##$GB= 0.15
##$INTBC= 1
##$INTSCL= 1
##$ISEN= 128
##$LB= 0.24
##$LEV0= 0
##$LPBIN= 0
##$MAXI= 10000
##$MC2= 0
##$MEAN= 0
##$ME_mod= 0
##$MI= 1.114404
##$NCOEF= 0
##$NC_proc= 0
##$NLEV= 6
##$NOISF1= 3.799351
##$NOISF2= 2.8
##$NSP= 1
##$NTH_PI= 0
##$NZP= 0
##$OFFSET= 15.70392
##$PC= 1
##$PHC0= -9992.922
##$PHC1= 32.4009
##$PH_mod= 1
##$PKNL= yes
##$PPARMOD= 0
##$PSCAL= 0
##$PSIGN= 0
##$REVERSE= no
##$SF= 200.130013532006
##$SI= 16384
##$SIGF1= 3
##$SIGF2= 2
##$SINO= 400
##$SIOLD= 16384
##$SREGLST= <1H.CDCl3>
##$SSB= 0
##$STSI= 0
##$STSR= 0
##$SW_p= 3612.71676300578
##$SYMM= 0
##$S_DEV= 0
##$TDeff= 0
##$TDoff= 0
##$TI= <>
##$TILT= no
##$TM1= 0
##$TM2= 0
##$TOPLEV= 0
##$USERP1= <user>
##$USERP2= <user>
##$USERP3= <user>
##$USERP4= <user>
##$USERP5= <user>
##$WDW= 1
##$XDIM= 8192
##$YMAX_p= 0
##$YMIN_p= 0
$$ End of Bruker specific parameters
$$ ---------------------------------
##NTUPLES= NMR FID
##VAR_NAME=  TIME,          FID/REAL,        FID/IMAG
##SYMBOL=    X,             R,               I
##VAR_TYPE=  INDEPENDENT,   DEPENDENT,       DEPENDENT
##VAR_FORM=  AFFN,          ASDF,            ASDF
##VAR_DIM=   8192,          8192,            8192
##UNITS=     SECONDS,       ARBITRARY UNITS, ARBITRARY UNITS
##FACTOR=    0.000296,      1,               1
##FIRST=     0,             0,               0
##LAST=      2.424536,      0,               0
##MIN=       0,             -1300450,        0
##MAX=       2.424536,      1474926,         0
$$ Real data points
##PAGE= N=1
##DATA TABLE= (X++(R..R)), XYDATA
0@%%%%%%%%%%%%%%%%J08k16K16k16K16k93M01m32N27o35P34q43R73j163J327j509
32h05J728j977K237k534K873l228L619m066M555n076N652o287O968p717Q545r434
48d947J0414j1486J2647j3922J5330j6890J8613k0519K2639k5032K7740l0825
60a6238L4384l8543M3474m9405N6699o5879P7667r3101J12520k24104J637452
71A474926k291064K24385J435303j682904J202087j98157o39136Q21005m26111
80g9666J6711K66486m32481M28078j57087j65032K63518j23015k8012J12027j40517
91c8990J07537L6709j83823J71729Q639k12823K96629k15037k7260K91565m12184
102a77309K62553P1604l92199M86553l07842p3218M24440n29943K91574J04434
$$ y = [0, 0, 0, 0, 0, 0, 0, 0, 0, 0, 0, 0, 0, 0, 0, 0, 0, 108, -108, 108, -108, 108, -185, 216, -216, 311, -324, 410, -433, 540, -623, 704, -805, 923, -1054, 1183, -1351, 1522, -1706, 1913, -2153, 2402, -2674, 2978, -3309, 3659, -4058, 4487, -4947, 5467, -6019, 6628, -7294, 8036, -8854, 9759, -10760, 11879, -13153, 14587, -16238, 18146, -20397, 23077, -26328, 30371, -35508, 42159, -50942, 61578, -162526, 1474926, -816138, -591753, 843550, -839354, 362733, 164576, -474560, 346445, -79666, -62955, 203531, -228950, 199128, 42041, -122991, 140527, 17512, -10500, 101527, -38990, 68547, 105256, -78567, 93162, 101801, -111022, 185607, -29430, -56690, 234875, -177309, 85244, 156848, -235351, 251202, -56640, -129858, 294582, -235361, 56213, 160647]
112A60647m06615M42671k59600m9269L01953l78475K27774J8777k24044K79223
122A13042j89030p559J68482j94881R3048K7138j01385J01847m3009m3068R3730
133A8355o7502j6183J03205j22269N0603Q2740j79928J71339l1794j39477K43112
144A12201j91783K8612J69068k67489K14878k2527j71845K69753k05200M1068
154b3264J44145k40928K14461o2426j18142K33851j99346N2253J18581j96616
164g7431J51078j6831j06055J46173r4426k628Q8724j16863O4562L3027j13726
175d4396J09173k1490r7093J44337r0756l9709J44655j61230O1009P4438j66656
186h7718J50051n5346p7029J61239j62494O1158O9283j67713J62727o7316p7995
$$ y = [160647, -245968, 196703, -62897, -112166, 189787, -188688, 39086, 57863, -166181, 113042, -75988, -83547, 84935, -109946, -16898, 10240, -91145, 10702, -32307, -75375, 18355, -49147, -65330, 37875, -84394, -33791, 48949, -130979, 40360, 8566, -130911, 112201, -79582, -50970, 118098, -149391, 65487, 42960, -128885, 140868, -64332, -23264, 120881, -120047, 94414, 31988, -86154, 147697, -51649, 604, 119185, -77431, 73647, 56816, -49239, 96934, 2508, -120, 88604, -28259, 36303, 69330, -44396, 64777, 43287, -53806, 90531, -225, -39934, 104721, -56509, 4500, 78938, -87718, 62333, 6987, -70042, 91197, -71297, -10139, 59144, -108569, 54158, -13158, -91153]
197i1153J69144j56019M3228Q4745j52894J19560k2400p8056J21979q9912Q637
208d3141P3033j07684P6856R139q9091J11164m9119m6926J14266r4092J0758Q4387
220D9550j13468P3718J6804q8671J12155o3259j6110R4157j16138P5749K2476
231D6963j04966J26504o2739l3985J09616j10155M5645M5341r9643R1617k9979
242B4219m0973Q5510q0980K7062M2229q5437P3513j4705n8607Q9472o0698j4423
254a3818P4393q4465L2177L1999p7741O7585k2400l7458P0571o9142K0451L8681
266C0833q4146P2264j6484n7166R0702o8014k702O5362q4832M8238J0020n9272
278e5197P0366m3465q376N4144o8622M3371J2207o1198P3243l3239k8718P2397
$$ y = [-91153, 77991, -78028, -34800, 49945, -102949, 16611, -5789, -83845, 38134, -51778, -43141, 29892, -77792, -936, 8203, -80888, 30276, -18843, -65769, 48497, -45595, -34837, 49550, -63918, 9800, 26604, -62067, 50088, -13171, -29281, 64876, -51262, 24487, 46963, -58003, 68501, 5762, -28223, 81393, -28762, 16883, 62224, -37419, 54198, 24219, -16754, 68756, -12224, 14838, 57067, -28370, 45143, 30438, -28169, 61303, 605, -13818, 60575, -23890, 8287, 40286, -37455, 30130, 7730, -29728, 40843, -28299, -7848, 30833, -53313, 18951, 2467, -54699, 36003, -32011, -34713, 30649, -54183, -5945, 4075, -55197, 15169, -28296, -36672, 17472, -51150, -7779, 4428, -56770, 16473, -16766, -45484, 26913]
290B6913o1910J3601M4739o6279M7656M251m4073N9779l7577j300M6808o1990
302b9382M4132R483n5843P0989l4189k3282O9180o3434J9276L6504o3680N3098
314C2852j0067l4123N7640m8624J1682L4608o1085M9423n078m6797O5893m0999
326E325j4126N5797o1630K4080K3007n4981M6231j6082k6012M7844m5648J2215
338c980K5692n5753M6340q541m0740O1327m2430r353M8150n5704K5990J5000m5722
351c9724M4753j9479j6834M2944m5295K1054J8221m8841M7894j3128k9988N4363
363A5940l8458o28M0346m7049K5857J1058l5360M1217j9503q101L5335m0336K4549
376D867J2175l9557M5078j3667k4875M9274l7979N394L1116m0892K6756K095k4591
$$ y = [26913, -34997, -21396, 23343, -42936, 4720, 8971, -35102, 24677, -12900, -14200, 32608, -29382, 14750, 24233, -31610, 39379, 5190, -18092, 51088, -12346, 6930, 43434, -20246, 32852, 22785, -11338, 46302, -2322, 9360, 43968, -17117, 32306, 27228, -19569, 46324, 5325, -8801, 46996, -14634, 9446, 32453, -22528, 23703, 7621, -18391, 29453, -16195, -3980, 21712, -34041, 12299, 3758, -36982, 24345, -18085, -27438, 20712, -34992, -9002, 5998, -39724, 5029, -14450, -31284, 11660, -33635, -12581, 5640, -43201, 4693, -8435, -38423, 15940, -22518, -23146, 17200, -29849, -3992, 7066, -28294, 12923, -6580, -14681, 20654, -19682, 4867, 17042, -22515, 22563, 8896, -15979, 33295, -4684, 710, 31826, -9066, 17690, 19785, -4806]
389d806L4179k3360J49K4943l7523K6213L246l3168M0351k0014j4533L6035l3995
402b283O702K0529l4103K2942k674k1813K9566k4744K300K0457l5897K6347j812
415E517k9983L9113k3962j1050L4035l7121J3367J4424l1749K7761j1055j1853
427b2556K8280k9211J2308J2022l1689L1520r325j9937L6720k5634j076K6480
439G902k9654J5602R285k2672K4615j1365m406K0835k3995J6666Q734k7469L0397
452A4475r170j7871L5489k4349p62K6377l0639J8134N542k2381K7377j7090j530
465C602K1777k9989J9267N606k7954L1707j4984j3803L1963k6918L795J6706k6855
478f080J7635j864j5024K0430j7437O46J5641k5934J7332J870k4311K7913j2973
$$ y = [-4806, 29373, 6013, 6162, 31105, -6418, 19795, 23041, -10127, 30224, 10210, -4323, 31712, -2283, 4419, 24948, -9155, 13787, 11113, -10700, 18866, -5878, -3578, 16879, -19018, 7329, 5517, -24466, 14647, -9315, -20365, 13670, -23451, -10084, 4340, -27409, 352, -10703, -22556, 5724, -23487, -11179, 843, -30846, 674, -8651, -28588, 8132, -17502, -18578, 7902, -21752, -6150, 3135, -19537, 5078, -6287, -10693, 10142, -13853, 2813, 11547, -15922, 14475, 5305, -12566, 22923, -1426, -2188, 24189, -6450, 11684, 17226, -5155, 22222, 5132, 3602, 25379, -4610, 14657, 20263, -7691, 24016, 9032, -4771, 27192, 274, 4069, 20775, -6080, 11555, 9691, -5333, 15097, -2340, -1694, 13947, -11987, 5345, 7215, -17096, 10817, -2156]
491b156j2836K4234k3039L708J5367k4095J6270j333j4247K0499j8013O310J0246
504I15k4085K1284k090j9846K7810j3895q738K3787k0376O098J1855j7819J3991
517a109k281p662J7122j5286N000J2360j9922J6446K943j9008K4139j1431n713
530d402K0758j8567P411Q845j6539J6527o823n107J6065j7942J0062N293j9523
543c942K0724p696j1101K0025j4656J098J0708j5837Q098J037q961R674p808j243
557A20R059j4160Q727J726j5041J5323n410j1469J7590j2870l799J4945j8064
570a3323Q988L198j1471J3237j0644k31J1292j8106J3035J464j5505J9429r402
583h039o909J7827j5168M363P769j1479J0172l598k086R266j0117O241M199j0874
$$ y = [-2156, -14992, 9242, -13797, -10089, 5278, -18817, -2547, -3880, -18127, 2372, -15641, -9331, 915, -23170, -1886, -3976, -23822, 3988, -9907, -18645, 5142, -15234, -9136, 2719, -15100, -1109, -3390, -11052, 6070, -9216, -4216, 8144, -11778, 4668, 7611, -11397, 12742, 1311, -4402, 16356, -2211, 5200, 14045, -2494, 14033, 7210, 2103, 18168, 226, 10288, 15581, -3942, 16782, 9086, -2015, 18010, 3354, 4452, 15160, -677, 7421, 8458, -503, 9171, 1363, 120, 9179, -4981, 3746, 5472, -9569, 5754, 344, -11125, 6465, -6405, -10204, 4741, -13323, -4335, -1137, -12608, 629, -10015, -10246, 1046, -17060, -4025, -2561, -18066, 1363, -8039, -14948, 2879, -12289, -7926, -157, -11636, -1464, -5062, -7148, 2118, -7999, -1758, 2441, -8433]
597h433J1954R1j1272J5792n920n888J3692j1134K522R037j0948Q332l85p357
611H3J2225j0081L151P904j5812J4278j136j3545J8731j1673k740J3565j4810
624A40O185K233r896J1067p348k016Q959j3343Q470R28j1554J1637m827p721J1718
639D632q022l110R049q412J729K016n801N669k721m224Q246r653M287N541j2552
654a3326J1465j672j0174J5267r784j091J0382j2121P293R03n328R263q079L526
668c476P035j1185Q781M57q924J1883m558k599Q902p184J925M238m039L450L63
683E069k170M239l625Q95N147q948O011K375q924Q391j231o387J0130p989n92
698B391P481q882M787j578l358O915q834M405L436j2169J0548k394q450J0660
$$ y = [-8433, 3521, 3612, -7660, 8132, 2212, -3676, 10016, -1118, 1404, 10441, -507, 7825, 7440, 83, 12308, 2227, 5378, 13282, -2530, 11748, 10612, -2933, 15798, 4125, 1385, 14950, 140, 6325, 8558, -1338, 9729, 2381, 365, 9324, -4019, 4451, 5379, -6175, 5462, 635, -7086, 4632, -3390, -6500, 2549, -5863, -4134, -2118, -7919, -2250, -4971, -9195, -949, -10602, -6315, -774, -13326, -1861, -3533, -13707, 1560, -8224, -9315, 1067, -11054, -3761, -2858, -8186, 1077, -7002, -3476, 3559, -7626, 1155, 1612, -7312, 4571, 13, -2586, 6316, -868, 1057, 5295, 1256, 4706, 5069, 2899, 7138, 3513, 4408, 9555, 607, 6618, 8993, 69, 8460, 7229, 842, 10972, 2983, 2391, 9872, 990, 5777, 4199, 841, 7756, -1078, 3327, 6763, -5406, 5142, 2748, -5702, 4958]
712D958p760p52N974o822K011J39k932M057l877q05L573n280M344M66o625P159
728b172j359n747P440k866l602P202n913K206L236n653N375p76k534P754q414
743e823M517L794j0126J1063k957l941Q505m801j123N916n246L357R20l669N722
758F108m714J592L268n200L748J272m758N812j921m257P217l729k103M400l596
773C139J96J313l747M985l209j371L978o351L921J211q480P616k016m390O347
788C142m760r46K639m949L576j465k313M772n505K232L350o370M179J31m937O223
804a001l008k798M499k148K75J176j454K274j383k95L964m773K678K194m248L311
820g37J114m728P167j829l317N659l023Q18J630k193M368k936M07L731n464L575
$$ y = [4958, -2802, -3554, 2420, -4402, -2391, -2252, -5184, -1127, -5004, -5809, -2236, -7516, -3172, -2706, -9331, -2172, -3531, -9278, -1838, -4704, -8306, -1104, -7017, -4811, -1575, -7228, -1853, -2629, -5163, 2591, -5823, -1306, 2488, -7638, 3425, 468, -3473, 5032, 231, -892, 5024, -222, 3135, 4055, 386, 6108, 1394, 2986, 6254, 1054, 4802, 6074, 1316, 7128, 5207, 950, 8167, 4438, 2335, 6735, 3139, 3335, 4648, 901, 5886, 2677, 1306, 5284, -1067, 2854, 4065, -4415, 3201, 1185, -3205, 3142, -1618, -2564, 75, -4874, -1298, -2763, -5076, -304, -5809, -3577, -227, -6597, -2418, -2287, -7224, -1001, -4009, -6807, -2308, -4456, -4181, -3005, -4459, -2185, -3568, -3863, 101, -4672, -1994, 200, -4048, -737, 377, -4351, 2816, 987, -2330, 3329, 306, 1124, 2754, 561, 4929, 1993, 2400, 6131, 667, 4242]
836D242J546o284O035j197l532N236k334j868L295k414J039j49k228M015m096
851A306J003K619n646L815N06n335M377j063m570M849k557p83K425m169K275p39
867a687j475L255l840N55L356o349L702J294o010O242k327j436K824l294P42K360
883b088k778K559j604J97M042n081K346K497m494L605J943m600N172j602k275
898b161M258k249J055J400l231M215j924l44L670l671K221J712n353M427J176
913E201m054L622j818j418L562k592l63J546k486K415j620p10L394m696K182J870
929D035n734M432j82m395N031l670o96K779l168Q96k87j759K561k164l76K548
945a49m150K611Q77n146L967j60k900K943p86k50J868k026q6J255k168L095j810
$$ y = [4242, 5788, -496, 5539, 4342, 810, 6046, 3712, 1844, 5139, 2725, 3764, 3615, 1387, 5402, 1306, 2309, 4928, -718, 3097, 3603, -1732, 2645, 1582, -2988, 1861, -696, -1479, 946, -3223, -948, -1687, -3162, 93, -3747, -3192, 164, -6185, -2483, -1189, -7199, -957, -3284, -4720, -1896, -5190, -4448, -2088, -4866, -2307, -3911, -3714, 328, -4753, -2407, 90, -4404, -799, 1144, -3456, 1716, 114, -2161, 2097, -152, 903, 2303, -928, 3287, 1363, 1019, 4689, 1018, 3239, 4951, -402, 4025, 5201, 1147, 4769, 2951, 1533, 5095, 2503, 2140, 3686, 1200, 3615, 1995, 1285, 4679, -17, 2165, 4035, -1699, 2733, 2551, -1844, 3187, -483, -1179, 1600, -1568, -672, -959, -2718, -157, -2321, -2697, -149, -4299, -1688, -811, -5957, -1990, -2150, -5050, -2107, -2893, -3143, -1275, -3301, -3387, -2132, -4300, -1205, -3015]
962c015k04K384k682K678J515l845M305j24l801M379k772P29J726j702K167p05
978A033n35K625k965J270J941k932L366k90k961L852j436j671K228j292M10J422
994D065k098J862j515k9L62k180Q68J497l444L136mm179L002L38k783K863k930
1011a169J35J011j661J681j362l14J919l645J841J264m128K868k08k662L523q91
1027a798r84K224k851J629o56m75K262k189J097P86k988L361K73l440L921L96
1043E68l903M216q31o26K144k312O39M15o72J716j194L50K358k789K033J994l792
1060C14L081q99j712K480j491K58K106l355K675j856M53J525l658J836J573l706
1076c76L351j218j994K911k347n47R59o36M48p14O25k48j661n7J810k839K094
$$ y = [-3015, -3219, -835, -3517, -839, 676, -3169, 1136, 1012, -2789, 1590, -1182, -453, 1273, -429, 1738, 1033, 498, 3123, 158, 1428, 3369, 437, 3803, 3513, 552, 4404, 2968, 1297, 3525, 2233, 2643, 4065, 1967, 3829, 2314, 2285, 2647, 467, 1335, 2832, -612, 2524, 2520, -1659, 1343, 1681, -1102, 1761, -1169, -1034, -23, -1684, -3, -1365, -1679, 240, -3405, -1564, -300, -4428, -1560, -1768, -4430, -907, -1798, -2782, -558, -3409, -1780, -2436, -2911, -649, -2838, -1741, -955, -3943, -582, -309, -3749, 172, 568, -3335, 881, 50, -576, 1568, -744, -105, 310, -362, 1354, 160, 510, 2868, 79, 2112, 4106, 314, 3395, 2496, 784, 3264, 1773, 2031, 4137, 782, 3457, 1601, 2054, 3579, -79, 1757, 3330, -376, 2975, 1757, -237, 2674, 327, -220, 739, 103, 551, -163, 462, 214, -1447, -1504, 306, -2533, -439]
1093d39Q09l576K143N41k607J921k71j027P51j045J189o85p89K387k078M33L268
1110I25l768J567J535l212K791n65r34J409o46L66O47q8M47l86J35R76q21O70
1128A048J842k909J969k36j027J437l72q42K747j385j037J321r18O71l02l13J212
1145B906k574L26K304k828K509j613j279K394k92k733K183j482P73J0r66J377
1161A015k164L64L69j000N1K012k984J169J140k509J440q72J96L79p46P04k54
1178a690j015J038p51J52K121k827J237J164k174K229p70j749K926P58k040K365
1194I74j964J194J76o51N75o12N55P20J0k55N08j685J538M47j418J618R13j431
1212A212L35k57M17j182J435N44j656R42j46q35k48J781j362M21j74j295K109
$$ y = [-439, 370, -3206, -1063, -522, -3129, -1208, -1479, -2506, -1755, -2800, -1611, -2296, -3085, -698, -2776, -2343, 925, -2843, -1276, 259, -2953, -162, -727, -1661, -252, -898, -532, 115, 27, 474, 88, 223, 1199, 378, 1048, 2890, -19, 1950, 1714, 687, 2124, 1752, 910, 3657, 2272, 1235, 2556, 1638, 2309, 2007, 1694, 2906, 332, 658, 2962, 134, 2643, 1030, -249, 2145, 1853, -880, 1303, -179, 594, 604, -362, 1015, -1149, -785, -416, -1416, -1365, 647, -2337, -1168, -28, -2537, -1097, -1969, -1773, -1394, -2140, -1436, -1690, -2705, -1667, -2418, -2266, -145, -2972, -1735, -571, -2745, -516, -1286, -3035, -109, 649, -1391, 974, -990, 204, 380, -271, 304, -308, 247, 967, 977, 722, 1230, -455, 1083, 1530, 112, 1730, 2643, 1212, 1547, 1290, 1707, 525, 1960, 2504, 848, 1790, 1644, 809, 561, 2342, 980, 1401, 1227, -68, 2041]
1229B041j180o33M73p53P12p19p93K208k227q7J172j136R6M0j651J984p27j51
1247a331M89o19P29j255j60J390j320J177r1j039J230M5j568J133l59j32R81O
1265f94m35J117l19N53J43j325O65r5N78J055j502Q76J059j788N52J774j660L98
1283I52J117j071L75m09J253j323O27J041j616j64R25r84O44P30q17K93o3j228
1301B82j10J379r14J445k733J839j351l8Q03k112J163L26p42J09L00o82L95N90
1319e1j599P61K61o64M67n71O35o0j69M85j704P85M65l88Q79m63q54Q03J428j255
1339h09N01P39l35K21l98R55o01O6L53j611M98J643j001R96o07l67N30P93j098
1358D68M98P60j030R54p82P31l69m3N88j407N7J731k872J519L34j035J636j055
$$ y = [2041, 861, 228, 701, -52, 660, -59, -852, 1356, -871, -958, 214, -922, -826, -786, -2437, -453, -1180, -1331, -842, -1461, -732, -1987, -2147, -757, -2077, -900, -991, -2030, -800, -755, -2323, -1190, -1549, -1681, -700, -694, -1129, -12, -331, 222, 365, -960, -295, -390, 188, 1243, -259, 617, 1676, -112, 440, 2214, 554, 952, 2069, 998, 1373, 964, 2217, 894, 1521, 2562, 946, 782, 1707, 723, 1367, 2097, 1280, 1573, 1510, 282, 172, 1551, 637, 2082, -651, 1188, -163, -201, 602, -1510, -347, -21, -763, -654, -354, -1036, -641, -51, -1650, -889, -628, -1292, -825, -1396, -761, -821, -990, -505, -2209, -1424, -959, -1347, -468, -931, -1785, -982, 446, -809, -308, 431, 96, 317, -81, 874, 273, 339, 692, -919, -421, 1222, 221, 1217, 610, 243, 773, 1566, 468, 966, 1726, 696, 1650, 868, 1599, 1230, 1187, 1775, 368, 425, 2156, -716, 803, 1137, 102, 1738, 683]
1376F83j85R25j469L47l63n52J760j496q41J393j058J253O2k175J124K59j251
1393a584J289m16j92K18o87J290q11o75J317q5p24K22j051J215l21j058P43Q03
1411e07m83L57m03J94Q2p1L50m83J60O69o11Q76O83r13Q73L26p06k56l88P90L26
1432H65R5L55l95p1Q95j275J368r4j281N21k0m9J99O87k223J115J49K55K22j08
1452A210q59J88K29n6j052M6R14o98l90J54o63J142o91N20j97M1O91j318J94K91
1472c04j151N51l48r4P23m42j46O14L27j163R11J68j481K021o51n95J223r6k94
1491b27r18N85j11J320j676J252p73P74J477j436mO70j326J95N93J189o69j400
1509d85J147R22m39K66j284m4R23L17j183R26j546J117J077j703J102p97o5J56
$$ y = [683, 498, 1423, -46, 301, -62, -614, 1146, -350, -1191, 202, -856, 397, 459, -1716, -592, -333, -1584, -295, -711, -903, -685, -1372, -82, -893, -1568, -251, -336, -1060, -838, -1889, -674, -995, -2053, -1310, -507, -990, -633, -1036, -842, -760, -831, -481, -964, -804, -135, -746, 130, 813, -100, 773, 1099, 393, 137, -251, 539, 865, 960, 1315, 920, 849, 1744, 469, 1837, 1743, 462, 983, 963, 914, 1113, 1800, -423, 692, 841, 1096, 1318, 1210, 351, 539, 768, 712, -340, -294, 620, -78, -468, -314, -977, 165, -526, -6, -203, -162, 529, -789, -595, -304, -1455, -904, -1252, -1346, -623, -1065, -1211, -597, -270, -1433, -522, -354, -1835, 186, -465, -1060, 163, 67, -227, -1145, -560, -671, 649, -1027, 225, -548, 226, 1703, 267, 263, 933, -393, -198, 395, 1584, 915, -485, 662, 1584, 1145, 1411, 127, 83, 1006, 1323, 140, 1066, -480, 637, 1714, 11, 1113, 316, 251, 407]
1527D07k86J95J5j64J18k96J9n04m50Q54R52k076Q53j74m49O95k2n41j099M10
1547a543J357k85m54N84k91n05J82N12n00Q28k48K10l96Q3R16j193J364m45k95
1566a19Q20j470R0J237q82N75O84j314R98n49j98Q16j00K87j60p58J171l28k34
1585E66R29r25L47O47j130O87k50l94P71j061K64j7MJ291p94o97K00j76P41l91
1605F12p76M00N86q09K46K36n18j50k71n24J182o88l61L80o80M74o7K66R4j021
1625a389L0J097j551K77R23N87j211J074o23j54Q92k21R25o87q78J339j065L93
1643b42O77k94N69j111l0K45N59J26l21k51K68P49n19O07j619J189m13l40P56
1662F05J23K72L15J02r33J00l56M72k96n8k92l0N07N2j114J634j263J11j11J96
$$ y = [407, 121, 316, 331, 167, 285, -11, 8, -496, -946, -92, 860, -1216, -363, -537, -986, -291, -313, -854, -1953, -1543, -186, -471, -925, -341, -632, -1137, -955, -443, -943, -115, -363, -153, -549, -466, 450, -743, 621, 176, -119, 701, -769, -679, 558, -324, 251, 935, -379, 619, 70, -128, 688, 588, 875, 715, -43, 1128, 800, 566, 1495, 570, 917, 1564, 434, 1121, 871, 477, 1248, 187, 451, 434, 438, 1729, 935, 238, 438, 262, 1003, 612, -164, 236, 822, 13, 259, 495, -23, -173, -444, -968, 214, -474, -835, -455, -1135, -661, -728, -462, -368, -1389, -1359, -262, -1813, -1536, -613, -26, -1237, -163, -786, -940, -48, -269, 656, -31, -909, 430, -635, -242, 435, 141, 710, -401, -431, -186, 373, 499, 178, -73, 195, 944, 425, 1032, -587, 602, 189, -151, 605, 728, 1000, 1315, 1417, 484, 584, 228, 700, 404, 346, 54, 24, 531, 583, -531, 1103, -160, -49, -160, 36]
1682C6p91O22J73r21L68K31k16o21J60m68L56R56k2j030J012m64m52R66p2L53
1702A76m17l62O0L7L29L36j381Q05l90K82l24k27J051J70q39M56P59n38L32J18
1722D33K0j64k46r1R13L28p11k03J406j257O21l17Q45j287O06J38j060Q00k92
1741D82Q24j240J049m89l36o93L48M34j70L09j146L90J122q07J08l76q49J421
1759C81K36p79L78L30j089j37r75J856r96K04O82m65n27N14K96J87j81m02L78
1778a09l15j91m85J229q93l8M18R8m68K4N13o48R8J088q54L48R5N74P4l73K79
1799D64K32n09L26n42M66P99j278O89R45j412J85N75p45R3M04M15J03j60o87M1
1819D04L70r88Q23M0k00l08J83m90l05N1J011o27K03m64R30m99M41p21l10K40
$$ y = [36, -755, -133, 40, -881, -513, -282, -498, -1119, -959, -1427, -1071, -115, -137, -1167, -155, -619, -1071, -105, -177, 176, -241, -603, -543, -506, -177, 159, -1222, -417, -807, -525, -849, -1076, -25, 145, -694, -238, 521, -17, 315, 433, 453, 289, 43, -48, 865, 1193, 482, 279, 1685, 428, 1049, 732, 1577, 290, 896, 1034, -26, 774, 482, 1306, 66, 1115, 626, 290, -403, -55, 379, 209, 518, -628, -238, 884, 77, 185, -191, -1040, 381, 617, -162, 216, 546, -543, -680, -1655, 201, -795, -591, 91, -374, -901, -387, -91, 96, -85, -487, -109, -424, -615, -1100, 129, -764, -802, -384, -286, -754, -730, -217, -865, -767, 321, -533, -185, -90, 484, 558, 185, 464, 696, 187, 513, -29, 437, 1236, -42, 647, 1592, 180, 365, 940, 195, 288, 692, 1107, 1210, 1050, 363, 404, 774, -214, 609, 649, 449, 141, 324, -166, -471, -420, 591, -36, 167, -297, 633, 134, 575, -146, -456, -216]
1839b16l94P1M93L7j137M90M34q76N44L95q96R17o98O62p55R81m4m85l24L2N78
1860a91r89J224n26j60M28m8J07L00K72j014J57o1O61l60N43M65K03q60M59l28
1880B82K85p7o64J406m60Q8j92K51Op50O67q98K18Q02k63m33O8N42j130n1K22
1901h1Q97l38o69M55O6j261K493k026Q76r00m43O44J25K10M77j513P49q1J02j21
1921c39J73k87J84j173J631l67q97J057r64P94l27mj18K16j159J004J093q27m25
1940g35J131o6q08J81J122o83J22N11n22j415K586r88m33J47Q08q06L25K2m52
1959D7K80K53k19m16J732j557O54L60n15o15O05q37J25L03K24l7O10j046M06m32
1979g5K78l66J351k140J257j007l73M82M79K70l49q03L35o9m2M22m56J491q94
$$ y = [-216, -610, -539, -46, -9, -1146, -656, -222, -1098, -554, -159, -1055, -138, -836, -174, -929, 52, 8, -477, -801, -769, -191, -1180, 44, -482, -642, -214, -262, -155, 145, 417, -597, -440, -501, 160, -200, 343, 808, 1011, 151, 610, 282, 567, 490, -174, 1232, 772, 860, 668, 919, 925, 175, 842, -56, 162, 964, 701, 268, 336, 878, -252, -303, -81, 816, 478, -191, 264, 330, -931, 1562, -464, 412, -488, -931, -287, -162, 48, 525, -988, -239, -320, -218, -339, -166, -453, -269, -1442, 189, -178, -1075, -18, -982, -188, -515, -519, -637, -421, -1580, -576, 517, -310, -735, 396, 330, -478, -297, 825, 142, 264, 775, 253, -1162, 1424, 436, 3, 150, 958, 152, 477, 499, 47, 327, 580, 361, -55, 1677, 120, 774, 1134, 619, 4, 609, -228, -103, 200, 424, 387, 997, -49, 357, -75, 203, -163, 1188, -952, 305, -702, -1075, -593, -114, 156, -193, -996, -661, -730, -772, -350, -806, 685, -209]
1998b09m42L79r5l83M52r4J16j76l5k11N37L50R7j034M92M44J07j004L18L10O58
2019E77q04O67n54J97M61L7q88Q88R4k59m3l28j91l09J45P85n76K99K53k00k4
2040B27j028J725N57p86K73j097K03l92P21q96L78N39l54r92R41J21N20j221N45
2059a6o33M40j81l03O01k33j18O31K17n63j027N60L67L27p98P46k46K48l07k46
2079e34P5j64J98Q32r88L32k68N74k51L28J20p18J08m5J379j129K62L40k93n90
2099d32K99J85l45R53r0q15j06O63m60J36j41P27l41L64n68j21O06p9p27O49r16
2120e59J492O1M8j138o6M71j040J414m83K92r7p24L37N06Q27j338O2p23RO81m66
2141d34N07j400J116o27O29K53m15m11K81k62p3n08J000j071R9J384n00K59K72
$$ y = [-209, -651, -272, -367, -750, -298, -392, -276, -452, -487, -698, -161, 189, 286, -748, -256, 188, 295, -709, -391, -81, 577, -227, 440, -114, 83, 544, 581, -307, 581, 675, 416, 373, 45, -146, -455, -310, 475, -101, 198, 451, 251, 227, -801, 924, 1481, 695, 968, -129, 74, -318, 403, -493, -115, 424, 70, -922, 19, 140, 660, -561, -16, -649, -209, -390, -693, -92, -325, -443, 188, 405, -158, -1185, -625, -258, 69, -729, 17, -229, 19, -288, -534, -459, -623, -425, 407, -581, -249, -517, 57, -194, 134, 254, -464, -356, -401, 978, -151, 111, 451, 158, -432, -133, 52, -293, 660, 570, -245, -351, 312, -148, -12, -153, 574, 233, 597, 29, -92, 514, 435, -292, 357, -559, 933, 994, 1042, -96, -162, 309, -731, 683, 200, 492, 395, -329, 8, 514, 1341, 3, 65, -658, -649, 32, -434, 73, -1327, -211, -838, -209, 44, -371, -782, -501, -763, -836, -1344, -344, -1415, -1316, 68, -432, -173, 99]
2160I9l82J53K25N11p68q6J14M50P18o01r02O02J22m22r45P46J276k62M0k97m9
2181C42Q58j240K39n60J435K06m93J18l8j490Q72l91P40J80q26o51P75J41n21
2200c04J308r23m94J93O19P80k276P98k53p41K09J16O55L39k60Q63j464J91K57
2219c87l5k29K27O64n06k57M55p44P97P78p37M6r76k18m25K793j817K51P1o86
2239i35K77J134l13Q6p03j031J626o04K091j980J67P08K42q07k68K045j660l11
2257b36M46R2M34l97R97j725J83J6J10N60n11L09J66o49Q35p04k13L54K08l39
2277f4M21q79N60j77L5K19n37k85K89K99m05J99L14l33L37j95K35M45j829J278
2297g3J33J026Q6j935O53O79l78o05P97q44J11O64n28N94K20r20Q11N33k80j093
$$ y = [99, -283, -130, 95, 606, -162, -248, -134, 316, 1034, 433, -469, 133, 255, -167, -1112, -366, 910, 648, 688, 391, 342, 1200, -40, 199, -361, 1074, 1280, 787, 905, 867, -623, 249, -142, 598, 778, -48, -699, 76, 217, -304, 1004, 81, -413, -220, 399, 1179, -1097, -299, -552, -1293, -1084, -968, -313, 26, -234, 629, -835, -644, -387, -422, -651, -424, 240, -266, -523, -68, -812, -15, 763, 26, 72, -904, -1122, -1547, 1246, -571, -320, -249, -935, -658, 476, 163, 249, -454, -1485, 141, -463, 1628, -352, -185, 523, 765, -42, -310, 1735, 75, -236, 210, 302, 736, 339, 1336, -389, -206, -190, -80, 480, -31, 278, 444, -205, 630, -74, -287, 67, 275, -64, 357, -522, 38, -139, -104, 115, -422, -707, -418, -119, -524, -325, -11, -344, -7, -202, 33, 478, -1351, -73, 60, 1086, 1172, -763, -110, 569, 191, -414, 383, -461, -350, 314, -214, 380, 600, -320, 491, 1024, 744, -349]
2317c49R9P86o39R52k89o95J06n97J038q59O82k63om2kJ92O02q16M35K59r65O7
2339c04L53J44P7q0M04k5j000K92J96m52R20on46l09l25J358l43m97J5N02q86
2360e12J102J30k93j185K30K91J00o68P20N58j324K1N76J85K07j187J029j56m57
2379f33J408j799Q95L56o05j01N63k49R9l15J9K90MK56K15N93q12J39m97O67n17
2400b4j56L89L32o13l94P20n25Q2L67Q18j411O59k08m20O01j40n73P18p69P90
2420B43J92J12K37k34r85L53k83n59J145l53M48o1k75k03Q31j097O98J03j008
2439f96k80M26O66Q72n99J8m00j96l97k38R45k43N26k97l82P83q96k44P5J070
2459E13r74j76P36j215R30r4K77o27K98O0N60J6M9k42j15N28K33j218L08J61K60
$$ y = [-349, -250, 536, -103, 849, 560, -135, -29, -626, 412, -447, 235, -28, -34, -76, -78, 114, 716, -100, 335, 594, -371, -304, 49, 193, 270, 190, 594, 569, -431, -139, 57, -395, 525, 519, -27, -336, -661, 697, 354, -143, -128, 374, -512, 590, 720, 427, -758, -528, -237, -137, -805, -85, 473, -851, -830, -254, -69, 138, -1049, -20, -176, -633, 775, -1024, -129, 227, -378, -479, 84, -165, -66, -381, -362, -72, -68, 188, 403, 996, 184, 323, -174, 493, -24, -180, 209, 541, -72, -466, 254, -271, -189, 178, 996, -415, 244, 36, -384, 217, 77, -496, 222, -547, 243, 435, 547, 784, 550, -435, -82, -365, -924, 221, -132, 316, 255, -20, -223, 608, -489, 209, 312, -696, -976, -550, 116, 988, 389, 407, 7, -189, -586, -824, 121, -122, 404, 107, -275, 508, -388, -632, -557, 513, -461, -637, 99, -1116, -186, -280, -3, -630, -332, -272, 288, 304, 353, 111, -4, 524, 757, -461, -153, 8, 268]
2480B68K63j2l32K02M17k0P0r34o76J787p91o3J61j114O47N80O10j411P08m90
2500a30J22M51n40J98j18j47O8n32P73o52R89l41J46k03J6J46n14O52k13j39L15
2521C47j010P79p20P55r00J394n15K16k93M25m38j88N53q4k13n44R97j105P7J689
2541A222j298K37K41o4r78J167j30n61j51O00q69n40N94M13N2M45o4n71P8%L35
2562A58R1j61n0J390j265J39l83K87n09Q95l55J85q23J04J624j270j13k94O91
2581C41k34m76J034p86R1K05m6q85N23R06Rp47J28m79K43o8j21o29M15O65j06
2602a7l95M30o08L28n48J826r46j42m55L78q00R69m16k29R28K9p01L35J597k256
2622f93K72J03j19M03l96j08N98o73P24p5m6j94J047p84M24q82L62J38r03m7J143
$$ y = [268, 531, 519, 187, 389, 806, 786, 856, -78, -754, 1033, 242, 179, 340, -774, -127, 453, 1063, -348, 360, -130, -8, 443, -97, 101, -17, -164, -96, -628, 145, -507, 482, 141, 287, 84, 100, 246, -268, 384, 171, 32, 347, -663, 116, -604, 151, -749, 645, 130, 346, 53, 478, 40, -148, 405, 321, 108, -436, 561, -544, -467, 1222, -76, 161, 402, 338, -640, 527, 397, -164, -315, 285, -584, -1124, -530, -117, -65, 380, 316, -255, -177, -177, 158, 249, 88, 38, 1428, 163, 302, -81, 206, -303, 592, 237, 422, -401, -297, 1327, 57, -56, -350, 341, 107, -369, 665, -121, -30, 175, 129, -756, -233, 673, 682, -65, 63, -416, -173, -241, -362, -991, -576, 89, -17, -412, 18, -590, -262, -810, 1016, 70, -72, -527, -149, -949, 20, -396, -625, 303, 332, -369, -34, 1563, -693, -421, -318, -437, -34, -430, -538, 60, -613, 111, 36, -10, -204, 843, 59, 483, -399, -37, 101, -802, -849, 294]
2643B94m09o27J236J67j230J108o78N88J76o38l92K07j26J20r94Q25N26q22R02
2662B33K8P62q40J67o24K4L77L44p98P75o01M47k29q85P54J97n91J169n20k04
2682a5P55n75o1k28L86j45%O23p94l49L59L71N11j598M32j16N56l02P97o23r85
2703a001O92J059j97j113N93J13J08l56j94J80q38J172m89M05j90N45m23M55k10
2722C11K72q52J33j62K83O70j404N43l53N29L84q03Q13n05p64J972k06j383Q63
2741C41p36K6Q80r21N92p27R14m82Q28n39J00j321J760P8r97q7m3O86o25n56J375
2762E46j290Q70J45K05l36j41Q3n10M45L50k56j82J284p25L59n64k62k22M55o19
2782c65P35o35P48J05j40j52l45J044j421L04J09l5M42q26R2P1p0M9K48K73Q8
$$ y = [294, -115, -742, 494, 661, -569, 539, -139, 449, 625, -13, -405, -198, -324, -204, -1198, -373, 153, -669, 233, 261, 1023, 183, 350, -274, -250, 127, 471, -327, 448, -153, 294, 65, -820, -66, 131, -460, 709, 189, -15, 740, 165, 104, -124, 262, 117, 117, 740, -54, -403, -44, 327, 838, -760, -328, -444, 112, -190, 607, -16, -1001, -309, 750, 553, -560, 33, 146, 254, -102, -296, -116, -954, 218, -271, 134, -56, 489, 66, 521, 311, 583, -269, -136, -298, -15, 655, -749, -206, -559, -30, 354, -449, 364, -141, -905, 1067, 861, -522, 341, -395, -369, 511, -410, 182, -545, 369, -113, 715, 176, 276, -1045, 715, 793, -204, -291, -334, 352, -273, -829, 546, -744, 126, 271, 476, 140, -1, 82, -428, 17, 367, 111, -71, 1213, 488, 847, 283, 21, -201, 254, -365, 370, -265, 483, 588, 448, 296, -49, 995, -426, -122, -13, -48, 394, -432, -340, -269, -339, -290, -42, 231, 319]
2803C19r13L90o58N32J190r06R18j485P69p9j53J80o08P3K91M43m5KK48p50O41
2824C99o83J97m80R46j145o67J375n98K73J045j304k72J167J77j528P51L96K91
2842C40r44M97J253j948Q83K51J95l74k17N79K84j077J41k8N73k72l82k8O07L78
2862G11j753Q31j42J02j93P56q70N85j42j09O65l63rL80m60j4l2N01j010J840
2882A274j856K89N10q38J086l02l99O76j87j109J154q81P59m04k98K44O24O20
2900I62J75m26j285K14R25q00L19O02q28o82J098L46o25m7P02j220R4O04J104
2919A232j671m4L13j84o07J262J54L90l91n08J255p1k561K27K677j581j180P47
2937e41J066P17L7j578k83l09O19J453j555R05o64r6K04O34j706J047m42M02j89
$$ y = [319, -594, -204, -862, -330, 860, -46, 872, -613, 156, 77, -76, 104, -504, -431, -140, 303, 258, 260, 508, -242, 399, -284, -87, -567, 379, -766, -1433, -58, -656, -383, 662, -642, -914, 253, 430, -1098, -347, 49, 340, -604, -107, 1146, -802, 81, 332, 527, 153, -64, 515, 799, -278, -137, -165, 408, 136, -246, -274, 333, 711, -1042, -211, -353, -251, -444, 312, -558, 27, -115, -224, 441, 78, 69, 449, -11, -25, -57, 444, -566, 1274, -582, -293, 217, -621, 465, 163, -236, 440, 253, -856, 298, -583, 176, -228, -526, -282, 342, 962, 1137, 711, -574, -360, 565, -235, 84, 686, -142, -824, 274, 620, -5, -52, 650, -570, -476, 128, 1232, -439, -483, -170, -354, -961, 301, 455, 845, 454, -54, 1201, 1130, -1431, -1204, 1473, -108, -1288, -541, 525, 1242, 1279, -299, -582, -891, -272, 1181, -374, 531, -133, -229, -25, 609, -1097, -50, -492, -90, -279]
2956b79j69n43O11R2K54R9p39Q53k91Q63j179L21j442J366J27K13J28J10n49K62
2976A08L72j525L41O20n90J594r58P00m90Q2j102P60o55J016j007k14J067n1J349
2995A417j411J53p63J172j174Q06j091J339j18r68K32M46K19J64l90N0n20N71
3013A34K86J3j168O74n98L34J20j25O34j48J49L85l32pM5n36K77n65K75N99r67
3034e21P13l53Q52n73q55N98m61kP59j179O26N87k88M15k22j87M5m32L50M17N67
3055H56q54k79Ll2L85o79R20p07P15p21K62J01k82L50N63r3j59n76l77M17N38
3076C51j008J043l65l03n06N34P08n38k08k06N59Q10o66N10n29J29Q32p90k00
3095A57j61M09o95N82j40L93j93m09N92r54J208r97K27o44O95m88J35R53l47m96
$$ y = [-279, -448, -991, -380, -288, -34, 65, -674, 179, -112, 751, -428, -107, -1549, -183, -56, 157, 285, 395, -154, 108, 480, -1045, -704, -84, -674, 920, -38, 662, 172, 254, -848, -88, -743, 273, -734, -948, 119, 68, 1417, 6, 159, -604, 568, -606, 200, -891, 448, 330, -638, -406, 40, 259, 423, 33, 83, -437, 134, 420, 433, -735, -61, -659, -325, -205, -330, 304, 156, 305, 690, 358, 351, 396, -140, 137, -428, -153, 446, -521, 192, -161, 691, 118, -737, -139, -600, -602, 157, -1022, -396, 191, -97, 318, 96, -91, -46, -478, -128, 289, 856, 2, -277, -274, -306, 79, -600, 320, -387, 328, -393, -131, -30, -312, 38, 601, 508, 349, -227, -604, -187, 351, -657, 386, 21, -282, -788, -254, 454, -84, -292, -498, 61, 871, 205, 715, 186, 315, 1147, 357, 157, -4, 405, -290, 292, 152, 545, 352, -57, 535, -419, 789, -208, 19, -625, 70, -418, -283, 670, 323, -173]
3115a73o5k14N69m52O69r13M66Q46j197M29r58J038m18P47k68L32j20k41j61m80
3135e64j5N67J53J33j095O39J97J30m54L46l41K43o80Q92l76O9J284j623N76K34
3155C15N85r41L82k51m01k6L80k37K61Q96p31m27m40N14j1J93K36k80k29K66l30
3176b76Q02J88j507P36N6j65q34P67O55j774J481M98l48m62j80m05P46N17M8n88
3196d5o89K71l34J940j617N83K2p94J99N23k33M16N1q27J34J69M87j158J188L55
3216F41j034J76m73P80L53J43j15N45r33R46n78j08o88O54j94NQ05o00j5o71J312
3237I51j046Q16j260N30N75l33n41K3N48N88p44l04l4j26M42j176N70R77l3p23
3257c00J71l12P70p4p07k62L83m57R06n72L2N26j9L98p69q87O28J352j122K5Q31
$$ y = [-173, -238, -452, 117, -335, 334, -579, -113, 733, -464, -35, -993, 45, -373, 374, 106, 438, 318, 77, -84, -564, -579, -12, 141, 274, -821, -182, 15, 145, -309, 37, -304, -61, -741, 151, -225, -156, 1128, -495, 81, 315, 900, -41, 341, 90, -311, -337, 43, -194, 67, 963, 232, -195, -635, -121, -132, 61, 297, 17, -212, 54, -276, 526, 714, -793, -57, -1, -166, -1000, -233, 422, -1352, 129, 627, 279, -183, -363, -768, -22, 495, 543, -45, -734, -463, -797, 1143, -474, 109, 131, -663, -464, 59, -174, 242, 293, -534, -400, -231, 256, -902, 286, 641, -393, -217, -690, 90, 443, 586, 471, 1016, 83, 1029, 451, 343, -345, 309, 115, 120, 925, 325, 310, -361, 951, -95, 721, -539, -9, 566, 233, -308, -285, 263, 851, 107, -197, -231, -357, 85, -1091, -521, 456, 423, -300, -129, -441, 329, 255, -452, -714, -331, -788, 118, -454, -422, 104, 85, 483, -286, -1173, -545, 807, -315, -290, 541]
3278E41p55J165j060J25k7o73R09K14O8k65P0m58l15j0n9Q86R7j98k13o13Q41
3299B70n5l53R36r98m34P63J06L45k36M54o56n38n5P91L8q70J91j71L57mJ52K28
3321B61o93o18O81M24n90P81K20j62k22J033j159K12Jl58L26J25N88j153P63L90
3341H50o23k01q61R00M43m56J46O08q90j44J55O0O6Q05j481K87K33m30L57j18
3361b94k31P98L45j227O40p3m66J448r42K31k71o17P88K92j169M77j90K51M90
3380B80n92K4n5Q31l4r80P26R08r39J59q4L77m35k16n4O38r22L83n7q71Q35o7
3402a45K85M39m58p33J294k95j175K35O78o35K05Q35K6k43R7M1J29m59Q3O85k19
3423F70o41M54p92R5Q56r31n47L34P6N26M48j314Q76n58J267j043M43k63m70j90
$$ y = [541, -214, 951, -109, 16, -11, -684, 225, 439, 507, 242, 312, -146, -461, -471, -530, 356, 453, 255, 42, -571, 270, 215, -138, 798, -200, -634, 129, 235, 580, 344, 798, 142, -396, -451, 340, 378, -492, -301, -472, -115, -119, 33, 261, -432, -1050, -369, 55, -535, 246, 466, 304, 82, 1115, -44, 168, 169, -189, 137, 262, 850, -303, 460, 850, 227, 26, -835, 65, 508, 52, 198, 806, -84, -228, -73, -13, 53, 858, -623, -336, -103, -533, -176, -294, -525, 273, 618, -609, 31, -42, -508, 940, -2, 229, -42, -659, 129, 421, -748, -271, -461, -210, 280, -312, -288, -343, 488, 454, -526, 200, 1108, 169, 328, 244, 621, 186, -30, -84, 554, -368, 15, -42, -913, -78, -145, 140, 579, 121, -612, 682, 387, -788, -553, 125, -510, -305, 530, 556, 313, 410, 451, 580, 121, 204, 889, 670, 29, 483, -309, -214, 642, -289, -836, -502, -426, 100, 548, -766, 110, -448, 819, -224, 219, -44, -514, -704]
3443g04J330r55O7n3J22k77Q68k31K68l75j41o0J04j93M44r0K28k80m03J008n97
3464H0j25J65K44L01l31L7k97n5j75K33K79p90N36l84J116j030j93J65r21N93
3484e52Q95q95Q00n11m70J076j61m45l52o5K036j626L03p2L61r11J288q52j83
3503c36N80k65O65q29M72o80J159j543Q99K49l07k90Q59j79j564Q65K62P14j343
3522f12O65j41M12p09L78n65L97o4o85J018J25KN22k15o30K12J83J53R06o06n31
3543B15N9n99R89O40o18m46O66j881R08j10L54L72m31L38J6k20o11O82r40J112
3563D95L94j445L8M44l2K17m82p6M24N44J09o81l0P80p02n13R40j083Q23L62m20
3584A06l4k13Q56p64n3J23m11r1Q15M48j209J604j447K84O58j064Q86l19p62M97
$$ y = [-704, 626, -329, -262, -315, -193, -470, 398, 167, 435, 60, -81, -141, -37, -230, 214, 124, 352, 72, -331, 677, 80, -45, 120, 364, 665, 334, 371, 74, 19, -156, 77, 356, -434, 102, -282, 834, -196, -389, -224, -1145, -552, 343, -552, 248, -263, -733, 343, 182, -263, -615, -680, 1356, -270, 33, -39, 322, -589, 699, -153, -336, 244, -21, 644, -185, 287, -393, 766, -777, 122, 371, 64, -226, 633, 454, -1110, -245, 17, 731, -612, 53, -88, 324, -385, -7, -572, -175, -239, -924, 94, 219, 221, 743, 528, -102, 110, 293, 446, 1352, 746, 215, 274, -325, 664, 1304, 686, 240, 906, -975, -67, -177, 177, 549, 118, 456, 472, 252, -359, 323, -617, 495, 889, -556, -518, -74, -106, 111, -371, -447, -23, 521, 630, -51, -81, 699, -3, -516, 424, -659, 164, 526, 106, 72, -141, 715, -49, -102, 21, -390, -481, 334, 782, -427, 1177, -270, 14, 672, -392, 494, 175, -587, -90]
3604i0J201j101L02M5j024J853j331j0j6k52O53N4r04P39L06k8n03O16j29j485
3624a104K092j236J227j143O14n04p79J57j73P98L01j6n10M31K74j162J465m93
3642B39j90J085r95no80j75Q39K07j610J100P49j23j949J143l33J189K75p86J96
3661A76k25m81M29j66J97K12O12j119K49M04j50l4J59O39q82n60k04M98L03K00
3681B57m36o2o4q44J629J3j297m59J383j056O62L19k63N50n09L93l63K6j76R4
3701b03J184n56q54K80N15j030O87Q03o60l64K41L98q06J053m45J5N6J15n3m22
3721d6m35n6N94l86M17l80L9J56R5K12m24J39O5j23R18n50j52j24j73j48R16j717
3743a163J174P2L9J04n13O19l65j89k79J61J060j372M64K6r58J251j434J111L86
$$ y = [-90, 1111, 10, 312, 357, -667, 1186, -145, -155, -171, -423, 230, 284, -620, 119, 425, 397, -106, 510, 381, -1104, 988, -248, 979, -164, 450, -54, -833, -676, -849, -51, 250, 234, -276, 155, 429, -733, 732, 239, 49, 1134, 139, 134, -546, -721, 118, 325, -1285, -185, 564, 441, -1508, -365, -698, 491, 766, -20, 176, -49, -530, -101, -267, -70, 142, 754, -365, -116, 288, 138, 104, 263, 902, 20, -540, -744, -246, 57, 257, -179, -241, -305, -1149, 480, 493, -804, -1263, 120, -936, -274, 45, -218, 332, -177, 216, -147, -121, -297, -203, 981, 425, -429, -149, 366, -664, 23, 826, 166, -198, 43, 441, -365, 688, 243, 258, 314, 429, 376, -46, -481, -537, 57, -329, 88, -292, -253, -97, -2, 210, -214, -75, -10, -133, 785, 235, 83, -41, -214, -362, 554, -1163, 11, 83, 122, 226, -287, 332, -33, -222, -501, -340, 720, -652, -188, -162, -1120, 131, -1303, -192, 194]
3762A94r94O01J94l78mM36Q33j385R52J88j19l59m02L74K13o53J073q78n37k25
3782h76R53L45n93N71m08O88L1m95l35O9O01n75m63O52k84M68m85l88n86J469
3802C59o56J70r16R09K13j79M71r86N85K31m41J88J00L4N46j177K77L53p12k32
3822h63O84J158q18m89J077j018N88l47j09J032p17OqP48l93n18k36P31n87M17
3842C38j65j037J177r66O86m16O72n57R08j211K99J52m40N35P04j310R01j7p98
3861e45m17R44q95k66J104N54j504J917r18k11l19n7k31J52P18j16J68n47n30
3880i99J450P30j645L21O14K88o91l03K85m2K13j155P35L59p91L4Q18K07q12J155
3900G71k29q40J061r12Q15q46K28O37m88j15M1n11m07J049m18L56q48N25l35k55
$$ y = [194, -800, -199, -5, -383, -387, 49, 882, -503, 449, 637, 518, 159, -243, 131, 344, -309, 764, -114, -651, -876, 77, 422, -171, 400, -8, 680, 711, 216, -119, -50, 551, -24, -487, 165, -119, 349, -136, -524, -1110, 359, -297, -127, -1043, -134, 79, -100, 371, -615, -30, 201, -240, -52, 48, 82, 628, -549, -272, 81, -631, -863, -179, 979, 161, -328, 749, -269, 319, -28, -137, 895, 178, 184, 176, 924, 531, 13, -223, 508, -79, 338, 173, -864, 313, -653, 33, -383, 289, -268, 640, -571, -272, -120, -560, -25, 679, -631, 270, 253, -545, -962, -18, -913, -1179, -75, 479, -1025, 892, -26, -237, -556, -613, -844, -692, 26, -90, 78, -469, -999, 451, 1181, -464, -143, 471, 759, 68, -235, 50, 8, 221, -934, -199, 160, -631, -597, 221, 428, -384, 771, 542, -298, 763, -149, 666, -180, 48, 685, 197, 82, 123, -388, -795, 254, -164, 192, -656, -131, -466, -721]
3920g21K4k63Q81n78J57J07N67k12k05p3L70J23L27j168M16L89k96q66J376n17
3940a62l05J489j930Q65m32J27L32N25j38l17K31o09O54o13R36p94r2J294r03
3959A58j90q0K94q47J529m43K70o03L49l56k45Q4J70n78k27n0R07n92N28p10K37
3980c95L29J22o88R14j32K14L78q59k13O72N33j030Q81q82L07k0l31J02k17j67
4000d82j84K84O52M38J76q14O58o76n20l12n5K01J003o21P3K22K99p36N01l35
4020b28l4J30L10K71Q28j639M78K33o91N32O47o44Q79r77q51N26o3l7N79K24j62
4041C11k06k13L69o53j61L56P64j377J437j270P4N25l32P21j286Q66J3j79j12
4060c53K39r9O16k20l16K8K78M0N70j28m23K76N9K09o27n21J24N6L75O04k78p62
$$ y = [-721, -697, -960, -79, -657, -500, -393, 174, -38, -243, -316, 54, 177, 504, -664, -248, 141, -155, -1021, 355, -162, -467, 1022, -908, -43, -475, -348, -16, 509, 371, 54, 285, -324, 330, -283, 653, -141, -233, 1061, 158, -32, -112, 182, -665, 864, 421, 691, 88, 437, 81, -164, -80, 90, -488, -715, -765, 142, -450, 78, -632, -395, -66, 56, -632, 282, 150, 364, 742, -117, -330, 342, 875, -155, 726, -156, 151, 131, -200, -98, -315, -482, -666, -382, 270, 708, 884, 70, 728, 52, -468, -780, -835, -634, 369, -252, -179, 43, 342, -394, 107, -228, -262, -132, 178, 449, 1277, -362, 116, 349, -342, 190, 837, 193, 1072, 95, -756, -230, -293, -330, 249, 473, 311, 105, -108, 261, -392, -553, -197, 567, -810, 627, -643, -569, -44, -376, 345, -941, -75, -62, -241, -353, -114, -213, 403, 183, -133, -105, 173, 213, 783, 655, 232, 508, 567, 776, 149, -372, -248, -192, 183, 787, 509, -253]
4082b53N7J46n38Kr1M52L60j037J119N42r69MO10L06rj164P84m50N85j012L51
4103b05L7j28N66j60J36l37L56m08N52J30r57K36J38K27l6K17j06o50n4m96R33
4124iO9J94o27m96J671j543J053o23k5n46P02J82m35J062l04n84N89m81O21k38
4144B32q91Q90r10J182k62j77m89J50L68J79n81J152j074P36M58j574Q84k31j69
4163a27l20J146j434Q97n43K32M73L51j283N31N21J76p09q0N88k27M36j57J30
4182F01o10l5m17Q49j70p95N72j024J596q16m70P12L58l29L05o2K76j011N63J048
4202A141j307j31J411j224P65n73l24J88p5J64k52N04K75r04M55k33r57Q34L71
4221A28o1l86K47n66J009m20O56n87k12p95M88J152o50N31M6o83l25L54m52R63
$$ y = [-253, -196, -50, -588, -586, -677, -225, 135, -902, 217, 759, -210, -206, 404, 710, 701, -463, 321, -129, 456, -556, -205, -168, -296, 270, 110, 246, -91, 265, -143, 409, 539, -418, -182, -44, 183, 147, 364, 258, -392, -446, -942, -9, 60, 254, -373, -869, 802, -741, 312, -311, -336, -882, -180, 2, -433, 629, 325, -259, 330, -151, 470, 232, -659, 231, -679, 503, 241, 64, -425, -275, 93, 272, -309, 843, -231, 505, 963, -611, 273, 42, -127, -447, 699, -735, 162, -381, -149, 324, 675, -608, -77, 444, 620, -89, -169, 419, 192, 628, 471, 601, -9, -44, -461, 388, 218, -577, -5, -1029, 567, -249, -719, -7, 351, 22, 327, 265, 541, -470, 93, 1141, -166, -297, 1114, -110, 655, 82, -242, -54, -129, 35, -217, 287, 562, -342, 113, -120, -1077, -243, 128, 67, -319, -72, -638, 371, -49, 607, 20, -192, -987, -499, 653, 3, 534, 580, -103, -428, -74, -526, 437]
4241D37j334J136k58n07M57NK03P1R3L49r2q12j71qK94N07q91L7l06O50J06n75
4263f09J390k84k43j223Q67l55RR54o73j59J129j380J088m16L98n84m74K84q6
4282c67P77J90n2J42j233o57M98J274m80m95L43n71M37j93K57M11r0m23J659j353
4302G4k36J34j37m24M92j85J324r75k88O58m05j54k58L21L06k66L48l12k30Q16
4322F03q87J472q83n15L7O0K40n68R3K24m15J413n17m15J43k56j02r3P41l55J32
4343A52q27J02J221k02K05j893K029q10j25J171n63n68J02l51r9K56L86O27p74
4362C9l55k13j65J208k24O1j544J652m7p28K35j14J195j480Q31J68q65K37O5j17
4382a61L55m62j39J254j349J028nl0j123O76k4m4J022l54j67q78L95q90J138n58
$$ y = [437, -897, 239, -19, -526, -69, -64, 139, 210, 303, 652, 560, -252, -423, -431, -137, 370, -521, -484, -790, -140, -34, -609, 781, 497, 254, -969, -102, -457, -448, 506, -167, -326, 803, -577, 511, 95, 493, -91, -565, -281, -367, 410, 600, 548, 690, -543, -1200, -702, 572, 92, -403, -60, -631, -194, -387, -130, 281, 191, -232, 1427, 74, -162, -28, -165, -589, -97, -282, 1042, 67, -221, 437, 32, -122, -380, -59, 247, -19, 329, 17, -213, 603, -284, 1188, 305, -210, -173, -113, 127, -441, -348, -124, -539, 874, 357, -58, 85, -171, -273, -366, 375, 20, 152, -675, -573, 648, 446, 651, -1242, 787, -23, -148, 1023, 460, -108, -6, -357, -456, -200, 186, 813, 39, -316, -529, -694, 514, 290, 351, -1193, 459, 412, -316, -81, -195, 1000, -480, 351, 519, -346, -109, -44, -161, 194, -268, -407, 847, -502, 526, 521, 491, -632, 44, 20, -24, 998, 644, 477, -401, -6, -896, 242, -316]
4402c16P20k06Q52j111l84L91M6J208j580p0J148n01n6Q31j292N54k77N77m24
4421A10n41K70J131o80L17n74l09N97K47j559J196OM3l83L63p30L66k02N62p40
4441e10l06J261J43j304O43o06J362r59m02J836j939Q55n04Q06k00q91J542j617
4459g90m04J782p47o82lL17K15L09j317J057J107j651J083n42J188j465j44Q77
4477A90n66N90L78k086P16P13l23L74j62J195n29j132R78l89O36j08l53N53l03
4496C72m42o69N95L33N5r91R16M81j126M75L33L8nm15n56Q18j036N69L49q7k24
4517b17L06K47l62j42N73r62K0N05p8J17r9j17N42K81o20oL81n39q3O51q17M15
4539dL78n71P1J27j83n52L00K45R37r06J88l07K72l51o72J066L43p34N14j271
$$ y = [-316, 404, 198, 1050, -61, -445, -54, -8, 1200, -380, -450, 698, 197, 141, 972, -320, 234, -43, 534, 110, -431, -161, 970, 290, 607, 33, -276, 321, 568, -991, 205, 211, 254, -129, 234, -496, -130, -332, 230, -510, -816, 445, 588, -716, -73, -679, 683, -276, -678, 1158, -781, 74, -430, 376, 176, -715, 827, -790, -1194, 588, -159, -841, -844, -527, -312, -3, -1320, -263, 844, -807, 276, -266, 922, -543, -687, 190, -376, 214, 592, -1494, -778, -65, -388, -14, -176, 1019, 490, -642, 336, -53, 583, 475, 122, 675, 372, -70, -739, -144, 189, 244, -747, 169, 650, -476, -1, 332, 370, 365, -50, -606, 212, -824, -255, 94, 7, -217, 89, 336, -26, -168, 405, -557, -537, -32, -110, 7, -92, -209, 333, 614, -6, -12, 369, -170, -253, 398, -419, -4, 374, -197, -126, 1, -182, -734, -434, -189, 748, -158, 30, -277, -5, -356, -1028, 38, 381, -353, 161, -1110]
4559a110J468l74J69j83l65K51Q02n89K33N28m02k97R0k27o06O65N79p99Km34
4579e99Q76R3j096K37R16k76o13P33j36O4J169k194O65N02q55Q17o65O34M29j028
4599c27j09j19O33o63M70P61j342M83P62k22l51K39L32r33Q26o65l49L79p0j03
4619c68P95j16p79k41P37M71l84l1l60L91J95n58l3J79K12k5L29j687K145p91
4639H1m51Q85j27j83M13p83L41j13q01J029q25Q84r65P24q20N23M74k70J07M76
4659E99r62R95l19j025M99k13n82P37m97J615j140K95P33p90j98O03o52L01P61
4678G60k7j234K79l5M85Q4N09j138J65j79n0L31L63N9L44j222P67K98j29j31o03
4699c04k39O35l52R10J49j450N88m90O71k20J94J76k2r72J109J00j183J82J204
$$ y = [-1110, 358, -16, 153, -30, -395, -144, 658, 69, 302, 830, 428, 131, 221, -6, -612, 53, 632, -167, -165, -599, 277, 370, -726, -489, 427, 151, -462, 271, 135, 199, 1368, -826, -161, 341, -514, 303, -362, 272, 701, -327, -436, -555, 78, -585, -115, 646, -696, -213, 549, 327, -24, 215, 547, -386, 440, -225, -574, -195, -265, -368, 427, 311, -468, -709, 28, 499, 115, 84, -276, 115, 310, -248, -281, -102, 110, 85, 414, -1273, 872, 81, -370, 515, 388, 205, 618, -165, 176, 63, -738, 291, -534, 350, -615, 109, -711, -188, 286, 16, 123, 599, -363, 632, 313, -712, -213, -426, -1008, -271, -768, 847, -293, 2, 735, -55, -253, 350, -302, -1, 760, 733, -501, -222, -257, 228, 312, 821, -317, -152, -331, -381, -50, 313, 372, 716, -506, 261, 559, 430, 299, -304, -543, 92, -260, 650, 799, -651, -63, -553, 118, -102, 92, 268, 246, -726, 383, 483, -700, -518, 686]
4718F86j14j04j118k45J401o54N94o13O7n01O45j32L53m44J84K43k05o18J061
4737D86k09k09n19J597j077j341R31L70M74m6m71J87L42p89K41L74j164K40O65
4756H2N60r21O36j102N26J399j127K19m00K99q2qJ83n76O02j484J241L8l50l4
4776b99J71Q6L03p9N89p41o39K29p6J137p35n85J017n20J144j894J143l01J80
4795A30M34p94L05M66k20l1p07M36L01p02j08K20j18m8M18L07j33N8J61j12p31
4816d68O90N38j854J343l70P14j94k11q16J154j402J007j102N33O32l42m35R27
4834C44q91l00J063Jm04P52j347M46O92j162J620p00r1M12J77k59j30r3l94O05
4854C41j80l48M71L05K05j051L91K92n57M34J19j92n42l7j71P88l13O56j377J087
$$ y = [686, 572, 468, -650, -895, 506, -148, 446, -167, -100, -601, 44, -88, 265, -179, 5, 248, 43, -575, 486, 277, 68, -451, 1146, 69, -1272, -341, 29, 503, 457, -14, 173, 515, -274, -33, 341, -823, -583, 82, 642, -279, 357, -745, -219, 1180, 53, 272, -128, 171, 89, 81, 264, -312, 290, -1194, 47, 85, -265, -299, -128, -42, 261, 182, 771, 30, -609, -380, -456, 681, -54, -639, 378, -142, 1002, -892, 251, -50, 130, 564, -230, 75, 541, 321, 290, -417, 19, 320, -382, -490, -270, -388, -436, -18, 289, 156, 214, 375, 263, -468, 222, 760, -1094, 249, -121, 593, 399, 188, -628, 526, -876, 131, -971, -438, 194, -148, -583, 344, -547, -847, 216, 217, -187, 565, -782, -336, 356, -806, 814, 114, 23, 435, 612, 353, 223, 130, -264, 341, 161, -187, 284, 589, 794, -257, 134, 426, -131, 303, 422, 230, -312, -349, -520, 268, -45, 611, -766, 321]
4874C21K56o28K58K53k01L37p18p26J234M0m7l67k26k34m6J004o05Q70k018O35
4894f08J170q56l92P67Q98j050K54q97N86l9M41p82L88L88k88K12L33p37K78L66
4914D32M83j381K67R30j448Q78J79l17L35L86k1m23j90j57p44N78L84l24J092
4933I39j327M25k47J3M63L02m45l15J94n43N64K04m60R03k0k84N72j058J66k36
4953a90J109j191k84J027j078P89m46K87M26n18r39Q87M29P6m08l9q12Q54q17
4972h38R12N44p21q4N15R1p32J81l50P08l62J22R90j094j96l33J100R5j135O94
4992A07O06o3j056P02p37M02r5R91j015J78L90N62j090o5N78r09J075q13n3R77
5012F72p57N10q76M91n22j34J001l59n0N99l25K8k40j60P03L96q85O89j028p7
$$ y = [321, 577, -51, 207, 460, 259, 596, -122, -848, 386, 426, 379, 12, -214, -448, -494, 510, -95, 775, -1243, -608, 562, -294, -686, 81, 979, -71, 183, -714, -128, -167, 274, -508, -120, 268, -20, 192, 525, -212, 66, 432, 915, -466, -199, 731, -717, 161, 340, 23, 358, 744, 723, 300, 110, -47, -791, -213, 171, -153, 939, -388, 37, -210, -197, 266, 568, 123, -192, 2, -541, 23, 227, -233, 670, 650, 366, 938, -120, 46, -190, 919, -272, -556, 471, -607, 182, -264, 23, 449, -69, -1008, -121, 308, 384, -24, -63, -875, -21, -838, 74, 618, -103, -187, 328, 419, -313, -132, -482, 226, -136, -14, 976, -118, -314, -647, 453, 548, -587, 107, 713, 650, -406, 296, -441, -39, -134, 857, -158, 20, 410, 972, -118, -183, 395, -514, 561, -252, -305, 672, -85, 425, -451, 40, -482, -616, 385, 26, -24, 575, 250, 278, 38, -122, 581, 977, 92, 781, -247, -324]
5032c24q7J31N69r26J008r82J327j049N00J23N42O4p44K6j92M85P0j040P30k84
5052e3r34J80Q00Q59m59q76O54L75L18j945O21k20j3N74J18J101j318O6l36L48
5072a40p06M50M19q95P44J64M53j050m2L96j26q4M36L06l61n09N60j65J29M6p98
5093g73M03J240p62k75K35m31K32q03J72K162j548P26n04l32L01J13p53J066J022
5112A491j979N35R36n41l77N09o19P4l58L88j0k82l52R67r99J487j079o70J454
5131E75p60j77L86o11j26P64p3j15L85j038j31J674j208l69M34P16J46j93J42
5150D21J82p28J60K95k80j1o27P77l66J009j099R4l47L57J056j191Q96k35l35
5169B8n87K16O2L52M89j34m06O43o61j94l94J026k62m46P51n55J04j60M74r56
$$ y = [-324, -411, -280, 289, -637, 371, -611, 716, -333, 167, 290, 832, 896, 152, 178, -14, 471, 541, -499, 231, -53, -987, -807, -7, 852, 393, -483, 171, 546, 864, -1081, -460, -680, -693, -119, -1, 1100, -218, -152, -488, -140, -846, -396, 23, -872, -128, 36, 489, -561, -603, -207, -333, -417, 19, 325, -36, -545, 15, -150, -21, 25, -773, -370, 870, 108, -167, 68, -363, -131, -934, -762, 1400, -148, 578, 74, -258, 43, 156, -597, 469, 1491, -488, 47, 983, 442, 65, 574, -45, 29, -329, 59, 49, -233, -585, 382, -617, 870, -209, -879, 575, -185, -362, 24, -587, -713, 51, -22, -137, 248, -790, -921, 753, -455, -824, -390, 326, 472, 279, 421, 603, -125, 35, 330, 50, 39, -588, 189, -177, 832, -267, -173, -520, -163, 893, -298, 598, 363, 28, -559, -343, -281, 71, 560, 426, 20, 663, 2, -192, -586, 440, 178, -268, 483, -72, 32, -128, 346, -610]
5189f10P06q7j02Q99n66n38o29N82P22n43J84K52k70R84j403K77k49O99k86r8
5209g6l78J37L29O86m89k89J81j81K97j33l38K14J359j620M74k22o28Q57l94J383
5229A169j017k24P44q89P58j133M57k54m52R73N24j495K67M79O2M76p57L46n10
5248d76o22J347m15J252m46k55l24L68m21j83L13m97R11n39j03j083O21R53n81
5267a80P29o62J40j098M31P54p38N66Q80k85n21M36p09L00J65o16Q09j67k17k99
5287b82K98j56q22M45L30M30n57Q21J40j233p03J763o08Q06j84l77J54J225j409
5306H1k26M62K11p33o07J074n51P5nJ06K45l44K17k17M5R58o59n1L2n94N34j042
5328i89O21O39oj45L55m76m57O16m33L88k04Q70J98j144k20P26K53j493Q46J11
$$ y = [-610, 96, 9, -93, 806, 240, -298, -927, -345, 377, -166, 18, 270, 0, 984, -419, -142, -391, 308, 22, -76, -454, -317, 12, 698, 209, -80, 101, -80, 217, 84, -254, -40, 1319, -301, 173, -49, -677, 180, -214, 1169, 152, -72, 672, -217, 541, -592, -135, -389, -841, 132, 656, -839, -572, -93, -31, 445, -312, 34, -476, -1098, 249, -166, 1086, 640, 385, 61, 429, 8, -175, 138, -359, 552, 13, -90, -1173, -552, 401, -180, 549, -113, 27, -1071, -640, 114, -624, -58, 822, 537, 16, 452, -257, 43, 208, -408, 401, 234, 17, -282, 16, -140, -962, -517, -187, 243, -314, 507, 647, -586, -1289, 474, -134, 672, 488, 111, 265, 1490, 81, -145, 317, 528, -205, -812, 262, -289, -214, -219, -113, 132, -212, 5, -212, -167, 791, 132, 81, 113, -481, 53, -989, -368, 271, 265, 120, 475, -1, -458, 158, -275, 113, -91, 779, 977, -167, -387, 339, 592, -901, -55, 56]
5348E6K49o57k39K42J52n12J088K33n33k01J7J75m70J131l82L41n62k83m85J119
5368D79P47j641L16j57J041r21m81K31K63m3K50m35N88J30m59j28O96m95Mr12
5388i27N71O79L68j435P77L64p89N23m13N70p33M30J13L27j13J44n31L51o59L96
5408A3M01K6k22R6m27n63M03M9O16q46J58q7J72j79N05j20N42O4j046K68J65j077
5430a089J500k42k11k32l3j48O3L6j44P49O3m58M50K7K36o54l33P9J162p18o68
5451e65L34L75Pj43M50j88q27J24O53m15n4O13q07J111n19N73o29q6m02J47K85
5472C7k28O81p17O13n4L73k37k61j057P91J81l79M95L73l21M51n19p03L34N15
5492C68L96k13j390J467k96n27J63l10N35m39j34P47r92K25P29o37m2J201j010
$$ y = [56, 305, -352, -591, -349, -197, -709, 379, 612, 79, -122, -105, 70, -400, 731, 349, 690, 128, -155, -640, 479, 1226, -415, -99, -256, 785, -136, -617, -386, -123, -166, 84, -351, 237, 367, -92, -220, 476, -19, -15, -927, -356, 323, 691, -744, 33, 397, -392, 131, -282, 288, -445, -15, 98, 425, 312, 456, -75, 276, -383, 13, 414, 440, 218, 314, -113, -676, -273, -224, 392, -454, -296, -383, -211, -390, 115, -5, 537, 601, -445, -177, -12, -1089, 411, 169, -42, -274, -307, -455, -392, -356, -500, 249, 312, -146, 304, 331, 567, -87, -420, -341, 821, 103, -565, -231, 144, 151, 8, 458, 270, -557, -433, 220, -195, -249, 364, -443, 668, 149, 722, 93, 7, -395, -248, 37, -191, 490, -227, 386, 332, 705, 468, 207, -850, -59, 122, -257, 238, 611, 290, 741, 222, -481, -147, 368, 764, 551, -839, 628, 332, -195, -32, -342, 193, -246, -380, 367, -625, -400, 329, -308, -350, 851, -159]
5511a59l55K2Q86n14M62O08j182l0M75N82r61M12n74pK4M69m31MM8J017r27O48
5533E17r47j48J86O60O33l35k04L30n81O98n66j030M04J000r45P16J17o96l30
5552e21Q41q6l48j75Q10j99L8n68K56P24j298J727j489N84n54J95M24o92Q58n42
5572a5N99o98M39K41j121J583p81l12q08O45K45j31m10P83M1m76M6P91j019P58
5592D00m84R47j333j14J526j375Q54n32l17J027j029P05p28p4Q76N4n22q47Q17
5611a49r96N56L56M48o4Q8j6q1l64P27n22Q79j865J206l37J72k77N20n92k99J179
5632E69O6k06p87O40L11j75J6l52j14N02n75j83J70p43N07N68n88M18j37k62P70
5653D15N75j170J86k77J30m16O6P11m8k65L01L7p18R61j84O59p30n43J36n4j57
$$ y = [-159, -514, -492, 394, -120, 342, 950, -232, -262, 213, 795, -166, 246, -328, -335, -311, 158, -273, -269, -221, 796, -131, 517, -430, -578, -392, 268, 901, 566, 362, 692, 111, 809, 243, -787, -383, 617, -328, 388, 505, -191, -521, 320, 234, -114, -289, 521, 322, 360, -208, 48, 772, -526, 1201, -288, 296, -258, -63, 361, -331, 527, -15, 584, -114, 325, 566, -555, 1028, 247, -65, -873, -228, 17, -114, -524, 259, 300, -176, -130, 661, -358, 400, -84, 863, -470, -584, 942, -433, 421, -111, -428, 599, -430, 275, -453, -527, 349, 403, -119, -966, -149, -1145, -589, -233, 215, 151, 239, 223, 142, -222, 505, -17, 862, -1003, 203, -134, 38, -239, 281, -311, -610, 569, 635, 429, -358, 282, 593, 418, 434, 82, -32, 470, -105, -288, -118, -861, -354, 214, -374, 44, -93, -355, 415, 990, -180, 6, -271, -141, -557, -491, 220, 172, -93, 208, 245, -473, 488, 304, 963, 233, -310, -174, -228, -385]
5674c85k67P35L6j65j78J02j5K92o37M06l08Q20K98j215O75K66p61k36M68L80
5694C11p94P35k49O03j332N40J04J4J066n45j83m02N80m95N10L6j73n11Q15m85
5714A45K51j147M82m7L68N11o94R88o49j252Q60m84J443k43m67L81p45n07J111
5733C05r43L80K78J35j022J145j78l32M74j142J11m94J708o53J24N00n29n1k74
5752d58N11p53K79R09L24j45r47j02K79p37P12M3l39M32n90R61r02M94k80Q83
5772E74l68j106J164l03K60N35k001R01L59O23j439J550j285J86l7N14l35N88
5790C80P5j099J82Q0R68j2m08j112J048l93N60N7K5k44l17K09K63o09l45J143
5810D51m90N89K18r42Q5k86J191j331L00J177j392Q84J57j150L64J58k36P65r25
$$ y = [-385, -652, 83, 119, -46, -224, -122, -137, 155, -482, -76, -384, 436, 734, -481, 194, 460, -301, -537, -69, 311, -483, 252, 3, 606, -726, -186, -82, -68, 998, 453, 270, -132, 448, -47, 463, 499, 326, -185, 630, 145, 396, -751, -269, -316, 52, 563, -131, 857, 208, -1044, -184, -668, 775, 532, 65, 446, -299, -806, 305, -638, -258, 20, 155, -867, 278, 100, -232, 242, -900, -789, -1283, 425, -228, -104, 396, -133, -184, -458, 53, -700, -421, 488, 812, 667, -280, -382, -103, -840, -128, -85, -424, 8, -582, 379, -523, -29, -309, 574, 206, -900, 264, -39, 221, 756, -1245, -344, 15, 638, -801, 749, -536, -350, -387, 127, -208, 380, 455, -644, -462, -382, 586, 574, 166, -946, 102, -291, 269, 326, 351, 107, -210, -1, 262, -347, -692, 451, -39, 550, 768, -174, -89, -375, 816, -515, -215, 962, -430, 454, 611, -539, -175, -17, -253, 512, -413]
5829d13M33j06J039o06j633J277p2l0J38L1J016j150k59j04k1M33j32M76M13k83
5849D47m11P2o63j73J065o50L22n31K38K22Q0Q43o96P3r62o01J886l42n67P44
5869C96o64j289R98J299j574P85J88l96j11Q06j40J8k69j195J456n51P53m07Q26
5888I29j132k3L23O41o34k98Q32p61j50J229j301N12M02m75p29L98K99N55o49
5907c2Q91j458P36p23K83M20l76J371j784N35M6P55k10j70m96j21k05J193j061
5926d06K89KQ78r61l64J044n43p6L83L42j100J416j446J646r35l03M84m83J2k44
5946c65L30m05O24K1m79m90J411o83k08k95M64NK70o47r2Q58j136N26M6n69O69
5967a45J52J73K50o43J97M91n01M19J08l86m19L4L1O13o05l42L4J131j49n17k71
$$ y = [-413, 20, -86, 953, 347, -1286, -9, -81, -111, 27, 58, 1074, -76, -335, -439, -460, -27, -159, 317, 730, 447, 36, 108, -555, -728, 337, -313, 9, -522, -284, -62, 18, 861, 165, 238, -724, -1325, 561, 219, -348, 396, -268, -1557, -559, 740, -834, -49, 139, -257, -368, 438, 298, 316, 47, -1148, 308, -243, 510, 103, 929, -203, -226, 97, 738, 104, -194, 638, -123, -273, 956, -345, 167, 569, 94, -635, -237, 62, 617, -32, 859, -599, 137, -586, -303, 117, -259, 1112, -672, -137, -91, 664, 454, 284, -212, -333, -538, 655, -406, -117, -115, 763, -198, -562, 482, -61, -137, 246, 588, -512, 904, -542, 1104, 169, -134, 350, -133, -121, -365, -35, -440, 184, 205, -274, -764, 647, -36, -244, -539, -75, -70, 200, -447, -539, 319, -817, -291, -245, -814, -145, 7, 180, 430, -213, -16, 475, -26, 393, 501, 115, -304, -270, -239, 374, -231, -573, -539, 592, 443, -74, -345]
5988c45M58N52k17l69J12m24J275k047N76K35J8P3L82L72o67R29n64j299N86L27
6008c7J81O55o09l78j61M19o9L3j43J83r08J88L2O52J02j181Q60P12l34j64J34
6029A67M05p04N47n79J108j840K019j476J24L90K76N4m59J159p23r44J201m12
6047C13j35L37r12R62m05J84m24LN09k36n26M94O94r29l70P78k03j282M29J240
6067E21k64L19j610Q13k46N87k87k7K1l06k11Q45j20J19Q50j204L26k16L26m30
6087a94J85m86p76J549k56L22p05J258n95r65L26O31k49p9m5m19R29O8o99j5M34
6108B19k97L16j30j96j18j28R48m25l52M78k19m23J44N56j246Q37j99p64R01M69
6128C71p62L65J83o63N77m20j64Q48K1j81j29m64o60J198o74J270m73j69k56k6
$$ y = [-345, 113, 665, 448, 79, 191, -233, 1042, -1005, -429, -194, -176, -103, 279, 651, -16, 913, 349, -950, -364, -37, 144, 799, 190, -188, -349, 70, 1, 34, -109, 74, -834, -646, -614, 38, 140, -1041, -181, 531, 197, 33, 167, 572, -132, 415, -164, 944, -896, 1123, -353, -229, 161, 437, 491, 32, 1191, 468, -476, 725, 313, 178, 515, -397, 565, 160, 344, -80, -77, 432, 196, -330, 164, 858, -71, -441, 337, 134, -1148, -719, 521, 257, 576, -1034, -221, -467, 120, -167, -194, -173, -479, -690, 155, 35, 154, 1004, -200, 126, -90, 236, -194, -9, -495, -1271, 278, 22, 344, -361, 897, 302, -663, -337, 294, 45, -34, -79, -498, 431, 499, -200, -215, 219, -78, 238, 108, -88, -206, -334, 614, 189, -163, 315, 96, -327, -183, 373, -873, -36, -235, -999, -98, 371, -391, -26, 157, -506, 71, -349, -513, 335, 356, 175, 46, -418, -1078, 120, -554, 716, 243, 74, -182, -208]
6148b08j25O62m08M81q59Q01p56M21J092q50l29K53m75N69J5l94k38m30J134p40
6168c84K27L70j04j72M17k73P8j39R7q34J154r82J529J45j319k19K86J55m43Q2
6188c29k45l6N51M55o47r0J005m25m4j159J288l6MP3m48R09j748P27P81p18j20
6209b52m61M64M94L22k61k65K31j006N27Q46p21j43m42J129L33n66j91K98j127
6228g91K66J12J8L7n2K57j5j52J84o81J066j76K22n2k6Nq7o98Q60R5p82K21L86
6251B17k62O34q47R07q61K67K91l62o9L26l87M87k92j20r77Q52K20m90J114j252
6271f04R88q03R01j98j26R4k86r78M39J191j14K1o15L84n12K63K18O19j017m37
6291e72N16N36m57j11N39p60O59o08J026p56N02r74M8L42K90N48o99J2P9K28n59
$$ y = [-208, -333, 329, -79, 402, -457, 344, -412, 9, 1101, 251, -78, 175, -300, 269, 284, -110, -348, -778, 356, -384, -157, 213, 109, -63, 354, 81, 159, 20, 117, -717, 437, -545, 984, 1129, -190, -409, -123, 32, -411, -329, -574, -610, -59, 396, -251, -341, 664, 239, 195, -964, 324, 288, 292, 365, -83, 826, -922, -195, 586, -132, -252, -713, -249, 245, 567, 306, 41, 272, -734, -207, 639, -82, -225, -667, 462, 795, 229, 38, 336, -791, -525, -413, -395, -358, -410, -153, -168, -320, -136, -817, 249, 73, 295, 243, 217, 222, 135, -563, 297, 392, -390, -169, 217, -45, 589, -258, 649, -212, 55, 346, -16, -85, 241, -146, 341, 49, -71, -1048, -196, 24, -466, 648, -604, 384, -419, 482, 284, 158, 252, -34, -1012, -573, 618, 504, 525, -90, 294, -218, 45, 263, 882, -135, -572, -56, 480, 23, -88, 451, -309, 350, -258, 768, 12, 514, -460, -412, -70, 220, 768, 69, 81, 160, 388, -171]
6312a71P4L84k99k04O42m81M65l08m76O9m33J226k76n2k03n89P35p01P47m21M60
6333A88q64J537q66k46J52L12O35p32o30J514j282O2L15m97O80j126M03P61n48
6352b32M47k53K09K04O55m82j49L31j331J456j022j00k92P46r89J154k64R55q33
6371B10j27j20K00o35P2R07L43j268K42O55n03n57J554j456M48m8Q29j31p89n62
6391g36J011K69o52M04K46p02o04O08O08L26p85RJ72j126Q81l0l2M1K18L68k13
6412B81j159k88J972p43l28J019j527M85P64n05j46K64m42P89r07R68J16n35L85
6431D63j044K92O06l04M76o46l79J101J03J75k244J710o68P12k87k80J76N21J49
6450F32p22J4l62N21M67j131J471j083N64n41L31N02p99L59M27k04r79N31M65
$$ y = [-171, -97, 287, -12, -216, 426, -55, 410, 102, -374, -305, -738, 488, 212, 160, -43, -632, 103, -598, 149, -272, 188, -676, 861, -5, -251, -99, 213, 848, 116, -514, 1000, -282, -220, 95, -402, 278, -848, -445, 316, -232, 215, -38, 171, 375, 1030, 548, 399, 730, -601, 855, -167, -267, -559, 187, -802, 352, 88, 1043, 210, 83, -37, 163, -472, -400, 507, 850, -418, -176, 479, -24, -581, 973, -483, -35, -83, 746, 615, -174, -736, 275, 544, -108, 296, 542, -160, -764, -156, 452, 778, -7, 2, 174, -952, -71, -101, -133, -92, 126, 494, 281, -878, -1166, 806, 63, -265, 754, -773, -288, 476, -29, -175, 89, -353, 436, -471, 497, 613, 78, 463, -581, -289, 317, 13, 489, -157, -536, 565, 668, 843, -1401, 309, -359, 353, 66, -214, -38, 483, 632, -90, -76, -438, 83, 550, -581, 890, -193, 371, -170, 161, 663, -136, 223, 650, 446, -533, -2, 463]
6469D63q02L89K75l50Q12q70L53R2l90M70k7j206Q95M28o23q90J695k53l09M61
6489F13l26K14J38n25P7j75o79R70n23O77O8k94J7K85o42k07r2M8O97o47k6N7
6511b75j9J83k09M64k52p86K04M87K12o7L45m76K02P06j027L87L7M22k8o75N96
6532D31R8j94k77n96J302L9j321P13K33j3r37Q52q75J1P41r85N07l1R9k25R6N45
6554B13m63P75J37m29o61M56k32R99j092j27K33O85j45p95L23J200q22l15M4N84
6574E68p00R1P3K04n88L11O01l69N60j233k8O61J18l37J82o51P11o86j37L95O82
6595D28l05l48q3M60n57L17L21l72M37k38K77q26J25N86N46j285P56n97J407p75
6615B74o17M37Q0J052j575R64j045L20O21l26M03j192M73L5j60K58L0j59N74j015
$$ y = [463, -339, 50, 325, -25, 787, -83, 270, 362, -28, 442, 415, -791, 104, 532, -91, -981, 714, 461, 152, 613, 287, 501, 639, 114, 191, 16, -663, 307, -216, 461, 529, 235, 252, 537, -105, -312, -404, -356, 341, -306, -332, -275, -294, -111, -320, 144, -108, -894, -690, -203, 9, -58, 287, -189, 13, 719, -308, 79, 116, 538, 510, -165, 431, 529, 335, 58, -538, 764, 803, -518, 195, 428, 415, -522, 330, -545, -534, 207, -778, -271, -302, -203, -428, -332, 213, -250, 525, 662, 233, -428, 28, -204, 795, -297, -424, -191, 494, 349, -446, -123, 1077, 255, -60, -16, 568, -132, -41, 32, 236, -352, -41, 560, 191, 751, -482, -510, 151, 269, -68, 114, -537, 174, -512, -649, -254, 428, 123, -225, -308, 152, -405, -88, 233, -139, 298, 60, 337, -489, -364, 222, 768, -517, 239, -358, 1049, 274, -343, 94, 174, 1226, -349, 615, -430, -110, 511, 185, 588, -604, -131, -96, -256, 2, 32, -127, 447, -568]
6635e68O77l27N09o60p2J66p5L73L77M25K1j246R66N17j524O85k52Q41k96p24
6655a87l53O69m86K93m1M10N09q81J15p2P02r25O9m3N84k24o0J84r39J47Q34j21
6677A84j12j46P58j049q1O74k83M64J24j255L71Q21J07m30M2J70j180J472m73
6696A78p42K47l79J396n98J88q34n34P14R83j242M64R44o27m7K45k47K5n83M70
6716B1o0q55J674j347K73O74k80j41k82K20o68N75m99N57n31O52N2M23m68M45
6736D35n38L52O59p68j012J963j104M11o40O10m82p92L90L25O61p74n5M19q42
6755g82R80J066j853l5J297p50N25m82l79K95L25k74R3M94j117J371j194P41m51
6774a30J59k01O33k37J4o99P23L40n66j96Q64l07n28n31R77n86P91J7p58K77q77
$$ y = [-568, 109, -218, 291, -369, -441, -275, -350, 23, 400, 825, 846, -400, 566, 1083, -441, 244, -8, 833, 537, -187, -540, 129, -357, -64, -105, 305, 814, -67, 48, -24, 678, -247, -178, -221, 363, 139, 79, 263, -676, -529, 305, 184, 72, -74, 684, -365, -446, 228, -55, 409, 533, -722, -351, 470, 577, 147, 189, 359, -821, 651, 178, -564, -317, -696, 700, 102, 290, -544, -1078, -364, 619, -623, -159, 785, 158, 111, 356, 109, 134, -449, 21, -39, -894, 780, -567, -294, 380, 100, -41, -323, -103, -771, -196, -695, -138, -669, -17, 35, 458, -10, 435, -103, 249, 908, 140, -872, 1091, -13, 398, -242, 368, -114, -906, -516, -191, 470, -304, -359, 60, -782, 198, 1264, -589, -624, 673, -77, 448, -34, -413, -118, 207, -67, 26, 520, -597, 774, -420, 321, -130, 29, -172, 461, 224, 238, -461, 262, 602, 36, -160, 704, 397, -131, -662, 315, -271, 520, 537, -221, 56, -821]
6795h21Q14l86J59q1J99N56j016j19J005J12l04m73M37R39j320ON15l69l20M91
6815B4j11N36Kn03p66K5N13M26K84o94j4k98N52j24J167r31j571J531j118P90
6835b80j73N44o50N11P46j803P54%j75N72N13n4j39p14n65J190j5p5j19l93P45
6856D20n99M98J54k75j128R82O96j073J336j840Q42n87K31P97p37N44j091O28
6874b02m1n93J277r74R83r17P11j60j38p75R09q3n09R48m33M48K76j393M46M23
6894B03n84P68q37K91J029q64r1k68O06p38N70q36K33R18J10r72J139J05j213
6913d31M28j09O91m83q7L15k34n34O05k37Q4m07Q94J44o4o61N16p31m77J05N33
6934a40r2m8m23J239M57q01m50n69L62k38N24l91O5Q01k11O8l2k90M76J16j518
$$ y = [-821, -7, -393, -234, -315, -116, 440, -576, -695, 310, 422, 118, -355, 82, 1021, -299, -293, 222, -147, -467, 24, -87, 449, 451, -52, -818, -793, -280, 146, 430, -264, -278, -576, -24, -148, 1019, 88, -1483, 48, -1070, -280, -453, 91, -559, -48, 698, -1105, -351, -351, -526, 46, 559, 505, 366, -348, -913, 277, 262, 187, 68, -325, 420, -179, 319, 473, 198, -930, 52, 748, -325, 1011, -829, 13, -574, -343, 454, -283, 261, -830, -202, -243, -836, 441, -533, 450, -467, 244, 84, -54, -829, 80, -3, -512, 436, 3, 451, 727, -666, -220, 203, -381, 387, -450, -159, 870, 6, -85, -353, 253, -485, 85, -751, -518, 400, 510, -462, 677, 782, -431, -3, -112, 579, 96, 9, 324, 90, -444, 161, -76, 8, -399, 495, 639, 575, -86, 430, -301, -778, -673, -140, -232, -280, -703, 536, 993, 192, -258, -827, -465, -703, -179, -570, -505, 296, 85, 153, 121, -169, 307, 423, -1095]
6955a095R09q01J415J93j151n9K11N88N7k78k20R82j319M44k67M62o12J174j69
6974D64J19j014M80o92M67M08P83n74k40q27M67O17o18J3L5N39j393K43J050K29
6994E56m62O89m8m34p0o38M83m96J426j379J04M03R8l48j359J633L56L46k67p17
7014a24l17J07J027p43J43p52J073p76R13m56j063L11N17M99r69M72k26N77j61
7033E2o6l01M06N0j785J111K55n25Q34k53N69l84om89Q49j66j35L67o86Q02o82
7054a83M29ml46O75n0n09j23LM79r12M99r9L19o90N91N18q88P2O8j95M14n29K77
7077a84J23l97P98j49l51K0J68m99J328j327O62M05l96l44k00P93j08M52j003
7096b09OR36r55J49P93o79K18l53j64l93J511J14p31p40O60j02j59o07J020k44
$$ y = [-1095, -186, -987, 428, 621, -530, -589, -378, 210, 267, -11, -231, 751, -568, -124, -391, 71, -541, 633, 464, 583, -431, 49, -643, -176, 232, 1015, 441, 201, -626, -159, 458, -160, -147, -112, 427, -966, -723, 327, 556, 94, 783, 735, 301, 231, -407, 76, -420, 1006, -373, -269, 134, 232, -116, -1475, 158, 514, 860, 593, -124, -441, -334, 693, -50, 93, -659, 414, -362, 551, 95, -968, -657, -140, 359, -610, -138, -364, 213, 52, -14, -315, 91, 141, -1644, -533, -278, -803, 31, -222, 347, -37, -43, -532, 317, 151, 16, 383, -303, 499, -183, 246, 242, -104, 571, 521, 12, -111, -108, 371, -541, -42, -141, 178, -512, 79, 597, -291, -219, -151, -346, 68, -461, -184, -61, -458, 340, 191, -160, -140, 28, -471, 857, -470, 192, 597, 201, -143, -343, 450, 342, 794, -209, -203, 733, -222, -73, 720, 41, 259, -94, -258, -651, 860, 974, 243, -497, 163, 61, -98, -705, 315, 71]
7116G1m23K14m14O67m1j23Q6R3J45K74J64q43M35p96K35P14k00r60J008k8l03
7137b5k85J238j000j31j08P69l71j23q9k17K99K08R8q99J110q39O22k0j48m09
7157c20K34n02P83M07o22lM76l21r30N07L65M81K08j445O34J15K71o28M94o59
7177d55L75o0j45L1J102p91P80r79k52J078n75K76o1n07K98o89J227j180M42n40
7197f25k48J692m88l20q02L34K64m10J19L02O33l84O42J97n89r76J556o46p07
7216d56Q56m76O41j123Q30p7l43j09M0L56m04M08L10j146J67K17j35j1K74l17
7236d98J044j101L63l43k15J796j132J42P45p44%o76P55l1l37l67J027l65K16
7255B79j0J40q31M97P2r2m26P3o44J593o16n60J169k30j838J714l72k80K85K03
$$ y = [71, -352, -138, -552, 115, 74, -49, 37, 130, 275, 549, 713, -130, 305, -491, -256, 458, 258, -702, 306, 278, -25, -310, 928, -72, -203, -311, 458, 87, -36, -125, -342, -43, 165, 263, -636, 474, -365, 257, 237, 89, -320, -86, -588, 195, 602, -20, -23, 453, 132, -798, -291, 74, 555, 763, -682, -48, 67, 338, -290, 204, -455, -80, -140, -285, -254, 848, 57, 837, -142, -394, 684, 109, 385, 324, -183, 115, -574, 653, -527, -85, -625, -873, 819, 331, 11, -791, -457, -193, -603, -484, -182, 451, 67, 709, 906, 317, -659, 897, 251, -456, 400, -76, 565, -558, 272, 195, -148, -257, -217, 139, -265, 143, 453, -693, -526, -309, -444, -455, -181, -498, 546, -555, -192, -535, -750, 1046, -86, 56, 801, 57, 57, -619, 136, 105, -232, -599, 428, 63, 279, 269, 409, -422, 75, 147, 55, -371, -298, -942, 651, 35, -525, 644, 414, -1424, 290, -82, -362, -77, 126]
7275A26o5l18O98m85K14j31M50p55P11q53K96o9M72Kl67R35q99j11P75p48m69
7296e91J2Q00n77M49N37p12K80m59n1N50m60j7L82P29l3o62j000J52O73j41m74
7317f13J83L81q1L31j2N85n62n54N14q23J149l82k31J003n19k98m5O23j314k74
7337i39J253M58r27L51o43L44K82n86M48P82m18p91L92j65n3P11l79KL34m28j06
7358g8K17n42J70K31k56j19P06n27L07L00q47K67nJ020n11L90o75k45m23O71q49
7379g98J156N94j033Q60o95j69J10N66j87j45r45O82Q76j008N94N41j566N71J19
7398A23q5N19j353P59K29m71L11K76n03lO03n60L43N00l15j40m5L61p85N09p85
7419e12L46K31p95J213n15k71N25l07j9N15j014M32J000j266K47L76N78n84L47
$$ y = [126, 61, -257, 441, -44, 170, 39, 489, -266, 445, -408, -112, -181, 291, 293, -74, 861, -38, -149, 626, -122, -591, -579, 221, -356, 93, 630, -82, 198, -261, -312, 238, -222, -239, 143, 872, 839, 177, -823, -671, 2, -139, -613, -430, -49, -130, 201, 189, 774, 212, -342, 172, -651, 498, 116, -115, 888, 369, 71, 26, 649, -665, -939, 314, 772, -155, 196, -447, -103, 179, -407, 41, 823, 405, -386, 6, -159, -212, 499, 120, 122, 456, 28, -78, 139, -403, -233, -2, -258, -377, 329, -198, 109, 409, -438, -171, -176, 844, 333, 723, 48, -197, -620, 51, -798, 358, 952, -81, 779, 84, -85, 25, 591, 404, 259, -686, -4, 872, -136, 458, 999, -567, 4, 123, 38, 557, -796, -37, 192, -279, 32, 308, -195, -198, 405, -155, 188, 688, 373, 233, 188, 549, -236, 273, -512, -166, 65, -730, 483, -32, -303, 222, -85, -104, 411, -603, -171, 829, -437, -190, 186, 764, 180, 527]
7438E27p10k72R05q88j15M12j00J12N08m9o20l18J121j63m65r7L15n37O54n57
7458c37o1L27N08n05LK74o98O87N73o03k57N28j21l17Q1k28j076J803o43m2N82
7479D78p10M1m10P74K76p54j34J089k53J95l57k73N89j094J026n82m58k08L00
7498d65J399r01P1o8L44m88J005q41k15J5q92J09O34M69k09O51j721J295J90p58
7518c76J6j27l02J797j170L93m02R3K37J58q63J802k72j526q34J760p21j67O24
7537A20o43L80J1j88P75m35om48P02n45L36lo99O75K04n77l21J084K91p94K93
7558B12p01J042r39N73q77R55m34L17M00o21n50M91L78m71M21l82K28k80K40m27
7578d25j27M11K4L55n38L96P7p01j3K44O23n07m58J051K16l41K84q70j56K80o70
$$ y = [527, -183, -455, 450, -438, -553, -141, -241, -129, 379, 330, -290, -608, 513, 350, -115, -212, 103, -434, 220, -337, -398, -71, 437, -68, -65, 209, -489, 198, 771, 168, -89, 439, 318, 1, 82, -146, -1222, 581, -62, -104, 478, -232, -191, -601, 173, 449, -305, -439, 650, 397, 592, 235, -38, 551, -543, 483, -99, -557, -765, -465, 934, 33, 104, 36, 380, -108, 897, 56, -159, -144, -1036, -927, -293, 176, -33, 618, -1103, 192, 382, -376, -360, -487, -789, 1008, -162, 231, -171, -78, 159, 317, -546, 1256, 984, -542, -1376, 384, -337, -504, 120, -523, -143, -132, -320, 455, 20, 14, -434, 268, -277, 59, 56, -643, 32, 236, -341, -662, 422, 713, -81, 212, -489, 553, -386, 187, -690, 265, -169, 148, 548, -73, -623, -132, 246, -225, 196, -186, 42, -238, 2, -425, -552, -141, -117, 238, -300, 96, 173, -528, -541, -297, 326, -181, -639, 412, 628, 287, 571, -299, -455, -175, -845]
7599h45J006q87Q67J73r9J80r87K04j52O65j8j25O77k13l96K19o12P73m18l94
7619c82M24L60n67R42o64P47j040P11P0r15k6k97K12Q41j196O53k1J52n1p30k94
7640a071J431n55k46J48M94m69N2J07j38L65K72M26r52Q83j125L94Q5L38m83l7
7660h1r6n37N50K93M6n24N52P3q12J599p99n55k59k53J134r4n02m15J036p34O19
7681B41n94M49k50L22n26Q43k95k11R9o27M96j11J151p71r6J5n33J86P57r65J71
7702b49L29O45j154J15q4J155n07o7m49L05j74M95L7J47l95p77L75p9N14j50M81
7723E13p38J02k73J44M57m80N40q92O78N81j052O49r03J360j308O00j53k42M2
7742c75Q95r97J87O78n23K95n04k55R17m27r8J7M9J70K04o72O88l19j77J294j383
$$ y = [-845, 161, -726, 141, 314, 215, 395, -592, -388, -540, 125, 107, -18, 659, 446, 50, 269, -343, 430, 12, -382, 42, 402, -165, 777, 113, 860, -180, 531, 601, -314, -340, -637, -425, 416, -780, -127, -148, 4, -47, -777, -1071, 360, -195, -441, -293, 201, -268, -216, -109, -247, 118, 390, 816, -136, 747, -378, 16, 101, 439, -44, -81, -177, -714, -164, 129, 175, -349, 203, 276, -536, 1063, 264, -291, -550, -803, 331, 237, -265, -680, 356, -378, 241, -353, 96, -154, 168, -358, 485, 190, -21, 78, -549, -53, -164, 987, 216, 120, 135, -398, -212, 545, -420, -249, 80, 725, -429, -314, -398, 757, 250, 183, -266, 39, -135, 360, 397, 544, 149, -628, -253, -332, 182, 32, 513, -225, -123, -396, -252, 205, -275, 265, -627, 51, 632, -420, 229, -674, 686, -622, -22, -175, -417, -375, 520, -477, -290, 388, -135, 160, -344, -599, 318, -109, -207, -190, -141, 29, 233, -439, 249, -70, -247, 1047, -336]
7763c36n97J076q87M72P79j50J47j175N8P74n66R57q75P05l48n65N23k97n17J039
7783B17o42L36l85N0L95l25j57Q06K38j192L39P56k0K27j172N33Q1P6o11j73M95
7804a28o68O36L95M31r7k01l52N09j094L61n5J33P93o99n56j70R26o68L28R0L0
7825e6o54K09k27L91Q42o68j06j53P60K76o85l92P76r92K45l70L64J81N05n98
7845c52P19q36K03M14p60L49J50n98K93M03m55K23L67K83q5r7j47p9m1n26K36
7866c36J042o42k74l25R04j307O61M04q42R91n00N38j066J317o68l46Q71j206
7884g84R41p5N18q15P43j330O6N90M4M1J825j660R4j099P11M80p84J150j242P13
7904A27J93k36Q7J7j33m09O39q44Q51n27L39L10j236J400n25j21m02O09k36j90
$$ y = [-336, -933, 143, -744, -272, 507, 357, 504, -671, -613, 161, -405, 552, -323, 382, 34, -531, -8, -305, -822, 217, -425, -89, -474, -424, -29, -354, -511, 295, 533, -659, -320, 436, 416, 643, -529, 4, 85, 161, -450, -623, -128, -796, -160, 235, 666, 569, 368, 16, 525, -569, -208, -263, -130, 663, -36, -592, -762, 164, -504, -176, -86, -56, -710, -501, -728, -337, 505, -163, -269, -422, 338, 614, -71, -463, 313, -679, -434, -804, -440, -259, 246, -352, 367, -469, -266, 148, -612, -263, -113, -711, -418, -15, -470, -247, 120, 403, 318, 221, 74, -5, -46, -572, -336, 706, 64, -210, -535, 369, -938, -277, 127, -715, 276, -224, 314, -752, 565, -103, -449, 422, -784, 157, 82, 600, -215, 528, -802, -736, -146, -102, -61, 1764, 104, 198, -901, -190, 290, -494, 656, -586, 127, 320, 84, 171, 188, 55, -354, 285, -559, 292, -235, 104, 414, -822, 578, 53, -68, -470, 139, -97, -287]
7924b87j9o2L33L35k48K06m57L97l96K76J9m69O87l41O59j083Q01k33k02l12K96
7945a00M21n43M72k97r95J297M48m15j89j44O34j133m27Q27p03J316k0j016R74
7964D07P8J5J05r90L87k26M52L85n19L8p97N91n37R63j61l40o64R28N4O51j844
7985a024J390j28j66P5p0O9k53M85k61K33j52k14l66Q34m25J64o61K68m85R49
8005B62k66n3m57J003r40k17L95p1J157j058M91l67l53O59J39O24r48J50q80N39
8025a91M09o23P57q26N22j6M68o42O5K99r5j49M34N04j245R93q14l27J192j250
8045e35R30o07l26K89Q71K51r52j47P35m88L07k54M23J48n52n43O17J1m07o54
8065h83M75K62M40j42K36j127Q10n95J177k20q74O04j049J292k21p15Q93j52j105
$$ y = [-287, -306, -368, -35, 300, 52, 258, -199, 198, -198, 78, 97, -372, 315, -26, 633, -450, 351, 118, -84, -396, -100, 321, -222, 250, -47, -1042, 255, 703, 288, 99, -45, 589, -544, -971, -144, -847, 469, 449, -567, 407, 485, 500, 605, -385, 2, -224, 228, 613, 94, 132, -665, -74, -611, 352, 191, -149, -813, 115, 169, 820, -1024, 366, 238, 72, 147, 77, 146, -107, 378, 117, 350, 198, -16, -382, 452, 27, 191, -470, -202, -687, 262, -4, -57, -514, 489, -451, -668, -273, -344, 813, -245, 246, -121, -474, 185, 324, 948, 0, 150, -730, -191, 218, -405, 352, -474, 48, 32, 500, -142, -77, 222, 127, -22, 412, 916, -329, 664, -150, -477, 715, -535, 395, -212, -538, -249, 622, 873, -79, -226, 509, 21, 328, 74, 497, 645, 93, -450, 167, 178, -229, -883, -408, -146, 294, 152, 388, -739, 71, -524, 653, 433, -441, 163, -886, 406, 185, -530, 363, 211, -894]
8084h94Q84n9k58M12l67M88m53l86M14Q89m33l33N56o50N74K24j831J846q43M44
8104B24J35L5k76J26j28l17l2N81O03j603J13L13N87o56M1m24N85R41l79j210
8124g41J81J184j134J03N60o26K37J45q75P6R93Ok8K06o02L95K84q46J251J5j456
8145f72R76J02m29p76JL86R43m46J41k20q02P72j029J544k18q86L49J99m62m2
8165e69j59Q59l70p08J096r96N64L39J82p12J55j44j24P46q18j41J282K57r46
8184b07O38m11k55k22P44k51J81
$$ y = [-894, -10, -69, -327, 85, -282, 206, -247, -633, -219, 670, 237, -96, 460, -190, 384, 608, -1223, 623, -220, 224, 359, 394, 118, 244, 116, -201, -233, 348, 951, -652, -539, -226, 361, -295, -254, -678, -93, 848, 469, -741, -560, 624, -510, -407, 153, -473, -236, -91, -966, -890, 103, 109, 81, 287, -315, 80, 364, -482, 769, 784, -672, 304, 406, -23, -799, -798, -412, 531, 85, 226, 6, -796, -24, -1053, 491, 273, -613, -264, -65, -527, -569, -728, 131, -239, -947, 149, -847, -283, 56, 238, -474, -319, -463, -587, 159, -659, -800, 482, 739, -207, 431, 20, -235, -457, 287, 36, 217]
8191B17
$$ Imaginary data points
##PAGE= N=2
##DATA TABLE= (X++(I..I)), XYDATA
0@%%%%%%%%%%%%j08K16k16K16l24M32m32N40o48P56r72J188j381J597j836K053
28A081k377K762l126L582m083M614n205N874o598P378q260R225j0279J1410j2650
43f652J4029j5525J7154j8929K0873k3005K5333k7906L0734l3867L7362m1256
55b1655M5638n0601N6276o2848P0553p9737R0895j04787J22622j46456J80074
66I9974k31256L19294n10701J618571p61349j834983K635086j748771L05725P23667
76F15257j107801O94615P4162n58943N87781m53284K16279J11195l38444K50635
86I1452Q927j94520J81498j18322K2615Q6762j50550L8082J54759k68837J87045
97C8911J1116k37347L41290k37948n8634L58972m65760K86416O6655m01647N10144
$$ y = [0, 0, 0, 0, 0, 0, 0, 0, 0, 0, 0, 0, 0, -108, 108, -108, 108, -216, 216, -216, 324, -324, 432, -540, 648, -733, 864, -972, 1081, -1296, 1466, -1660, 1922, -2161, 2453, -2752, 3122, -3476, 3902, -4358, 4867, -5412, 5998, -6652, 7377, -8148, 9006, -9923, 10950, -12055, 13278, -14628, 16106, -17761, 19601, -21655, 23983, -26618, 29658, -33190, 37363, -42374, 48521, -56266, 66356, -80100, 99974, -131282, 188012, -322689, 1295882, 534533, -1300450, 1334636, -414135, -108410, 615257, -492544, 202071, 276233, -282710, 305071, -148213, 68066, 179261, -159183, 91452, 100379, -94141, 87357, -30965, -8350, 78412, -72138, -34056, 120703, -148134, 38911, 50027, -187320, 153970, -83978, -142612, 216360, -249400, 37016, 103671, -297976, 212168]
108B12168l13061r3740M40504n01112K65640Q1770l44092M09407k51025k9847
118a23388K69827l25676K07033M808j84497K48313j44296k3498J40174j33186
128f4386O4875K8455q5351Q7947j2700o7213J07630n4591m4964J42804j45557
139d3051M5210J17618k15367J84102k5911j55466K57194k04932K7008J75797k73434
150a11232K08838k7968j63154K54027k08961N3637J25078k38736K11208o5897
160C6840j20243K17025j81923L3699J10549j75595J16959m949r7674J21668q0707
171b4351j4746R3392j15671M4551O1199j33099R9860R479j25701J53649p7117
182b8555o1041J60143j57336N3103P9098j62395J55270n9727p2676J66553j61072
$$ y = [212168, -100893, -194633, 245871, -255241, 10399, 92169, -251923, 157484, -93541, -123388, 146439, -179237, 27796, 32604, -151893, 96420, -47876, -71374, 68800, -64386, 489, 28944, -56407, 31540, 18840, -48373, 59257, 4666, -40298, 102506, -43051, 2159, 119777, -95590, 88512, 62601, -92865, 164329, -40603, -13595, 162202, -111232, 97606, 69638, -93516, 160511, -48450, 5187, 130265, -108471, 102737, 36840, -83403, 133622, -48301, -14602, 95947, -79648, 37311, 32362, -65312, 56356, -24351, -39097, 54295, -61376, -16825, 44374, -88725, 11135, 20614, -105087, 48562, -28555, -89596, 70547, -86789, -33686, 45412, -116983, 38287, -21440, -94116, 72437, -88635]
193h8635O4992P4120j67347J65478n5560q2676J67489j37241L3282Q5544j33946
204g4500J05159j4410p0228J13657q0359M543Q0063j07750O7895K7265j01400
215e0065J08687l0899o7399J19877q2626o553Q9360j12098O7466J6746q9597J11626
227G4525o9348j5715R5905j24092O9506K7876j10890J18838n4919m4784J05938
238G2840j03340L3487M3800r2818Q0832l1976l9612Q2289q0144K0661M6599q7860
250e5242O6737l132o8958Q7651m7944k6877P6272p5667K5001L4299p1902O4961
262E199k0592l6989P5407o9828K1513M8359q7661P2747o471o0737R0715n6702
274b5040p065O4967p4998M6615J1053n4364O9882m0758p134N8429p0965M2707
$$ y = [-88635, -23643, 50477, -116870, 48608, -6952, -89628, 77861, -59380, -26098, 59446, -74500, 30659, 16249, -53979, 59678, -20681, -16138, 63925, -43825, 24070, 51335, -50065, 58622, 27723, -39676, 80201, -2425, -8978, 80382, -31716, 35750, 52496, -37101, 74525, 5177, -10538, 85367, -38725, 30781, 58657, -52233, 66605, 11686, -33098, 72840, -30500, 2987, 46787, -46031, 34801, 2825, -36787, 45502, -34642, -13981, 32618, -55242, 11495, 8363, -60595, 27056, -20888, -47765, 28507, -47160, -22159, 12140, -59762, 5199, -15393, -52382, 23025, -46803, -25290, 23069, -64592, 8155, 1684, -59053, 31662, -25040, -32105, 32862, -42136, 4479, 15532, -38832, 31050, -9708, -16842, 41587, -29378, 13329]
286A3329K0753o7095P0754k1817l6653P1815n3658N096M5808o2117M1954K174
298C0343m3571O0089m1663m394N0602o8935M0445J4938o3696O7737k8560l2372
310a9037O6734n9511J1677L5397o1428M8157j3202l4369N7813n1690R166L7691
322B7398o6679M5511L571n3905O3712l3955j9916N4467n3074J6355K4422n0303
334d2396M4285j3832k5105N0143m6502J3313L2948n8210M6574n2m4715O0045l2790
347a6294j1865M8653m8501K2571J7551m0884M4130j9248j3622M4219m4775K0323
359B258K4591n0654M5459m045l6590N3196k9739q010L9442m2280K1749J1736l5039
372g926L9515k1653r482L6963m2611J9999J7108m6412M2125j0892k8380M3818
$$ y = [13329, 34082, -33013, 37741, 15924, -20729, 51086, -2572, 2524, 48332, -13785, 28169, 30343, -13228, 46861, 5198, 804, 51406, -17529, 22916, 37854, -25842, 41895, 13335, -19037, 47697, -11814, -137, 35260, -26168, 21989, 8787, -25582, 32231, -19459, -10293, 27398, -39281, 6230, 9801, -44104, 19608, -14347, -34263, 20204, -32870, -16515, 7907, -42396, 1889, -11943, -37048, 13095, -33407, -20094, 12854, -45356, 1218, 1166, -43549, 16496, -16294, -28159, 20494, -28007, -5436, 12115, -28769, 15361, -3887, -17509, 26710, -18065, 2258, 26849, -23805, 21654, 17609, -18981, 34215, 4476, -3534, 35908, -6372, 15377, 27113, -7926, 31589, 9936, 454, 37417, -5194, 14805, 31913, -14499, 27626, 16734, -11646, 32172]
384C2172l2618K4K6008l7666K3880j462k3985L3753k7958j147K7503l9545K3006
397A965O545l7593L8206j3401k0801L5775k8355J771K1300l2822K3056k054j9992
410b6400L0607k5255L477K4034l8242K6988N130l1680L8646j8438j1965L4117
422A1019l0648J1608J5009k8200K8361j1619q178K9025l0491J5458J3967l1917
434a6606L1649n037k4666L7824j9451o124K5403k6008J2822P858k1098K3898j2526
447G938o399K4485k7599J2281J4796l3710K7773l279k5769L4799k0807o104K3471
460B1876k7881J4467L582k2355K6372j8524n224K5256l3163J6905Q506l1250K9523
473H090j0487j5558K6808k1333k37J7039k3380J5487j663j3888K0737j7330J94
$$ y = [32172, -446, -422, 25586, -12080, 11800, 10338, -13647, 20106, -7852, -8999, 18504, -21041, 1965, 8510, -29083, 9123, -4278, -25079, 10696, -17659, -15888, 5412, -27410, -4354, -6408, -26400, 4207, -21048, -17571, 6463, -31779, -4791, 339, -31341, 7305, -11133, -23098, 11019, -19629, -8021, 6988, -21212, 7149, -4470, -12648, 16377, -14114, 1344, 15311, -16606, 15043, 10006, -14660, 23164, 3713, -2411, 22992, -3016, 9806, 17664, -3434, 20464, 7938, 1539, 26024, -1575, 10706, 25502, -8208, 19565, 16286, -9483, 25316, 4509, -1595, 21876, -6005, 8462, 12044, -10311, 16061, -2463, -7687, 17569, -15594, 1311, 9817, -21433, 8090, -2397, -17955, 8853, -12480, -12717, 4322, -19058, -3571, -5234, -19122, 1615, -15715, -15521]
486a5521J9194k7140J6599P862k5995K5851p385j3155K4920j9099L957J4626k2147
499a7433J8561j305j2535K4145k0572N319J7092k5706J8297N022k3095K7196j0732
512D254q610K2573j7224L632J1279j6802J3769k600r866J8978j5512K119J3922
525A9912k2570J4207M255j9587K0427r619q551J8296j7822N390O967j5510J6353
538A2148j0202m440J4347j9884R610O416k0683J8714m826j3142J6013j1718j198
551h845J0492j3977P998P37r443J1264q546k91J0519j5284Q293P111j7964J4478
565c458m04j3407J9088r242l884J4371j4903Q310K789j0562J7649j2838R42J3826
579H277j8311J3029M865j6258J7940o384o850J5601j1511M067N278j0727J1207
$$ y = [-15521, 3673, -23467, -6868, 994, -25001, 850, -6535, -19690, 5230, -13869, -9912, 4714, -17433, 1128, -177, -12712, 11433, -9139, -3820, 13272, -12434, 5863, 10885, -12210, 14986, 4254, -4356, 18217, 993, 4625, 15904, -898, 12871, 10271, 405, 19383, 3871, 5990, 19912, -2658, 11549, 15804, -3783, 16644, 7025, -1526, 16770, -1052, 4338, 11305, -4205, 12148, 1946, -2494, 11853, -8031, 1579, 7995, -12688, 6026, 1200, -11942, 4071, -7647, -8845, 1647, -12330, -4332, -3595, -13038, -1774, -10320, -10611, -92, -15376, -7083, 28, -17936, -3458, -3862, -17269, 1819, -7423, -11307, 3064, -11839, -3529, -740, -11302, 6347, -6491, -5549, 8277, -10034, 2995, 7860, -8398, 9542, 3158, -3692, 11909, 398, 4465, 9743, -984, 10223]
592A0223m247k817J0500j2237M956Q015j5606J0720J467j1816J2622l916q000
605a36J2131q945r58Q414j2075R740l466p912J3867j4980K920J1303k0275J2617
619B245J523j5255J6667r722l864J1440j2491O762O38r320J1422p966j095Q673
633c43j2266P102L750j1354R427M37q355R535l506l635P712o451K758M279o773
648g683P063j432l796J1125j1568M026R251j4175J1657L73j0121J4244p566q16
662E82Q545j0030Q224j258n525J0427q006Q62P843j2472P984J791q271Q913l315
677F294m425O827l323k169K711m004L099p71l709N061n672o28P101r571L317M787
693D925j1604Q190m48r000R959o355r87N681q122P507m529l312Q694j0422L592
$$ y = [10223, 5976, 3159, 13659, 1422, 6378, 14393, -1213, 9507, 10974, -842, 11780, 7864, -136, 11995, 3050, 2092, 10506, -1569, 8171, 4705, -3207, 10660, -4320, -1400, 9903, -10372, 2245, 3768, -11487, 5180, -4542, -8406, 3034, -9457, -2695, -2057, -11377, 45, -7921, -9016, -343, -12609, -5507, -1757, -13111, -3684, -3247, -11602, -2067, -5573, -9208, -1496, -7947, -5189, -910, -7683, -620, -2052, -5848, 5277, -6291, -2265, 6986, -7189, 4468, 4841, -5280, 8964, 1398, 582, 9127, -903, 7321, 6063, 538, 10965, 2959, 3821, 11664, -808, 7176, 8967, 696, 9609, 6294, 1869, 8696, 5373, 3204, 5915, 1911, 5010, 4239, 530, 5591, -81, -709, 6392, -3179, 138, 4925, -6679, 1511, 1063, -7937, 2022, -4333, -5320, 361, -7761, -254, -4783, -8095, 599, -9823, -6231]
708f231O814j2736R159j33p188R391n009p57M594m969L367N90k548N172m135P53
724c866M693n170J915M948o947N416K981p459O786m24m140P483n152J516K982
739E562n768P771m200j895R175j0530L611O194r844P734j241o851Q448m393j647
754B126M922o501M859j528k915N372n729J77M840p061K296L307p278M756r87m879
770d223N147l200j712M200m826K358Q19n028M794l491j627Q135r558L260N166
785B14r222P554l74o283P543n769K002K369l899N060k311j345N328n227K096M915
801B651p327N361J317n054M491N17l870M995j010j53K083k484L479j468j624M338
817F242l891P55M064o270M055J617n271L598k25k988L892l072M47Q29l055L866
$$ y = [-6231, 583, -12153, -2994, -3127, -10315, -924, -5933, -6690, -2096, -7065, -3698, -3108, -5656, -484, -4619, -3866, 827, -4343, -2428, 2520, -4427, 989, 3970, -3489, 3297, 2873, -1267, 6216, 1064, 2580, 5562, -206, 7565, 3365, 1470, 10645, 115, 3726, 9920, 76, 7810, 6569, -282, 8166, 3773, 2126, 7048, 547, 5406, 3878, 963, 6335, 606, 783, 5623, -1438, 858, 4165, -3113, 1643, 656, -4223, 924, -2276, -3988, 212, -4614, -2256, -1437, -6465, -1671, -5162, -6789, 1346, -8212, -4952, 214, -9008, -1454, -1828, -8111, -568, -6337, -4335, -1966, -5865, -805, -3116, -4461, 867, -4360, -2264, 2651, -4676, 685, 2002, -3052, 1439, 1956, -1914, 3081, 2071, 1918, 4001, 1517, 4996, 3528, 1904, 6242, 2351, 3106, 7170, 900, 4955, 6572, 1301, 4899, 4674, 1686, 5578, 2506, 2953, 3782, 727, 4593]
833D593k069j343L620n951K604K896o526M009q14m773N181j525j657J770l010
848b995K334k025j572L975l817J1M451n826J332L310n586L247N94l276M087j929
864c685j26K315l317L332n37k646N055l353n21N064n477K243L249n382M431J036
880A681l110M031k467O17K043k598L976k377p69N165n085J622L556n914K842K792
896F005n512M126r67j881L080k585M19Q50j704J584j816l83K759m123J118L754
912D724n333K104L32l642L126j505k296L408l135J020o3j168K776k487j547L929
928B43n696K067L515n627L842K77m594M125j351j538K667j687J839n11j233M608
944I46m733J738K399l811J143K701l457K745R20j608J758p73K56Q39n66J812n37
$$ y = [4593, 2524, 1181, 4801, -1150, 1454, 4350, -2176, 1833, 1019, -3754, 1427, -98, -1755, 15, -2995, -661, -2686, -4258, -283, -4100, -4089, 362, -5464, -4132, -822, -6408, -3161, -2567, -5843, -1756, -3685, -3811, -1496, -4813, -1481, -2018, -4664, 391, -2962, -3483, 1581, -3896, -1653, 1596, -3786, 645, 1681, -1429, 2602, 135, 752, 2795, 197, 4173, 1796, 1027, 6192, 1107, 2729, 6285, 371, 3213, 6005, 493, 4619, 3652, 1771, 4851, 2266, 2685, 3535, 1831, 3415, 1599, 1216, 3975, -148, 970, 4724, -609, 1495, 1827, -1815, 1311, -194, -2490, 918, -2217, -1197, -1260, -2428, 348, -2139, -3686, 243, -5453, -3386, 129, -5498, -1656, -1379, -5973, -1848, -3199, -4737, -2070, -3757, -1918, -2429, -3662, 946, -3787, -2049, 350, -3461, -2318, 383, -3074, -329, 591, -1017, 741, -32, 224, 1063, 497, 2309, 1772]
961A772j575K895j495j243M477l575J662J279m264L162L41j877J866r93j15J033
977C350k288K791p17k224L678l726n16K720m139K374R57l780K152k47j924J900
993C61j838J898q49k347L012j918j236K458j824j097L039l982J893q9q89J587
1009a821n47j323K023j707J872o73k331M652l013M79L434l299P03K081l352K338
1025d84O75k428L884k020K16J495j067J319r34j140K860k030M50K830k290O40
1041A976J944l263J956k51o85J890j492j42J016j936J766k28q43J665k707J163
1057A829J086l626J962P72k714J732l87j358J536j205N16O98l036L186k877J09
1073a777J043j352l14J429o88k59N51k047J647k68l05R15r60LO69j532L178j386
$$ y = [1772, 197, 3092, 1597, 354, 4831, 1256, 2918, 4197, -67, 3095, 3436, 1559, 3425, 2432, 2317, 3350, 1062, 3853, 3136, 912, 4590, 864, 348, 3068, -1071, 1303, 2260, -1520, 632, 385, -1539, 361, -1477, 421, -428, -2775, 237, -1681, -2917, -459, -2283, -3380, -341, -4323, -2430, -2519, -3408, -1821, -2368, -3691, -1668, -3375, -1503, -2176, -4507, 145, -2868, -2389, 1045, -2254, -1551, 530, -2822, -484, 191, -2237, 1647, -373, -157, 1338, 271, 1590, 656, -484, 2376, 346, 796, 3626, 1336, 1976, 3920, 657, 2613, 2362, 1677, 3567, 2075, 1933, 2949, 1013, 2779, 2551, 1708, 3373, 666, 1829, 2915, -711, 1251, 2023, -691, 1041, 654, -704, 832, -373, 143, 841, -2195, 991, -1886, -1777, -734, -2086, -2400, -971, -1659, -1918, -1367, -3414, -1767, -2035, -2340, -1425, -2385, -2382, -1713, -3245, -67, -1453]
1091a453j570K675j988K80K052j683J232J47k107J996k64M75R55n86Q17J32j987
1108h77L901k733K29K088k623J435J793l186J808P67j397J913p42r6j43r21J18
1125A334R39p10J387k927Q99J848k542J175J272l652K599j022n89J688j726j45
1141a72R01j432J169m55k046J549k007J027K437m191J535J438k979R12L62j179
1157c131J855j097P19N9m26K83J48j50J121j486NK353k414J019J332j928J560
1174a78o70J57J427l96L32l78p42J857o11j588L623j885m35K493j968n1J755j981
1192G61J407L85m30j25j119J426K04j483J651j655L30J649l394J071J709k247
1208A40N77j43P0K64m63q89K101k292J009m13p85M56r83o79J833k057M73R75j839
$$ y = [-1453, -3023, -348, -2336, -2056, -4, -1687, -455, -308, -2415, -419, -683, -208, 747, 161, 978, 1110, -877, 3024, 291, 520, 2608, -15, 1420, 3213, 27, 1835, 2602, 1205, 3118, 2376, 2280, 2137, 1216, 1334, 2273, 1563, 2950, 23, 922, 2770, 228, 1403, 2675, -977, 1622, 600, 11, 1699, -27, -172, 729, -703, 466, 11, -2035, -486, -2493, -1466, 971, -3220, -1685, -247, -3226, -2314, -1952, -3131, -1276, -2373, -1654, -1595, -2021, -1738, -1590, -1740, -619, -2105, -2100, 253, -2161, -1142, 190, -1738, -178, -848, -691, 736, 340, 672, 294, -448, 1409, 798, -790, 2833, 948, 513, 3006, 1038, 987, 2742, 761, 2168, 2553, 2123, 1998, 879, 2305, 2509, 1026, 2677, 1022, 1352, 3001, -393, 678, 2387, 140, 717, 574, 644, 908, 445, -444, 1657, -635, 374, -39, -824, -368, -1351, -2030, -197, -2254, -1781, -806, -2645]
1227b645J372M20j583K000j159J27Q1j151K780k149l35K000r25q45J635j846Q71
1244a352P53j279N50Q52k07J261m95L70o78r02J178N40l0J046k307J117J348j523
1262B42J08K144k092O54R31n35L17r00Q70k71o18J554p29j414K165j657P1L64
1280A204n00n07N82m28M88N26m90L37j360J163j138l36J516j937K82K12j241O53
1298i74P85j537o5J454p59M15j113J596j023n36R01q06n5J058l59q60J969k066
1316a975M81J151o81N06l68k9N95J17O92J84o89N91j017k59J782j954O24J489
1334A240m06P86m91m62J79n2n1j07j84P99L21n19R04j032n67N49m0m07J774j476
1354G58M46K79j615L68O26p09K60k68K87j57j81l42J80q27J185o89o88J054m92
$$ y = [-2645, -1273, -853, -2436, -436, -1595, -1468, -1387, -2538, 242, -1907, -2242, -242, -1167, -2012, -377, -2223, -1352, -599, -1878, -1328, -476, -683, 578, 83, 453, -225, -1127, 51, 591, 561, 1607, -700, 417, 1765, 242, 350, 2494, 402, 1056, 1987, 1452, 1769, 869, 1739, 1468, 850, 2404, 1675, 261, 2426, 769, 840, 1204, 704, 197, 779, 351, 839, 1365, 875, 1212, -148, 1015, -123, -459, 1057, -880, -598, -386, -1627, -974, -189, -1726, -1791, -337, -1096, -681, -1794, -198, -1221, -1757, -856, -1662, -1717, -659, -1018, -1878, 91, -1975, -1494, -343, -1024, -518, -886, -915, -320, -203, 489, 673, -16, 575, -442, -701, 1081, -873, -249, 1240, 834, 1620, 1129, 667, 846, 794, 743, 636, 452, 1251, 1572, 1053, 1957, 925, 358, 907, 867, 460, 2234, 758, 1204, 1483, -132, 236, 862, 153, 413, 145, 432, 275, 94, -248, -68, -895, 290, -399, -1087, -33, -525]
1373e25m95N92j009O30Q29j496R51K97n90m15p63J438r00j89J561j471L63LM42
1392g47J71L04p0N20j003Q66m77K94J34L59j297J868q33K5L03L98k77m1m61J017
1412A053l95O28l10m35P95q70J512m40o55O28K17j644K38Q03J46j289P79l3o58
1431G0O15l36L05j010K98R04j614J639m63r39J389r52n12P88j726P16L78r6n3
1450e99p75O65l94M72O1r38K74N04o21p03J014J95M24N96j717J635o27J23pr28
1470a346J491n00k78O21L62j220J462m6j647J680l36k37J496l58o41K16K47kl12
1489F52L83Q24k167K177j151k31Q24M8q84J353j585j50R57l31K87M18j74P1k090
1508g69J523N52j745N98r9k29J076n79p82J081k45o54j41P6r50J133l63n27K51
$$ y = [-525, -1020, -428, -1437, -807, 22, -1474, -523, -226, -816, -1231, -1994, -556, -1456, -1645, -84, -1555, -1192, -1189, -747, -576, -272, -342, 178, -825, 41, -436, -142, -8, 351, -946, 922, 89, 114, 417, 815, 538, 497, 36, 1053, 658, 1286, 976, 541, 1336, 466, 1978, 1538, 883, 1511, 1728, 84, 322, 1125, 1271, -18, 761, 728, 70, 685, 349, 654, -356, -58, 846, -768, 871, 408, -531, 858, -94, -606, 182, -1544, -828, -450, -546, -599, -1374, -709, -1103, -631, -570, -1508, -1234, -730, -1351, -2054, -1040, -845, -421, 175, -1542, 93, -534, -411, -418, -1346, 145, -355, -633, -12, 350, -870, 592, 546, -1101, 579, 243, 6, 1502, 1144, 503, 719, 966, 964, 652, 1035, 1859, -308, 1869, 718, 487, 1311, 1359, 475, 1828, 243, 93, 1050, 719, 1006, 1424, 1250, 1321, -769, 754, 1306, -439, 159, 60, -169, 907, 328, -454, 627, 382, -272, -413, -337, -1287, -154, -517, -1044, -793]
1527g93k63K88J34l32P22r28m62R67j171J291J61j548J360p31k07P99m91J79L16
1546g09R81j87o35J329n36m79O42q81M73P81o07k25Q73j36m76N42L78r93Q30l7
1566I28j49p85J627j320P7N18j052J82k06N33n60J114j06M2m40K32o9m36j27k4
1586b1j0n34N82K80L30l27p82j47O09k57P01n39J93m52J95o50p25Q68j04j104
1606a894J416p5m28L79m19R04r75k59Q02l87L26R11j040P58J19l74M84l91O14
1625D71j7J38p43o9O81N6O85j250K42M66J70k34m19J44P70q60J214o06k85J206
1645A760j091J17n53J18P35j96n29K6l84R08q0p91K88%k91R71j634R01L24j076
1665d77L29M92p97j56L37l31k02K50J85k73N8M38m79k79J189j049K22n42J231
$$ y = [-793, -1056, -768, -634, -966, -244, -1172, -1634, -667, -1838, -547, -386, -1934, -574, -1305, -1512, -713, -1204, -1025, -709, 272, 85, -550, 779, 243, -236, 406, -475, -2, 779, 172, -53, 820, 684, 208, 750, 1128, 135, 965, 928, 779, -6, 1621, 301, 378, 896, -156, 26, -180, 353, -207, 907, 801, 843, 403, 635, 566, 130, 3, -21, -31, -565, 17, 297, 627, 300, -482, -629, -20, -277, 424, -115, 78, -374, -179, -829, -1554, -686, -790, -1894, -478, -553, -981, -602, -1021, -117, -1092, -1351, -549, -936, -610, 301, -739, 19, 138, -236, 248, -143, 471, 454, 592, -151, -220, 461, 517, 1202, -48, 194, 660, 830, 596, 177, 321, 1091, 231, 1445, 839, 554, 1760, 669, 786, 233, 351, 1086, 890, 361, 387, 3, 911, 831, 40, 328, 328, 37, 1008, -626, 275, 599, -477, -148, 344, -453, -609, -272, -603, -805, -555, -370, -643, -585, -147, -626, -905, 284, -765, -543, -1085, 146]
1684A46j164Q08O96j576L62N82P73j487Q87J25p18J019j532O37l51J373n19P1
1702A32Q88p08o9M74l14j61K9Q10k51j28L15l44k45N26j039N31M03L82r09l44
1722b2J192M32j569j95J208j287J055j378J211r71o6J457o23j03k56l69M7P88
1740E51L7n19R5Rk81r31J471m69k65R8p25l2J110r84m05K22l34N61j053J143n8
1761g59O0N90o23M44j71q1k74J114m07q16Q97O74n96L2P5K7j68k64N25m68K03
1782A4K73o13J077R7r70J391j513J109n2l1j031J387j359J031j29j78n9O09m51
1801F02o74P1L92j52o04L22j33p86Q10L33o13N67p70K18Q86o38j69k01J115j093
1821e17J0N16j590J722q34J006j033k23O59o51Q70o13N13r37J051m22n01L38k90
$$ y = [146, -1018, -210, 486, -1090, -728, -146, 627, -860, 27, 152, -566, 453, -1079, -442, -793, 580, 61, 132, 1020, 312, 243, 717, 403, 242, 271, 1081, 830, 702, 1017, 673, 428, 954, -85, 446, 849, 1231, 322, -22, 1170, 1602, 33, -162, 1046, -241, 814, -564, 647, -324, -390, 1067, 444, 341, 85, -284, -237, 551, 588, 69, 164, 173, -108, -1039, 432, -37, -302, -204, -929, -961, 149, -835, -1240, -1018, -1352, -791, -1844, -701, -759, -699, -109, -732, -288, -459, -540, -814, 300, -107, -923, -26, 648, 52, 84, 159, 186, 18, -246, 279, -189, 14, 287, -326, 751, 848, -122, 1269, -244, 865, 813, 782, -249, 1138, -221, 810, 681, 503, 444, 1053, 602, -72, -1, 391, 239, -365, -43, -176, -962, -152, 181, -432, 135, -635, -417, 469, -169, -338, -539, 576, -517, -507, 9, -1581, 141, -693, 313, -720, -943, -284, -935, -65, -678, -165, -1102, -51, -473, -974, -636, -926]
1840i26N23J30J91L11L72r76L69Kk1J85o8K29k31j74n80Q80K09O24j072j68J347
1861A156l60L8o53K24k10K43L88L17j679M52L78l02O07M27l29o99k62Q7M90N35
1881H48j461O78P04o43l93O63k3n95m34O18L28m20j26N4k89L0M4K1N76n04N39
1902B15n39R93o26j382J461r47o7J99J76M55P19k068J402K31j376R97q83N87O51
1921A98l91M9n1Q54j258P92l5p41L24k30M41L18L94p61P22k70m61l7P20J67o58
1942H6k11J35P25o5K61r14l43N36m04j76M57M76q40k5N30r40J444q09M66o73M22
1963A38J08p35Q66j194M34n61R59l74M91o79Q90q96R29j220j72J10O24N5k72J039
1983E40j836J080j082J346R2p54k02Q93M15q71O12n6j62M9j02o8L53q53J319m22
$$ y = [-926, -403, -273, -82, 229, 601, -375, -6, -4, -25, 160, 92, 321, 90, -84, -664, 216, 425, 1049, -23, -191, 1156, 796, 834, 181, 405, 195, 438, 826, 1143, -536, -84, 294, -8, 599, 1026, 697, -2, -264, -177, 313, 848, -613, 65, 769, 126, -267, 396, 373, -222, -656, -38, 290, -130, -256, -202, -491, -461, -417, -396, 180, -324, 215, -324, 669, 43, -1339, 122, -825, -892, -693, -517, -62, 657, -1411, -9, 222, -1154, -157, -1040, -453, 198, -193, -144, -195, 659, -599, 193, 158, -583, -259, -489, -48, 270, 664, -97, 625, 355, -106, -143, 577, 744, 86, -125, 10, 735, 670, 931, 17, -326, 210, -194, -370, 87, 563, -277, -302, 228, -712, 732, -77, 389, -284, 138, 246, -489, 377, -817, -383, -944, 15, -359, 132, -547, 343, -553, 376, -844, -1016, -906, -282, -227, -499, 540, -1296, -216, -1298, 48, 140, -614, -816, 77, 492, -379, 233, 177, 15, 64, -38, -106, 247, -606, 713, 291]
2003B91o01O48p02R27j153J62P36O5m88Q74r22k43R99O41j095K28o63M26J72p4
2023B28j43p0l49J41R92k39k76q12M68k60L95O93M47r12K02k36j37o33J163q27
2043a65o19M91o02k9N26p5q3j20P1p54J385j008M28q44L81N25p53P06M96q43N68
2064c18J017j395J013m39P4J13n93O46o27J520n18n10P5j95n99J61J87N1R46n02
2084A07J383n51k70j023R89r72N84L70Q33j321L03K58k59K34Q3M9j584J914n55
2103E72j366P57O3j90k73R73K86r50J69M42n37J060j452P29j01J03q08r6J022
2122D03k18r61K38R61j546k75J170O43q04P25j71j85L16k95R81k512J260J79J058
2141I67p81j444J709q95l90R96j468J118p2L47l45P72p15l62Q68m25p37Q45M58
$$ y = [291, -310, 338, -364, 563, -590, -428, 308, 373, -115, 759, -163, -406, 593, 1234, 139, 367, -296, 130, 302, 228, 85, 15, -334, -193, 799, 560, 284, -528, -60, -320, 75, 768, 1215, 303, 505, 269, 132, -501, 662, -165, -784, -293, -895, -924, -398, -473, -556, -676, -605, -1359, 26, -982, -554, -1398, -1017, -492, -1245, -539, -43, -886, -318, 699, -696, 317, -122, -48, 65, -528, 118, -509, 1011, 493, -17, 58, -137, -736, -575, -388, -337, 609, 107, 1490, 939, 669, -354, 635, -337, 247, 617, 1450, 129, 432, 690, 431, 665, 748, 797, -787, 1127, 572, -794, -37, 26, -164, -437, 536, 822, -128, 41, 483, -54, 1006, -446, 283, 182, 285, -523, -619, 403, 185, -776, -538, 423, -1123, -1398, -228, 415, -389, 336, 165, -20, 296, 1, 982, -1530, -270, -91, 967, 186, -1258, 451, -444, -834, 162, -1306, -188, -260, 87, -258, 514, -201, -563, 305, -120, -857, -12, 446]
2160D46K3k08J19j03n33J905j613L64m65N84J58q80R4k24J013p11O95o94R0O04
2180F64m57m43P70j35j27m7j082M09L50R55p06M19m27L5j78m3J089j233k14K98
2200a03p49L76Q52M15j475K72M48J63P8q46J498m94l7P25j552M20P00l09k14k68
2220a00n39J34l42R95r9k85J281Ql88q42Q28o65Q79o68j46N88J23o1r85J260p63
$$ y = [446, 469, 261, 380, 277, -256, 1649, 36, 400, -65, 519, 677, -203, -109, -333, 680, -31, 664, -30, 60, 664, 207, -236, 534, 399, 272, 225, -857, -448, -98, 857, 151, 570, 143, 178, 0, -43, 1046, -187, -401, -103, -852, -476, 376, 791, -684, -412, 36, 199, 277, -569, 929, 435, 398, 1123, -429, -9, 691, 382, 168, -100, -639, -505, -847, 148, 49, -236, 1045, 1053, 665, -177, 651, -14, 865, 197, 51, 639, 762, 701, -284, 976, 213]
$$ [...]
8191B67
##END NTUPLES=NMR FID
##END=
