##TITLE=1H_UK-9'
 CDCl3, 108 sc, 
 3.9.2020
##JCAMPDX= 6.0         $$ Bruker NMR JCAMP-DX V2.0
##DATA TYPE= NMR FID
##DATA CLASS= NTUPLES
##ORIGIN= UXNMR, Bruker Analytische Messtechnik GmbH
##OWNER= root
$$ XWIN-NMR		Version 3.5
$$ Thu Sep  3 12:34:40 2020 Russian Standard Time (UT+4h)  she@DPX200
##.OBSERVE FREQUENCY= 200.1315066352
##.OBSERVE NUCLEUS= ^1H
##.DELAY= (6, 6)
##.ACQUISITION MODE= SIMULTANEOUS
##.ACQUISITION SCHEME= undefined
##.AVERAGES= 108
##.DIGITISER RES= 18
##SPECTROMETER/DATA SYSTEM= spect
##.PULSE SEQUENCE= zg30
##.SOLVENT NAME= D2O
##.SHIFT REFERENCE= (INTERNAL, D2O, 0, 15.7039)
##AUDIT TRAIL= $$ (NUMBER, WHEN, WHO, WHERE, WHAT)
$$ ##TITLE= Audit trail, XWIN-NMR		Version 3.5
$$ ##JCAMPDX= 5.01
$$ ##ORIGIN= Bruker BioSpin GmbH
$$ ##OWNER= she
$$ F:/spectra/data/she/nmr/H-F/1/audita.txt
$$ ##AUDIT TRAIL=  $$ (NUMBER, WHEN, WHO, WHERE, WHAT)
(   1,<2020-09-03 12:33:13.48 +0400>,<she>,<DPX200>,
      <continue with go, POWCHK disabled, PULCHK disabled
       configuration hash MD5:
       00 E9 B6 7A A2 85 ED C7 34 08 36 98 17 FE 4E 26
       data hash MD5: 16K
       BE 23 61 0E 19 1B 0A EB 14 9A B8 43 16 A1 D7 A3>)
$$ ##END=
$$ 
$$ hash MD5
$$ 26 FB C4 69 A2 E2 02 9B 4D 77 87 F6 49 E0 FE D6
##$RELAX= 
##$RELAX= 
##$RELAX= 
##$RELAX= 
##$RELAX= 
##$RELAX= 
$$ Bruker specific parameters
$$ --------------------------
##$DU= <F:/spectra>
##$EXPNO= 1
##$NAME= <H-F>
##$PROCNO= 1
##$TYPE= <nmr>
##$USER= <she>
##$AMP= (0..31)
100 100 100 100 100 100 100 100 100 100 100 100 100 100 100 100 100 100 
100 100 100 100 100 100 100 100 100 100 100 100 100 100 
##$AQSEQ= 0
##$AQ_mod= 1
##$AUNM= <au_zg>
##$AUTOPOS= <>
##$BF1= 200.13
##$BF2= 200.13
##$BF3= 200.13
##$BF4= 200.13
##$BF5= 200.13
##$BF6= 200.13
##$BF7= 200.13
##$BF8= 200.13
##$BYTORDA= 1
##$CFDGTYP= 0
##$CFRGTYP= 5
##$CHEMSTR= <none>
##$CNST= (0..31)
1 1 145 1 1 1 1 1 1 1 1 1 1 1 1 1 1 1 1 1 1 1 1 1 1 1 1 1 1 1 1 1 
##$CPDPRG= <>
##$CPDPRG1= <>
##$CPDPRG2= <>
##$CPDPRG3= <>
##$CPDPRG4= <mlev>
##$CPDPRG5= <mlev>
##$CPDPRG6= <mlev>
##$CPDPRG7= <mlev>
##$CPDPRG8= <mlev>
##$CPDPRGB= <>
##$CPDPRGT= <>
##$D= (0..31)
0 1.2 0 0 0 0 0 0 0 0.06 0 0.03 0 0 0 0 0.0002 0 0 0 0 0 0 0 0 0 0 0 0 
0 0 0 
##$DATE= 1599121604
##$DBL= (0..7)
120 120 120 120 120 120 120 120 
##$DBP= (0..7)
150 150 150 150 150 150 150 150 
##$DBP07= 0
##$DBPNAM0= <>
##$DBPNAM1= <>
##$DBPNAM2= <>
##$DBPNAM3= <>
##$DBPNAM4= <>
##$DBPNAM5= <>
##$DBPNAM6= <>
##$DBPNAM7= <>
##$DBPOAL= (0..7)
0.5 0.5 0.5 0.5 0.5 0.5 0.5 0.5 
##$DBPOFFS= (0..7)
0 0 0 0 0 0 0 0 
##$DE= 6
##$DECBNUC= <off>
##$DECIM= 32
##$DECNUC= <off>
##$DECSTAT= 4
##$DIGMOD= 1
##$DIGTYP= 9
##$DL= (0..7)
0 120 120 120 120 120 120 120 
##$DP= (0..7)
150 150 150 150 150 150 150 150 
##$DP07= 0
##$DPNAME0= <>
##$DPNAME1= <>
##$DPNAME2= <>
##$DPNAME3= <>
##$DPNAME4= <>
##$DPNAME5= <>
##$DPNAME6= <>
##$DPNAME7= <>
##$DPOAL= (0..7)
0.5 0.5 0.5 0.5 0.5 0.5 0.5 0.5 
##$DPOFFS= (0..7)
0 0 0 0 0 0 0 0 
##$DQDMODE= 0
##$DR= 18
##$DS= 0
##$DSLIST= <SSSSSSSSSSSSSSS>
$$ [...]
##$SUBNAM2= <"">
##$SUBNAM3= <"">
##$SUBNAM4= <"">
##$SUBNAM5= <"">
##$SUBNAM6= <"">
##$SUBNAM7= <"">
##$SUBNAM8= <"">
##$SUBNAM9= <"">
##$SW= 16.880792210976
##$SWIBOX= (0..15)
0 0 2 0 0 0 0 0 0 0 0 0 0 0 0 0 
##$SW_h= 3378.37837837838
##$TD= 16384
##$TD0= 1
##$TE= 0
##$TE2= 300
##$TE3= 300
##$TEG= 300
##$TL= (0..7)
0 120 120 120 120 120 120 120 
##$TP= (0..7)
150 150 150 150 150 150 150 150 
##$TP07= 0
##$TPNAME0= <>
##$TPNAME1= <>
##$TPNAME2= <>
##$TPNAME3= <>
##$TPNAME4= <>
##$TPNAME5= <>
##$TPNAME6= <>
##$TPNAME7= <>
##$TPOAL= (0..7)
0.5 0.5 0.5 0.5 0.5 0.5 0.5 0.5 
##$TPOFFS= (0..7)
0 0 0 0 0 0 0 0 
##$TUNHIN= 0
##$TUNHOUT= 0
##$TUNXOUT= 0
##$USERA1= <user>
##$USERA2= <user>
##$USERA3= <user>
##$USERA4= <user>
##$USERA5= <user>
##$V9= 5
##$VALIST= <valist>
##$VCLIST= <CCCCCCCCCCCCCCC>
##$VD= 0
##$VDLIST= <DDDDDDDDDDDDDDD>
##$VPLIST= <PPPPPPPPPPPPPPP>
##$VTLIST= <TTTTTTTTTTTTTTT>
##$WBST= 1024
##$WBSW= 4
##$XGAIN= (0..3)
0 0 0 0 
##$XL= 0
##$YL= 0
##$YMAX_a= 1556319
##$YMIN_a= -1341920
##$ZGOPTNS= <>
##$ZL1= 120
##$ZL2= 120
##$ZL3= 120
##$ZL4= 120
##$ABSF1= 10
##$ABSF2= 0
##$ABSG= 5
##$ABSL= 3
##$ALPHA= 0
##$AQORDER= 0
##$ASSFAC= 0
##$ASSFACI= 0
##$ASSFACX= 0
##$ASSWID= 0
##$AUNMP= <proc_1d>
##$AZFE= 0.1
##$AZFW= 0.1
##$BCFW= 1
##$BC_mod= 2
##$BYTORDP= 1
##$COROFFS= 0
##$CY= 11.3945322036743
##$DATMOD= 1
##$DC= 2
##$DFILT= <>
##$DTYPP= 0
##$F1P= 16.9975609425685
##$F2P= -3.02152046262296
##$FCOR= 0.5
##$FTSIZE= 0
##$FT_mod= 4
##$GAMMA= 1
##$GB= 0.15
##$INTBC= 1
##$INTSCL= 1
##$ISEN= 128
##$LB= 0.24
##$LEV0= 0
##$LPBIN= 0
##$MAXI= 10000
##$MC2= 0
##$MEAN= 0
##$ME_mod= 0
##$MI= 1.114404
##$NCOEF= 0
##$NC_proc= 0
##$NLEV= 6
##$NOISF1= 3.799351
##$NOISF2= 2.8
##$NSP= 1
##$NTH_PI= 0
##$NZP= 0
##$OFFSET= 15.70392
##$PC= 1
##$PHC0= -9987.519
##$PHC1= 29.60089
##$PH_mod= 1
##$PKNL= yes
##$PPARMOD= 0
##$PSCAL= 0
##$PSIGN= 0
##$REVERSE= no
##$SF= 200.130013532006
##$SI= 16384
##$SIGF1= 3
##$SIGF2= 2
##$SINO= 400
##$SIOLD= 16384
##$SREGLST= <1H.CDCl3>
##$SSB= 0
##$STSI= 0
##$STSR= 0
##$SW_p= 3612.71676300578
##$SYMM= 0
##$S_DEV= 0
##$TDeff= 0
##$TDoff= 0
##$TI= <>
##$TILT= no
##$TM1= 0
##$TM2= 0
##$TOPLEV= 0
##$USERP1= <user>
##$USERP2= <user>
##$USERP3= <user>
##$USERP4= <user>
##$USERP5= <user>
##$WDW= 1
##$XDIM= 8192
##$YMAX_p= 0
##$YMIN_p= 0
$$ End of Bruker specific parameters
$$ ---------------------------------
##NTUPLES= NMR FID
##VAR_NAME=  TIME,          FID/REAL,        FID/IMAG
##SYMBOL=    X,             R,               I
##VAR_TYPE=  INDEPENDENT,   DEPENDENT,       DEPENDENT
##VAR_FORM=  AFFN,          ASDF,            ASDF
##VAR_DIM=   8192,          8192,            8192
##UNITS=     SECONDS,       ARBITRARY UNITS, ARBITRARY UNITS
##FACTOR=    0.000296,      1,               1
##FIRST=     0,             0,               0
##LAST=      2.424536,      0,               0
##MIN=       0,             -1341920,        0
##MAX=       2.424536,      1556319,         0
$$ Real data points
##PAGE= N=1
##DATA TABLE= (X++(R..R)), XYDATA
0@%%%%%%%%%%%%%%%%J08k16K16k16K16l07M15m32N36o44P47q56R73j178J360j546
32h24J766k009K274k574K914l285L690m135M627n161N747o392P088p849Q684r600
48e039J0592j1677J2867j4162J5590j7173J8925k0867K3032k5462K8214l1354
60a6514L4978l9216M4224n0259N7694o7050P9065r4821J14643k25357J718932
71A556319k232565L7655J212830j361670J427417n90289o79025J032175l74459
80B8388k8963J03369l56985N39925k06696j91560J87355p3249P0451K6690j90259
91i1534J56588L5264j29415J41021j10141n7517K85366l19931J00552J39779l24768
102a74736L66900j91762j83718M35980m15719J76120J42444m19975M52663j80529
$$ plain form
0 0 0 0 0 0 0 0 0 0 0 0 0 0 0 0 0 0 108 -108 108 -108 108 -199 216 -216 320 -324 423 -433 540 -638 722 -824
32 -824 942 -1067 1207 -1367 1547 -1738 1952 -2183 2444 -2717 3030 -3362 3726 -4123 4561 -5039
48 -5039 5553 -6124 6743 -7419 8171 -9002 9923 -10944 12088 -13374 14840 -16514
60 -16514 18464 -20752 23472 -26787 30907 -36143 42922 -51899 62744 -162613 1556319
71 1556319 -676246 -638591 574239 -787431 639986 49697 -629328 402847 28388
80 28388 -575 102794 -254191 285734 79038 -112522 74833 1584 72035 98725 -91534
91 -91534 65054 100318 -29097 111924 1783 -55734 229632 -90299 10253 150032 -174736
102 -174736 192164 402 -183316 252664 -163055 13065 155509 -264466 188197 7668
112G668j79737L60642l42874J68749P2339k77594K81384j36062m6932J59104j98102
123a31415J23303K4830j26428J20078m9016j9127P0060p2344J6638N2442p2059
134f3038L2973L3095q7077R3701k4324p2576J41480j12298K1114J00112j58148
145i4986J35243j8288j03818J71871j33256K7365R5337j54812J31366l4657o6023
156d4658J35759j22237M9289N6560j16892J08152l1224m9359R1044p0679J1350
167A7105M4293o3233M1203O93m3068N3718k7388k3764N6581m8666k802N3040p3388
180a5676L4947K2275p3194O8619k8142l5478O8010o9759K4766K6339p1782O7931
192A8856l0904l1536O9498p1180K2262L3658p0118N4884j1710l8133N4733l9946
$$ plain form
112 7668 -172069 188573 -154301 14448 86787 -190807 90577 -45485 -92417 66687 -131415
123 -131415 -8112 16718 -109710 10368 -38648 -57775 12285 -60059 -43421 9021 -63038
134 -63038 -30065 3030 -84047 9654 -14670 -87246 54234 -58064 -36950 63162 -94986
145 -94986 40257 21969 -81849 90022 -43234 -15869 79468 -75344 56022 21365 -44658
156 -44658 91101 -31136 18153 74713 -42179 65973 34749 -14610 76434 5755 17105
167 17105 61398 -1835 39368 40061 -3007 50711 23323 -441 56140 7474 4672 57712 -15676
180 -15676 19271 41546 -31648 36971 8829 -26649 41361 -28398 -3632 22707 -49075 18856
192 18856 -12048 -43584 25914 -45266 -23004 10654 -59464 -4580 -16290 -54423 310 -39636
204c9636J070L3365m4557K9425N406l3906M2755k0309j3885M4379l9354R324L4148
217H225m8674L4670J0174m0194M9656k1470j2301M6574m3963K3292J7796m1390
229a7605M9709j9586j7619N1492m7098J7245K7388m9192M3063o707k8712M5724
241D8102l4465L509K7474l9358K8358q91k9278L7728k5625o592L1280l9578J6042
254A6706J3429m0041L3939j1298k4148L5927l0580J795K1074l9643K8504n730
266f6k9031L9472l1508k300K9745m4199K5420M829l4091L8005j9556j0085L0541
279b824l4643J8266Q720l0478L3840j4597j0658L2323l2905J2994J9091l2750
291c3621L0051l202k0002L4867k1205J909K3511k7361K0587L755k2325L3611j7721
$$ plain form
204 -39636 -38566 -5201 -49758 -20333 -14927 -48833 -6078 -26387 -40272 4107 -35247 -25923 8225
217 8225 -40449 -5779 4395 -35799 13857 -7613 -19914 26660 -17303 5989 23785 -17605
229 -17605 32104 12518 -5101 46391 -707 16538 43926 -5266 37797 31090 2378 48102
241 48102 13637 17146 44620 5262 33620 32729 3451 41179 15554 8962 40242 664 16706
254 16706 30135 -9906 24033 12735 -11413 24514 -6066 -4271 16803 -22840 5664 -66
266 -66 -29097 10375 -21133 -23433 6312 -37887 -12467 -7638 -41729 -3724 -23280 -33365 -2824
279 -2824 -37467 -19201 -10481 -40959 -7119 -21716 -32374 -51 -32956 -19962 -871 -33621
291 -33621 -3570 -6772 -26774 8093 -13112 -11203 12308 -15053 5534 9289 -13036 20575 2854
304B854m983L0485l1818J6562J3750k9659K9594p170j5164K9886k3741P176J5055
317C2827k6434K3349o823j5431K7689k3447J896J9304l0120J7393K881k4670K5632
330B4046j4016r310K1061k4907P964P814k4341J9794r635j2731K1713k1745K657
343a1636J3905k7123J8288p97j9898K2151j4039n506J7152j9388R324L968j7322
356c0921K0073j0680n216J9023j9222Q829J0537k0426J9112k02j3954K2228j0818
369a1637k358J7849j6881J1168M543j2909J9583r013j533J7760j7581J0473R493
382A8957j7600J7256k215j0965J9351j3373K807J0502j3547J0473K38j1713J6599
395B6770j1179k203J3694j8816J0110L392j7551J6043q227q618J4352j5910K274
$$ plain form
304 2854 -2129 28356 -3462 13100 26850 -2809 26785 19615 4451 34337 10596 17772 32827
317 32827 6393 29742 22919 7488 35177 11730 13626 32930 2810 20203 23084 -1586 24046
330 24046 10030 720 21781 -3126 4838 12652 -11689 8105 -1530 -14261 7452 -14293 -11636
343 -11636 2269 -24854 -6566 -7363 -27261 -5110 -19149 -24655 -7503 -26891 -17567 -13599 -30921
356 -30921 -10848 -21528 -26744 -7721 -26943 -18114 -7577 -28003 -8891 -9093 -23047 -819 -11637
369 -11637 -13995 3854 -13027 -1859 2684 -10225 9358 345 -1188 16572 -1009 9464 18957
382 18957 1357 18613 16398 5433 24784 11411 14218 24720 11173 21646 21884 10171 26770
395 26770 15591 13388 27082 8266 18376 21768 4217 20260 12033 3415 17767 1857 4131
408D131P946j7451J0981k671j1716J5396j5295J13R856j8920J0802p46j3130J5578
422e126j1272m211J3824j8244R674M059j4429J6202q295n782J6379j4923O469
435a5675P147j5831J5985l098p923J6567j1387K725J1920j4470J2395J216q902
448i331J6169r133J037J2886j5011J1291M982j4204J7989o079n777J7017j4808
461G028O532P752j4873J4341l774q126J6126j5236L488R730j7330J3578k797j1552
475D887J5957j2650j051R678j4241Q206j511j0784J2767r420n669J1066j4332
488g097M683L260j4087J0309l649p175J2152j2646J428O624j2868R625k380q126
502a9947J2763j1098J693Q276j3049R817O35r088J2169o043o88Q977j0718Q062
$$ plain form
408 4131 12077 -5374 5607 2936 -8780 6616 -8679 -8566 1290 -17630 -6828 -7574 -20704 -5126
422 -5126 -16398 -20609 -6785 -25029 -15355 -11296 -25725 -9523 -17818 -23600 -7221 -22144 -15675
435 -15675 -8528 -24359 -8374 -11472 -19395 -2828 -14215 -11490 430 -14040 -1645 -429 -9331
448 -9331 6838 -2295 -1258 11628 -3383 7908 12890 -1314 16675 10596 4819 21836 7028
461 7028 13560 21312 6439 20780 17006 8880 25006 9770 13258 22988 5658 19236 16439 4887
475 4887 20844 8194 7143 16821 2580 10786 9275 -1509 11258 1838 -3831 7235 -7097
488 -7097 -2414 846 -13241 -2932 -6581 -13756 -1604 -14250 -12822 -6198 -19066 -9441 -11821 -19947
502 -19947 -7184 -18282 -16589 -8313 -21362 -11545 -10910 -19998 -7829 -13872 -14560 -5583 -16301 -8239
516h239L207q484J1208k787l211J0790p454L340N013p020J0127j108m779J0194
530A0797n827K441O489q248O402J251n851R261n185l37O987p742N361O41p127
545I313Q716o069j748P308r872M894l4o568N970l963m082N627p070J43J649o441
561b227L612j748n210N068m691j733L437o114K342q96m675M898m128j318M520
576h863o022K374J470n716M450r05r94L947l861L338K131m450N118j144j175M599
592e703l225L400K557k683M781J67j623M303j520J714L051k109K783J649j708
607E834N085k676j80L527k009J290J979l610L306J235k509L127k643q96K918m520
623I258K177n94l175L383l586j630J286k418J005r04l517K269l127j192P42l634
$$ plain form
516 -8239 -5032 -13516 -2308 -5095 -8306 2484 -4970 -1630 3383 -3637 6490 5382 603 10797
530 10797 4970 7411 13900 5652 12054 13305 7454 16715 11530 11193 18180 10438 15799 16440 9313
545 9313 18029 11960 10212 17520 7648 12542 12508 5940 11910 7947 3865 9492 2422 2565 4214 -2227
561 -2227 1385 -363 -5573 -505 -5196 -6929 -3492 -9606 -7264 -8160 -12835 -7937 -12065 -13383 -8863
576 -8863 -14885 -12511 -11041 -16757 -12307 -13212 -14206 -10259 -14120 -10782 -8651 -13101 -7983 -9127 -10302 -5703
592 -5703 -8928 -5528 -2971 -5654 -873 -706 -2329 1974 454 2168 5219 3110 5893 7542 5834
607 5834 10919 8243 8063 11590 9581 10871 12850 9240 12546 13781 11272 14399 11756 10860 13778 9258
623 9258 11435 10841 7666 11049 7463 5833 7119 4701 5706 4802 1285 3554 427 -765 -23 -3657
639c657P92J44m173K386j926k047Q09k378O25N75k927J307j52k135K403j861L16
656a1899J614j616J462J017l392N353j608q09L406j355R36J911j655L643l17N31
672b778K521j182K348J573j835L953R26j112K783p46L10K248j144N39J907r80
688I331N58P97j358J480p90P26O57k459K235j343j557K154k685j181K547l616
704E496J410j200k830L41l85j912N25k588P42q73k725J833l186r05J548k404Q6
721g027m3j718K78j0j731J119j345N4O82j097J380m77j91K496j793o63L000j299
739h385R69J899p88K231m63N78K074l88K335j78l19K837R0p23L075q73J491J737
757G199j003P48J242p57N06R64K20N16j745J740O8j621K001j164j017J546k227
$$ plain form
639 -3657 -2865 -2721 -6894 -4508 -6434 -8481 -7672 -10050 -9425 -8850 -11777 -10470 -10622 -12757 -10354 -12215 -11899
656 -11899 -10285 -11901 -10439 -9422 -12814 -7461 -9069 -9878 -6472 -7827 -6891 -4980 -6635 -2992 -3309 -2778
672 -2778 -257 -1439 909 2482 647 4600 5526 4414 7197 6451 6761 9009 7865 8404 10311 9331
688 9331 9889 10686 9328 10808 10018 10744 11401 8942 11177 9834 8277 10431 7746 6565 9112 5496
704 5496 6906 5706 2876 3217 2832 920 1445 -1143 -401 -1274 -3999 -2166 -5352 -6257 -4709 -7113 -7027
721 -7027 -7070 -8788 -8510 -8520 -10251 -9132 -10477 -10423 -9741 -10838 -9458 -9935 -10126 -7630 -9423 -10086 -7086 -8385
739 -8385 -7416 -5517 -6305 -4074 -4537 -3959 -1885 -2273 62 -116 -435 2402 2492 1769 4844 3971 5462 7199
757 7199 6196 6944 8186 7429 7935 8899 9119 9635 7890 9630 9698 8077 10078 8914 7897 9443 7216
774G216J784j264j801J298j329j379N95j345j99j010j811R44j934j071j0j857
790c173n87O77k314M55q89j967J725j125j586J337j149P8M63k015J524K87j281
807i540J477r43Q69O17j000J663N22p88K204O43M80Q38r15J764J270m29K601j149
825A84J67L353k094Q42J548j99J990P3M11N18J083J7o93N42J218r9j125J450j252
844G934j83Q91j157Q64o63j029q5M31j439L1k004J97l06j399M75k337r35J066
862C52j349j137L35k452R55r63r19k06j177m62P30j167J097r11j344R30p6l31
880h095O32j632J887K1j078K511j662J064R61Q2M2J520p36K665p99l74K775p25
898i41L46J811l10O21J984j040J969M53r9J277m82K136l72j227J600q78j20J346
$$ plain form
774 7216 9000 7736 5935 7233 5904 4525 5120 3775 3576 2566 755 1699 -235 -1306 -1316 -3173
790 -3173 -3760 -3083 -5397 -4942 -5831 -7798 -6073 -7198 -8784 -7447 -8596 -8518 -8055 -10070 -8546 -8259 -9540
807 -9540 -8063 -9006 -8137 -7520 -8520 -6857 -6335 -7123 -4919 -4276 -3796 -2958 -3873 -2109 -839 -1268 1333 184
825 184 351 3704 1610 2452 4000 3801 5791 5864 6275 6793 7876 7893 7200 7742 8960 8861 7736 9186 7934
844 7934 7751 8642 7485 8349 7686 6657 6572 7003 5564 5595 3591 3788 3482 2083 2558 221 -714 352
862 352 -997 -2134 -1799 -4251 -3296 -4259 -5178 -5384 -6561 -7023 -6293 -7460 -6363 -7274 -8618 -7688 -7764 -8095
880 -8095 -7463 -9095 -7208 -7187 -8265 -5754 -7416 -6352 -5391 -5309 -5267 -3747 -4483 -1818 -2617 -2991 -216 -941
898 -941 -595 1216 906 1527 3511 2471 4440 4893 4794 6071 5589 7725 7353 6126 7726 6848 6728 8074
916H074j367Q46R81k234J241m22n06P68j606L85r01r02O53j024j554Q18r48k135
934A67J449k550N26J052l048P98q54n99j53k243m6J515k224R69j013j841K268
951e827q91O94k57j742P52R44j411J970J68n89P10n83R79P77j075J826K35J53
969c167K475q89l54K395o11J486K12L7J805j977J800J825j099J409j159K22K189
986F599j781K230J20j242N33R83j481O35K96j037J237j268K29M96k458L25p61
1003C655J58P60k484N19L96l135J533k34k914J861j827j342J167j838L67q99o12
1020d869J227j649q00J435k869J178R99k079J634j78j582K168n54K38N2r8Q18
1037d929j37J98J871k008J988O45j012K009L5j427L202j12m86J235L16J459J96
$$ plain form
916 8074 6707 7553 8534 6300 7541 7119 6613 7381 5775 6160 5259 4357 5010 3986 2432 3250 2302 167
934 167 1616 -934 -408 644 -2404 -1606 -2460 -3059 -3212 -5455 -5501 -3986 -6210 -5241 -6254 -8095 -5827
951 -5827 -6718 -6024 -6281 -8023 -7271 -6327 -7738 -5768 -5600 -6189 -5479 -6062 -5083 -4306 -5381 -3555 -3320 -3167
969 -3167 -692 -1581 -1935 460 -151 1335 1547 1584 3389 1412 3212 5037 3938 5347 4188 4410 6599
986 6599 4818 7048 7168 5926 6459 7442 5961 6596 6892 5855 7092 5824 6053 6549 4091 4416 3655
1003 3655 3813 4573 2089 2608 3004 -131 1402 1168 -1746 115 -1712 -3054 -1887 -3725 -3358 -4257 -4869
1020 -4869 -3642 -5291 -6091 -4656 -7525 -6347 -5348 -7427 -5793 -5971 -7553 -5385 -5939 -5701 -5649 -5747 -4929
1037 -4929 -5066 -4868 -2997 -5005 -3017 -2372 -3384 -1375 -1340 -2767 435 323 -163 1072 1388 2847 3043
1054C043r88K921j463L37K763l061J695J127j905K763j221m67J552j651R21L67
1070F733p55N4j019n24Q20r08q3L15j192P4k02q74o70q86m29K07j714J438k309
1089a924K82P66k034m57J47j176L40K35k230M32L49j316J464o24j042J438j109
1106f459Q47K57p73J658r31M44J301j474R96J470j225J633l58K2J896M60k15K495
1124B044j777Q79O87O12Q22p81j80K623k174J199J032q14R43M30n09R50m5k55
1142E686m50O55k66n26o96K36l0q02J263j637L49q38r47Q52j548k81K7p81j14
1161A52n05j75p36r68p95M40k064J338K75j552L86n53p14K28J54m7N4q98J916
1180d064q27l2Q98j648J47N80J078oN14q44J574R13j580J942L26o69K371o65K81
$$ plain form
1054 3043 2055 4976 3513 3850 6613 3552 5247 6374 4469 7232 6011 5544 7096 5445 6366 6733
1070 6733 5978 6032 5013 4489 5309 4401 4318 4633 3441 3515 3313 2439 1769 883 454 661 -1053 385 -1924
1089 -1924 -1642 -876 -2910 -3367 -3220 -4396 -4056 -3821 -6051 -5619 -5270 -6586 -5122 -5746 -6788 -5350 -6459
1106 -6459 -5612 -5355 -6128 -4470 -5401 -4957 -3656 -5130 -4134 -2664 -3889 -2256 -2614 -2592 -696 -236 -451 2044
1124 2044 267 1146 1833 2445 3267 2486 2306 4929 2755 3954 4986 4172 5115 5545 5036 5986 5941 5686
1142 5686 5236 5891 5625 5099 4403 4639 4609 3807 5070 3433 3782 2944 1997 2849 1301 1020 1047 266 152
1161 152 -353 -528 -1264 -2232 -3027 -2587 -4651 -3313 -3038 -4590 -4204 -4757 -5471 -5243 -5089 -5136 -5082 -5980 -4064
1180 -4064 -4891 -4923 -4025 -5673 -5526 -4946 -3868 -3874 -3360 -4204 -2630 -1717 -3297 -1355 -1029 -1698 673 8 289
1199B89O65n68J013J35R10K37p7M22J361o62J374l60Q6J32K45j56j26n74J323
1218E669l82p72K59kj61K7j381l89J030o88J35q74k120J085l60r26J88j683J810
1237D65j249l45P9j571j47L62k9j279K82n79K61r47J33M20j250O77J052j891J699
1256c857j589k36K094j318O87n36O3J544Q45r73P20K11L12J023l58O87P38r7J467
1275A427K84l96R4J0O35L53j19J728M07j072R03p77J016j44m03o4P02r56J963
1294E591j765N77J01r31P30m22q94M69j01j726J37M03q75N60p93m48o26q67k4
1313i04J6k55n25m95Q03j468q48J115j289M9J00n63o7m79J38J05M2o87J386j055
1333d881J95O67L02R85j79j94J295j235O95M60J74N50J394l03O82l09L30N49o9
$$ plain form
1199 289 954 386 1399 1534 2444 2681 2604 3026 4387 3725 5099 4739 4825 4957 5202 5046 4920 4346 5669
1218 5669 5287 4515 4774 4772 4611 4638 3257 2868 3898 3210 3345 2471 351 1436 1076 150 338 -1345 465
1237 465 -784 -1129 -1050 -2621 -2768 -2406 -2435 -3714 -3432 -4011 -3750 -4697 -4564 -4144 -5394 -4717 -3665 -5556 -3857
1256 -3857 -5446 -5682 -3588 -4906 -4219 -4755 -4692 -3148 -2303 -3276 -2556 -2345 -2033 -1010 -1368 -681 57 -40 1427
1275 1427 1711 1315 1409 1419 2054 2407 2288 4016 4423 3351 4254 3477 4493 4349 3946 3882 4584 3628 5591
1294 5591 3826 4403 4504 3573 4303 3881 2987 3456 3355 1629 1766 2169 1294 1854 1061 613 -13 -880 -904
1313 -904 -888 -1143 -1668 -2163 -1360 -2828 -3676 -2561 -3850 -3801 -3701 -4264 -4331 -4810 -4672 -4567 -4525 -5212 -3826 -4881
1333 -4881 -4686 -4019 -3717 -2732 -2911 -3105 -1810 -3045 -2350 -1890 -1716 -1166 228 -75 607 298 628 1177 1108
1352A108P49Q3L35N78l81J52R71o69O15l83M62J56J482j343R54j243l70J071k33
1371D094K7j13j162j3M2o89Q07q42k70j49J78q9j028q50L17j004L98o75J14o12
1391a519j048j60P69r04n47J509k171K10j66J54m02kJ76P28j120P47o00L33o2
1410d075Q46l61J127M48m95J122q60J876j254M33R80m09Q50Q3K03M04M82n37K148
1429C011o8j384J650j15k84O61l69Q16k03P6K39q6j081J553r95O34k94k09l51
1448C201m97j36L75l70j77j058o68J348j773M43M75k223O99R5o28q50J459j480
1466a765p61N83K56l9k145J497o50k27J45p44m53N83m42P69K19m31N83j003J243
1485b782o08m75K346j095L30p10J433l12J432m2r56J624j12R02l18J87M08R77
$$ plain form
1352 1108 1857 1940 2275 2853 2472 2624 3595 2926 3541 3158 3620 3776 5258 3915 4869 3626 3256 4327 4094
1371 4094 4121 4008 2846 2833 2875 2186 2993 2151 1881 1732 1910 1821 793 -57 260 -744 -346 -1021 -907 -1519
1391 -1519 -2567 -2727 -1958 -2862 -3409 -1900 -4071 -3861 -4027 -3873 -4275 -4277 -4101 -3373 -4493 -3746 -4346 -4013 -4075
1410 -4075 -3229 -3590 -2463 -2015 -2510 -1388 -2248 -372 -1626 -1193 -213 -622 228 311 514 918 1400 863 3011
1429 3011 2943 1559 3209 3094 2810 3471 3102 3918 3715 3791 4030 3944 2863 4416 3421 4055 3761 3552 3201
1448 3201 2704 2568 2943 2573 2396 1338 670 2018 245 688 1163 -1060 -361 -266 -894 -1744 -285 -1765
1466 -1765 -2526 -1943 -1687 -1726 -3871 -2374 -3024 -3251 -3106 -3850 -4303 -3720 -4162 -3393 -3174 -3605 -3022 -4025 -2782
1485 -2782 -3390 -3865 -1519 -2614 -2284 -2994 -1561 -1873 -441 -483 -1439 185 73 975 657 844 1252 2229
1503B229k54l62k37P6J408l99J543j464Q40J32m53Q46p33K18P7m66J118n27r10
1522B682J77P4j064O95k38qK25k020O05k9o15J36m62l38L5m59o93Q06p29n80m55
1543b255L70r43m45K65J081j031k71m2l53N02j15R9R82j088j78J97j87P68QJ213
1563a423k23K13j129K131j517O32L27M75Q48l27K07K48j72Q38N60k64J15L69M54
1582B362J40O0K29L59l06L86L81j54K38J62q64l9N41k9Q5j415Q07j1j007Q36m88
1603B273j536N86j17p04K44m89Q21k086Q80p75r26Q33J93j756J138n1o09Q7j064
1622c058P95m08N39q40r5n52N96J22L21k57j093J060O02n80P39k5O06m43l63J424
1642i10O2o0L41j9R9J006j26Q6J150n02N60n40L89L98K34j13P32l75L70R0R89
$$ plain form
1503 2229 1975 1613 1376 1452 2860 2461 4004 2540 3380 3512 3059 3905 3172 3390 3467 3001 4119 3592 2682
1522 2682 2859 2933 1869 2564 2326 2318 2543 523 1128 1099 484 620 158 -180 -145 -604 -1297 -491 -1220 -1800 -2255
1543 -2255 -1885 -2828 -3273 -3008 -1927 -2958 -3229 -3271 -3624 -3122 -3237 -3138 -2156 -3244 -3422 -3225 -3412 -2644 -2636 -1423
1563 -1423 -1646 -1433 -2562 -431 -1948 -1316 -989 -514 334 7 214 462 290 1128 1688 1424 1539 1908 2362
1582 2362 2502 2562 2791 3150 2844 3230 3611 3457 3695 3857 2993 2954 3495 3466 3551 2136 2943 2932 1925 2761 2273
1603 2273 737 1323 1206 502 746 257 1078 -1008 -128 -903 -1829 -996 -803 -2559 -1421 -1472 -2081 -1994 -3058
1622 -3058 -2263 -2671 -2132 -2972 -3067 -3619 -3023 -2901 -2580 -2837 -3930 -2870 -2268 -2848 -2109 -2134 -1528 -1971 -2334 -910
1642 -910 -848 -908 -567 -586 -487 519 393 479 1629 1127 1687 1147 1536 1934 2168 2055 2787 2412 2782 2872 3861
1663C861j88m41o05O03p36L69K3k87K87m98l79p46J251n93Pq08N4J85l16l99n31
1684A13o0L60p58l28m88j370J312p05N91q37o41p7Q79j188N42M5n71J094j087
1703c174O84o70Q03M7P4r51J245r56j51J046J0k56R59N64q81J32P18O28L95O68
1723I34l88k75J139o78j13J103o13L47J030n42N18J17R34j474k07N81N62NN33
1742C513k17l33m5o82N05j99j83j55j003l35Q70r60K79r8r28L93p67M94m74r14
1762a239M83J26j36o10M49j244q0M77j053O08j483R39P41q19K51j12j011J237
1780b476j73o98J223q17N29L87K91k35P26l19j59L52L91R3M51J026j070L9N29
1799I0l04N19Q38N87j274J591R4M71p08k04N64L79l85J28l49M14M05n87J205r87
$$ plain form
1663 3861 3673 3232 2627 3230 2494 2863 2886 2599 2886 2388 2009 1263 2514 1921 1928 1120 1174 1359 1043 644 113
1684 113 53 413 -345 -673 -1161 -2531 -1219 -1924 -1333 -2170 -2811 -2888 -2009 -3197 -2655 -2610 -3181 -2087 -3174
1703 -3174 -2490 -3160 -2357 -2310 -2236 -3187 -1942 -2898 -3049 -2003 -1993 -2249 -1290 -726 -1607 -1475 -757 -129 266 934
1723 934 546 271 1410 732 619 1722 1109 1456 2486 1944 2462 2579 3513 2039 1832 2413 2975 2980 3513
1742 3513 3296 2963 2918 2236 2741 2542 2359 2204 1201 866 1736 776 1055 957 29 422 -345 149 -325 -1239
1762 -1239 -756 -630 -766 -1376 -927 -2171 -2251 -1774 -2827 -2219 -3702 -2763 -2022 -2841 -2590 -2702 -3713 -2476
1780 -2476 -2649 -3347 -2124 -2941 -2412 -2025 -1734 -1969 -1243 -1562 -1721 -1369 -978 -885 -434 592 -478 -439 90
1799 90 -214 305 1143 1730 456 2047 2141 2612 1904 1700 2264 2643 2258 2386 2037 2451 2856 2269 3474 2487
1819B487o18K68J44N05r48n98R23K49j999M54n20PK36m43p50j73n9J129m75j088
1839a269O29j290j49L55k51j77L21p75R59l15k42K4K22P2k55m88m97K88J19P63
1859a956M5n90R66O05n33m39P63O58j117N38K39J34O24O0M49J058j398N03Q71
1878A480l52Q51K66n51m10RP61k13J146o58k0J27k85Q74n90o22J168m13j553N65
1898A580J93m79P88j061N36O6j64q26l47K46k72r60N93j009k4M50j37P38j398
1917a487m3qN15j053j09J92J7n0k06K44J72r29L20N53q2n45P49m16R12l40J03
1938a491k22j37O97N66r1j400K288j050M79N74m59J0Q48J97J48M08o26O19J21
1957A479M07K07l71k04j8j20Q83l77O68j21r8K04k37j231K12P11K72r76N23l00
$$ plain form
1819 2487 1869 2137 2281 2786 1838 1240 2163 2412 413 867 347 354 590 147 -603 -776 -835 294 -181 -1269
1839 -1269 -640 -1930 -2079 -1724 -1975 -2152 -1831 -2606 -1647 -1962 -2204 -2180 -1958 -1886 -2141 -2629 -3126 -2838 -2719 -1956
1859 -1956 -1911 -2501 -1535 -930 -1463 -1902 -1139 -481 -1598 -1060 -821 -687 -63 -3 446 1504 106 609 1480
1878 1480 1128 1979 2245 1694 1284 1293 2054 1841 2987 2329 2309 2436 2151 3025 2435 1813 2981 2568 1015 1580
1898 1580 1773 1294 2082 1021 1557 1623 1459 633 286 532 260 -700 -107 -1116 -1140 -690 -827 -89 -1487
1917 -1487 -1530 -1538 -1023 -2076 -2185 -1993 -1976 -2026 -2232 -1988 -1816 -2745 -2425 -1872 -1954 -2499 -1750 -2166 -1254 -1594 -1491
1938 -1491 -1713 -1850 -1153 -587 -678 -2078 210 -840 -361 213 -246 -236 612 809 957 1365 739 1358 1479
1957 1479 1886 2093 1722 1518 1500 1380 2263 1886 2554 2433 2335 2539 2302 1071 1283 1994 2266 1290 1813 1513
1977A513K33p88n41J10k28q4J28j539P55N50o73m38j31N53q75P19p95l29N67Q7
1997a206l96o06J001p83o53Q51j076O22J008p01j004K69J642m25M49j131R01P6
2015a162l6J8K23j56P99q80J018J73m00J009Q08o28J13Q20l20L87O61p47R13j98
2035B415k10k29J533j487K93L18l00m61p47P23M64j123N46k21q5K26n36K23j01
2054A241J1n78j202J243k18j56o30m70M36o27l99Q18j061Q1M90m42m72p32N20
2073b147J63j81j96M86K56o57J240m86M6L8J92m62q1n0M80J72q47P56k87J166
2093c99J61L45m83r4O30q0P9K83L58K94J65m42M05J61l13P00Q42o77J117j151
2113A901M39k08k03M29m2l66q82N07J16K24q65K90o51K96K09p84n71P34k10l74
$$ plain form
1977 1513 1746 958 417 527 299 215 343 -1196 -441 109 -564 -1002 -1133 -580 -1455 -736 -1531 -1860 -1293 -1206
1997 -1206 -1602 -2208 -1207 -1990 -2643 -1792 -2868 -2246 -1238 -1939 -2943 -2674 -1032 -1457 -1008 -2139 -1238 -1162
2015 -1162 -1198 -1180 -957 -1113 -314 -1194 -176 -3 -403 606 1414 786 899 1719 1399 1786 2447 1700 2613 2415
2035 2415 2205 1976 3509 2022 2315 2633 2333 1872 1125 1848 2312 1189 1735 1514 1429 1655 1119 1342 1241
2054 1241 1252 674 -528 715 497 341 -289 -759 -323 -950 -1349 -531 -1592 -1511 -1021 -1463 -1935 -2667 -2147
2073 -2147 -1984 -2165 -2361 -1875 -1619 -2276 -1036 -1522 -1476 -1438 -1246 -1708 -1789 -1839 -1359 -1187 -2034 -1278 -1565 -399
2093 -399 -238 107 -376 -470 160 80 159 442 800 1094 1259 817 1222 1383 1070 1770 2612 1935 3052 1901
2113 1901 2340 2132 1929 2358 2316 1950 1068 1575 1691 1915 1050 1340 689 985 1194 410 -161 573 363 -11
2133a1k30M13o43on83M23q54M50K01j104N69j2M74j99p07q2m9p1m01R07j012O32
2155a895q7j41N63K83p19N01L4Q12J25q03L42k35R90m21J007p76J021o57L26L45
2175F15O46J45k24P88Mj003Q15N73j050K98L56m60O96j46L8n80j11m44K97L06
2195A559l53K40m40l42J21R72j55j200P97j036m23L17k15L65q56m8P73q55J55
2214f24r39L35j23M75K75n07P69j849Q42j29j62M93M65l13j379m03J305k88K01
2233a556j39M67k41j4J48J05L64n82J261K36l24k18P5K7J095O26m92k42R25o43
2253H78m76Q50j30N7k86J532j456M94l00K18J72L5k53J08L76l38O96l92Pm95p10
2274E87o15O92l63J15K35O69Mj620J019p18j55J92m8r50l07J51j55p25P50L39
$$ plain form
2133 -11 -241 172 -471 -477 -1060 -637 -1491 -1041 -840 -1944 -1375 -1387 -913 -1112 -1819 -1901 -1950 -2021 -2422 -1515 -2527 -1895
2155 -1895 -1982 -2123 -1560 -1277 -1996 -1495 -1461 -649 -524 -1327 -985 -1220 -230 -651 356 -420 601 -56 270 615
2175 615 1261 1406 1182 1970 1974 971 1786 2359 1309 1607 1963 1503 2199 2053 2091 1511 1400 956 1253 1559
2195 1559 1206 1446 1006 664 785 1757 1602 402 1199 163 -260 57 -158 207 -649 -697 76 -779 -624
2214 -624 -1563 -1228 -1351 -876 -601 -1108 -339 -2188 -1346 -1475 -1637 -1144 -679 -992 -2371 -2774 -1469 -1757 -1556
2233 -1556 -1695 -1228 -1469 -1483 -1335 -1230 -866 -1448 -187 49 -275 -493 -418 -391 704 1330 838 596 1521 878
2253 878 402 1252 1122 1179 893 2425 969 1463 1163 1381 1553 1588 1335 1443 1819 1481 2177 1785 1792 1297 587
2274 587 -28 664 301 416 651 1320 1324 -296 723 5 -150 42 -6 -956 -1263 -1112 -1267 -1992 -1242 -903
2294i03J51J32j229L92n32n22J503j54j365N67O11o16K95O06j376J130J43J86
2312i81j97n14J268j15r4L07P86o94n8R20p85O46k1k36J232r88O98o26m01J305
2332A452k05L1j62P60m05R2l52k5P3K06n2M52q57P2P01l59O3K30j107l5j6m12
2354A45P69l52Ko41R29j458q1K38q7M51o36k70n96L13j52J67R44n58j92p06N98
2375a173L0J326j710l53m74M60O00J64l70N82o82J618o99k40o74P28m38J203k1
2394a23l54K01k26R95j68N39n32K29J52Q90l39o6m63J12O15M50m83Q19j037k5
2414A186P00J4m51n31R2q5N91n51P20n06J76j141J064l93l18N7m2K58n26n13N28
2435C29n84k48L05m36M33l58k88J08J35j061k46L74p4J66l38r4J823j396o59Q04
$$ plain form
2294 -903 -752 -620 -1849 -1457 -1989 -2511 -1008 -1162 -2527 -1960 -1349 -1965 -1670 -1064 -2440 -1310 -1167 -981
2312 -981 -1178 -1692 -424 -539 -633 -326 460 -234 -292 628 -157 489 468 232 1464 476 1174 548 147 1452
2332 1452 1247 1278 1116 1876 1471 1563 1211 1186 1259 1465 1413 1865 1008 1080 1781 1422 1485 1715 608 573 557 145
2354 145 914 562 564 -77 852 -606 -687 -449 -536 -85 -721 -991 -1587 -1274 -1426 -1259 -315 -873 -1065 -1771 -1173
2375 -1173 -1143 183 -1527 -1880 -2354 -1894 -1294 -1130 -1500 -918 -1600 18 -681 -921 -1595 -867 -1305 -102 -123
2394 -123 -477 -276 -502 493 325 864 332 561 713 1603 1264 1198 735 847 1462 1912 1429 2248 1211 1186
2414 1186 1886 1900 1449 918 1010 925 1516 965 1685 1179 1355 214 1278 885 567 624 582 840 314 -199 329
2435 329 -255 -503 -198 -634 -201 -559 -847 -739 -604 -1665 -1911 -1537 -1611 -1445 -1783 -1877 -54 -1450 -2109 -1305
2455a305n2O79k23m14l21J240n95j04l9O26O2J4J99p0N91k30j45L09m6L35q6K35
2477F60m4N57n02R05R7n52j80P90j15m89K03n30J15n51R1O70N4N14N32j316O9
2498I78M37j101J57o51J152J28j66j109J07M09k86j24J3j178M17J035j176K73
2516f85l09K62q67M50l10N27QL35o66M84j117R43k18q26N29O71l03N24l42J4R8
2537g98o86L87J079k38J09N37j56K72O33j097M18o70K8J214M71r45J00K90K25
2556A173l17o53J167o79J086j065Q30n46J29P7P57m40p80L17m77M75J87r07K34
2575E68r9M62j02K39n59m13m58L12l93Q64j833J857j563N46N41q76o51N53j064
2594b069R06M11m8o69K32K78r97J192l33n91J03Q90m99L00q07P54J480j666R9
$$ plain form
2455 -1305 -1357 -678 -901 -1315 -1636 -396 -991 -1095 -1134 -508 -446 -432 -233 -303 288 58 -87 222 176 511 425 660
2477 660 616 1173 671 1576 1673 1121 941 1731 1616 1127 1330 800 915 364 455 1125 1179 1693 2225 909 978
2498 978 1415 314 471 -180 972 1100 934 -175 -68 341 55 -69 -56 -1234 -817 218 -958 -685
2516 -685 -994 -732 -1599 -1149 -1459 -932 -924 -589 -1255 -771 -1888 -945 -1163 -1989 -1460 -789 -1092 -568 -910 -896 -798
2537 -798 -1484 -1097 -18 -256 -147 390 234 506 1139 42 460 -210 -182 1032 1503 558 658 948 1173
2556 1173 856 203 1370 691 1777 712 1542 996 1125 1202 1959 1519 739 1056 579 1054 1241 334 568
2575 568 469 931 829 1068 509 96 -362 -50 -443 421 -1412 445 -1118 -572 -31 -907 -1558 -1005 -2069
2594 -2069 -1163 -752 -800 -1469 -1237 -959 -1956 -764 -1097 -1688 -1585 -695 -1194 -894 -1701 -947 533 -1133 -1034
2613a034Q66j754K178p12K75L45n15o02J940p35p93O11P28Nm15N58o1L31M70n78
2633A108l03R10r22M46q48M75L23j05J8K24o88J48P57m68k03J003q40n35R1n47
2653D4P41j059O93l77k29NL25P54j047q19K58m77L41p5ll27O27q62J46M54l23
2674a210N3l5K21r47Q79l3N63j28J42r91M03K91O61l42K60n86M40l06L23P47j054
2695f49R55k06N31k85Q5J24n86J177k78L46L98k50j455O10L61K13L57r51Q98J66
2715A561j91P61p96p49O43J36P6o66K09j279J623k10O0j002L16Q6m35L5l25N4
2735i3m79O51K03n13p68K33P35k74K33m78l39K44k10LR0l80m86R30k27R2m02P08
2757e27m53N09n28J578j650L58O32m65Lm85K48K54L94j40l51n8J415R84k017O04
$$ plain form
2613 -1034 -168 -1922 256 -456 -181 164 -351 -953 987 252 -541 70 798 803 388 946 885 1216 1686 1108
2633 1108 805 1715 793 1239 391 866 1189 1084 1102 1326 638 786 1543 1075 872 1875 1035 500 591 44
2653 44 785 -274 419 42 -187 -182 143 897 -150 -969 -711 -1188 -847 -922 -925 -1252 -625 -1487 -1341 -887 -1210
2674 -1210 -1157 -1192 -971 -1918 -1039 -1072 -509 -637 -495 -1486 -1083 -792 -131 -473 -213 -799 -359 -665 -342 405 -649
2695 -649 306 100 631 346 431 555 -31 1146 868 1214 1612 1362 -93 517 878 1091 1448 497 1395 1561
2715 1561 1370 2131 1335 586 1229 1365 1441 775 984 -295 1328 1118 1178 176 492 578 143 178 -147 -93
2735 -93 -572 79 282 -231 -999 -766 -31 -305 -72 -550 -889 -645 -855 -852 -762 -1142 -1628 -698 -925 -833 -1235 -527
2757 -527 -980 -471 -999 579 -1071 -713 -81 -546 -543 -1028 -780 -526 -132 -272 -623 -681 734 1718 -299 305
2777C05O87r39N72L56k17k97O10r36J080M63j640J470o93M33o38N26L2k57j09
2796H08k40K59K23k72k34p4n57N19k6m42j47l86J90P02p68O7k00M12q63m34J715
2817B52j136L44r88J07K35J33P21o87O3q4m55O66m60P79n92N54l74K61M81j214
2837a394R48p09O02O02J82k23m69N50k63kn33J611l69o13j69R94k62k76J032l25
2857I14n46P92n04R6r7K24j63j73p78J529j051P40j4K87N0m13r8n93R8N83l34
2878E49R1j107P56o68M78K95o96k21M31p31P06l40j84K45J13m3p00m51K98M20
2898g59M65k54K92n86J80o7m67J253o46K17l90q0K66M06l57J43o97P23l68P68
2918D2r02J244J00m51k36k08Q51J43k97L53j40l3l38M18N35Q0m13M52p13o33R97
$$ plain form
2777 305 992 53 625 981 764 467 1077 141 1221 1684 44 1514 821 1254 616 1142 1174 917 808
2796 808 568 827 1050 778 544 470 -87 432 406 -36 -183 -569 -379 323 -445 -378 -578 -166 -1029 -1463 252
2817 252 -884 -540 -1528 -1421 -1186 -1053 -332 -1019 -956 -1040 -1495 -829 -1289 -510 -1102 -548 -922 -661 -180 -1394
2837 -1394 -446 -1155 -553 49 231 8 -461 89 -174 -176 -709 902 533 -80 -249 745 483 207 1239 914
2857 914 368 1160 656 752 655 879 716 543 -235 1294 243 983 969 1256 1306 893 795 202 300 883 549
2878 549 640 -467 289 -379 99 394 -302 -523 -92 -823 -117 -457 -641 -396 -283 -326 -1026 -1477 -1179 -759
2898 -759 -294 -548 -256 -842 -662 -729 -1196 57 -589 -372 -762 -842 -576 -170 -527 -384 -1081 -358 -726 42
2918 42 -860 384 484 33 -203 -411 440 583 286 639 499 466 128 546 1081 1161 748 1200 487 -146 851
2939H51M69p74M5N83q58K50j43M67O77j534M65P8K51p43J08O5N80q92p34J490
2959G01o78L98k66q24l55Q59q45O48m5q56J74J362j066j21P70j458K44Q09M06
2978a43o01l08R18j150M17J38l98M1R0J76J237J04j015O82n83O04n57N00M72k16
2998D08m43J76n79O54J485n00j161N50L17l85P87l47K46r41M45j50j1L1l41o33
3018c92J368r19J78L64J26j43M0k00p12N78R9N55q27k64k54J67Np63J480m42q
3039C6M38j323m6J79O5j78L89l24r08J397r67L38M84r75J030m56o75J289m13k97
3059i17M80k73L66M4J33m19J173n08n66J119o43J005j73k04Q30j105M13l29n97
3078a71J033N6n61O0p6L94m52j21N5N28p84J425O30p51j324j6J108o52j02j12
$$ plain form
2939 851 1320 546 591 1174 316 566 423 890 1567 33 498 576 827 84 192 257 837 -55 -789 701
2959 701 23 421 155 -669 -1024 -165 -1010 -362 -407 -1263 -1089 273 -793 -914 -144 -1602 -1358 -549 -143
2978 -143 -744 -1052 -134 -1284 -867 -729 -1127 -1086 -996 -820 417 521 -494 188 -395 209 -348 152 624 408
2998 408 -35 141 -438 216 1701 1201 40 590 907 522 1309 962 1208 267 712 562 551 582 241 -392
3018 -392 976 57 235 599 725 582 622 422 -290 288 387 942 115 -149 -403 -236 -231 -994 486 44 36
3039 36 474 -849 -895 -716 -651 -829 -440 -764 -1672 -275 -1242 -904 -420 -1395 -365 -821 -1496 -207 -620 -917
3059 -917 -437 -710 -344 -300 -167 -586 587 79 -487 632 -11 994 821 617 1447 342 755 426 -171
3078 -171 862 918 357 417 341 735 283 162 217 745 -39 1386 2016 1265 -59 -75 1033 381 279 167
3098A67Q77j548Q92K93o67J36k1J69o13M8k82j78j16J419q20k3j67L09k99K27
3118a97q28P31o58m6Q91j164J32O72j93m69L93k92K02O49m18q87J006N75M0n19
3138c80m81O22q1O68M2r62N35L49k59N58n5K18n61k50M16M81n97o61J57R30j41
3159E48P95r80l59M64q23R51n43l28Q17k30M12o2j092R72%j26NL64p69N70m06
3180A80m09L39j05R3r90M45j75J78m53O84j163J174n08Q72K38j093M6k39M61J79
3200b46k04m61m18J051k98L25r22Q42p62N95R09j016O19p00k25N90N87l23K17
3219A60J50m44j26l1K45J133m58n4k25R71l96J23L0l09m30Q08n46N66n57K98m37
3240D71j71K5K78N07o92m27P40n96P7k5J78K57r75no65J283m52L29m52M05m56
$$ plain form
3098 167 1044 -504 388 681 14 150 129 298 -315 -267 -549 -727 -843 576 -244 -267 -434 -125 -424 -197
3118 -197 -1025 -294 -952 -998 -107 -1271 -1139 -467 -660 -1129 -736 -1028 -826 -177 -595 -1482 -476 99 139 -380
3138 -380 -861 -239 -320 348 390 -572 -37 312 53 611 556 774 213 -37 379 860 263 -398 -241 689 548
3159 548 1343 363 4 468 -355 596 53 -275 542 312 724 662 -430 542 542 416 421 785 16 586 180
3180 180 -229 110 5 98 -892 -447 -622 -444 -897 -213 -1376 -202 -710 162 400 -693 -647 -886 -425 -246
3200 -246 -450 -911 -1329 -278 -576 -251 -1173 -331 -1093 -498 411 -605 14 -686 -911 -321 266 -57 160
3219 160 310 -134 -260 -291 -46 1087 629 575 350 1321 925 1048 1078 769 339 1147 601 1167 610 908 471
3240 471 300 325 603 1110 418 -9 731 135 212 187 365 622 -353 -358 -1023 260 -192 137 -315 90 -366
3261c66N34n35P24p4o57O80n65l49Q78j110l01J817j424N43M22q17k55L71o28
3280a112K23K91L41j143J591J79j63n3j32j72k5p27P88n05P38Q29j823J038J5
3299A78R55j175K92l30L07j17J000m59q49Q08p28O89j04j13n19N26P1l92N24J29
3319F93m9r5n14j18N88m53l94K56j33L22L57r63L97M64m06k18K57j4O98j149j3
3340d87m4j269J660n73L43M68m77L33j014L38L91m36R99o86n46R39o35l49R25
3359a20n3n77N41l99N39m61P34n65n55J328k62Q35j744O40R7p2J732j324l57J344
3379A301j096K27P69o15M39J49p86N25j06K35m78p31J220m27K39m50K19m5n8l70
3399A61N66l7p49N03p6o48J682j671M55j8k59m86K8O57O1j016J010n59P66o23
$$ plain form
3261 -366 168 -367 357 283 -374 306 -259 -608 270 -840 -1141 676 -748 -205 217 -600 -855 -484 -1112
3280 -1112 -889 -598 -257 -1400 191 370 207 154 22 -150 -175 -902 -114 -619 119 948 -875 163 178
3299 178 1133 -42 250 -80 227 110 1110 651 -198 610 -118 571 467 354 -165 361 432 40 564 693
3319 693 644 549 35 -83 505 52 -342 -86 -219 103 460 -503 -106 358 -48 -266 -9 -23 675 -474 -487
3340 -487 -531 -1800 -140 -713 -370 98 -379 -46 -1060 -722 -331 -767 232 -454 -1000 -61 -696 -1045 -120
3359 -120 -173 -750 -209 -608 -69 -530 204 -361 -916 412 150 985 -759 -119 -22 -94 1638 314 -43 1301
3379 1301 205 432 1201 586 1025 1174 388 913 807 1042 564 -167 1053 626 865 415 634 589 531 161
3399 161 727 690 -59 444 368 -280 1402 -269 186 168 -91 -577 -549 108 169 -847 163 -396 370 -253
3419b53P3m80O23m84j68O56l69N99o33l71M84o71p6Q77q48N3R12L03K80j053m2
3440e88K18j29k98J110k06K99j05J57P6r9k79mn1J5P75r30L58L2m97J355J41j077
3462B73M62L13p66Q99n61m92m6k5J022n80P95l11n66j3j180O92l03J16q85J282
3482A26r75M24K95R3o15N21m37O68q47qR90q68Q65l60j2j35L32n87M11k3Nk15
3504c52Q6k59k83M35J86j055P24O77m14K67p9p61J240L90p70O10n97L20J55N76
3524A096j325N39n08j07P70j68K10j38j3O19K16r90J55k59m82K17L56j01J032
3543A119l83j50p59K74o78J369n07j98o88R50O4q89P93p61k52R55n02K55N47j305
3563g46N04k90L45l80j49N46j259K13J772o50l93j147J336j27L72o94R2L61L8
$$ plain form
3419 -253 -180 -660 -37 -521 -689 -33 -402 197 -436 -807 -323 -994 -1070 -193 -1041 -988 -76 227 507 -546 -588
3440 -588 -370 -499 -797 313 107 406 301 458 534 435 156 152 101 116 891 -39 319 351 -146 1209 1350 273
3462 273 735 1048 282 1181 620 128 82 57 1079 499 1294 983 417 404 -776 -84 -387 -271 -1156 126
3482 126 -849 -425 -130 -37 -652 -131 -568 100 -747 -755 235 -633 232 -128 -140 -275 57 -530 -119 -142 -137 -352
3504 -352 -266 -525 -808 -373 -187 -1242 -518 159 -255 12 -67 -828 412 802 32 642 45 365 520 1096
3524 1096 -229 310 -198 -305 465 297 507 369 356 975 1191 201 356 97 -385 -168 188 87 1119
3543 1119 736 586 -173 101 -577 792 285 87 -601 349 413 -476 317 -444 -696 259 -243 12 559 -746
3563 -746 -242 -532 -187 -567 -716 -170 -1429 -1216 556 -94 -487 -1634 -298 -425 -53 -747 -655 -294 -256
3582b56M55J83j251R33l44j57O93k35M87N91j383p6M92j31O20j053J616q04M0
3601D20K09N33j245j45R18J55j317J023L77j173P27K67o24J102m36k68M41p65
3619A99j6k0j58Q48j473L03R54m09L1l4k78N34o85j47N08J22r06O61L62K88q11
3640a27n40M50l48J092o24q16L90M05k17M54n84N01n13K04K62l00n27N07n13J066
3660B22Q73j936N24J85M59k79k10n4N85n41Q51p75N69Q6m22N28j196Q96j014J227
3680E78k38p36L76M03l90M32k55J12K77J66NJ32o21Q60j182M06p63J106n30L28
3700D66o15N4K85l86K61q91J115l15N3k48l55l62N64j98L90J80n30O43p14J48
3720d55r6N05K7J79p75p17P55K43M31n34j31P61l18k07M47m12L2L68j47l44O9
$$ plain form
3582 -256 199 382 -869 64 -280 -437 256 21 508 1099 -284 -360 132 1 621 -432 1184 380 420
3601 420 629 1162 -83 -228 690 845 -472 551 928 -245 482 749 125 1227 791 523 964 199
3619 199 183 163 5 853 -620 -317 637 228 259 225 -53 481 -204 -351 157 279 -627 34 396 684 -127
3640 -127 -667 -217 -565 527 -97 -913 -523 -118 -335 119 -465 36 -477 -273 -11 -311 -838 -331 -844 222
3660 222 1095 -841 -317 -132 327 48 -162 -216 369 -172 679 -96 473 559 137 665 -531 365 -649 578
3680 578 340 -396 -20 383 -7 425 170 282 559 725 730 862 241 1101 -81 325 -438 668 138 466
3700 466 -149 -95 190 -196 65 -826 289 -26 27 -221 -576 -938 -374 -572 -182 -2 -532 111 -603 -455
3720 -455 -551 -46 -19 160 -615 -1332 -577 -334 97 -437 -568 193 -125 -332 115 -297 -265 103 -44 -388 -319
3741c19P08j515J746J14p85l66P68l44j55P85m61R99j490J123p84n99J254m32
3759B47M1L0KM89R2l89k25M72n51N16p15N63m39J45K22n39J127n64m34K67k18
3780A39o60J283j277R96m69r64J085r71L26m3M58o54M53K87n79J01K14r0n23N67
3800c21K69n58q4J485r78N63o74J47l00O02o82M57p5P63q47K35k07j03K26Q1k06
3821b07L25k90R36k64L38j463P02k1J74J87l95N76m09K63J56Q84q56m81J37P7
3841C69K15l5L24j01n38J48n48N66o36q1J63j09M71j35k99k63J076o70m51k08
3861g42P64J00k21k72L72k24J94k64N63q91k00M20K07m88N53k46n09Q37q3P1m
3882f3o03J073j66r46Q75r03P03J75l69K38L69K47j124P89O9o21O98j87k26n7
$$ plain form
3741 -319 389 -1126 620 734 -51 -417 351 7 -148 637 176 1175 -315 808 24 -575 679 247
3759 247 288 318 320 809 901 512 287 759 208 724 9 572 133 278 500 -39 1088 524 90 357 139
3780 139 -521 762 -515 481 12 -952 133 -838 -512 -555 -97 -751 -298 -11 -590 -489 -275 -365 -888 -321
3800 -321 -52 -610 -694 791 -187 376 -298 -151 -451 151 -531 -74 -149 614 -233 2 -205 -308 -82 -1 -207
3821 -207 118 -172 764 500 838 -625 77 56 230 417 22 598 189 452 608 1492 636 155 292 369
3841 369 584 549 873 772 234 382 -166 400 -236 -317 -154 -263 208 73 -226 -489 587 -83 -534 -742
3861 -742 22 122 -99 -371 1 -223 -29 -293 270 -621 -821 -401 -194 -682 -129 -375 -884 -47 -130 -59 -63
3882 -63 -666 407 241 -705 170 -733 -30 145 -224 14 383 630 -494 295 364 -257 441 254 28 -29
3902b9K76l1l23J84K89r4P09k04o31K79k67m6L00qj92M43l05O2O20m94j9j10N59
3925I68m95m8n97n27P74K06l07Q29q09M08l46o91J80k10P56k00l71Q3o23M11M55
3946a54k25L19N11n12n81Q27m51j25k37K60l63N13n82J23R42j52r08J071K2M17
3966G15p60n63J122L47o60j84l09R61j26l75o90p3M25M82o81K76k85Q60j45K35
3986E72M43n28n0K8P5p53k08J462m88o55L67R9N6l34N34q18k15O37n28Q99r44
4007c49J027n00l54l78O03M78m82o74J015m78J9j033O62K21P07p37m67l08R26
4026a02j32M0L04o9o64k6J022n77l9k56K81R56j259Q0N12J90p75M59M10m54n18
4047f17O18j72K01N11r63R37r35P90n96k47R93l26O0n9o31J436q55l62J20O08
$$ plain form
3902 -29 247 216 -107 77 366 272 981 777 146 425 158 112 412 404 212 655 350 412 1032 538 519 409 968
3925 968 473 425 -172 -699 75 281 -26 803 -6 402 56 -635 -455 -665 91 -109 -480 -397 -1020 -609 -154
3946 -154 -379 -60 451 -61 -642 185 -266 -391 -628 -368 -731 -218 -800 -677 265 113 -795 276 298 715
3966 715 -45 -608 514 861 201 17 -292 669 543 168 -522 -595 -170 312 -369 -93 -378 482 337 572
3986 572 1015 487 437 465 540 -213 -421 1041 553 -102 265 364 420 86 620 -198 -413 224 -304 595 -349
4007 -349 678 178 -176 -554 49 527 45 -629 386 -92 -73 -1106 -444 -223 484 -253 -720 -1028 -102
4026 -102 -234 -194 110 41 -623 -649 373 -204 -243 -499 -218 738 -521 -441 71 261 -514 -55 355 -99 -617
4047 -617 1 -171 30 541 -422 515 -420 370 -226 -473 520 194 254 195 -436 1000 145 -217 -97 511
4067E11J0j94m69K15O2M82m8p14k5J46m08J076p27n60L68R6K42j50k99R9n65N78
4089b74l90O96l25K44J5o24J04l52J067p02l4L32o44J232k51k46J87n16k08J97
4109d92Q79l52l74N98M83o56O68j350Q46l60J154n91n7k12O02m93p55O24R65o76
4129D51m6n5L77o97o38Q78j56m2Q5J6j74M27p70Q60m19N29m19m58J196m42m58
4150D5j58n07M94K00J64j218J962j395L19n9N18q8p96j66J158n31p67j93P36j77
4170d59mj84l82Q17N4j34l54r8O59j64l15j54k83J263j34j37p14P64K16l10m30
4191d83P65l55O69l25j31j78L8N23j39k31L55n66N79l4r11R56q79O88m05K94r70
4212g40M78J10O97n7l81K24J39N19L54j350O10j341L92K20N89j113Q60n27j42
$$ plain form
4067 511 521 327 -142 73 135 617 569 -145 -170 -24 -432 644 -83 -643 -275 -179 63 -87 -386 -287 -852 -274
4089 -274 -664 32 -293 -49 -34 -658 -554 -906 161 -541 -575 -243 -887 345 94 -152 35 -481 -689 -492
4109 -492 387 35 -339 259 742 86 754 -596 250 -110 1044 453 396 184 786 293 -462 162 1127 451
4129 451 405 350 727 30 -608 270 114 72 157 173 -1 426 -344 516 97 626 207 -251 945 503 45
4150 45 -113 -620 -126 74 238 -980 982 -413 -94 -153 365 277 -519 -685 473 -58 -825 -1018 -282 -459
4170 -459 -463 -647 -1029 -212 -158 -292 -646 -744 -85 -249 -564 -718 -1001 262 128 -9 -723 41 257 -53 -483
4191 -483 282 -73 596 271 140 -38 0 523 384 153 508 -58 521 487 -424 532 -347 341 -64 230 -740
4212 -740 -262 -152 545 488 107 331 470 989 1343 -7 603 -738 -346 -126 463 -650 210 -317 -459
4231d59M78n3j54J93L90j39o2j34r76J277l39K97m51R52q35n11Q64j120N01j33
4251d14L6K0R2m19K38O67k8k90P11k128J656J20j045J241q45J86K073j097j596
4270h22L79L19N55m22O70L05r36M23L50m56k94N64k91o66Q41k37L89o33J77j56
4290E9L96m6p43O97l10k02k73J88L77L52o58L52P27j067P10j149n94N33J30Q01
4310B80L47r22N96n71o12Q47o61M81l55P55q48O55J59j05q78J241r41p3M59J49
4330Cj53N84j33j46o72J27rj87l35J886j88p67L7L09m59M05m81L74RK68j46j60
4352A66p16P47N46J01q29n14Q11k90M90m23O87j8n95L56k69J0L31j77J0l57K36
4373C03o39K01n52Q13p47L15M90l03P2O8J24n48P61p16j26P79R00j577j93J47
$$ plain form
4231 -459 19 -34 -188 5 395 256 194 60 -916 361 22 319 -132 820 -15 -526 338 -782 -281 -414
4251 -414 -378 -358 -266 -685 -447 220 192 -98 613 -1515 141 261 -784 457 -388 -202 1871 774 -822
4270 -822 -443 -124 431 9 679 984 48 471 821 365 71 635 344 -322 519 282 671 38 215 59
4290 59 455 409 -334 363 53 -149 -422 -234 143 495 -163 189 916 -151 559 -590 -1184 -651 -521 280
4310 280 627 -295 301 -270 -882 -35 -696 -215 -570 185 -663 -8 151 46 -832 409 -532 -605 -146 3
4330 3 -150 434 301 155 -517 -390 -399 -586 -921 965 777 10 47 356 -103 302 -179 195 204 472 326 166
4352 166 -550 197 743 844 15 -499 312 22 512 89 776 758 163 519 250 260 591 414 424 67 303
4373 303 -336 -135 -687 126 -621 -306 184 -119 -47 21 145 -403 358 -358 -484 295 1195 -382 -575 -428
4393d28l34J297p07oR8n65K59P80m74L54q75O39n63Q22o53l74O03M58j88M01r7
4414D47o36R15r70Q2L20l15N36K02n03j5r98N39J240r79O28L04r23R19M9j013
4434a71J005n21O2J98k53J15j164J0J106j074L37P51j6K16j254J338n39j13j220
4453a187O71J08J37K11k59R9l55N62j36L99p3m37K54l00k66M17R74l00n40l95
4473d16P5O99J16n02n16o8n7O19o61N09J79m5m77P67p05M70k82O68n95M02k97
4494a17p97Q26j7j03l6O62L14k76o29P93l98J025j154l01Q19Q7o37jK3n97J760
4515A246k97p92K20l96R05r33O07l46m7l89m76R87j004P14p60O83L88m94j62q2
4535d28p8M73J298j091n85O17l67l05J125q66J82q6n83J064m81k30l76R26n57
$$ plain form
4393 -428 -762 535 -172 -178 -80 -645 -386 394 -80 274 -601 38 -525 297 -356 -730 -127 331 143 544 447
4414 447 -189 726 -244 -162 158 -157 379 581 78 63 -935 -396 844 -135 493 797 -126 793 842 -171
4434 -171 834 313 375 573 320 435 -729 -719 387 -687 -350 401 385 601 -653 685 146 33 -1187
4453 -1187 -516 -408 -271 -60 -319 -220 -575 -13 -149 250 177 -260 -6 -306 -572 -155 819 519 -21 -416
4473 -416 -341 358 474 -28 -544 -612 -669 -50 -711 -202 -23 -68 -545 222 -483 -13 -295 373 -222 180 -117
4494 -117 -914 -88 -105 -208 -244 418 732 456 -173 620 222 1247 93 -208 611 698 61 60 83 -514 1246
4515 1246 949 157 377 -19 886 -47 560 214 167 -222 -698 289 -715 -1 -761 -78 310 -184 -346 -428
4535 -428 -506 -33 1265 174 -411 206 -161 -466 659 -207 -25 -111 -694 370 -111 -341 -717 209 -348
4554c48q03J392L84l84L21r07Q30n04K04N01o48M18J31q54K45j82k90J87P96R5
4574E84n26Q32q03L53j32k04O83n05nj44p98R94l14N20L3l03M28p05M61l59J56
4595B46K66J59n62q39R25m16J31J09R57p84j062R41o50k22k39J163L7k81K6r8
4615a93l00L72L27l87L73l4m68l56O92k79l05J65O93q97k96N74N01Q49j992L54
4635f07J076n50k0L6K42K9m52Q52n60p43O87m35L96j86K20L36r1k64m26N87R14
4656A041l10m61m09n4L57o78j16J009J44n37k2M36o35K71j36J50j81k6R86j536
4676g07o7J612n84j48L76j050L03k49O36q40j83P57l66N6M64n21M89L64q92O67
4696A17J30r61M20O97o31J06k84K89R75j972R70R50j478J395r05O35k97r4o7l49
$$ plain form
4554 -348 -1151 241 625 241 562 -345 485 -19 185 686 38 456 587 -267 -22 -204 -494 -307 489 584
4574 584 58 890 87 440 308 104 787 282 277 133 -665 329 15 535 568 265 693 -12 449 90 246
4595 246 512 671 109 -730 195 -221 -90 19 976 192 -870 71 -579 -801 -1040 123 160 -121 -95 -193
4615 -193 -493 -121 206 -181 192 158 -310 -666 26 -253 -558 -393 300 -597 -893 -319 182 1031 -961 -607
4635 -607 469 -81 -101 -65 177 206 -246 606 46 -697 -10 -445 -49 -235 -15 321 230 -34 -460 127 1041
4656 1041 731 270 -139 -193 164 -514 -630 379 523 -14 -36 400 -235 36 -100 50 -131 -157 829 -707
4676 -707 -774 838 254 106 482 -568 -265 -514 122 -718 -901 -144 -510 -454 10 -511 -22 342 -550 117
4696 117 247 -714 -294 403 -228 -122 -406 -117 858 -1114 -144 806 -672 723 -182 453 156 62 -5 -354
4716c54p22J677m83K71k58o45Q42r04J48K87P06k55J50o99N47n64L18O53l52p67
4736d04J254j160J51N14m81L08K41j320R67N44J66q48m82Q00J21n79j62j01J37
4755c34J57o06J118p05l22J502p08N8k27L68l26q00Q82N39j441R63k10K89l99
4774b02L18K49j156L47J71O61q38M41j1Q32l40k74QO25r78R30n01m50M21m34K24
4795D3n61J009m23q6Q9j5M51l8j138M41M41j46q61N06J1K14K4r4j27J78j04N81
4817C95j57m29m31J063l23J78L45n39j99J91k34o98J201O3l44m72P39o73m64P26
4837f2r52J198k78m66K67l63J00Q67j168P72j144J399k37l43j41Q21l66N1k38
4856b83N06j058N36J222j631R45m15j83k20N02L68l96O24oJ10k85m10R29j31P5
$$ plain form
4716 -354 -1076 601 118 389 131 -514 328 -576 -428 -141 565 310 460 -239 308 -256 62 715 363 -404
4736 -404 850 -310 -159 355 -126 182 423 -897 70 614 780 -68 -550 250 371 -208 -370 -471 -334
4755 -334 -177 -783 335 -370 -692 810 102 160 -67 301 -25 -825 57 596 -845 118 -92 197 -202
4774 -202 116 365 -791 -444 -273 388 -450 -9 -20 812 472 198 206 831 -147 783 282 -168 253 -181 43
4795 43 -518 491 68 -18 71 56 507 469 -669 -228 213 67 -794 -288 -277 -63 -39 -133 -260 -82 -186 395
4817 395 238 -191 -622 441 118 296 641 102 -97 94 -140 -838 363 426 82 -390 349 -324 -788 -62
4837 -62 -1014 184 -94 -560 -293 -656 -556 311 -857 -85 -1229 170 -67 -410 -551 270 -96 -45 -283
4856 -283 223 -835 -299 923 -708 237 -178 -361 -581 -79 289 -107 517 511 621 336 -74 855 724 799
4876G99l04j406J209p74O43o1m44l53J275r98L33K80L21m12j41k62K27L15k53
4895fj22J027o22J75l90O84r4j211Q05o16K22j71K37L56j06n20l36J438j137L37
4915e0L46k40O29j185K34k57rO12j5k39m72R26n00R77p93L51l67q58J031J63l09
4936b5k8j95kJ005r78J08L00N7k73N19m14j4m66N76j85K31r3q33J591j173j48
4957d40k8M97m58J000n27l15K61Q72o89k32P51m15Q3M7j091P59L90k86m92N06
4977A93K22p39k07l89P91n79L68r03J656p34N78k0k20o37O93k37r1P22j075K68
4997c40L11M14or99O15k28M56m75k90J049k97j04M30j217R20J45n77J70K56L42
5017E75m43m12M53Q5o78K83l45R34q22N94l08n96Q36k06n61Q86K14P19m70N91
$$ plain form
4876 799 495 -911 298 -476 167 106 -338 -691 584 -414 -81 199 520 108 -33 -295 -68 247 -6
4895 -6 -128 899 277 452 62 746 652 -559 246 -370 -148 -319 -82 274 168 -352 -688 750 -387 -50
4915 -50 296 56 685 -500 -266 -523 -532 80 65 -174 -646 280 -220 757 -36 315 -52 -910 121 284 -25
4936 -25 -53 -248 -250 755 -223 -115 185 242 -31 488 74 60 -406 170 -15 216 123 -710 881 -292 -440
4957 -440 -468 29 -429 571 44 -271 -10 862 173 -59 692 277 360 407 -684 75 465 179 -313 193
4977 193 415 -324 -531 -920 -129 -708 -340 -1243 413 -321 257 237 17 -620 73 -164 -255 467 -608 -340
4997 -340 -29 385 379 -620 -5 -233 223 -252 -542 507 210 106 536 -681 239 384 -193 -23 233 575
5017 575 132 -280 173 258 -420 -137 -482 452 -370 224 -84 -680 156 -50 -611 275 489 1208 738 1329
5037A329j365l33O54j44o5K9j60J98r02L13P87n18M62K62J59q34J032j556j54
5056h06P29J64o79J28J512o49n59K69L35q20N25l03K28M14q85O72j57L1K33p18
5076c36J033j091k53P1J036m32R10r48n86J188r59P8J255o00m26L00j80N3Q8o52
5096d51O64M63k93p78M62Q12j29o95Q6j66L69L08j216Q90r95O84k03M85n47J499
5116A249p87p20L98r5J0J29J29k09j25l04K19m38n16K46P43K00q06O90L42k46
5136A09m70M52j60M68o53J92J128j105P95q10J67M54m72L69n41Q53q00j57o09
5155g90m07J355J17J24q93P43M88j146M86j56l17P11m72l09R87n1L63o67n79K68
5175a45N20l9k58m12P38o15R30k77m27Q17j215J292j435J262m70m25N40q80J47
$$ plain form
5037 1329 -36 -369 285 141 76 105 -55 143 -759 -446 341 -177 285 547 706 -128 904 -652 -806
5056 -806 -77 87 -592 -464 1048 399 -160 109 444 -376 149 -154 74 488 -397 275 118 149 382 -336
5076 -336 697 -394 -647 -576 460 28 938 -10 -596 592 -367 -289 966 366 -60 240 60 113 201 -451
5096 -451 213 676 383 -395 67 879 750 55 141 -25 344 652 -564 326 -669 15 -188 297 -250 1249
5116 1249 462 -258 140 45 55 184 313 104 -21 -325 -106 -544 -1060 -814 -71 129 -677 13 355 109
5136 109 -361 91 -69 399 -254 -62 1066 -39 756 -54 113 567 95 464 -77 776 -24 -181 -790
5155 -790 -1197 158 275 399 -494 249 737 -409 77 -79 -396 315 -157 -466 521 470 833 166 -413 -145
5175 -145 375 336 78 -334 404 -211 719 442 15 832 -383 909 -526 736 266 -159 381 -499 -352
5194c52J29O84O55m05j394J531j001M58k53n57K13J74q4m32K44J9l42J373m75
5213A85n1l75p62J757q48J85M05p52m69N56P35l31M56o74K05m16M46n55L39L15
5233C51o73L21J58o79O93l15M43L43m62k00k95r9m92P80m87K14L87J51o59O58
5253A38m10r2M5pP02M3p4P6k34Q37q82p43l88J150k76R4p69J91J403j248N70O85
5275H11j429J298j296K51M45l59q7k0n18J298p90l29J266p91L31K41j049R31o9
5294A35j024L16J051m38mo51J171r8j87l28J252r91n9K57j394J635o51R9n24J23
5314c10P66J56l86j68m84J291j36p79k24P26l48j103K56Q77q3n04J48N13K55n15
5334e2j10j47O63m80k15K02j34O26k82J61q47M76N47n78j75J168p1r3l86q39O17
$$ plain form
5194 -352 -223 461 1116 711 -683 848 -153 305 52 -505 -292 -118 -202 -634 -390 -371 -713 660 185
5213 185 134 -241 -1003 754 -94 91 496 -256 -725 -169 566 235 691 17 222 -194 252 -303 36 351
5233 351 -322 -1 157 -522 171 -144 299 642 180 -20 -315 -414 -906 -126 -613 -399 -12 139 -520 138
5253 138 -272 -364 -319 -326 376 419 345 421 187 1024 142 -601 -989 161 -115 -21 -790 -599 804 -444 126 811
5275 811 -618 680 -616 -365 80 -279 -366 -386 -904 394 -396 -725 541 -250 81 322 -727 204 135
5294 135 -889 -573 478 40 36 -615 556 458 271 -57 1195 204 145 402 -992 643 -8 91 -433 -310
5314 -310 456 612 226 58 -426 865 729 -50 -274 452 104 -999 -743 134 51 -453 -305 208 463 -52
5334 -52 -162 -309 354 -126 -341 -139 -273 353 71 232 -615 -139 408 -170 -345 823 752 659 273 -566 51
5355E1j066J217j356J158L40p63R77p31J007o06p76N1jM29J30N7q8N4J82r78N01
5376b11M33j221O61l56J27J7L80l6j46O55k7lR5N67j470K40Q07n36j03O87J41
5397G01o16O53m93m98K83l42P87O31m11k42p90J045r76k85K73R1k22J172n00J23
5417C84r11J129j076k82Q35L28j128P00J29J365k60j149J3mK1k83K02r1J57k14
5437a35o72J667j063j13l78L51Q29j037K16K55N24L22o27k32M8l82L26N4l71k68
5457f86J011k65N43q42O0Q31r18o99P48N38p13p13J091l56o35J557O07j700m14
5476i55J414l27n56Q28o3p24J10n77R21o99L2L94O55k72J45j062O23M44L73j106
5496d02K97J13M87j125N11J56K63k46L02k18k21N27j112N08K77L13n31j14M02
$$ plain form
5355 51 -1015 202 -1154 4 344 -419 558 -173 834 228 -548 -497 -498 -69 61 118 30 84 266 -712 -211
5376 -211 222 -999 -338 -694 -567 -550 -170 -206 -352 303 276 273 368 935 -535 -295 512 -24 -127 560 701
5397 701 85 738 245 -253 30 -312 475 1106 695 453 -337 708 -268 -553 -280 -189 -411 761 261 384
5417 384 -527 602 -474 -756 79 407 -721 -21 108 1473 1213 64 77 73 94 -189 13 -78 79 -135
5437 -135 -807 860 -203 -316 -694 -343 486 -551 -335 -80 444 766 139 -93 -45 -427 -101 -47 -418 -686
5457 -686 325 60 603 -239 -179 652 -266 -965 -217 321 -392 -1105 -14 -370 -1005 552 1159 -541 -955
5476 -955 459 132 -424 404 341 -383 -273 -850 71 -628 -596 -202 453 181 326 -736 -113 331 704 -402
5496 -402 -105 8 495 -630 -119 37 300 54 356 138 -83 444 -668 -160 117 430 -101 -215 187
5515A87J90p99L93j19M62k7l14j4M10l99l96N5J84K6N55r10P47j79k20O1n05P70
5537A58p42P08k92R36m18M93j562J249q56R7l02K53M02J403j228n14R03k45r16
5556d73J36N9L7P27K84j135N39j02n85N71M43j427R99k00R52j013L18P8n27M59
5576A40M79k77q09R4P8k15K9O78J69R8J2l00k94J203q17n95p0L5P86k49l27L44
5598A92k89k00O28l5o28n93P69L32l81L0L40j78K07k10O17n47m36L76N15k3m26
5619F0M70q53K96l28J4M38j47K87O2q25k59J011q98M64M94m72P95K30j808J181
5639B12l65k10L73N29R6l66r6O47p39p01J191q89L21o8j97P68m30j92r51Q65O06
5660D04m73J67J46j8l9q21P1L39l40M11M49M53q32J71l84J12n17R41r1m06R31
$$ plain form
5515 187 377 -422 -29 -148 314 287 -27 -41 369 -30 -426 -371 -187 -161 394 -516 231 52 -168 -107 -612 158
5537 158 -584 124 -168 768 350 843 -719 530 -326 -229 -531 -278 124 1527 299 -215 688 443 -473
5556 -473 -337 -278 -241 486 770 -365 174 72 -513 58 501 -926 73 -127 825 -188 130 208 -319 140
5576 140 619 342 -467 -373 -295 -510 -481 197 366 464 476 176 -118 1085 268 -327 -397 -362 424 175 -152 192
5598 192 -97 -297 331 296 -332 -925 -156 176 -205 -175 165 -13 194 -16 601 54 -382 -6 509 486 60
5619 60 530 -323 -27 -355 -341 97 -50 237 299 -526 -785 226 -672 -208 286 -186 609 839 -969 212
5639 212 -153 -363 10 539 635 269 173 820 81 -620 571 -318 3 -65 -262 506 76 -116 -1067 -202 404
5660 404 -69 98 244 226 187 -634 -563 -224 -564 -153 296 749 -83 88 -296 -184 -701 240 149 -257 674
5681F74m43N8n34j20J147r24L28M7O41o58K60j37n2L52l33L63j226J006o39Q59
5701F69l28l53l44J058p37p76J070K15n16N79K82r55R15n59j128P54M62j71m84
5720c47p92J447ko0j81l09o42R70P46k74L7p56p78J409K35o77l73K8J205r04m90
5741e08L23p2N53P19j054O20k2r11K04M2j3N44q11O73j035Q72L11p37N82j26N95
5762G49o51M30j39l54k35K35J85J38r2m2L37m46j44n67K78O09M05n74O7m09N86
5783C66J75OK8q67P3M27q40J299q28Q87m98m39r65J517p34j40Q14M72q14m61M99
5804b3o9n88P13q76Q65r9j53P41Q2r0o03m13O97J35Pj260J195J17m59Q9mJ84o16
5827d28K01l44P09n22m57J051k66L62J68J48K7Q20j245J39n77L47J62J81k10R6
$$ plain form
5681 674 231 289 -245 -365 782 -142 186 233 874 216 476 339 287 639 306 669 -557 449 -190 669
5701 669 341 -12 -356 702 -35 -811 259 474 -42 537 819 -136 779 220 -908 -154 308 137 -347
5720 -347 -1139 308 306 246 65 -244 -886 84 830 556 593 -163 -941 468 703 26 -347 -319 886 -18 -508
5741 -508 -185 -257 296 1015 -39 581 559 -352 -148 -106 -119 425 -386 287 -748 124 435 -302 280 154 749
5762 749 98 528 389 35 -200 35 220 358 266 224 561 115 -29 -596 -318 291 696 122 189 -220 366
5783 366 541 547 575 -292 -219 208 -632 667 -161 726 228 -211 -1176 341 -393 -533 281 753 -61 -522 -23
5804 -23 -92 -680 33 -843 22 -77 -230 511 593 503 -100 -513 184 319 326 -934 261 378 -81 8 4 188 -428
5827 -428 -227 -571 138 -384 -841 210 -56 306 474 622 649 1469 224 363 -214 133 295 476 266 362
5847C62m10m42L35J74j36j09k77J153l73M23n69m51n41P16K83j41m71M84J057
5866A067r21j063P23N69J13j079j80J465n66P9L65j556k2J273M97p43L1k76M85
5885B61m04Kj73J71K73q39R62o00l5Q92j049M36q4O39r91j108P19J198n29K46
5905a3J80J35P88j241k70L32k88K94lL03k26L15m68N06k0q91J374k3q82k50K98
5926e0J96n98m59M64M66N78r65J98P03k05n87Q58q85L05K37J34m06R6M09q46L41
5947a6q57N15p07K159j112j94K79O68n12P94j246L3M35j044J135N9m17k89kK31
5967h8n92N08O07m11n94L75j17M72j26J35q75J222Qp26N73o13J344p33K2k37l94
5988b40kl38M46l09k93P44k73L78p04M63Q85q01N87j304J484p32p65N92M42j041
$$ plain form
5847 362 -48 -490 -155 19 -117 -226 -503 650 277 700 131 -320 -861 -145 138 -3 -474 10 1067
5866 1067 146 -917 -194 375 488 -591 -771 694 128 207 572 -984 -1006 267 764 21 52 -224 261
5885 261 -143 -141 -314 -143 130 -709 253 -347 -382 510 -539 -103 -187 452 -539 -1647 -928 270 -259 -13
5905 -13 167 302 1090 -151 -421 -89 -377 -83 -86 217 -9 306 -162 344 324 -567 807 784 -98 -348 -50
5926 -50 146 -452 -911 -447 19 597 -368 -170 533 328 -259 599 -286 19 256 390 -16 80 489 -357 -16
5947 -16 -873 -358 -1065 1094 -18 -212 67 735 223 1017 -229 -196 239 -805 330 389 -28 -317 -319 -88
5967 -88 -680 -172 435 24 -570 -195 -312 160 34 169 -706 516 524 -202 371 -242 1102 369 391 154 -240
5988 -240 -242 -580 -134 -443 -736 8 -265 113 -591 -128 757 -44 543 -761 723 -9 -774 -182 260 -781
6008g81R23J67J37r56j1m91P93L26J69j1O3j94m23q0Q55j051O80j22K66j13l32
6029a86j43L00m96K6Q53L27p91P48k96n16O39j114Q14k64J45M26K80q73L3K44
6049A56j68j369J301k41R43m0K99j129L80L15m53o96M70P23m28J82L07l30j634
6068a412J400N50k33m29R1o33R11k33l88k26K62l8J052q91q89J269J118j521m11
6087f51K76O41n27j01J01l77J489m80l20K64m57mO43M04m88j0k24l60L94oj24
6108H3j30M00j08n85n79J332p92n19Q43j99k91O03L4q15L36L47o5k25P69k60l27
6129a48N4j36q2m12P81K01m43P18p72m32J57P37o91P65P87r24p8l5K83P9k18o62
6151d71P63J18j070O40k54l56M46l23K60J71O1l15J78J37m10M92J65J06m30q29
$$ plain form
6008 -781 142 309 446 -510 -521 -1012 -219 107 276 265 328 134 -289 -369 486 -565 115 -7 259 146 -186
6029 -186 -329 -29 -525 -499 354 681 -110 638 342 -174 465 -649 165 -99 46 472 752 -121 -88 156
6049 156 -12 -1381 -80 -321 622 582 881 -248 132 447 -6 -702 -232 491 63 245 552 222 -1412
6068 -1412 -12 538 305 -124 -33 -666 245 12 -376 -602 -340 -378 674 -217 -1106 163 1281 -240 -651
6087 -651 -375 266 -261 -362 -261 -638 851 371 51 315 -142 -146 497 901 413 403 179 -181 213 207 83
6108 83 -47 353 245 -340 -919 413 -379 -898 -55 -254 -545 58 92 -723 -387 -40 -105 -330 439 179 -148
6129 -148 -94 -230 -312 -724 57 258 -185 533 -239 -671 -514 223 -468 297 1084 160 82 47 330 409 191 -471
6151 -471 292 410 -660 -20 -274 -630 -184 -507 -247 -76 -15 -330 -152 -15 -425 67 232 338 -92 -921
6171i21N55O2n78N12L05p57J600p18p9M40J82m63m26K53l80L95J22l78o00J210
6191C36p22K21q2L38L7L50m79k48J83n09m6L65m6Q0o43J258l7m78k9k15J63N73
6213C70r28K02J62L18n46R71l37M29l11j10O37m03j20p40L04j31K71n36O74O44
6233H20m58K96J04j62n55m92J334j409N4Q20o17L98J51j451J696j173Q40j60j37
6252a01R19j478N31k88N81j05k02L60K37r71J677j856J206R6j79j72r9O16j201
6271d29M12p0n7L95l33J67j27O52j432Q07L4q48N66k24Q41p88L28j61K9L42j07
6292cK89M51j193L87R43m61o85N27L7j8l04o8m85O83n17J678j039K11j034L53
6312b48M70J70p57P15J72m82L4l52K96N0n11N13m76l5Q54n49O71j96l88N87l15
$$ plain form
6171 -921 -366 -304 -882 -370 -65 -822 778 60 -19 421 603 140 -286 -33 -413 -18 104 -274 -874 336
6191 336 -386 -165 -247 91 128 478 -1 -249 -66 -575 -621 -256 -302 -222 -865 393 356 -122 -151 -366 -203 370
6213 370 -558 -356 -194 124 -422 549 212 641 330 220 857 454 334 -406 -102 -233 38 -498 176 820
6233 820 362 658 762 600 45 -447 887 -522 -468 352 -265 133 284 -1167 529 -644 196 36 -101
6252 -101 818 -660 -129 -417 164 59 -143 217 454 -517 1160 -696 510 606 427 255 156 772 -429
6271 -429 -17 -87 -144 251 -82 85 -42 610 -822 -15 19 -829 -263 -487 354 -434 -106 -267 -238 104 -3
6292 -3 286 737 -456 -69 874 413 -272 255 292 274 -30 -98 -583 100 -417 1261 222 433 -601 -248
6312 -248 222 392 -365 350 522 40 74 -278 18 68 -443 70 -406 -441 413 -136 535 339 -49 538 223
6333B23j21l39l72P12j90P13o56j0l53P53m36M49m49J80k84M5O2M16o62O15k87
6354Il37P71o81O08n00R81r89N39p6q53K12J88K80p9m82N81lj018J429M5nn15
6376A05O93l61o4q12J087k98o29q0O46m98R6L84O4J50k03M48j004M29n81J336
6396I08j425O67k6M99p93O8L02n32M06k1N51K59q53l48P71p49N4M02q10N60L03
6417A93K39k47M95k04o15n45L57o47J262K6M15l75q02K39P1J82j10K18Q77j678
6437f49M69J200q76O58n82l80j86L04M13J126o17K52j344J279j550R1K67P65r35
6456b95j58M94M59j355l99N51N08m9R99q27J1M68M53n39M64p98M22l11n43O66
6476B21o06l38P18o82P31k41K05R29j93p84p07N45J05r16J451k7l93o06O9J86
$$ plain form
6333 223 102 -237 -609 103 -87 626 -30 -40 -393 360 -76 373 -76 104 -180 -135 -73 343 -319 296 9
6354 9 -328 443 -238 370 -130 851 -138 401 325 -528 -316 -128 152 73 -409 172 169 -849 580 625 620 105
6376 105 798 437 373 -439 648 350 -279 -359 287 -211 -115 269 333 483 280 728 -276 153 -428 908
6396 908 -517 150 124 623 -170 -102 200 -332 74 53 604 863 10 -338 433 -316 -262 140 -670 -110 193
6417 193 432 185 680 476 -139 -684 -327 -974 288 314 729 354 -448 -209 -138 44 -66 152 1029 -649
6437 -649 -180 1020 144 802 220 -160 -346 -42 371 1497 880 1132 -212 1067 -483 -392 -125 640 -295
6456 -295 -453 41 500 -855 -1254 -703 -195 -244 755 -72 -61 407 860 321 785 -13 409 98 -445 221
6476 221 -385 -723 -5 -687 44 -197 8 937 744 -40 -747 -202 -97 -1013 438 411 18 -588 -519 -333
6496c33M40n30l50P98L76p70L58p18Q0O00n62L21k82qJ623r90r3O0k96N42o83
6517d17Q76p21M93O58n24j72M17o65K83J17l9o02M45k06J98k64l80R94l8q18L61
6538dL92m0l57m27O9J156p03Q37p73kl91k35M93L41r38O73p33N63M12r13r60K776
6560A236o67J94l54k41p3k5R26j455L16O10j105Q69Q11r05j54m44J002q75l51
6579f85P08Q33m54n30j178K52J269L86J15O9o66q0N44j391J033o52Q08K32l66
6598B47j35q3n27K93N07J95n13J51k38L34m42n5N89m54K30k51J141J4j334K8O76
6619C73j96m11L24L99J15k82J59j6p6o88N80L70n8l6p64P0L83p08O91R6Q7j489
6641a077R04P44m20J31J31l27k66j37L36J26l73J16l7Q80Q5q15k17J77o33J010
$$ plain form
6496 -333 107 -423 -773 25 401 -369 -11 -729 -649 -49 -611 -290 -572 -580 1043 53 -40 20 -276 266 -417
6517 -417 459 -262 231 889 365 193 610 -55 228 345 306 -296 149 -57 141 -123 -503 491 453 -365 -4
6538 -4 388 348 -9 -436 -367 789 86 923 150 148 -243 -478 15 356 -582 91 -642 -79 333 -580 -1540 1236
6560 1236 569 763 409 168 95 70 996 -459 -143 467 -638 231 1042 137 -17 -461 541 -334 -685
6579 -685 23 856 402 -128 -1306 -1054 215 601 716 785 119 39 583 -808 225 -427 381 613 247
6598 247 112 29 -498 -205 302 497 -16 135 -103 231 -211 -266 323 -131 99 -152 989 1003 -331 -303 373
6619 373 177 -234 90 489 604 322 481 465 389 -299 281 651 593 557 -207 -137 246 -462 229 325 412 -1077
6641 -1077 -173 571 151 282 413 86 -180 -317 19 145 -228 -112 -149 731 816 1 -216 -39 -672 338
6661C38k95N12k11r1l96o50J80J015k95M36l66j446M79N38K65P18q31M9jJ61Q75
6682I84j025m51J017q4M14l13j338K75P28l44p80P39N94j155P01J82l98l35J65
6701d24J68M71m8n30l22J016j48q67P20K96n93k79M57r9P61o16N49O64j188N68
6721E56q85L07N48r60k83J302j53j137Q52m48O17k27M8m56N63l62j08J206j081
6740a01O10n71Q1q36K5J007J40k30k23j059J068Q68j78m84m6j14K27J8K40j576
6760a134J204M27q44O55r03N81R42j431O17n23l66O07J59m74J116l50q39R49k24
6779A69J45n67J65J70K72k28l25L65Kl87P00l16j341R24l4L22k26l67J318J48
6799I09j9J24j200j23K21J91m88M54p5m70l02Q32K29l38o9K39J52K83p06jr4n1
$$ plain form
6661 338 43 555 344 253 -143 -793 -613 402 107 543 177 -1269 -790 -252 13 731 -100 -51 -52 109 984
6682 984 -41 -492 525 441 855 542 -796 -521 207 -137 -917 -178 416 -739 -38 144 -254 -589 -424
6701 -424 -256 215 167 -363 -685 331 183 -684 36 332 -261 -540 -83 -182 579 -37 512 1176 -12 556
6721 556 -329 -22 526 -434 -717 585 432 -705 147 -301 316 89 137 -319 244 -118 -226 980 -101
6740 -101 509 -62 19 -817 -792 215 355 125 -98 -1157 -89 779 601 117 71 -43 184 202 442 -1134
6760 -1134 70 497 -347 308 -595 -14 928 -503 114 -409 -775 -168 -9 -483 633 283 -556 393 169
6779 169 314 -253 -88 82 354 126 -199 166 168 -219 481 165 -1176 -252 -286 36 -190 -557 761 909
6799 909 890 1014 -186 -309 -88 103 -385 69 -6 -476 -778 54 283 -55 -124 115 267 550 -156 -157 -251 -302
6821c02J083j453N54M97j055O51q52N52L23n42P81n89j2l9K14m22J071p81M00
6840G9j69L6k15j138J439o71O70o23P46L03K9k22j81L6r55J117M07k28K4o64p71
6861i51N94Q10j15o00M79r03N34L07r8l32K43m5l26P78J9K33o83q48J267j2p88
6882d37L68J42k40k33J97L39n78P26n92p68N69N47mK88q0j53n31k96N64m6N94
6903C76l79l6k4J33o71N81J54m81Q1R54j274J87k45J292M60j015l19J4M00o28
6923d40L94k10J029n94o92M97q71P98K77K66n70J27K37r50k74Q49p93Q71r5o91
6943h35K63M48J7k20Q21o54N80p77O68k05L61Kj102J100m17q03N53m96J110m04
6963A0n72L66j112J142K34M95o02l19N15l54j75L33J71k75k93N61R17j002m58
$$ plain form
6821 -302 781 -672 -118 379 -676 -25 -877 -325 -2 -544 237 -352 -364 -403 -189 -611 460 -321 79
6840 79 -90 -54 -269 -1407 32 -639 31 -592 154 457 486 264 83 119 -836 281 688 460 484 -180 -951
6861 -951 -357 453 338 -262 217 -686 -152 155 57 -275 -32 -77 -403 375 394 627 -56 -904 363 351 -437
6882 -437 -69 73 -167 -400 -203 136 -442 284 -308 -1076 -507 40 36 324 244 91 -440 -736 -172 -218 376
6903 376 -3 -39 -63 70 -601 -20 134 -347 -266 688 -586 -399 -644 648 1108 93 -226 -212 188 -440
6923 -440 -46 -256 773 179 -513 -16 -887 -89 188 454 -116 11 248 -702 -976 -127 -920 -49 -144 -835
6943 -835 -572 -124 -107 -327 494 -160 420 -357 311 106 467 469 -633 467 50 -753 -200 -696 414 10
6963 10 -562 -196 -1308 -166 68 563 -39 -358 157 -197 -372 -39 132 -143 -436 125 1042 40 -418
6982d18K26N86l0m55L30m66P16n27l34P20r15n13J021l72K14L38p84l93N97Q01
7002C42l11m31M36M78j06l96M52n03j58R2k63n63J415j033R15m63N03k10L83k22
7022C57k67m1%r39R82L94p97P26n31M20L08N9j575J635j185P17p28J55m30R75
7042B35m00jk46N42n17N29n27J078j40p12j46k47J107k54n89o85N41N88m65L37
7062B8J53Nk26k62P25n56L75L05j372L42P34k2n49Q31r18J012r34N19o60k40J051
7083C41P9l41p25J121L96q02J45n12j18J305j089J374j522P77N64r38J99m1m2
7102A71L93j081J215j27o63j15L86m55k0L93L9rO10p24l37l06O42j43q99L62N51
7123a17r51J422K71m61N49rn40q11P24J107j409N72p20P96n93N85l31k35p03J405
$$ plain form
6982 -418 -192 394 364 -91 239 -227 489 -38 -372 348 -567 -1080 -59 -431 -217 121 -663 -1056 -459 342
7002 342 31 -400 36 514 408 12 464 -39 -197 -105 -368 -931 484 -549 366 -97 406 196 579 357
7022 357 90 49 49 -890 92 486 -311 415 -116 304 612 671 -904 731 -454 263 -465 -310 -740 235
7042 235 -165 -166 -412 130 -387 142 -385 693 553 -159 -305 -552 555 301 -288 -973 -432 156 -309 28
7062 28 181 186 -40 -302 423 -133 242 547 -825 -483 251 229 -320 511 -407 605 -329 190 -470 -710 341
7083 341 420 79 -646 475 871 69 214 -298 -416 889 -200 1174 -348 429 993 55 254 213 171
7102 171 564 -517 698 571 -92 -207 179 -276 -296 97 136 127 737 13 -324 -630 12 -131 -1030 -668 -117
7123 -117 -1068 354 625 164 713 704 164 -647 77 1184 -225 347 -373 423 -170 415 84 -151 -854 551
7143E51p91k86O47n11N2M65N31k28m88j89L84k77Q87m64j99l84o03N09N76R1j95
7164G8K61m35j38M17l43M34j90L07Ro51k13M48Q15q60M24N59p33O72j97m18n54
7185c08J77K8k85J20k64L60J4R9O07j347R36p88O05J18K51j41j83J04j41R1Jm44
7207c90J18M31n86l1O43J08j69r53J154n55J276k472J677m53K52k18l07J224l22
7226D27q14O12p51K89L22q96R92m42N66m42J10j03P50j084P43K80m73Q8M61r07
7246b72L89l37O0J73N73q81L63Q2O87l62k02J76m89j0mN39O8l70N3j437J071J80
7268E0l27j9P92j36j92M62j665J199N7m31O35q47N4M68Q56q77Q64j38j876M58
7288f13J018Kk0O12r15Q71j154M85N16j065O86j264R83k3K40l45o81O01l96M58
$$ plain form
7143 551 -240 -526 121 -390 -338 127 658 430 -58 -247 137 -140 747 283 84 -300 -903 -394 182 273 78
7164 78 339 -96 -234 183 -160 274 84 391 400 -251 -464 -16 799 -61 363 922 189 861 664 246 -308
7185 -308 -131 -103 -388 -268 -532 -172 -158 -59 548 -799 137 -651 -46 72 323 182 -1 103 -38 53 54 -390
7207 -390 -272 159 -427 -458 185 293 124 -829 325 -230 1046 -1426 251 -202 50 -168 -475 749 427
7226 427 -387 225 -526 -237 85 -811 181 -261 305 -137 -27 -130 620 -464 279 559 86 174 635 -272
7246 -272 117 -220 -160 13 586 -295 68 150 837 475 273 449 -40 -50 -54 485 553 183 236 -1201 -130 50
7268 50 -277 -296 496 360 168 630 -1035 164 221 -210 425 -422 -368 100 956 79 943 805 -1071 -613
7288 -613 405 407 387 999 84 955 -199 286 802 -263 423 -841 142 119 359 14 -667 -66 -462 -4
7308dQM27l38K33j128Q77J41j1o3j1j43P08P73j231q56m38J264n60O15j3l88p29
7330h67J404j447O83N30oM27j121J76R05q59P56j90K18n56n92J048j106K60J008
7349F71J75j022N55qJ40k97n87q15Q38J29j207J519O48K58j256N98p37Q71p34
7368b61K5pP31j814J088M72rl23m65K09n86O27N8P90j72m69J72m71O83j08l84
7389b14j3O62j033M61M97m45n0M33L3j55q60Q04J35J12Rj63J98l33K77N06j696
7410h35K15J674o24J26m37k16L68N9m95Q76j036L45k26L50N83J7q90k79K95M78
7430C48m10j60K21j2k16P36l29J5k4L03q00J67P73o08J117j814P12m92R44j12
7450C59j86l76n56j59J004k49J06L48k1m79k38M17O78r91J057n82k34O87k71q96
$$ plain form
7308 -4 4 431 93 326 -802 75 216 205 142 131 -12 696 1469 238 -618 -1056 208 -352 263 250 -138 -867
7330 -867 537 -910 -227 303 297 724 -397 -221 684 -175 581 391 609 53 -539 509 -597 -337 671
7349 671 846 -176 379 371 511 214 -373 -1188 -350 -221 -1428 91 739 997 -259 339 -398 473 -261
7368 -261 -236 -243 488 -1326 -238 234 225 -98 -563 -354 -940 -313 -255 535 363 -106 66 -405 278 170 -214
7389 -214 -227 435 -598 -137 360 -85 -135 298 331 176 -684 120 255 367 376 213 411 78 355 861 -835
7410 -835 -620 1054 430 556 119 -97 271 330 -165 711 -325 20 -206 144 727 744 -146 -425 -130 348
7430 348 -62 -222 -1 -13 -229 507 178 193 169 472 -328 -161 612 4 1121 -693 19 -473 471 359
7450 359 173 -203 -759 -918 86 -163 -57 291 270 -209 -447 -30 648 -343 714 132 -102 585 314 -582
7470e82K79N78R4p72m48Q21p76M12J12J32j51O26o77j7M71J1o29J347q45n97O55
7491D4K14m72M91n35N49j03l41L63M70r41L45k88QO8J98n82J70R38j90l61N1K01
7513B97n11n81M33O45j66m78P81p6r28k35J472l51k35p19J427l31r58P98p29J099
7533F54m18m6L52k8Q44j039j138J187k93J73l25r02J688q94m00M27L76J32l64
7552a4N14j16k62l65J283q83r61J445j011o1k0M25k25j70M58J97j210R03j67l50
7572e90O1R35o49J15K10p88N66O70J24q28J5P02j029M12j37l37Q52p50Q56j243
7592h33P17J097o60Q1j54N71J22j462j61R86j121K53J64Q65k98l15M83p44K79
7611a30O74j289K16P61J88j34n91J322j013K90j43j3l18L24O84o73J15m35k12
$$ plain form
7470 -582 -303 275 369 -403 -851 -30 -806 -394 -282 -150 -301 325 -352 -369 102 113 -516 831 -14 -611 44
7491 44 258 -214 277 -258 291 188 -153 210 680 -261 84 -204 -196 -128 70 -512 -342 596 406 45 96 297
7513 297 -214 -795 -362 283 117 -361 420 344 -584 -819 653 302 67 -652 775 444 -514 284 -445 654
7533 654 236 190 542 514 1358 319 -819 368 75 248 -77 -979 709 -185 -585 -158 218 350 -14
7552 -14 500 384 122 -243 1040 157 -804 641 -370 -431 -451 -26 -251 -421 37 234 -976 -73 -240 -590
7572 -590 -529 406 -243 -128 82 -706 -140 530 654 -174 -159 543 -486 -74 -211 -548 304 -446 410 -833
7592 -833 -116 981 321 402 248 819 941 -521 -682 304 -817 -564 -400 465 167 -148 335 -409 -130
7611 -130 544 -745 -529 232 420 286 -305 1017 4 294 151 138 -180 144 828 155 270 -165 -377
7630c77l24Q90K23p03K79n50R97J74o14J010j465J337j304O55m12K93l3o5j72
7649a61N16n88n2Q36k95K30j278J874j431l63K33P53j331K232q72k64M62m82M24
7668D43J67k73N95m14m58O4k54k02J78N78p78K6j05N77m4J82l62M88p25M11J40
7689B34j19J85q97J075q49M47q11P55M48l26P25j224K12o99J008l17L73J04o55
7708c31J197r90L08l34K63j75qL5P52j559J067l75q1J054n38K10j25L13k02j154
7728f73j53N42l19M92j34O36o74m42N69O83j504N30P72n57J69k77N52q26J646
7747A032n05p43M98m61p1j42O96L45q22L50K99r30K82j92m94O72J226q49j75L49
7767C65N38j103L24k95k59O52J2k16o80R12j144P94J84O20p95L03M36k80N12r97
$$ plain form
7630 -377 -701 189 412 -291 -12 -562 435 609 -5 1005 -460 877 -427 228 -184 109 76 11 -161
7649 -161 355 -233 -285 551 256 486 -792 1082 -349 -712 -479 274 -1057 1175 303 39 501 19 443
7668 443 610 337 932 518 60 124 -130 -332 -154 424 -354 -328 -433 144 100 282 -80 408 -317 94 234
7689 234 115 300 -597 478 -371 76 -735 20 468 142 867 -357 -145 -844 164 -153 220 324 -331
7708 -331 866 -124 184 -150 113 -62 -70 -35 717 -842 225 -150 -231 823 285 495 370 683 481 -673
7728 -673 -826 -284 -603 -111 -245 391 -283 -725 -156 527 -977 -447 325 -232 -63 -340 212 -614 1032
7747 1032 527 -216 282 -179 -250 -392 304 649 -173 177 476 -454 -172 -364 -858 -186 1040 191 16 365
7767 365 903 -200 124 -171 -430 222 234 18 -662 250 -894 -100 84 704 -91 212 648 368 880 -117
7787a17k67K99l2o71Q62o69M54N6p7R10O37j115j843J280m59Q32k58L11L7p85
7807f15N31J41k18m88J232p82O11L76k50l27L68q35k15P2L28J23j02j003R08O21
7827D76k7Ql62N36r4j82K44o77k87J274n41o93M24Q9m55N28m22J86k62J05R2M64
7849D24m89L44o32k11M96q9K64j37K42m68K9J93m51L17J23m99N83L97L5k94k11
7870c4k1J222m78o59l76n6N28p38K06Q47k43j7k56L81R7j59n41O13l05M49r47
7891d87l26R87l09k55Q93r50M99K22k37L51j21L91q23K98n01j42Q26j000O35q84
7911i33P74Q15n15j39j68l42j59mO07k57K26L54p04K01O03n47J95O41j460J228
7931D16j55j022J121o10O19Q0o08R11o70N07k03j84n2q37Q3J215l52K10j4j106
$$ plain form
7787 -117 -384 -85 -117 -788 74 -595 -141 -85 -162 748 1385 270 -1573 -293 -752 80 -178 133 170 -615
7807 -615 -84 57 -161 -649 583 -199 412 788 538 211 579 -256 -471 -399 -71 52 -50 -1053 -145 476
7827 476 449 457 95 631 537 355 599 -78 -365 909 368 -325 99 188 -267 261 -161 25 -237 -132 -40 424
7849 424 -65 279 -353 -564 -68 -157 107 -30 212 -256 -227 -34 -485 -168 -45 -544 39 436 471 177 -34
7870 -34 -55 1167 689 30 -346 -402 126 -612 -406 441 198 181 -75 306 403 244 -297 316 11 460 -487
7891 -487 -813 174 -135 -390 503 -447 52 274 37 388 267 658 -165 133 -368 -510 316 -684 -49 -933
7911 -933 -159 656 141 2 -166 -508 -667 -671 -64 -321 -95 259 -445 -244 359 -188 7 648 -812 416
7931 416 261 -761 360 -250 369 449 -159 752 82 589 386 202 150 -687 -604 611 259 469 455 -651
7951f51Q87nm88P77k28N95j349Q38k62o74O12K15M33j154O2O96n68k41K75k04
7971d34J194m57n93l25N28k2k17N73l98L14O84r13o26R65j73n07M60k58J83j10
7991a32j74R93p38M16j00p48O4M33J34j75M20m29j89O02n29j73n0j13J006q84
8011c66L32P52j220L60P06q98m19m89J096p3M57j30n51M41P3J57M50j29L97j335
8031c89k99J359k77r32P79K4l68J95J17M00n81j50q6l38M96l41K36j23k05J652
8051A169j011L11k53m53k80L25P6L9q07J77R95o02Q49j089N89m81R65k84m00k47
8071d12J321n71r12N36J78j058R91Ok70J11qO9p2N4j82k70M2Q75L8J034j821J92
8093a29L03L50n0j084J119l21j38L02l12J81l23J33q91J003K10n05O21r81K0M56
$$ plain form
7951 -651 236 231 -257 520 292 887 -462 376 114 -560 52 267 700 -454 -392 304 -264 -505 -230 -434
7971 -434 760 303 -290 -615 -87 -109 -326 247 -151 163 847 -66 -692 273 100 -407 53 -205 -22 -132
7991 -132 -306 687 -51 365 265 -483 -419 14 148 -27 393 -36 -225 377 -152 -325 -375 -488 518 -366
8011 -366 -34 718 -502 -142 564 -334 -753 -1242 -146 -219 238 108 -443 -2 71 228 678 549 946 -389
8031 -389 -688 671 394 -538 241 265 -103 92 209 609 28 -122 -208 -546 -50 -391 -155 -278 -483 1169
8051 1169 158 469 216 -237 -517 -192 -116 -77 -884 -707 288 -314 535 -554 35 -446 519 235 -165 -412
8071 -412 909 338 -574 -38 140 -918 73 79 -191 -80 -88 -19 -91 -37 -219 -489 -447 428 466 1500 -321 -129
8093 -129 174 524 474 -610 509 188 50 352 40 221 -102 31 -860 143 353 -152 469 -512 -492 -36
8113c6n9k29L9L93j47l61K03J001n66l63k03J71O87N56j581L57l20J015j93N16
8133H80o46m44Q38n46k93P18n22KK60m26J0o57m8R14N52j251O21K83l05J353j048
8154B45o79O74p06K27l78L41m43O85j83l40O27K03j35L45o72Q1n28K22J297j164
8174b81K22m17Q26j414J109J15L9l71L20J10M85k84N62q00p67l20O97
$$ plain form
8113 -36 -95 -324 -285 108 -39 -400 -197 804 238 -125 -328 -157 530 1086 -495 -138 -458 557 364 880
8133 880 234 -210 628 82 -211 507 -15 -13 247 -179 -169 -826 -874 40 592 -659 -38 245 -60 1293 245
8154 245 -434 240 -466 -239 -617 -276 -719 -34 -217 -557 70 273 138 483 -189 -108 -636 -414 883 -281
8174 -281 -59 -476 350 -1064 45 160 199 -172 148 258 743 459 1021 221 -546 -866 -169
8191a69
$$ Imaginary data points
##PAGE= N=2
##DATA TABLE= (X++(I..I)), XYDATA
0@%%%%%%%%%%%%j08K16k16K16l24M32m32N40o52P60r72J188j404J620j836K131
28A159k455K808l240L673m181M741n334O030o786P600q504R497j0577J1757j3048
43f860J4449j5981J7662j9492K1493k3685K6088k8735L1651l4875L8462m2475
55b2298M6992n2110N7953o4718P2662q2125R3627j07957J26357j50944J85664
66A03103k38593L29799n28784J691895o98224k001116K495390j522126N64279
75A95623L29462j240408J020842R0331o59761M74233m05191L82234K7830l94932
85a79737K37281L4952r7556J03201k02455R2256J04599j57086M0312N1274j76406
96a49365K70715j56505j32143L17723k93328J32881J29904m06590M34427j70666
$$ plain form
0 0 0 0 0 0 0 0 0 0 0 0 0 0 -108 108 -108 108 -216 216 -216 324 -328 432 -540 648 -756 864 -972 1159
28 1159 -1296 1512 -1728 1945 -2236 2505 -2829 3201 -3585 4015 -4489 5008 -5569 6188 -6860
43 -6860 7589 -8392 9270 -10222 11271 -12414 13674 -15061 16590 -18285 20177 -22298
55 -22298 24694 -27416 30537 -34181 38481 -43644 49983 -57974 68383 -82561 103103
66 103103 -135490 194309 -334475 1357420 659196 -1341920 1153470 -368656 195623
75 195623 525085 -715323 305519 395850 -263911 210322 -194869 187365 215195 -179737
85 -179737 57544 92496 -5060 98141 -104314 -12058 92541 -64545 -24233 27041 -149365
96 -149365 121350 -35155 -167298 150425 -142903 -10022 119882 -286708 147719 -22947
106b2947j85054M00329m27532K11054J65913m32512L99018j45945j11275K98314
116A49363l22891J69957P5687k22724K25098j29736r018J44442j72091Q3200L5146
127B6433q2396Q6306l5331k5420P8965m8972j2291P0962p4130L2245N2114j16804
139d8319J09788j7615r0763J52524j22971K1419J03803j68274J36823k0559j02821
150d6965J63529j31961K7471Q0524j45005J24715m6751n9836J24378j20216M0666
161A0549N1846j08009Q7589k4310m9056P4728n7168J543L6472n7511L3019O212
173E904n2076N0997j5790m0544O4982m5597j4214O3953p4778L1144L0830p3278
185f8467O7276k4735l1666O9753o9372K9446L0481o9143P0557k6270l0003P1992
$$ plain form
106 -22947 -208001 192328 -235204 -24150 141763 -290749 108269 -37676 -148951 149363
116 149363 -173528 -3571 72116 -150608 74490 -55246 -64264 80178 -91913 -8713 26433
127 26433 -55963 30343 -4988 -30408 48557 -415 -12706 58256 -15874 16371 68485 -48319
139 -48319 61469 43854 -46909 105615 -17356 4063 107866 -60408 76415 55856 -46965
150 -46965 116564 -15397 12074 92598 -52407 72308 25557 -34279 90099 -30117 10549
161 10549 62395 -45614 41975 17665 -31391 43337 -13831 -12288 24184 -33327 -308 5904
173 5904 -46172 4825 -10965 -51509 13473 -32124 -46338 17615 -57163 -26019 4811 -68467
185 -68467 -1191 -25926 -57592 12161 -57211 -27765 2716 -66427 4130 -22140 -52143 19849
197A9849o1401J8647L9047o1525N0254k664l3244N2119l1785J239L4935m0732
209a5261K8555R843l5859M4349j3893k1978M9225l5602J042L9320m7777K7967
221B9931J2681m3975M6530k0078j6004M2717m6777K0849J6116m7609M7479k0256
233B1604k4494M8663m6842J0496K5576n0240L4908o014l1213M0039l3144R20K3603
246A3862m0097K5391m79l1514L8177k4106j2595L5136l9547J3806J6619l7922
258d3269L0934p026k2585L6261k8482L137K5866l8112L1145o36k8123M3215k7189
271b4864l556L6566l9963K3873J0600l1572L7995j6084o484L1115l0462J9058
283F222J1257k9583L5210j1568j4033L5797k8661Q193K0957l2397K4713J215k2666
$$ plain form
197 19849 -41552 -22905 16142 -45383 4871 2207 -31037 21082 -10703 -9464 25471 -15261
209 -15261 13294 23137 -12722 31627 17734 -4244 44981 9379 10421 49741 1964 29931
221 29931 42612 -1363 45167 25089 9085 51802 5025 25874 41990 -5619 41860 21604
233 21604 -2890 45773 -1069 9427 35003 -15237 19671 13657 -17556 22483 -10661 -9741 13862
246 13862 -26235 -844 -1323 -32837 5340 -18766 -31361 3775 -35772 -21966 -5347 -43269
258 -43269 -12335 -19361 -41946 -5685 -34167 -31030 -5164 -43276 -12131 -12767 -40890 2325 -24864
271 -24864 -28420 8146 -31817 -7944 2656 -28916 9079 -7005 -13489 17626 -12836 6222
283 6222 17479 -12104 23106 11538 -2495 33302 4641 12834 33791 1394 26107 27322 4656
296D656L0513j8696j233K1590k9925J9332L227k6439L1672j9445j0232L0067l3243
309A844J1423J2581l3014K6956q416j8555K8134k6064N245J2782k9512K1633o202
322a165j9573K7809k3357j732K0586k9944J4740M862k3082K3241j2097q246K0972
335f986k0752P913R335k1753K2444o472j3811K6088j9588L212J8756k4088J6269
348i433N094j8247K3330r372l299J8510j7201J1600O989j5785K0220o973n805
361c72K1780j8024N619J4334k0890J7543J859j5567K0411j0185k885J4489j6596
374A1516R974K114j4212J7022j0949m987J6830j9685O202Q926k0268J4420l633
387A3270j2799J5121j3439j964R165j6241R504j551j4087J5270j1924m077J3331
$$ plain form
296 4656 35169 16473 15240 36830 6905 26237 29464 3025 34697 15252 5020 35087 1844
309 1844 13267 25848 -7166 19790 11374 -7181 20953 -5111 134 12916 -16596 5037 -1165
322 -1165 -20738 7071 -16286 -18018 2568 -27376 -12636 -7774 -30856 -7615 -19712 -27958 -6986
335 -6986 -27738 -19825 -10490 -32243 -9799 -16271 -30082 -3994 -23582 -20370 -1614 -25702 -9433
348 -9433 -4339 -22586 744 -8628 -11927 6583 -10618 982 7971 -7814 12406 5433 -372
361 -372 21408 3384 9003 23337 2447 19990 21849 6282 26693 16508 13623 28112 11516
374 11516 21490 23604 9392 26414 15465 10478 27308 7623 13825 22751 2483 16903 13270
387 13270 471 15592 2153 189 9354 -6887 2617 1066 -13021 2249 -9675 -13752 -421
400d21j7932P660M096j6990J4611n532r228J6242j5036K050J0082j4985J2406
413a2977j743j1429J9058j2792R15J3079j7020J3849J571j3090J8667p961k934
426a2807J6557j5641J0474N257j2869J7683n834m387J6547j3821O782R208j5059
439B090J4585j941r009J6032j0345J283R915j3890J0970j91j1765J6069r112m060
453A0631J3433j6783O732N524j6771J4546p351p865J5124j5741K705O416j6673
466f073J3926p392q720J6234j6982K447Q467j7440J0814j269j2498J4086j0457
479a4857j350R572j3643Q060N83j1277J4690r140k767J2360j2590N819N867j1810
493b0483J1416j660n443J3461r826L449Q257j0739J1299r96q091J5342q123P98
$$ plain form
400 -421 -18353 -10693 -6597 -23587 -8976 -14508 -23736 -7494 -22530 -20480 -10398 -25383 -12977
413 -12977 -14720 -26149 -7091 -19883 -18968 -5889 -22909 -9060 -7489 -20579 -1912 -9873 -12807
426 -12807 3750 -11891 -1417 3840 -9029 8654 2820 -1567 14980 1159 7941 17149 2090
439 2090 16675 14734 5725 21757 11412 12695 22610 8720 19690 19499 7734 23803 14691 10631
453 10631 24064 7281 14013 19537 2766 17312 9961 2096 17220 1479 4184 10600 -6073
466 -6073 7853 461 -8259 7975 -9007 -6560 1907 -15533 -4719 -5988 -18486 -4400 -14857
479 -14857 -16207 -6635 -20278 -12218 -11635 -22912 -8222 -17362 -20129 -7769 -20359 -14540 -8673 -20483
493 -20483 -9067 -10727 -16170 -2709 -12535 -9086 -829 -11568 -269 -1265 -9356 5986 -2137 -1339
507a339Q779r960R869K196q706J2781o114o69J0158r953O250K961q279R729k956
522A4747m762Q715p273K272M180q824P003j879o450R001q405K70N092j0115M562
537H134p7q002P296n938j817N064r585M173M80q594Q286o817j955N225r019L278
553i868J227o162O381n251j917N554n643J532M240p307M947l01k833O590m201
568a3012qM930l984M469K133m969P209k193m35O647m844L272L574m392O928j741
584C584j259O455l492J843K888l031M170k49k023M420k866R89K625m058L357K9
600A3382l818L732j689r31K653l776J474l53l564J664k291j541J966l895m83J108
616C638m972K594o30m847L670m046q40J516n088K296k72m140K927k186k32J326
$$ plain form
507 -1339 7440 -2520 7349 9545 839 13620 7506 6837 16995 7042 13292 16253 7974 17703 14747
522 14747 9985 18700 11427 13699 17879 9055 16058 14179 7729 16730 8325 8595 13687 3572 8134
537 8134 8057 55 7351 1413 -404 4660 -4925 -752 -272 -8866 -580 -7397 -9352 -4127 -13146 -9868
553 -9868 -8641 -14803 -8422 -13673 -15590 -10036 -15679 -14147 -9907 -17214 -12267 -12568 -15401 -8811 -13012
568 -13012 -13020 -8090 -12074 -7605 -5472 -10441 -3232 -5425 -5860 787 -4057 -785 2789 -1603 5325 3584
584 3584 2325 8780 5288 7131 10019 6988 11158 10909 8886 13306 10440 11429 14054 9996 13353 13382
600 13382 9564 13296 11607 10676 13329 9553 11027 10674 7110 8774 6483 4942 6908 3013 2530 3638
616 3638 -1334 1260 630 -4217 -547 -4593 -5433 -3917 -9005 -6709 -6981 -11121 -8194 -10380 -10612 -9286
632i286l683J241J01j862L023j825p04L909k312R8K497k829K915J130j867L810
648e644o23M39K943q47K106O74q51L835j173M93L526k544K474K702j866K655J62
665H461j532L505j608R02J999j884J957l15j820K538k169N12J043k630R20j09
681I770k315J340j287j571J414k734Q9l05k140P06k055q66L63l333j20L53k648
698e339R56l55k608J619k469o14J473l281J157r25m85J053j558M33J710k675K602
715i306J21j236K451l5j121K692n11J291J111l89K343k59J76K554j064K175K39
732A232o41K836Q58j480L213J6q46L131j292J277J260l91M38J52m15J959k188
749I119J352M2j617J849r46k350J304k022J83M08j456K0p88j587K50k301j01M11
$$ plain form
632 -9286 -12969 -11728 -11627 -13489 -10466 -12291 -12995 -9086 -11398 -11300 -8803 -11632 -8717 -7587 -9454 -5644
648 -5644 -6267 -5828 -2885 -3732 -1626 -952 -1803 2032 859 1352 4878 2334 4808 7510 5644 8299 8461
665 8461 6929 10434 8826 9728 11727 9843 11800 11485 9665 12203 10034 10546 11589 8959 9879 9770
681 9770 7455 8795 7508 5937 7351 4617 4706 4401 2261 2967 912 46 409 -2924 -3044 -2691 -5339
698 -5339 -4383 -4738 -7346 -5727 -8196 -8810 -7337 -10618 -9461 -10386 -10871 -9818 -11376 -10943 -9233 -11908 -9306
715 -9306 -9185 -10421 -7970 -8005 -9126 -6434 -6945 -5654 -4543 -4932 -2589 -2848 -2672 -118 -1182 993 1232
732 1232 591 3427 4285 2805 6018 6034 5188 8319 7027 8304 9564 9173 9611 9763 9348 11307 9119
749 9119 10471 10513 8896 10745 9799 7449 8753 6731 6914 7322 5866 5886 5098 3511 3761 1460 1359 1770
767A770k584J327j390j727k18k325j00J632k679l08O5k176J562j227k310L162
783g526j850m33J313k606J912j21j015K630M2r93J952j546J793J480j476K183
799d261L7J128J728j841J630J614j006K713N71p67K649l07Q15O70J068q7R35K99
817G588J838j837N34J259j087N86k02n46R69p50j025J331j445m38O2j396J164
834F605r73j040m39j853j17L63k605J054l25k218J07j021q95K26j037j09m44k115
852f836J021o92j172N66r46K90M52k704L294j492j29J333q21L31R17q30J705M87
870e226j090J381r66K205O17j129K548q0NK583N13p09K401j935J897J488j254
887C249J806p40J106J511j058J707m3l46Q99k82j128J742j528O64O97k713R40
$$ plain form
767 1770 -814 513 -877 -2604 -2822 -5147 -5247 -3615 -6294 -6602 -6537 -8713 -7151 -8378 -10688 -7526
783 -7526 -9376 -9809 -8496 -11102 -9190 -9311 -10326 -7696 -7654 -8647 -6695 -8241 -6448 -4968 -6444 -4261
799 -4261 -4224 -3096 -1368 -3209 -1579 35 -971 1742 2313 1546 4195 3888 4703 5373 6441 6354 7289 7588
817 7588 9426 7589 8123 9382 8295 8881 8679 8133 9102 8352 7327 8658 7213 6775 6837 5441 6605
834 6605 5632 4592 4153 2300 2183 2546 -59 995 670 -1548 -1441 -2462 -3357 -3131 -4168 -4277 -4721 -6836
852 -6836 -5815 -6507 -7679 -7113 -8059 -7769 -7317 -10021 -6727 -8219 -8348 -7015 -7836 -7505 -6588 -7418 -5713 -5226
870 -5226 -6316 -4935 -5901 -3696 -3079 -4208 -1660 -1740 -1735 848 1361 652 3053 1118 3015 4503 3249
887 3249 5055 4315 5421 6932 5874 7581 7538 7192 8091 7809 6681 8423 6895 7559 8256 5543 6483
904F483L44j919J489j564OK74j947J072j129j850J389j743k047K591k981j01J149
921d84l081J118r52j661J058j142j000J216k239J273r76j067K015j431k74J586
937f041j274n09J243j125J117J010l30J744j291J388j60M90J957j300N14K837
953B70j256m30K525j36J292l1J96J399n65R04J588m47Q57M04k319L872j485m78
971F160K011j553J88R87q73L48o70m25O16j440J6Q18k764J107q92j605J640k739
989I30k42J005k429J08M35k106R41k082K33J70j737N02n28j205O06m22j490J701
1007e610j383O37P21k052J737l87o72J97Q01M22J531j353J363n31m95K978j427
1024c523K59K699j537J072Q02j536K850J8L46K247j501J011R26j138J533k06l9
$$ plain form
904 6483 6827 4908 6397 4833 4839 5113 3166 4238 3109 1259 2648 905 -1142 1449 -1532 -1633 -484
921 -484 -3565 -2447 -3399 -5060 -4002 -5144 -6144 -4928 -7167 -5894 -6870 -7937 -5922 -7353 -7627 -6041
937 -6041 -7315 -7824 -6581 -7706 -6589 -5579 -5909 -4165 -5456 -4068 -4228 -3738 -1781 -3081 -2567 270
953 270 -986 -1416 1109 973 2265 2234 2430 3829 3264 4168 5756 5309 6166 6570 4251 8123 6638 6160
971 6160 8171 6618 6806 7793 6920 7268 6598 6173 6789 5349 5365 6183 3419 4526 3634 2029 3669 930
989 930 688 1693 -736 -628 -193 -2299 -1358 -3440 -3207 -3037 -4774 -4272 -4800 -6005 -5399 -5821 -7311 -5610
1007 -5610 -6993 -6356 -5635 -7687 -5950 -6337 -7009 -6812 -6011 -5589 -4058 -5411 -4048 -4579 -5074 -2096 -3523
1024 -3523 -3264 -565 -2102 -1030 -228 -1764 1086 1104 1450 3697 2196 3207 4133 2995 4528 4322 4283
1041D283K371j085N20Q69j541J219m43k46N39k97j097J694k128M42j40j401R21
1058D480j770K06L95j240j14P43k256J34J69k142J670j756k53p72r00L15o22j141
1076d854J043j899Q70N04j788P04J42j897J625j80R7m1n07P96j12M58J030m92
1094d501q78K022m89N33L53j34J520R24j623J625P40l66K167r01J891o09m31J560
1112C403j02K55K005j759J101P08l59q9J300j036O24j050L00Q25j101J228q33
1129E420j237J097m12r96R84j567m60J65j361k57M75j590R55j178m99q23n83P03
1147a164j069r25J69j061j16L93j028l45K54L0K59J34j625J647j300L67N57o93
1165e516N58K08r1Q02p81Q44J619n42l41K039m47N22P46j44J309M3R00l12N43
$$ plain form
1041 4283 6654 5569 6089 6958 5417 6636 6193 5947 6486 6189 5092 6786 4658 5100 4960 3559 4480
1058 4480 2710 2916 3311 2071 1957 2700 444 578 747 -1395 275 -1481 -1734 -2506 -3406 -3091 -3713 -4854
1076 -4854 -3811 -5710 -4840 -4336 -6124 -5420 -5278 -7175 -5550 -5730 -5633 -5674 -6181 -5385 -5497 -5039 -4009 -4501
1094 -4501 -5379 -3357 -3846 -3313 -2960 -3094 -1574 -650 -2273 -648 92 -274 1893 992 2883 2274 1843 3403
1112 3403 3301 3556 5561 3802 4903 5611 5252 5163 6463 5427 6051 5001 5301 6126 5025 6253 5420
1129 5420 4183 5280 4868 3872 4856 3289 2829 2994 1633 1376 1851 261 1216 38 -461 -1284 -1867 -1164
1147 -1164 -2233 -3158 -2989 -4050 -4166 -3773 -4801 -5146 -4892 -4862 -4603 -4469 -6094 -4447 -5747 -5380 -4823 -5516
1165 -5516 -4958 -4750 -4841 -4039 -4820 -3976 -2357 -2899 -3240 -1201 -1648 -1126 -380 -524 785 828 1728 1416 1959
1184A959R41J19n27K655j756N43Q50j257Q76Q81l75K84J30j65J43K17p0mj617
1203C827O30j070N29L27j402P11j1j384O06r68j976J444p95r14K79j298J75N07
1221g83j370P6j932N18L00j654P64N38n76l79m92Q10j204P77n4lR9k44J104p82
1241d487M98M31n99J244n99R66O82j028J549J48K91m8K2Q82M08R04N28J34r3J070
1261B903l49R28L99j553J779M98r47J140k54l9m6J23j86l44j33N16k4j05N20k026
1281B800O99J86j901J085m6k370J641j384n56O00q99l55m71j093J580j331j084
1298b899P95j624P94N33j936J557n65j195L48J13p75j21O50j07J15n89J457o22
1316d071q02K347j346J227K77o34J126q8q47K339j407J284Q71j08L93L88N05J422
$$ plain form
1184 1959 2900 3019 2492 5147 3391 3934 4784 3527 4403 5284 4909 5193 5323 5158 5301 5518 5448 5444 3827
1203 3827 4457 3387 3916 4243 2841 3552 3541 2157 2763 1795 -181 1263 468 -446 -167 -1465 -1290 -783
1221 -783 -2153 -2077 -4009 -3491 -3191 -4845 -4081 -3543 -4119 -4498 -4990 -4180 -5384 -4607 -4661 -4664 -4565 -4809 -3705 -4487
1241 -4487 -3989 -3558 -4157 -2913 -3512 -2546 -1864 -2892 -1343 -1195 -904 -952 -930 -48 360 1264 1792 1926 1833 2903
1261 2903 2554 3482 3881 2328 4107 4605 3658 4798 4544 4505 4459 4582 4396 4052 3919 4435 4411 4306 4826 2800
1281 2800 3499 3685 1784 2869 2823 453 2094 710 154 754 -145 -500 -971 -2064 -484 -1815 -2899
1298 -2899 -2104 -3728 -2934 -2401 -4337 -2780 -3345 -4540 -4192 -4079 -4854 -4975 -4325 -4432 -4317 -4906 -3449 -4071
1316 -4071 -4873 -2526 -3872 -2645 -2368 -3002 -1876 -1964 -2811 -472 -1879 -595 276 168 561 949 1454 2876
1334B876j488N51J508j620K082l02n77J599j245J022P77q22O06n59p70J01k96
1351C443R13l39j50j87N19j398p14K30o91Q70n12j087P93j095J90q23j136m2m70
1370a686N02K67j812J369q40j011J296j559r1M1j557J648n62K18k23p81j95K62
1388d714J5J766j01n89O28r0N32K74l92M11Q29J0K92P89n07J289n28Q78j1J109
1408A890p59P20N46N71m90L14M3L21P89J30l61O21J1q62N2N60J78R51j903j23
1428C199O81j456L62j4q4J526j760j435K02n64Q85k98j091J51j011j07j70o31
1446a615M71n89l98p72j94M46p79q5j67N18n82o64l8P44N68j205P19J7N74N66
1466b465r28K07J036j09K11n42O69J117K0m51J051k99J030p49J28Q28K10Q04N67
$$ plain form
1334 2876 1388 1939 3447 1827 3909 3607 3030 4629 3384 4406 5183 4361 4967 4408 3638 3739 3443
1351 3443 4356 4017 3867 3680 4199 2801 2087 2317 1626 2496 1984 897 1690 595 785 -38 -1174 -1216 -1686
1370 -1686 -1184 -917 -2729 -1360 -2200 -3211 -1915 -3474 -3565 -3524 -5081 -3433 -3995 -3777 -4000 -4781 -4976 -4714
1388 -4714 -4699 -2933 -3034 -3623 -2995 -3085 -2553 -2279 -2671 -2260 -1431 -1421 -1129 -340 -847 442 -86 792 781 1890
1408 1890 1131 1851 2397 2968 2478 2792 2835 3156 3945 4075 3714 4335 4346 3484 3536 4096 4274 5225 3322 3199
1428 3199 3880 2424 2786 2772 2688 4214 2454 1019 1221 657 1542 1244 153 304 -707 -814 -984 -1615
1446 -1615 -1144 -1733 -2131 -2903 -3097 -2651 -3430 -3515 -3682 -3164 -3746 -4410 -4448 -3704 -3136 -4341 -3622 -3605 -3031 -2465
1466 -2465 -3393 -3186 -2150 -2259 -2048 -2590 -1921 -804 -784 -1235 -184 -483 547 -202 -74 754 964 1768 2335
1485B335j243O92J999o26K03n19L7L6Q51l53k41P56l41O2n53N35p23P7N43o82
1505B845k21l74j116J265o99q27O47m76m01Q02j195k85m79o10J17j194j43J089
1523a255j084p33Q81l62K16K09n25j034L99q61J002r8r25m2J40J003j78q7J877
1542a457j762M65O6n2Q38J17j55J286r61N62M72j53P27N72K69K76m8j29J114j22
1562A925O78K98O4N24n69j89p9n48J661o43K7L6m30J156m68o7j131O59m64p53
1582A687L70p29J53K49m63J90n39j622J095o48K22p98m99R12p43r1j281J37J15
1601b283L30j277M02n76N95M15j340J91M94m2m42L57M58j93O12n12k18R80J220
1620h29p55o63M61K27Q50P31L82n19L76j091J968o40J75R48p27P88K06j76J5O18
$$ plain form
1485 2335 1092 1784 3783 3157 3360 2841 2878 2914 3765 3412 3171 3927 3586 3648 3095 3630 2907 2984 3527 2845
1505 2845 2624 2250 1134 2399 1700 873 1520 1044 643 1445 250 -35 -514 -1124 -1007 -2201 -2344 -1255
1523 -1255 -2339 -3072 -2191 -2553 -2337 -2128 -2653 -3687 -3288 -4149 -3147 -3245 -4170 -4212 -4072 -3069 -3247 -3334 -1457
1542 -1457 -3219 -2754 -2688 -2740 -1902 -1785 -1940 -654 -1615 -1053 -581 -734 -7 565 834 1110 1062 933 2047 1925
1562 1925 2603 2901 2965 3489 2920 2731 2652 2104 3765 3122 3149 3185 2755 3911 3443 3376 2245 2904 2440 1687
1582 1687 2057 1328 1481 1730 1267 1457 918 -704 391 -257 -35 -833 -1332 -420 -1163 -1254 -2535 -2398 -2283
1601 -2283 -1953 -3230 -2828 -3404 -2809 -2394 -3734 -3543 -3049 -3091 -3533 -3176 -2718 -2911 -2299 -2811 -3029 -2049 -829
1620 -829 -1584 -2247 -1786 -1559 -709 22 404 -115 261 -830 1138 498 673 1621 894 1682 1888 1712 1727 2345
1640B345L68N12m47r2J012r18N39J13p40Q74q17n24J145j377K62p82M99k91K34
1659A915l56L00q56J02K33j712J60K44J39n17n30k94J59o17l19m55k92R41j172
1678b927L95m7l1l26P8m66N01L13n66N49O0l07J75m41N26J037j301J730k08M42
1698h14l3R5O42m9l31Q44m50N29l92J110Q28Qp05L46Q61j381R79j034J699j259
1718A493J623n75L62p20J209r47m06J589m13j413J026m48p7P0n00K24j545R61
1736A513j115m82J23m62j84Q45j108L77o51M5l38m88m0J02k62o82J98l64R49j194
1756c218J161q05M63r16K09j14J36N23l44J075J67n94k37K55N28K57L80j06j62
1775a342M19n6K88K304q13l56J610q80Q6L53l92l40J546m56q59J387m37j47R36
$$ plain form
1640 2345 2713 3225 2778 2686 3698 2780 3319 3432 2692 3566 2749 2225 3370 1993 2255 1473 1972 1681 1915
1659 1915 1559 1859 1003 1105 1338 -374 -214 30 169 -348 -878 -1172 -1013 -1630 -1949 -2404 -2696 -1755 -2927
1678 -2927 -2532 -2579 -2610 -2936 -2858 -3324 -2823 -2510 -3076 -2527 -2467 -2774 -2599 -3040 -2514 -1477 -2778 -1048 -1256 -814
1698 -814 -847 -752 -110 -159 -490 354 -96 433 41 1151 1979 1987 1282 1628 2489 1108 2087 1053 2752 1493
1718 1493 3116 2541 2903 2183 3392 2445 2039 3628 3215 1802 2828 2380 2303 2373 1873 2097 552 1513
1736 1513 398 -84 39 -423 -607 238 -870 -493 -1144 -1099 -1437 -1925 -1965 -1863 -2125 -2807 -2609 -2973 -2024 -3218
1756 -3218 -2057 -2862 -2399 -3315 -3106 -3220 -3084 -2561 -2905 -1830 -1663 -2257 -2494 -2239 -1711 -1454 -1074 -1180 -1342
1775 -1342 -923 -979 -691 1613 800 444 2054 1174 1260 1613 1221 881 2427 1971 1112 2499 2062 1915 2851
1794B851n01M83n38Q40q1r66O79m49m69m49M58Pj52K0j83o70J10n87L2J101j554
1815a8o35O66n28k88j24l38l15L2j81l20K91O13j061P07m29m06r41J288m11n28
1835b926m77J600l17j03L4n12N16L35Q25q80P12M07q90O37P36l96R15J54o91N43
1855B22o31Q83J176p58O93K34p06M11K41O16k66j17N12m84J25P53m77p08J162
1874B881o14n3o7k51j76k59k66K65L56l77p4J4K20j395L46J0j225N24P7r48n31
1895a543k08N67K29q77Q9r6J6p75J67j57J55P2r48K57P0O07L16k85K16j99M16
1916a911M54l81O89n20L91J26m24J210O27j455J181p03J133J48m99P17K32N44
1934A559q5l76o67J185p21J040k02m01O95K66j386J683n83J131j730O07J49j62
$$ plain form
1794 2851 2350 2833 2295 3135 3054 2088 2767 2318 1849 1400 1858 1865 1713 1733 1550 880 990 403 435 1536 -18
1815 -18 -653 13 -515 -803 -927 -1265 -1580 -1548 -1729 -2049 -1758 -1145 -2206 -1499 -1928 -2334 -3275 -1987 -2398 -2926
1835 -2926 -3403 -1803 -2120 -2223 -2189 -2701 -2185 -1850 -1025 -1905 -1193 -786 -1676 -1039 -303 -699 216 370 -321 222
1855 222 -409 474 1650 892 1585 1819 1113 1524 1765 2381 2115 1998 2510 2026 2151 2904 2427 1719 2881
1874 2881 2267 2214 2147 1896 1720 1461 1195 1460 1816 1439 1365 1379 1599 204 550 560 -665 -141 -64 -1012 -1543
1895 -1543 -1751 -1184 -955 -1832 -1743 -1839 -1823 -2598 -2431 -2588 -2433 -2361 -3309 -3052 -2982 -2375 -2059 -2344 -2128 -2327 -1911
1916 -1911 -1457 -1838 -1149 -1669 -1278 -1152 -1576 -366 261 -1194 -13 -716 417 565 66 783 1015 1559
1934 1559 1474 1098 431 1616 895 1935 1733 1332 2027 2293 907 2590 2007 3138 1408 2015 2164 2002
1952B002N14m58p39J59k65L79P0K36j594M26J89O0q30k70J17p40J480p00p56j371
1972b091J195j34p68L20k45k72l65M63o45P90k99m17Q62j558O89K07n95J536j27
1991a454p7j55M10k40k28J6J584m16K97K74R22j028k37K86L15J10O00k06o23J083
2011A233q41M51L12O20k39M04J371j306n55N68l1k55J38J15r4N12k18n78Q74j643
2031H38O62P2nq65K07j72n83J58n74O66o53k15M22m57k16n00k77N72p47l88O59
2052a396l51q97J427q59M71j35j015O66L00O68m99n91J46m93k21J723%n2m17P63
2072g62M1o05Q5J025o93O06J337l02M19p48k6J62O4M84J103o13j34j45N02J55
2092A955J89o75l2J801j837K04N98n59L62q7j62j64j2J52p80N74P7J24r71n61
$$ plain form
1952 2002 2516 2058 1319 1478 1213 1592 1662 1898 304 730 919 979 149 -121 -4 -744 736 36 -720 -2091
1972 -2091 -896 -1030 -1798 -1478 -1723 -1995 -2360 -1897 -2542 -1752 -2051 -2468 -1606 -3164 -2475 -2268 -2863 -1327 -1454
1991 -1454 -1531 -1686 -1276 -1516 -1744 -1728 -144 -560 -263 11 933 -95 -332 -46 269 379 979 773 150 1233
2011 1233 392 843 1155 1775 1536 1940 3311 2005 1450 2018 1987 1732 1870 1985 1891 2403 2185 1607 2481 838
2031 838 1500 1572 1567 702 909 737 154 312 -262 404 -249 -464 -42 -499 -715 -1215 -1492 -920 -1667 -2055 -1396
2052 -1396 -1747 -2644 -1217 -2076 -1605 -1740 -2755 -2089 -1789 -1121 -1620 -2211 -2065 -2558 -2779 -1056 -1056 -1108 -1525 -762
2072 -762 -721 -1326 -1241 -216 -909 -303 1034 732 1151 403 377 539 603 1087 2190 1577 1443 1298 1800 1955
2092 1955 2144 1469 1437 3238 1401 1605 2203 1644 2006 1919 1757 1593 1581 1733 953 1527 1604 1728 757 196
2112A96l86M70j050J294p83J92l11q42K73o0J47q12O21N39j032N38r96O71r0n06
2132a927O1oR66o96m96K69L71j7L89j362J165m07Q92J61n72p06N74J005Q95n60
$$ plain form
2112 196 -190 280 -770 524 -259 -67 -378 -1220 -947 -1007 -860 -1672 -1051 -512 -1544 -1006 -2002 -1331 -1421 -1927
2132 -1927 -1866 -1872 -906 -1602 -2098 -1829 -1458 -1475 -1086 -2448 -1283 -1690 -798 -637 -1209 -1915 -1341 -336 559 -1
$$ [...]
8191B23
##END NTUPLES=NMR FID
##END=
