##TITLE=1H_UK-8
 CDCl3, 108 sc, 
 30.7.2020
##JCAMPDX= 6.0         $$ Bruker NMR JCAMP-DX V2.0
##DATA TYPE= NMR FID
##DATA CLASS= NTUPLES
##ORIGIN= UXNMR, Bruker Analytische Messtechnik GmbH
##OWNER= root
$$ XWIN-NMR		Version 3.5
$$ Thu Jul 30 12:21:03 2020 Russian Standard Time (UT+4h)  she@DPX200
##.OBSERVE FREQUENCY= 200.1315
##.OBSERVE NUCLEUS= ^1H
##.DELAY= (6, 6)
##.ACQUISITION MODE= SIMULTANEOUS
##.ACQUISITION SCHEME= undefined
##.AVERAGES= 108
##.DIGITISER RES= 18
##SPECTROMETER/DATA SYSTEM= spect
##.PULSE SEQUENCE= zg30
##.SOLVENT NAME= D2O
##.SHIFT REFERENCE= (INTERNAL, D2O, 0, 15.7039)
##AUDIT TRAIL= $$ (NUMBER, WHEN, WHO, WHERE, WHAT)
$$ ##TITLE= Audit trail, XWIN-NMR		Version 3.5
$$ ##JCAMPDX= 5.01
$$ ##ORIGIN= Bruker BioSpin GmbH
$$ ##OWNER= she
$$ F:/spectra/data/she/nmr/H-F/1/audita.txt
$$ ##AUDIT TRAIL=  $$ (NUMBER, WHEN, WHO, WHERE, WHAT)
(   1,<2020-07-30 12:17:37.51 +0400>,<she>,<DPX200>,
      <continue with go, POWCHK disabled, PULCHK disabled
       configuration hash MD5:
       00 E9 B6 7A A2 85 ED C7 34 08 36 98 17 FE 4E 26
       data hash MD5: 16K
       6F 17 4B 9A 00 2C 72 99 57 AF 6B 81 10 92 02 03>)
$$ ##END=
$$ 
$$ hash MD5
$$ 03 AE A4 28 56 18 FE EA 1D 69 B6 B0 98 40 14 E8
##$RELAX= 
##$RELAX= 
##$RELAX= 
##$RELAX= 
##$RELAX= 
##$RELAX= 
$$ Bruker specific parameters
$$ --------------------------
##$DU= <F:/spectra>
##$EXPNO= 1
##$NAME= <H-F>
##$PROCNO= 1
##$TYPE= <nmr>
##$USER= <she>
##$AMP= (0..31)
100 100 100 100 100 100 100 100 100 100 100 100 100 100 100 100 100 100 
100 100 100 100 100 100 100 100 100 100 100 100 100 100 
##$AQSEQ= 0
##$AQ_mod= 1
##$AUNM= <au_zg>
##$AUTOPOS= <>
##$BF1= 200.13
##$BF2= 200.13
##$BF3= 200.13
##$BF4= 200.13
##$BF5= 200.13
##$BF6= 200.13
##$BF7= 200.13
##$BF8= 200.13
##$BYTORDA= 1
##$CFDGTYP= 0
##$CFRGTYP= 5
##$CHEMSTR= <none>
##$CNST= (0..31)
1 1 145 1 1 1 1 1 1 1 1 1 1 1 1 1 1 1 1 1 1 1 1 1 1 1 1 1 1 1 1 1 
##$CPDPRG= <>
##$CPDPRG1= <>
##$CPDPRG2= <>
##$CPDPRG3= <>
##$CPDPRG4= <mlev>
##$CPDPRG5= <mlev>
##$CPDPRG6= <mlev>
##$CPDPRG7= <mlev>
##$CPDPRG8= <mlev>
##$CPDPRGB= <>
##$CPDPRGT= <>
##$D= (0..31)
0 1.2 0 0 0 0 0 0 0 0.06 0 0.03 0 0 0 0 0.0002 0 0 0 0 0 0 0 0 0 0 0 0 
0 0 0 
##$DATE= 1596096717
##$DBL= (0..7)
120 120 120 120 120 120 120 120 
##$DBP= (0..7)
150 150 150 150 150 150 150 150 
##$DBP07= 0
##$DBPNAM0= <>
##$DBPNAM1= <>
##$DBPNAM2= <>
##$DBPNAM3= <>
##$DBPNAM4= <>
##$DBPNAM5= <>
##$DBPNAM6= <>
##$DBPNAM7= <>
##$DBPOAL= (0..7)
0.5 0.5 0.5 0.5 0.5 0.5 0.5 0.5 
##$DBPOFFS= (0..7)
0 0 0 0 0 0 0 0 
##$DE= 6
##$DECBNUC= <off>
##$DECIM= 24
##$DECNUC= <off>
##$DECSTAT= 4
##$DIGMOD= 1
##$DIGTYP= 9
##$DL= (0..7)
0 120 120 120 120 120 120 120 
##$DP= (0..7)
150 150 150 150 150 150 150 150 
##$DP07= 0
##$DPNAME0= <>
##$DPNAME1= <>
##$DPNAME2= <>
##$DPNAME3= <>
##$DPNAME4= <>
##$DPNAME5= <>
##$DPNAME6= <>
##$DPNAME7= <>
##$DPOAL= (0..7)
0.5 0.5 0.5 0.5 0.5 0.5 0.5 0.5 
##$DPOFFS= (0..7)
0 0 0 0 0 0 0 0 
##$DQDMODE= 0
##$DR= 18
##$DS= 0
##$DSLIST= <SSSSSSSSSSSSSSS>
$$ [...]
##$SUBNAM2= <"">
##$SUBNAM3= <"">
##$SUBNAM4= <"">
##$SUBNAM5= <"">
##$SUBNAM6= <"">
##$SUBNAM7= <"">
##$SUBNAM8= <"">
##$SUBNAM9= <"">
##$SW= 24.9337058887773
##$SWIBOX= (0..15)
0 0 2 0 0 0 0 0 0 0 0 0 0 0 0 0 
##$SW_h= 4990.01996007984
##$TD= 16384
##$TD0= 1
##$TE= 0
##$TE2= 300
##$TE3= 300
##$TEG= 300
##$TL= (0..7)
0 120 120 120 120 120 120 120 
##$TP= (0..7)
150 150 150 150 150 150 150 150 
##$TP07= 0
##$TPNAME0= <>
##$TPNAME1= <>
##$TPNAME2= <>
##$TPNAME3= <>
##$TPNAME4= <>
##$TPNAME5= <>
##$TPNAME6= <>
##$TPNAME7= <>
##$TPOAL= (0..7)
0.5 0.5 0.5 0.5 0.5 0.5 0.5 0.5 
##$TPOFFS= (0..7)
0 0 0 0 0 0 0 0 
##$TUNHIN= 0
##$TUNHOUT= 0
##$TUNXOUT= 0
##$USERA1= <user>
##$USERA2= <user>
##$USERA3= <user>
##$USERA4= <user>
##$USERA5= <user>
##$V9= 5
##$VALIST= <valist>
##$VCLIST= <CCCCCCCCCCCCCCC>
##$VD= 0
##$VDLIST= <DDDDDDDDDDDDDDD>
##$VPLIST= <PPPPPPPPPPPPPPP>
##$VTLIST= <TTTTTTTTTTTTTTT>
##$WBST= 1024
##$WBSW= 4
##$XGAIN= (0..3)
0 0 0 0 
##$XL= 0
##$YL= 0
##$YMAX_a= 714576
##$YMIN_a= -491387
##$ZGOPTNS= <>
##$ZL1= 120
##$ZL2= 120
##$ZL3= 120
##$ZL4= 120
##$ABSF1= 10
##$ABSF2= 0
##$ABSG= 5
##$ABSL= 3
##$ALPHA= 0
##$AQORDER= 0
##$ASSFAC= 0
##$ASSFACI= 0
##$ASSFACX= 0
##$ASSWID= 0
##$AUNMP= <proc_1d>
##$AZFE= 0.1
##$AZFW= 0.1
##$BCFW= 1
##$BC_mod= 2
##$BYTORDP= 1
##$COROFFS= 0
##$CY= 11.3945322036743
##$DATMOD= 1
##$DC= 2
##$DFILT= <>
##$DTYPP= 0
##$F1P= 16.9975609425685
##$F2P= -3.02152046262296
##$FCOR= 0.5
##$FTSIZE= 0
##$FT_mod= 4
##$GAMMA= 1
##$GB= 0.15
##$INTBC= 1
##$INTSCL= 1
##$ISEN= 128
##$LB= 0.24
##$LEV0= 0
##$LPBIN= 0
##$MAXI= 10000
##$MC2= 0
##$MEAN= 0
##$ME_mod= 0
##$MI= 1.114404
##$NCOEF= 0
##$NC_proc= 0
##$NLEV= 6
##$NOISF1= 3.799351
##$NOISF2= 2.8
##$NSP= 1
##$NTH_PI= 0
##$NZP= 0
##$OFFSET= 15.70392
##$PC= 1
##$PHC0= -9800.29
##$PHC1= 22.20091
##$PH_mod= 1
##$PKNL= yes
##$PPARMOD= 0
##$PSCAL= 0
##$PSIGN= 0
##$REVERSE= no
##$SF= 200.130013532006
##$SI= 16384
##$SIGF1= 3
##$SIGF2= 2
##$SINO= 400
##$SIOLD= 16384
##$SREGLST= <1H.CDCl3>
##$SSB= 0
##$STSI= 0
##$STSR= 0
##$SW_p= 3612.71676300578
##$SYMM= 0
##$S_DEV= 0
##$TDeff= 0
##$TDoff= 0
##$TI= <>
##$TILT= no
##$TM1= 0
##$TM2= 0
##$TOPLEV= 0
##$USERP1= <user>
##$USERP2= <user>
##$USERP3= <user>
##$USERP4= <user>
##$USERP5= <user>
##$WDW= 1
##$XDIM= 8192
##$YMAX_p= 0
##$YMIN_p= 0
$$ End of Bruker specific parameters
$$ ---------------------------------
##NTUPLES= NMR FID
##VAR_NAME=  TIME,          FID/REAL,        FID/IMAG
##SYMBOL=    X,             R,               I
##VAR_TYPE=  INDEPENDENT,   DEPENDENT,       DEPENDENT
##VAR_FORM=  AFFN,          ASDF,            ASDF
##VAR_DIM=   8192,          8192,            8192
##UNITS=     SECONDS,       ARBITRARY UNITS, ARBITRARY UNITS
##FACTOR=    0.0002004,     1,               1
##FIRST=     0,             0,               0
##LAST=      1.6414764,     0,               0
##MIN=       0,             -491387,         0
##MAX=       1.6414764,     714576,          0
$$ Real data points
##PAGE= N=1
##DATA TABLE= (X++(R..R)), XYDATA
$$ [...]
2909a179k12J914L21k087j84J904P82n81p35M0J012j22r33J312k22J49P89K58
2927B226k8P94j168P26M37k57j095J346j29m17m44P42R39lp51J024q94m86r2J029
2947C499Q97q8p71l30R98n15r81L02p9K50n12r65J408j130j94k8J107l4m03p50
2967A681l27m13l03K27J488j030j074j73R22j740O92p9k61J00n27p35O17O14K5
2986b96r21K85j170r87K17K221j681Q31p05K03k006J223k34M08O77o00j44l74
3004c053m17L7k41J267o7j365J262M0r86L89M51Q76j079R55n13m94L14j90j57
3023b971R09k53j208J402M33k22O16L50Q6p85K77J422j428J458j904k72R92J053
3041d5j026L76J037r87J345o44J554p03q80N14J197p29p86M57K320j289m00J384
$$ plain form
2909 -1179 -1391 523 844 -1243 -1427 477 1259 678 -57 -17 995 873 -60 1252 1030 1179 1968 2226
2927 2226 2198 2992 1824 2550 2987 2730 1635 2981 2852 2435 1991 2733 3672 3669 2918 3942 3048 2562 2470 3499
2947 3499 4396 4308 3537 3207 4205 3690 2709 3011 2932 3182 2670 1705 3113 1983 1789 1761 2868 2834 2431 1681
2967 1681 1354 941 638 865 2353 1323 249 76 998 -742 -50 -129 -390 -290 -817 -1552 -935 -321 -296
2986 -296 -1217 -932 -2102 -3089 -2872 -651 -2332 -1501 -2206 -2003 -4009 -2786 -3020 -2612 -1935 -2535 -2679 -3053
3004 -3053 -3470 -3433 -3674 -2407 -2474 -3839 -2577 -2537 -3523 -3134 -2683 -1807 -2886 -1931 -2444 -2938 -2624 -2814 -2971
3023 -2971 -2062 -2315 -3523 -2121 -1688 -1910 -1294 -944 -858 -1643 -1366 56 -1372 86 -1818 -2090 -1098 -45
3041 -45 -1071 -695 342 -645 700 56 1610 907 27 541 1738 1009 223 680 3000 1711 1311 2695
3059B695o88n32j47P34J762j731k58J286L14m60j216Q79j9n32J07J505m82l24
3077B893m18N01Q67q84j69j530K293j71r17k81K07L75q04J5R5Ko29p66J28R44
3097A751p22J4J461j617o37Q49n25K58n67M20K50J17j794m00O82N03J29j728R71
3116e85m28J49j028L91L29r57n78N46J88o77K74J61R96m72j319P80P73j495l24
3135c276N44J402k668J251R75j262j205J290M14P61p61m27O38P54j1j323J104
3152a800q18o58J678p48J363j04r39M4J591n39r63J460j299J038p38R16P92j209
3170i33O58J787j094l86M64p49J501J10k05k95J124j46j039P42k31O84m02l19
3188A271Q99O7p38m5J058O58n00k59M91j902J270l72J332j077N63k60P23m11r89
$$ plain form
3059 2695 2007 1475 1328 2062 3824 2093 1835 3121 3435 2975 1759 2638 2619 2087 2194 3699 3217 2893
3077 2893 2475 2976 3843 2959 2790 1260 3553 3382 2465 2184 2391 2766 1962 1977 2072 2074 1445 679 807 1751
3097 1751 1029 1043 2504 887 250 1099 574 832 265 685 935 1052 -742 -1142 -460 43 172 -1556 -585
3116 -585 -1013 -864 -1892 -1501 -1172 -2129 -2707 -2161 -1973 -2650 -2376 -2215 -1219 -1691 -3010 -2230 -1457 -2952 -3276
3135 -3276 -2732 -1330 -3998 -2747 -1772 -3034 -4239 -2949 -2535 -1774 -2535 -2962 -2324 -1570 -1581 -2904 -1800
3152 -1800 -2618 -3276 -1598 -2346 -983 -1087 -2026 -1982 -391 -930 -1893 -433 -1732 -694 -1432 -516 276 -933
3170 -933 -275 1512 418 32 496 -253 1248 1358 1153 858 1982 1836 797 1539 1308 1992 1590 1271
3188 1271 2170 2237 1499 1454 2512 3170 2670 2411 2902 1000 2270 1898 3230 2153 2716 2456 3179 2768 1779
3207A779J312l47p51l47P34O25N29j711O70p29L32j052P95m96J553j224L06m25
3225A553k61o39J432r35j162J185Q39j074j768O75J658o22m28o11j47J401k555
3242a459Q51m7J236k159m9M55K55j349m60N58L36kn99K30m8j1m33N97r05R74j371
3263c400O06J129m40o48l49J421l62l40l80K62J24j401M05R84M21p93M34M77l65
3282b215M41j720J949q96L43L64jK66p66J576J29m29L94k30Q47N60j605O52K72
3301f9m24n16J550J38L76j54L00k6R0q58O68O83J150k467M64J42M17J378j292
3320A550K83Q81l50O9l1Q06j145P00j21n84Q41j40N7O83o60j231m36P59P73n64
3340B140P63j99N09j534Q55M80q00j63k65P2n69N07l19K43J150k225J071j41j103
$$ plain form
3207 1779 3091 2744 1993 1646 2380 3005 3534 1823 2493 1764 2096 1044 1839 1343 2896 1672 1978 1553
3225 1553 1292 653 2085 1150 -12 1173 2012 938 -830 -155 1503 881 453 -158 -305 1096 -1459
3242 -1459 -608 -655 581 -1578 -1627 -1172 -917 -2266 -2726 -2168 -1832 -1834 -2433 -2203 -2251 -2262 -2695 -2098 -3003 -2029 -3400
3263 -3400 -2794 -1665 -2105 -2753 -3102 -1681 -2043 -2383 -2763 -2501 -2377 -3778 -3373 -2389 -1968 -2761 -2327 -1850 -2215
3282 -2215 -1774 -3494 -1545 -2441 -2098 -1734 -1735 -1469 -2235 -659 -530 -959 -565 -795 52 612 -993 -341 -69
3301 -69 -493 -1009 541 679 1055 901 1201 1175 1265 407 1075 1758 2908 441 905 1047 1464 2842 1550
3320 1550 1833 2714 2364 2433 2402 3208 2063 2763 2642 2058 2899 2759 2816 3499 2839 1608 1172 1931 2704 2140
3340 2140 2903 2704 3213 1679 2534 3014 2214 2051 1786 1858 1289 1796 1477 1720 2870 645 1716 1575 472
3359D72J80K51N3K38o97r03k41J310j801K323k491J312q58%O17K13j720J116l20
3378i46j8n08m68M04J54l16M79o74n33P92J11n10k10J9l95K61R7N88j288L14n22
3399c169M90k6L80K10j174J072j18j229j16K128l70N94j476J298m75Q06O4m77
3417a588l28Q07q75J025J94q60k21J290M22m45L99J81N52r43M35k29O58p71K16
3436h1M78m90J86N04l11J359Ll99L83Q65j683P30l4m38Q14o76o50J856Q7j117
3456A386J311J09l42K8j125M45R02n27j59J092j73l21j589J599l20l65J9Q33o49
3475B154m24M03L68p00j101k37K406j275n04J04J6jq50M0O20l25l06m14R89j093
3495a30l96O14n7p06M59q75K410j448l64r27L72P99m94j036QQ16j005R32j897
$$ plain form
3359 472 652 903 956 1194 497 -406 -647 663 -1138 1185 -1306 6 -852 -852 -235 -22 -1742 -626 -946
3378 -946 -964 -1472 -1940 -1536 -1382 -1698 -1219 -1893 -2426 -1634 -1523 -2033 -2243 -2224 -2619 -2358 -2261 -1673 -2961 -2647 -3169
3399 -3169 -2679 -2705 -2325 -2115 -3289 -2217 -2335 -3564 -3680 -1552 -1922 -1328 -2804 -1506 -1981 -1175 -1111 -1588
3417 -1588 -1916 -1109 -1984 -959 -765 -1625 -1846 -556 -134 -579 -180 1 553 -390 45 -184 474 -297 -81
3436 -81 397 -93 93 597 286 1645 1648 1249 1632 2497 814 1544 1510 1072 1886 1210 560 2416 2503 1386
3456 1386 2697 2806 2464 2492 1367 1812 2714 2187 2028 3120 2947 2626 1037 2636 2316 1951 1970 2803 2154
3475 2154 1730 2133 2501 1801 700 463 2869 1594 1090 1194 1210 1209 359 399 1019 694 388 -26 963 -130
3495 -130 -526 88 31 -675 -216 -1091 1319 -129 -493 -1420 -1048 -249 -743 -1779 -1771 -955 -1960 -1028 -2925
3514b925J951o56o60R08l55j286J221n00K26l82j687K279r95J166j462K105j931
3531b983P37j70m85R57l21l84M47M43J92M55j534Q97Q33j102K101j707M75K09
3549i40L32k59p59k71J280J312j196J44N71m42o42N22k74j09J556j034J022J1
3567H24J41M50Po1j31j58j362K106M45j075P62j62k36R0k05O17m76M59k65J133
3587B903k311J797l24L84l76L38k46L66p39J43N1m73O07N43r66R20j149P29J7
3606B214m37o15M27k01o8q94Q53l0k47K21o98K60P46j676M71N10J8n07j60l33
3626a46K30j103M72m96M36p52J15J206q82k26k29P00j150n2J529r23N31j009N3
3645a696o65J375k98r10P34o31l26p08J530M5n23L09M75l28o70m40j17J654o91
$$ plain form
3514 -2925 -974 -1630 -2290 -1382 -1737 -3023 -1802 -2302 -2076 -2458 -4145 -1866 -2861 -1695 -3157 -1052 -2983
3531 -2983 -2246 -2416 -2901 -1944 -2265 -2649 -2202 -1759 -1567 -1112 -2646 -1749 -916 -2018 83 -1624 -1149 -940
3549 -940 -608 -867 -1626 -1897 -617 695 -501 -357 214 -228 -870 -348 -622 -731 825 -209 813 824
3567 824 965 1415 1422 1361 1230 1072 -290 1816 2261 1186 1948 1786 1550 1640 1435 2052 1576 2035 1770 2903
3587 2903 592 2389 2065 2449 2073 2411 2165 2531 1792 1935 1986 1513 2120 2663 1697 2617 1468 2197 2214
3606 2214 1777 1162 1589 1388 1320 426 1279 1249 1002 1223 525 785 1531 -145 326 836 854 347 187 -146
3626 -146 84 -1019 -547 -1043 -607 -1359 -1244 -38 -920 -1146 -1375 -675 -1825 -1877 -348 -1271 -740 -1749 -1696
3645 -1696 -2361 -986 -1284 -2194 -1460 -2091 -2417 -3125 -1595 -1550 -2073 -1764 -1289 -1617 -2287 -2727 -2844 -1190 -1881
3664a881j050M76Q64o63K89q4J88N32m68N32r5J147j520M52m93R89l30P23j93
3683e85l15j80Q45O98j175O58K93K23m58M48P20p59O56l49P90o82m70J114j110
3702C62j13L20L38L21L2J320n38p68J498r9j390O8L68L16L44j296j19P96J28Q83
3722B771j074J017j233K29N87K6o04n54r8O32o35j1K97k03q54L15l09J151K02
3741A652J86j323L78l34m68k50N31j61q8O98j416J558j432M88o64N20K68O2k33
3760b8k079O10K119k312P67m70M36N02j39q51J622j535P42M80r98j201M91J233
3778f11p92j34j137Q79M41m59L07M77j596J538j517P01k29r9j13J994j205o13
3796b168n99K032L85q82n89l26K114o14K64M83k15j383M18K32O88O31p27j42K04
$$ plain form
3664 -1881 -2931 -2455 -1591 -2254 -1965 -2049 -1861 -1329 -1797 -1265 -1360 -213 -1733 -1281 -1774 -785 -1115 -392 -585
3683 -585 -900 -1080 -235 463 -712 -54 239 462 4 452 1172 413 1069 720 1510 828 358 1472 362
3702 362 249 569 907 1228 1260 2580 2042 1274 2772 2673 1283 1351 1719 2035 2379 1083 964 1760 1888 2771
3722 2771 1697 2714 1481 1710 2297 2323 1719 1165 1067 1699 1064 1053 1350 1147 293 608 299 1450 1652
3741 1652 1838 515 893 559 91 -159 372 211 123 821 -595 963 -469 19 -645 -125 143 205 -28
3760 -28 -2107 -1497 622 -1690 -923 -1393 -957 -455 -594 -1445 177 -1358 -616 -136 -1134 -2335 -1844 -611
3778 -611 -1403 -1537 -2674 -1795 -1354 -1813 -1506 -1029 -2625 -1087 -2604 -1903 -2132 -2231 -2344 -350 -1555 -2168
3796 -2168 -2767 -735 -350 -1232 -1821 -2147 -33 -647 -383 100 -115 -1498 -1080 -848 -160 471 -256 -398 -194
3815a94M89j178O64J656j768P3J136k54R59j024n49J038j8j23r76J748j028O29
3833A280m78J235j61q18j03J608j408K24j571J997m75R41j123k28Q11o30R15n10
3851A506M32M20m37Q30r16o72Q71m25p0q61R70m61j33m00k53J082O89p56n23J46
3871A039l6K08j174J027k83Q51j593J002j162P11j747J177J618k741J424j181
3887h60Q16n08o6O50l60j087L85p40J79L55R78r04Q81j390J0l04K13P91l90l93
3907a744J06Q42j745k73P99J237K76j663M77K85L83J75j443P52N29o85J89m0Q82
3926f61q54L45k80J12J094p45m13k02J064O00k93p32J172k4o34L23o91P52J511
3945A444j175m59k02J597k89N13k600R03L56P95m58R46q71J776n22L55n84l25
$$ plain form
3815 -194 295 -883 -219 1437 -331 -258 878 624 1583 559 10 1048 1030 907 -69 1679 651 1280
3833 1280 802 2037 1876 1058 955 2563 1155 1379 -192 1805 1330 2271 1148 920 1731 1101 2016 1506
3851 1506 1938 2358 1921 2751 1835 1163 2034 1609 1539 678 1648 1187 1054 654 401 1483 2172 1416 893 1039
3871 1039 1003 1211 37 1064 781 1632 39 1041 -121 590 -1157 20 1638 -1103 321 -860
3887 -860 -44 -552 -618 32 -328 -1415 -1030 -1770 -1591 -1236 -258 -1162 -281 -1671 -1661 -1965 -1752 -961 -1351 -1744
3907 -1744 -1638 -796 -2541 -2814 -2015 -778 -502 -2165 -1688 -1403 -1020 -845 -2288 -1536 -1007 -1692 -1503 -1543 -661
3926 -661 -1515 -1170 -1450 -1338 -244 -989 -1402 -1604 -540 60 -233 -965 207 183 -451 -128 -819 -67 1444
3945 1444 269 -190 -392 1205 916 1429 -1171 -268 88 883 425 1371 500 2276 1754 2109 1525 1200
3963A200m68Q50p39J436p56m62r2N12o34K34J7K58O61r96p7l22J571l64k17p21
3983H91J220o61K84n07M27k36l60K85M80r71J46J34R75o38k86O95o72j806J377
4002G77M06L94q78l88J7J11M18j702J542o37P81p35j786R55MJ187l06q01p17Q37
4022e21k47L11K30j473J400m91K50r98K2M42p90L58P95q0q26L7j053K23K34nl1
4043b213J35N6k06J002J39j023N53n17R39M42n03o34K05J189l52q28j54J402l07
4062f75k86M54q70R25k59J71j22O06n3j59k85k35R58r08P21P01m60j333K276j215
4082d8K63K2o53J589o87M0J477j63j006Q19M64q13m48O05O43p03l9L84o84J05
4102A167J6j52P76l90n42Q09p9q7%j49L83j001R3M1R83j284P25J03J9Q7q40Q01
$$ plain form
3963 1200 732 1582 843 2279 1523 1061 969 1481 847 1081 1098 1356 2017 1021 944 622 2193 1829 1612 891
3983 891 2111 1450 1734 1227 1654 1418 1058 1343 1823 852 998 1132 2107 1469 1183 1878 1206 -600 777
4002 777 1183 1577 699 311 328 439 857 -845 697 60 841 106 -1680 -725 -721 466 160 -641 -1358 -521
4022 -521 -768 -457 -227 -1700 -300 -791 -541 -1539 -1517 -1075 -1865 -1507 -712 -792 -1618 -1581 -2634 -2411 -2177 -2182 -2213
4043 -2213 -2078 -2022 -2228 -1226 -1087 -2110 -1557 -2074 -1135 -693 -1196 -1830 -1625 -436 -788 -1616 -1770 -368 -675
4062 -675 -961 -507 -1377 -452 -711 -540 -662 -56 -109 -268 -553 -788 170 -738 -17 684 224 -1109 1167 -48
4082 -48 215 237 -416 1173 486 526 2003 1840 834 1653 2117 1304 856 1461 2104 1401 1362 1746 1062 1167
4102 1167 1183 1031 1807 1417 875 1684 1605 1518 1518 1369 1752 751 844 885 1868 584 1309 1412 1431 1518 678 1479
4124A479M70j683P65r85R81j173J63j8o11K37P97N3K61j033K93l79o46M12K38
4143c79l02P49j34j94m20m9n27J033k98k13k08n60J098qj083P91L10q22p26p25
4163b667J284j25n30J721j544JL00j82l24J9J227j171M73J062o70j94j604J736
4181a188N91p53J2J22r8R3J39K56k78O28k56Q25j208q05J645j161J754m27J63
4200E4m57l50M51K72l09N95n48l36J248M21L09q11K75K95j280p74L112j788m73
4219i4L77M84L72p0o12J454K27j132L70j26n31m08J96N78J099p01n65N4n20R21
4239A373o33J211l78q90N73o92J493p54M5l41M28J07j296J475p6j753m04J288
4257G76r25R48J76j11N7l67k85m70J57k58K49o67J449n62P81j780Q85l63K27K54
$$ plain form
4124 1479 1949 266 1031 46 1027 -146 17 -1 -612 -375 422 475 736 -297 -4 -383 -1029 -617 -379
4143 -379 -681 68 -66 -260 -680 -729 -1256 -223 -521 -734 -942 -1502 -404 -412 -1495 -704 -394 -1216 -1942 -2667
4163 -2667 -1383 -1508 -2038 -317 -1861 -1860 -1560 -1742 -2066 -2047 -820 -1991 -1518 -456 -1126 -1320 -2924 -1188
4181 -1188 -597 -1350 -1338 -1216 -1314 -1221 -1082 -826 -1104 -476 -732 93 -1115 -1920 -275 -1436 318 -109 54
4200 54 -403 -753 -302 -30 -339 256 -292 -628 620 1041 1350 539 814 1109 -171 -945 2167 379 -94
4219 -94 283 767 1139 1069 457 1911 2138 1006 1376 1250 719 311 507 1085 2184 1483 918 972 452 1373
4239 1373 740 1951 1573 683 1256 564 2057 1303 1348 1007 1435 1542 246 1721 1645 -108 -512 776
4257 776 -149 799 975 864 921 554 269 -201 -44 -302 -53 -720 729 167 948 -832 53 -310 -83 171
4277A71n08j297J379M05p38M67q60O25r21J093j546j31J429o33P73q27K99l93
4295a213K11J51n37j092J229q4k43O4K74N38o2n24N68o16P7j271O69J324j229
4314a766R08nM48j506P42j34l63M20n83J023N17P3j97j56O18j25j293J037J481
4333A139r31j84j147K367q75L51m39n35J126K28J80M36j036n83K83J195p09J590
4351B456j127J03M49m94L38j119Q16M2n15P48o05m65P47N00p72K11O39j034k03
4370G15R2k44J255q45J34q8l26L13om5M9q74N14J71O07j693R43L91J22j127L8
4391I6N57p13K31Q72q96j91m22P14p00P30J78j201l36P15L30j135P72o23N64J36
4411c22r98N55N06p32l2m53J437j51n02j388R82J695k840J162N32r21Q50J17m19
$$ plain form
4277 171 -337 -1634 -255 150 -588 -121 -981 -356 -1277 -184 -1730 -1861 -432 -1065 -292 -1119 -820 -1213
4295 -1213 -1002 -851 -1388 -2480 -1251 -1335 -1578 -1514 -1240 -702 -764 -1288 -720 -1336 -1259 -2530 -1861 -537 -1766
4314 -1766 -858 -863 -415 -1921 -1179 -1313 -1676 -1256 -1839 -816 -299 -226 -423 -579 39 -86 -1379 -342 1139
4333 1139 208 24 -1123 1244 369 720 281 -254 872 1100 1280 1716 680 97 380 1575 866 2456
4351 2456 1329 1432 1881 1387 1725 606 1422 1464 949 1697 1092 627 1374 1874 1102 1313 1952 918 715
4370 715 807 563 1818 973 1107 1019 693 1006 1000 955 1004 130 644 815 1422 -271 672 1063 1185 58 96
4391 96 653 -60 171 1043 147 -44 -466 248 -452 278 456 -745 -1081 -366 -36 -1171 -399 -1022 -458 -322
4411 -322 -1320 -765 -259 -991 -1023 -1476 -39 -190 -692 -2080 -1098 597 -2243 -1081 -549 -1470 -620 -503 -922
4430i22l2k85o32J273K8n36l2p56J879j65r90n26P39J48O6j46N9o08Q96l39m75
4451a356L77J467r57J03r3n31R84n09K42J95k55N55O59j289O17r18J215J19K08
4470H33o77J145O0j102J939j513j54M15M99j044O99q37R73m56N04j05L40O69p51
4489A437k88q23M84m23J506j065km3n75L32Q64p72P47n32o65M22P69q07j13J260
4509A713j524N56o4j39j93j01L62o81M89j275L78Q00K39J48j513J793k69L66j638
4528e53q67J015n73L24K63n50N02j10l13j73Q33j172R44l1p00R24o86R3j45Q30
4548a45m17l81k89K66q6j00l2R98k59p93L37j123K39P06O91r84n00N18L2l82J002
4569g02m55J139r96m9O97N57q12K03J125j254J97m91J046l16k21r55J192M4P63
$$ plain form
4430 -922 -954 -1239 -1871 -598 -570 -1106 -1138 -1894 -15 -180 -1170 -1696 -957 -809 -743 -889 -830 -1438 -542 -881 -1356
4451 -1356 -979 488 -469 -366 -459 -990 -6 -515 -273 -78 -333 222 881 -408 209 -709 506 625 833
4470 833 156 1301 1361 259 2198 685 531 946 1445 401 1100 263 1236 780 1284 1179 1519 2188 1437
4489 1437 1149 326 810 387 1893 828 826 783 208 540 1404 632 1379 847 182 604 1373 566 453 1713
4509 1713 189 745 681 542 349 248 610 -71 418 -857 -479 321 560 708 -805 988 719 1085 -553
4528 -553 -1420 -405 -978 -654 -391 -941 -439 -549 -862 -1035 -202 -1374 -430 -461 -1161 -237 -923 -830 -975 -145
4548 -145 -562 -943 -1232 -966 -1052 -1152 -1184 -186 -445 -1238 -901 -2024 -1785 -1079 -388 -1372 -1872 -1354 -1322 -1704 -702
4569 -702 -1157 -18 -1014 -1063 -366 191 -621 -418 707 -547 -350 -841 205 -111 -332 -1287 -95 -51 712
4588G12o73J59j59n70N95k27j59P5O61j66J62l92J525r00j20k56k7Q51q44J04
4608C51J1Q28m38n47j23J933q64P47j364M77N82n35j068J420l08M79o15K9n34
4627D61M6O89l06k03p1J194j317J860k057m0j92L94m83J119L2jJ34j004k45M00
4647D10q47N94l53P08o98M67RM37m09j179J159j127J237j205J224q82l04k68l2
4666a059J368j313J049m06L88l08q16O12q09N80K29k14j26r67J522r11Q45j512
4684a848Q43P23j53o67J53J34M5l75L61M1o86l28P92j06K85J03n33M80Q2j91K9
4705h16K64l49m64O81Q18j103p13J963n15M49p3j04m65J074l96P53o67r91J004
4724C50J31K02q01L76L2l71J697p39p23K24M68j67L72q67L81J70O78J24J73j086
$$ plain form
4588 712 39 198 39 -531 64 -163 -322 -247 414 248 410 18 1543 643 523 267 240 1091 247 351
4608 351 362 1190 752 205 82 2015 1151 1898 534 1011 1593 1058 -10 1410 1102 1581 966 995 461
4627 461 507 1196 890 687 616 1810 493 2353 296 256 64 458 -25 1094 1126 1125 1259 255 10 410
4647 410 -437 157 -196 512 -186 281 290 727 318 -861 298 -829 408 -797 427 -455 -759 -1027 -1059
4666 -1059 309 -1004 45 -361 27 -281 -1097 -485 -1294 -714 -485 -699 -825 -1792 -270 -1181 -336 -1848
4684 -1848 -1005 -282 -435 -1102 -949 -815 -770 -1145 -784 -743 -1429 -1757 -965 -1071 -786 -683 -1216 -736 -654 -845 -816
4705 -816 -552 -901 -1365 -684 134 -969 -1682 281 -234 215 142 38 -427 647 251 1004 337 -654 350
4724 350 481 683 -118 258 290 -81 1616 877 154 378 846 679 1051 184 565 735 1413 1537 1710 624
4744F24M07j115K164j239j87K41K70Pj160O16J6J243j581Q93j201R05m03M22l24
4763E98N51l49n13j7k45K25R69m43L47r50n73K249j977N9M51j31J6j392J266o05
4783d64K63j0L49p78P29j34j081J367p71M14p39O07L05q95M66k48M5m24o06M24
4803a181N56o71j03J023m10j156P69nN5k07K49n00Q33L9o52O29o61P14p69J387
4823f1j20j097n80M95J053j210J252j399J908j393N86J43L92p20K15Q27j87n15
4841d11K44j3o83L91M91k20l28O63J10R4p67J497o28o66K35K29J192l37j638Q74
4861C29k08L76j542J497M93n22J085p14j97n81O41M8Q87j513J329n17o88j23J003
4880A083M5L26o24J7n27l70R44m83P19o9o2N75n18o23r21K127j270L27m59N15
$$ plain form
4744 624 1031 -84 2080 841 654 895 1165 1172 12 628 644 1887 306 1199 -2 903 500 922 598
4763 598 1149 800 287 270 25 250 1219 776 1123 173 -400 1849 -128 -69 382 251 267 -1125 141 -464
4783 -464 -201 -211 138 -640 89 -45 -1126 241 -530 -116 -855 -248 57 -838 -372 -620 -575 -999 -1605 -1181
4803 -1181 -625 -1296 -1399 -376 -786 -1942 -1173 -1178 -1123 -1330 -1081 -1581 -748 -709 -1361 -732 -1393 -679 -1448 -61
4823 -61 -181 -1278 -1858 -1363 -310 -1520 -268 -1667 241 -1152 -566 -423 -31 -751 -536 291 104 -411
4841 -411 -167 -180 -863 -472 19 -201 -529 134 244 338 -429 1068 440 -226 9 238 1430 1093 -545 329
4861 329 121 497 -1045 452 945 423 1508 794 597 16 657 705 1592 79 1408 891 203 80 1083
4880 1083 1128 1454 830 847 320 -50 894 411 1130 1061 999 1574 1056 433 -488 1639 369 696 237 752
4900G52j403J301R27j153Q57j159J152j211n34m42J451j22k27k42J03n40P73j49
4918A34k33l61N6l05j00Q09r43J061K07p11l35R51m75m50O53p0o69L03K34r89
4938a233m1M19K94P5k50J48p1m54k52J353q55J25L36j74p46l44P12K05M1K87k69
4959f94n24P97j93P15J69p26p6l66K40J280k063K175j148m98J089n55P86k50m70
4978c12L52M51Q9m73R73j444P57J74n32o25J439j27lL52p4j540P03J218j139k47
4998hJ067j232M26J631j584J363j818O02N79Q2M26j001L57N74j35q02Q9J102q83
5017H35k5n09J05n51J613q97m0J86L58j832K79J189m12K74j386O01Q38J54p00
5036H0N08K27j106Q3P25k01j023J69J098j500L10q02J254k00j78j04n52J232K3
$$ plain form
4900 752 -651 650 1577 424 1281 122 1274 63 -471 -913 538 416 189 -53 50 -490 283 134
4918 134 -99 -460 -404 -709 -809 0 -943 118 325 -386 -721 230 -245 -695 -42 -112 -781 -478 -244 -1233
4938 -1233 -1274 -855 -561 -486 -736 -588 -659 -1113 -1365 -12 -867 -742 -406 -580 -1326 -1670 -958 -753 -712 -425 -694
4959 -694 -1218 -421 -614 101 270 -456 -532 -898 -658 622 -1441 734 -414 -912 177 -378 408 158 -312
4978 -312 40 491 580 107 1080 -364 393 567 35 -590 849 722 719 1071 997 -543 160 1378 239 -8
4998 -8 1059 -173 253 1884 300 1663 -155 447 1026 1108 1534 533 890 1464 1329 527 616 1718 835
5017 835 810 301 406 -145 1468 571 531 717 1075 -757 -478 711 299 573 -813 -212 626 780 80
5036 80 588 815 -291 -208 517 316 -707 -538 560 -940 -630 -1432 -178 -378 -556 -660 -1212 20 43
5055D3q82J05K02j27p93P35N3M86q06j193J132K30m5n03R0Q21j044N12N32k23
5075f75r2m89L30K75N16k03j104R77j18r44N68pL27o66L87K17j54J535l52r33
5095f05r6K70m30P71q66K55L66J38J01L67N08p92l50l61Q18J36q14N62J323n41
5115G60n54N4R95j453J018j352P03N37j19J54K0N71n26L83o53q78J328o63M55
5134G80K59p18J111O6j341J618j438k46O83p85J52o89P19J801j181q44J136K55
5152A338n51M14j279J442r13p15Q77p90K04N15j35p5L10j880J353L32n19L20j194
5171i46J385j141O90K2m17M20k73k5l30P67l11K59r98J212o78o14L93J43Q29p19
5191c32J53Lm18J18n35K78J14K15L20M75k72j462L31P8J332q50J85m70l71J267
$$ plain form
5055 43 -839 -734 -532 -659 -1452 -717 -664 -178 -984 -2177 -1045 -815 -860 -1363 -1273 -452 -1496 -984 -452 -675
5075 -675 -767 -1256 -926 -651 -135 -338 -1442 -465 -583 -1527 -959 -966 -639 -1305 -918 -701 -855 680 328 -605
5095 -605 -701 -431 -861 -90 -956 -701 -335 -197 -96 271 779 -13 -363 -724 94 230 -584 -22 1301 760
5115 760 206 260 1255 -198 820 -532 171 708 589 743 763 1334 808 1191 538 -340 988 325 780
5134 780 1039 321 1432 1498 157 1775 337 91 774 -11 141 -548 171 1972 791 -53 1083 1338
5152 1338 787 1201 -78 1364 451 -264 613 -177 27 542 407 332 642 -1238 115 447 -72 248 -946
5171 -946 439 -702 -12 10 -407 13 -260 -285 -615 152 -159 100 -898 314 -364 -978 -585 -442 387 -332
5191 -332 -179 -176 -594 -476 -1011 -733 -619 -404 -84 391 119 -1343 -1012 -934 398 -452 -267 -737 -1108 159
5211A59j103O90J72j025j91J613j82O93j081l96l23J01O23o7n61M45m0j273K022
5230B76n54M84j744K365j990R72J301j489P30J41J48K04o80M16L13N5k40p42J213
5249A179j273J457n50p10J406j210Q55j98Q0j81j27N85K72j928J592m90r26J604
5267A437p6j356O21J5l54K84j450K018j220J201j578J468k78j84m65j35j27R64
5285G85J14m67j856L077n21r61o91J44M76J0j13J3J36M62K12j534R13R56j547
5304c92j01K67M34j474P92o31K60M73k43r1J54O48j390R68l56n28k73K234j523
5323g72N12q09L31Q40o3j43j1K47o19l82J97j6p69N13Q84l46o81P74o24n75p87
5344b299K673j471J39Q99j241J283n29n08Q68n81J40m27O25m52J539m58N3p65
$$ plain form
5211 159 -944 -254 -82 -1107 -1298 315 133 826 -255 -651 -974 -873 -250 -317 -878 -433 -473 -1746 276
5230 276 -278 206 -1538 827 -1163 -191 1110 -379 351 492 640 844 164 580 893 948 708 -34 1179
5249 1179 -94 1363 813 103 1509 299 1154 956 1036 855 728 1313 1585 -343 1249 759 -167 1437
5267 1437 1361 5 626 641 287 571 -879 1139 -81 1120 -458 1010 732 548 83 -52 -179 785
5285 785 899 432 -1424 1653 1132 171 -520 -376 100 110 -3 10 146 608 820 -714 199 1155 -392
5304 -392 -493 -226 208 -1266 -474 -1105 -845 -372 -615 -706 -552 96 -1294 -326 -682 -1210 -1483 751 -772
5323 -772 -260 -1069 -738 102 39 -104 -115 132 -487 -869 -672 -688 -1457 -944 -60 -406 -1087 -313 -937 -1512 -2299
5344 -2299 374 -1097 -958 -59 -1300 -17 -546 -1054 -186 -767 -627 -1054 -429 -881 658 200 253 -512
5362e12M13K97j47M5k20l14P99o47j56J93k97Q79l08P89p67K30K84qo0L2M40K98
5384A263j63p78M24J067k88j576M38o25L22J714j450K56o73O09L19l04N40j00
5402I95n19O29J70j264L21M67J17j107L54J436j350J53r35J329o29r18J097J11
5420D57Oq52N46k51M10o71J91k52J861j528l34J87P02R55j056j649J541o98o47
5439a082N44J544j473n50J194k00m95r98J230M62j103Q98q22Q21M1q51K71m58
5457a027J794j740N1R05L76j115J56o63O37P66n19j79m20P06p66R38O84m97k0
5476F7l63K42j152N88r50J483n07k40K61l81L31Q56j152J428j57j95j200J942
5494I01j229N80P8K59L50k79n06P93j485P96l61j39M71j829J658K90J020n80j258
$$ plain form
5362 -512 -99 198 51 96 -124 -438 361 -286 -442 -249 -546 333 25 814 47 277 561 553 493 525 965 1263
5384 1263 1100 322 746 1813 1525 -51 387 -238 84 1798 348 604 -69 540 859 555 1095 995
5402 995 476 1105 1275 11 332 799 916 -191 163 1599 249 402 -533 796 167 -751 346 457
5420 457 463 -389 157 -94 316 -355 -164 -416 1445 -83 -417 -230 472 1427 371 -1278 263 -435 -1082
5439 -1082 -538 1006 -467 -1017 177 -23 -518 -1516 -286 176 -927 -29 -851 -30 11 -840 -569 -1027
5457 -1027 767 -973 -922 -17 359 -756 -600 -1263 -626 140 -379 -558 -978 -272 -1038 -100 584 87 67
5476 67 -296 -54 -1206 -618 -1568 -85 -592 -832 -571 -952 -621 235 -917 511 354 159 -1041 901
5494 901 -328 252 330 589 939 660 154 947 -538 258 -103 -242 229 -1600 58 348 1368 788 -470
5513d70N07Q40o22K64l49L59o2n82N87K19n81j36LJ129o89J027j143Q22o17q46
5533c40M05P21n15n5k26O83k88o95J051k78P62p39n88K09n88L6N44N38j082J246
5553H01p32J514p15p27m62o07J186m03j24P88j103n39Q73o8k48J79j44M23j75
5572b83j10K17m91n67Q81p65M36Q9J96J71j42j076R00q84Q11L47L24j157M94J032
5592D23j441r4J058j267R90p20K76j02O7O19j044o21J794j407R52R98j273j3M70
5611c35j140J407o66j05N10K03n9K45J77o6Q96r95K28l49K47m76m45J578j154
5630b99J03k5N86R87j064j68p65J53O01K81Q53j253j29k39K78M5M43l15JN08q93
5651c11J400q47Q16j845R56J039j409j38Q87j30P17j182l79J92Q38o96m18j60
$$ plain form
5513 -470 37 877 255 519 170 529 467 -115 472 691 110 -26 -23 1106 417 1444 301 1123 506 -340
5533 -340 65 786 271 216 -10 673 385 -310 741 463 1225 486 -102 107 -481 -445 99 637 -445 801
5553 801 69 1583 868 141 -321 -928 258 -145 -269 519 -584 -1123 -250 -318 -566 -387 -531 -108 -283
5572 -283 -393 -176 -667 -1234 -353 -1118 -682 -593 -397 -226 -368 -1444 -544 -1428 -617 -270 54 -1103 -609 423
5592 423 -1018 -1112 -54 -1321 -331 -1051 -775 -877 -810 -191 -1235 -1856 -62 -1469 -517 481 -792 -805 -335
5611 -335 -1475 -68 -734 -839 -329 -126 -185 60 237 171 1067 72 300 -49 198 -278 -723 855 -299
5630 -299 -196 -221 365 1352 288 120 -645 -492 109 390 1243 -10 -139 -378 -100 -55 388 73 74 582 -311
5651 -311 1089 242 1058 -787 169 1208 -201 -339 548 418 1135 -47 -426 -234 604 -92 -510 -670
5669f70J7J685p55m13j18R06n64q8L19j000M81P6L57k5N28l71l07q2p0k24m95
5690h13K138r39j500J457j33M74j576J561j465N36N86q25L91r24N88j261J383
5707c22k34M84n1j300O78o71J161M18L00r07L16J70n07J22q0q7M06k12L99p42
5727f59p05N37l65K26J068j227N57J75m54O45K6K74K27J169k429J575p01j89R3
5746a57k08R58j094R00m2k11R71r93N73N05p70M00m16L75p06J62n24J373k96j324
5766e24Q85r36J445mo47O00N70j085K91j126N27N55J05J71j53r9J81m0r77M22
5786A61J10J020j006p9OJ425j049m95L94L55j038J353j909J030p19J262q17r9
5804i5R62j139l79J660j64j001P8k58J63P04K73k71k24m24p29J099o38J28K59
$$ plain form
5669 -670 -653 1032 277 -136 -254 652 88 0 319 -681 -200 -124 233 208 736 365 58 -24 -94 -318 -813
5690 -813 1325 386 -1114 343 210 684 -892 669 -796 -260 326 -499 -108 -1032 -444 -1705 -322
5707 -322 -556 -72 -123 -1423 -745 -1416 -255 163 463 -444 -128 42 -465 -343 -423 -510 -104 -316 83 -659
5727 -659 -1364 -827 -1192 -966 102 -1125 -568 -393 -847 -202 -176 98 325 1494 -935 640 -61 -250 -157
5746 -157 -365 593 -501 399 357 146 1117 124 697 1202 432 832 416 791 85 247 -277 1096 800 -524
5766 -524 361 -575 870 866 219 819 1389 304 595 -531 -4 551 656 827 674 575 756 716 -261 161
5786 161 271 1291 285 206 212 1637 588 93 487 842 -196 1157 -752 278 -441 821 4 -95
5804 -95 867 -272 -651 1009 845 -156 -78 -336 -173 531 804 533 309 -115 -844 255 -383 -255 4
5823Dq8P65j180J13P74q78l25R99j397R08J07O18n34J64J95r85P07r11j88j61
5843a293J330n16J54M29j020k40J518j420J596j99p93r8R78r4n18j75q20J549
5861C68j073J187j156J572r23j012J168j173J012l04k64O33N82j330J336j107
5877d84L87J09N37p10m78P80j052O72P77o08n70Q33n35J38k88P71M74o69J155
5896A239o79r30O4J297j044L72j94J76P40j052J110m42q91Q39J53O77n04j001
5914g0O28O28r30L54N71n75n26O50l97k59N37q78J470P21j450l63Q12l42j137
5933e56J735j345Q52l91q74J85K257q67j029j284J602j240R08q50L20J346j940
5950a171P76l97L85O93k14j187J226M70l75J75j052o7J332l78j515J232m53P65
$$ plain form
5823 4 -84 681 -499 -386 388 -490 -815 184 -1213 -305 -198 420 -114 50 245 -740 -33 -944 -1132 -1293
5843 -1293 37 -479 -325 104 -916 -1156 362 -1058 538 339 -454 -552 426 332 -186 -361 -1181 368
5861 368 -705 482 -674 898 -25 -1037 131 -1042 -30 -334 -598 35 617 -713 623 -484
5877 -484 -97 12 549 -161 -639 141 -911 -239 538 -70 -640 193 -342 -204 -492 279 753 84 1239
5896 1239 560 -370 -306 991 -53 319 125 301 1041 -11 1099 657 -234 605 758 1435 931 -70
5914 -70 558 1186 256 610 1181 606 80 730 333 74 611 -267 1203 1924 474 111 923 581 -556
5933 -556 1179 -166 686 295 -579 -394 1863 996 -33 -1317 285 -955 -47 -897 -577 769 -1171
5950 -1171 -395 -792 -407 286 72 -1115 111 581 206 381 -671 -738 594 216 -1299 -67 -520 245
5968B45p82k90P68j917J435J875k099L52M49k101K349m01r75J683p95k55L1J38
5986b90M61n21p73K32J379r08n36J158j294L81L46M92o10o09P69K90Q50M25j021
6005B21J99p60J21N84n42P30n4q1n51R09K19q48K33j72J82j6j011J182N5n40K38
6026B98Q45j471K92m93N09J528q57m47p35J287k93Q42m96j42j88r59J502k54L34
6045A102j568N75J324j386L33j12N2k91r38J548j670Q82Q59l59Q80r01K19j243
6063f94J217r07J340o99Q19n57o87M66m06M84q88L09m63o4K06P17l9l87o49j78
6083a060R22m13P62j99J74n10Q60j088n4J447q57l11j78M24j30J72o20J069j269
6102h59R8L31N07O9j178L14Q65J15j242q6J045n90J315k03j035L92n33N04O47
$$ plain form
5968 245 -537 -827 -59 -1976 -541 1334 -765 -413 36 -2065 284 -117 -1092 591 -204 -459 -428 -290
5986 -290 171 -350 -1123 -891 488 -420 -956 202 -1092 -711 -365 127 -483 -1092 -323 -33 817 1242 221
6005 221 420 -340 -219 365 -177 553 499 418 -133 776 995 147 380 208 390 374 -637 545 600 60 298
6026 298 1143 -328 -36 -529 -20 1508 651 204 -531 756 463 1305 809 667 479 -480 1022 768 1102
6045 1102 -466 109 1433 47 380 268 320 29 -909 639 -1031 -149 710 351 1231 330 549 -694
6063 -694 523 -384 956 257 1076 519 -168 298 -108 376 -512 -203 -666 -730 -524 193 154 -233 -882 -1060
6083 -1060 -138 -551 211 12 186 -324 536 -552 -606 841 -16 -327 -505 -81 -211 -39 -659 410 -859
6102 -859 -761 -430 77 146 -1032 -718 147 262 -980 -1066 -21 -611 704 501 -534 -142 -675 -171 476
6121D76q92m36J847p86n02n20n1Q85J74q3o13J118J26n31N61k97p76J86J13n41
6141e42J559r03L70l03q4N33o30L18R94n52q73N35p51L13K25J104j394J02R81
6160A002k01M08q97N79L6l53j93j06L58N7j474J125O08J28j220Q88j566J269j92
6179B56M12J03J9k23o37J73l58J62j37J805j212n55J870j237J69j40P9P4q07L65
6199A81Q26j491J61M44R0j272K060j766R34j82l84LN42m74n8J636j564j11L1o91
6219a085R07n58J292m89m66Q61o56k22k5J563k437O00K12K93k99J114q63q44L92
6238g10K35j01l42O71N68j775J408r71J727j046l71J001K63j591L74R24M19j21
6256E62j597K67K137j676k43p0N51R52j833Q50K23r89R72P07n10K07j168K506
$$ plain form
6121 476 -416 -852 995 209 -293 -813 -864 21 195 112 -501 617 743 212 773 476 -300 -114 -1 -542
6141 -542 1017 114 484 181 97 630 0 318 1312 760 -113 422 -329 -16 209 1313 -81 21 1002
6160 1002 801 1209 312 891 927 574 381 275 633 690 -784 341 949 1077 -143 745 -821 448 256
6179 256 668 771 790 567 -70 103 -255 -93 -230 1575 363 -192 1678 441 610 470 549 623 -184 181
6199 181 1007 -484 -323 121 211 -1061 999 -767 167 -15 -399 -396 146 -328 -386 1250 -314 -425 -394 -1085
6219 -1085 -178 -736 556 67 -399 462 -194 -416 -441 1122 -1315 -715 -503 -210 -509 605 -258 -1102 -710
6238 -710 -475 -576 -918 -247 321 -1454 -46 -1017 710 -336 -707 294 557 -1034 -660 264 683 562
6256 562 -1035 -768 1369 -307 -550 -620 -69 883 -950 -100 123 -866 106 813 303 510 -658 1848
6274A848j871M8Q32J8j425J696l98p43r6M9k09J87K31Q54r8n36L5N50o26n09M79
6295C16n25P63N57j335J67M68O19j247K73M82m85Q72r06J86k74M52r80J858o28
6314F33K94n15K2r61J497m67q00M92j399N68P86n61O2k44J539q45l05N20o11N93
6334B98r02J25L04l07J44L87m63J91Q01o84j33l36P40q76J231j579J42O36l12
6353e93L15P74q73n47L1N9K44J49n35O76m07Q73j426M91R90k15Q17j690N12j76
6373e31q74P78R8M09k45o08M07m83N71P70p6o75O89m50j75L43o81P13P5K51k39
6394F7n65K68l58P51m17N83N24k053Q31q8R43j413J905j864J280j041N47K30p7
6413E3P72q49j63J6O98j466R38J8J18m20l63O73R1J356j277O52q97J56M5k10r9
$$ plain form
6274 1848 -23 25 857 875 -550 1146 748 5 -91 -42 -251 -64 167 1021 923 387 422 972 346 -163 316
6295 316 -209 554 1111 -224 -57 411 1030 -217 56 538 53 925 19 205 -69 383 -597 1261 633
6314 633 927 412 434 -527 970 503 -297 195 -1204 -636 150 -411 -349 -593 946 101 -204 316 -295 298
6334 298 -604 -479 -175 -482 -338 49 -414 -223 578 -106 -239 -575 165 -711 520 -1059 -917 -281 -593
6353 -593 -278 496 -377 -924 -893 -834 -590 -441 -976 -300 -707 166 -1260 -769 221 6 823 -867 -355 -531
6373 -531 -1405 -627 -529 -120 -365 -973 -566 -1049 -478 292 216 -459 230 -220 -395 -52 -733 -20 55 306 67
6394 67 -498 -230 -588 163 -254 329 853 -1200 -369 -457 486 -927 978 -886 394 -647 -100 130 53
6413 53 825 -24 -187 -171 527 -939 -1 17 135 -285 -648 25 116 1472 195 847 -50 106 151 -59 -158
6434a58J77n00J82L55J78m72O24O02m39q69L71J027j012R9J04j73P55j532J88
6453d93j05J207j020R7m42L84J13o18J51L20R22n81K94j55n3k79k73K13J108k72
6473E18j298J319o75m09L39J6l01l79j68N92o3o34Q09R98l24j035k96P33Q08j947
6493a397J293r69J622n38n7k12L15J14j006K74O62q8l96Q27j648Q94Q95q79m3
6512c37J202j172O84m7l47j16j04P7O92n55J86M18n36j17N31P20j176J40l86K15
6532b8J74m47J95R01N40j611Q11M29q65n87l21J107o89L50R08m46J050j001l6
6551D34j248O75L65j9o25J058P39q59p54Q88r19L67m43k46J012M73j590J068j291
6570i15M63J269j890J410j311J143N8j034Q14N99o94o34J348j774l1J92L14N46
$$ plain form
6434 -158 19 -481 -299 56 234 -238 386 988 549 -320 51 1078 66 165 269 96 851 -681 -493
6453 -493 -598 609 -411 -314 -756 -372 -259 -877 -726 -406 516 -65 229 74 21 -258 -531 -318 790 518
6473 518 -780 539 -136 -545 -206 -190 -491 -870 -1038 -446 -509 -1143 -334 664 340 -695 -991 -258 550 -1397
6493 -1397 -104 -1073 549 11 -46 -258 57 171 -835 -561 101 13 -383 444 -1204 -310 585 -294 -337
6512 -337 865 -307 377 330 -17 -133 -237 -160 532 -23 163 581 45 -72 459 1179 3 143 -243 -28
6532 -28 146 -301 -106 795 1335 -276 535 964 99 -488 -809 298 -391 -41 867 421 1471 470 434
6551 434 -814 -139 226 207 -418 640 1379 520 -234 654 -265 102 -341 -587 425 898 -692 376 -915
6570 -915 -452 817 -1073 337 -974 169 227 -807 7 606 -88 -722 626 -1148 -1179 -987 -673 -127
6588a27k43J165l13Q92j309O02Q7q43K24j116J175j40P35m24n52k50J892j202
6606B53q4K05l32r30J327j068O06P1o58N04R95o67j041R44n27Q3R42o00M63j271
6626g85M2j69J073j209P5L91k15J575q66j796K380k41j395P83O47k89m03K95l46
6645d53R36j744M36L95J2N18N74n24K89j3o74Qm61R41j80K38k79J301o40r41o1
6666c22O79p85j43P9K50R52l72j97j94L99Q41j351n11R68k90J15o6k64o37J575
6686G26q74p50N30L03M75N31n49m58J278q17p96O41p37P13p54l35J525k45j323
6705i16R19j89P62j179J307j450j87R24K58m97J06K00m57L47o58Q71l39j39N9
6724b58J23r44J141N04j364J56K19J99r51P17K06m89r71J364j0J85J028j021L12
$$ plain form
6588 -127 -370 795 482 1374 65 667 754 -89 135 -981 194 54 789 365 -187 -437 1455 253
6606 253 169 374 42 -888 439 -629 -23 48 -610 -106 889 222 -819 125 -402 -319 623 23 486 -785
6626 -785 -743 -912 161 -1048 -973 -582 -797 778 -88 -1884 496 255 -1140 -357 290 1 -402 -107 -453
6645 -453 483 -1261 -825 -430 -418 100 674 150 439 426 -248 -240 -701 240 60 298 19 1320 680 -261 -322
6666 -322 357 -428 -571 -492 -242 710 338 141 -53 346 1187 -164 -675 293 3 118 52 -212 -849 726
6686 726 -148 -898 -368 -65 410 941 392 -66 1212 395 -401 240 -497 216 -538 -873 652 407 -916
6705 -916 3 -186 576 -603 704 -746 -933 -9 249 -248 -142 58 -399 -52 -710 161 -178 -317 -258
6724 -258 -135 -1079 62 566 -798 -642 -423 -224 -1175 -458 -252 -741 -1712 -348 -358 -173 855 -166 146
6743A46o25p76J700j6r94Q75p68q6K62P75j470J270j95m21j67M39j07q96J184
6762A30k26r81l44P74P38m74n08J342l02l62k62J511k95K03j738J304p75J312
6780A047p74p9k62N13m45r0P17j558Q60oM32J046p59q37o35J300j463M88Q75P43
6800A113r25l83K34o37Q65J32o25M93K69n50P71p36J002j125O19j191J211N3p50
6819a60QO91m0p82J132o33O14p67O38k58j06K44q86J30k62p6J810r79K67j409
6839h24N92L83k30L09m44L99q0j82m33O05p60mJ000q91O29j003J588m66j443J628
6859C73j260J366P29k697O05J924j428N66L32J60r18K85k94m0M66L75j868Q11
6877e13J60J318j028n11P41o41l22M34k97J3L32m17N09k20J35o84L43R47k23O08
$$ plain form
6743 146 -479 -1255 445 429 -565 310 -458 -544 -282 493 -977 293 98 -323 -490 -51 -158 -1054 130
6762 130 -96 -1077 -1421 -647 91 -383 -891 451 149 -213 -475 1036 741 944 -794 510 -265 1047
6780 1047 273 194 -68 445 0 -90 627 -931 -71 -77 355 1401 642 -195 -830 470 -993 -505 370 1113
6800 1113 188 -195 39 -598 267 399 -226 267 536 -14 757 21 1023 -102 517 -674 537 590 -160
6819 -160 -152 539 499 -283 849 216 830 63 701 443 337 581 -305 -175 -437 -513 1297 318 585 -824
6839 -824 -232 151 -79 230 -214 185 105 -77 -510 95 -665 -669 331 -560 69 -934 654 188 -1255 373
6859 373 -887 479 1208 -1489 -884 1040 -388 178 510 670 -248 37 -257 -297 169 544 -1324 -513
6877 -513 -353 965 -63 -574 167 -474 -796 -362 -659 -646 -314 -731 -222 -442 -307 -991 -648 299 76 684
6897F84O6p18k09Lp48J474J92j470M52O46o92J219k126J964j219P84L48n18J37
6916B69M05j361P3p10J927L28j226p8L33J148m46j004L11j39Rp29J038j08J72
6935B12q52J487j183P84m87j86O95NM3m28p26J92J112M40q79K80p96L35K18m29
6955a63J034k9k47J82o07k39L7K19K74qm05J203j951P62M67r1k23m34M29j472
6975a262QP12R62j299J36M12J126r23K49n11M01L90k27K78l54j671R23Q62o29
6994d17L58j4L63q82K84o56J42j07J618j263N53j410J188q00O60O86j189R37o05
7013e54o7M98q8M74m44j41P58n22o52J505k19o23j086J008K13L65L15K5r76K93
7033H2j94j091K238J09j788NN50J2m55P18J05p30J209K2l97J27k97O33j694L92
$$ plain form
6897 684 750 32 -177 -174 -922 552 744 -726 -274 372 -320 899 -1227 737 -482 302 650 132 269
6916 269 674 -687 -614 -1324 603 931 -295 -373 -40 1108 662 -342 -31 -170 -161 -890 148 40 212
6935 212 -640 847 -336 448 -39 -225 470 475 518 90 -636 -444 668 1108 229 509 -287 48 266 -163
6955 -163 871 842 595 777 170 -69 -32 187 461 453 48 1251 -700 62 529 438 215 -219 210 -1262
6975 -1262 -1254 -542 420 -879 -743 -331 795 -128 121 -390 11 401 174 452 98 -1573 -650 212 -417
6994 -417 -59 -73 290 -592 -308 -964 -822 -929 689 -574 -21 -1431 -243 -1043 -383 303 -886 51 -554
7013 -554 -621 -123 -211 263 -181 -322 436 -86 -738 767 548 -75 -1161 -153 60 425 740 765 -211 82
7033 82 -112 -1203 1035 1144 -644 -639 -89 -77 -532 186 291 -439 770 792 395 522 225 858 -836 -444
7053d44J151L49j421Q5L40l82K18N87l84J279j529J23Q77q76L06n43O64q39P36
7072B97n22N32M62m34o58M90r20Q78l83J225r6j070Q33o01j15J85R7j45j026J702
7092G31m92M21k63o47O2P76j45ll58j406J581J46r89J192j347J569j102N04j199
7111i69Q79m24O79m41l53o1M56K89p7o87N33L98l17O32P9j365j2J7K89M71L88
7132D04j154N27k58l3N27Q02n22J15q14J98N74p30P52n61K45M86M5j456Q6K54
7152e13l15Q68J90K74r56N69k29L00p5P09o30O87j48j352P86k45o9P83r30M85
7172A89J097j696Q00n22M05k1k1O64j340N75L86k20Q22j728L57Q15k00k48P01
7191H15N60k91q59K46q66p2j88R66J31l80j874J801J411j214k94J14R13k84j171
$$ plain form
7053 -444 707 1056 -365 -280 60 -322 -104 483 99 1378 -151 -28 849 -27 279 -264 400 -439 297
7072 297 -225 307 769 335 -323 167 -753 125 -258 967 871 -199 634 33 -82 103 200 55 -971 731
7092 731 239 660 397 -250 -188 588 443 440 82 -1324 257 403 -586 606 -741 828 -274 230 -969
7111 -969 -90 -514 165 -276 -629 -690 -234 55 -22 -709 -176 222 -95 537 616 -749 -761 -744 -455 16 404
7132 404 -750 -223 -481 -514 13 815 293 408 -406 -208 366 -364 388 -173 72 558 603 -853 -767 -513
7152 -513 -828 40 230 504 -452 117 -112 188 113 822 192 879 731 -621 165 -80 -149 634 -296 189
7172 189 1286 -410 390 -132 273 252 231 895 -445 130 516 296 1118 -610 -253 562 362 114 815
7191 815 1375 1084 225 471 -395 -467 -655 311 442 62 -1812 -11 1400 186 -108 6 919 635 -536
7210e36P59p1J77k49J80K14l62K26p54K29K02l49N54l78J23l04j031Q49M44j82
7230b59K29m35O55M31n52r38J323p13m30R35r57J415j414K90p51Q39J292j032
7248g2R87j285o35L10K86L65j078J075l75L85K9N19j066l27m36J652j098N22J72
7267g0L48o63L73N93m05l26J22R77r77j37l95K32J30P77q37J06J16o14N38l70
7287d82P48p24J471j758R83P83p75O5O38k97p24P69k57j60l49j15j240J613K05
7306C94l5L32k08K29o5j810J675J77J51j180P64J21n98k9J064j130N07M21j184
7325d04K61P54n96l61O54n10J114n30J56n55l46J217m24j512O92K96K76m16J71
7344f3J31N20j541o6K575j047j438L12J81K51J116j044n28M64K32m4l29R13j193
$$ plain form
7210 -536 223 152 329 80 260 474 112 338 -416 -187 15 -334 220 -158 -35 -339 -1370 -521 -77 -259
7230 -259 -30 -465 190 621 69 -869 454 -259 -689 246 -711 704 -710 -420 -1171 -332 960 -72
7248 -72 915 -370 -1005 -695 -409 -44 -1122 -47 -422 -37 -8 511 -555 -882 -1318 334 -764 -242 -70
7267 -70 278 -385 -12 581 176 -150 -28 949 -28 -165 -560 -328 -198 579 -258 -152 -36 -650 -112 -482
7287 -482 266 -458 1013 -745 238 1021 246 311 949 652 -72 697 440 280 -69 -184 -1424 189 394
7306 394 359 691 483 712 647 -1163 512 689 840 -340 424 545 -53 -82 982 -148 359 780 -404
7325 -404 -143 611 15 -346 308 -202 912 382 538 -17 -363 854 430 -1082 -390 -94 182 -234 -63
7344 -63 68 588 -953 -1019 1556 509 -929 -617 -436 -185 931 -113 -641 -177 55 11 -318 595 -598
7363e98J220n77n67P75n61P29j915R93n47N07N2n30R52j008J034n85J383l33j480
7382a056J280J50j364K14P55k86O1M90j083J033k12j29m34J91M05K8l49m24J154
7401D24L16j55p63m79Q26K83j437J067q8j009P68N84r28k51P70L14j395R91q75
7420a037J575l50n78J73O17m53L0L36J447k256J411m08j449J835j032J446j346
7437c9N26Q42j155NL31k6j191J99J252r15M36J09q00O88m86L80p83R96k52n67
7457d50M80m27J138k166J351j20n62Q32K68Q3m3J91j247R59J47q93J520j430j47
7476e16J521q09l86L43n3k39j11j66J111r75J426q49M09o62j13j98Q13L42k46
7495F42l80j030O67J024q99j037K20L8P50O2r36Q46N33Q05j942P94o32r26R87
$$ plain form
7363 -598 622 45 -522 253 -308 421 -1494 -501 -1048 -541 -489 -1019 -67 -1075 -41 -626 757 424 -1056
7382 -1056 224 374 -990 -776 -21 -307 -246 244 -839 194 -18 -147 -581 -390 15 43 -306 -730 424
7401 424 740 585 -178 -657 169 452 -985 82 -6 -1015 -247 337 -591 -842 -72 242 -1153 -162 -1037
7420 -1037 538 188 -390 -217 400 -53 -23 313 1760 -496 915 507 -942 893 -139 1307 -39
7437 -39 487 1329 174 179 510 484 -707 -508 744 -171 265 374 -426 262 -224 156 -627 369 117 -450
7457 -450 30 -397 741 -1425 -74 -194 -756 76 344 427 384 575 -672 287 434 -459 1061 -369 -516
7476 -516 1005 196 -190 153 100 -139 -250 -416 695 -280 1146 297 706 44 -69 -267 546 888 642
7495 642 262 -768 -101 923 24 -1013 -793 -755 -5 57 -879 -33 500 1305 -637 157 -475 -1401 -414
7514d14NP14o94j8O4P1j158R02N73L70j042J60P89q86M29o8K56o50P5N45L21q4
7536B60l73K62K05o79j37K92O53o36J10K15N5N1k52o01k5J83N72l40n46Q86o75
7557e20O85J64m87M62J119j464j056J393q7M6j6K9n8q72J149j40m05j77O30M6
7577D41N92r27m99J142l15q50J051l3m51N20J15r6j04k54M03k104J141j08l60
7596f96R44j41L63q46k87J523j42o20q37P22M7L36n12l95J149o81n10k65P44m48
7616e52M10J505j886N36k94l82J90r0Q60p89k5M30N19l55o16J078k21k80j30n78
7636f70J008k10l34M24j115J369j038J87m50K33q51N43J277l46M45m04k48R22
7654G42J9o21N21n41l63K26p7q15N2Q95J273k189M74Q89k70l76k68K39m16k37
$$ plain form
7514 -414 -409 305 -389 -407 -343 -272 -1430 -528 45 415 -627 -467 322 -564 -135 -203 53 -597 -522 23 344 260
7536 260 -113 149 354 -325 -462 -170 483 -153 -43 172 227 278 26 -575 -600 -417 155 -185 -731 155 -520
7557 -520 165 329 -158 304 1423 -41 -1097 296 209 255 239 268 210 -662 487 347 -58 -235 395 441
7577 441 1033 106 -393 749 434 -416 635 602 151 671 786 690 586 332 735 -1369 -228 -336 -696
7596 -696 248 107 470 -376 -663 860 718 98 -739 -17 30 366 -146 -541 608 -73 -583 -848 -104 -552
7616 -552 -142 1363 -523 13 -281 -663 -473 -563 297 -492 -517 -87 432 77 -539 539 318 38 -92 -670
7636 -670 338 128 -206 218 -897 472 -566 -379 -829 -596 -1447 -904 373 27 472 68 -180 742
7654 742 761 140 661 120 -243 -17 -94 -909 -857 38 1311 -878 -404 485 215 -161 -429 -190 -606 -843
7674h43J083N62q86K28M83J11o91J331l45o43j732P17l87J080K07m87k3K43M2
7693E0k79jk60J428q12Q41j718O69Q75M42k044r1J916K3j848P37p4L84q04q98
7713a464J695r75j27R20J116j382J237j085n10N57M69P90p01j145J233l17k78
7730C3Q49j300n20K88O51P71j011O44k35N2j05J82p97k77J86m1J90R2j79O85p78
7751f20oJ59M88J91j512J621j74J318j496l68J212r55K79k54j95k86M20j74Q43
7770D91l65n76O05q82l7J075j089k42K91P45r5n8j85K47j220Q06K46n54P91j259
7790a265J398q67J701j355Q75q2k62K58o05m03P24p76l48J931m87J72j181N45
7808b7j059J810j098P76j0j779J581p43J02M28N79n47L57L18j193N53m09P79K80
$$ plain form
7674 -843 240 802 -84 144 627 738 47 1378 1033 390 -1342 -625 -1012 68 275 -212 -235 8 50
7693 50 -229 -230 -490 938 126 967 -751 -82 793 1235 -809 -900 1016 1039 -809 -72 -146 238 -566 -1464
7713 -1464 231 -744 -871 49 1165 -217 1020 -65 -575 -18 451 1241 540 -605 628 311 33
7730 33 882 -418 -938 -650 1 772 -239 405 170 222 117 299 -498 -775 -589 -630 -440 -348 -527 158 -620
7751 -620 -626 -467 21 212 -1300 321 147 1465 -31 -399 813 -142 137 -117 -312 -598 -178 -352 491
7770 491 126 -450 155 -727 -764 311 -778 -1020 -729 16 -79 -137 -322 -75 -1295 -489 -243 -797 -6 -1265
7790 -1265 133 -734 967 -388 487 405 143 401 -204 -607 117 -659 -1007 924 437 609 -572 -27
7808 -27 -1086 724 -374 402 392 -1387 194 -549 -447 -19 560 13 370 688 -505 48 -361 418 698
7827F98q17J97J85l86l63K13q6M29n91k21J747l31m32J63N48p65R7M34k38o63
7847a82L38M38J46r54j33R19L12j115O10n10L40r13J025r08J164L16p26p16o4
7866f13R67j58J05r92J671j283O12q30L80k69J0l38M08J0j404L97J031Q6J037
7885H27j062m6j1P44m53K49k1j075L49MM59j61N8j074R40l10J000j047R46j54
7905A62o46o92Q68J67m04M43l78N90l82L38j5J10K49l27Q9m72p3M93r5j362K207
7926H70q02L58q28k22J581n11p56J48N98l38m84N08J43k1j426Q01J31j499J575
7945a74J88P73j149P54K99n99J04N60j082O7N86n68Q81q98L72J09M9n68Q53N84
7965A141j074N67j337R33M66j412l04J655j102J303k61m29m25k36N6M70J351j471
$$ plain form
7827 698 -119 78 263 -123 -486 -273 -359 70 -521 -742 1005 674 242 405 953 188 285 719 481 -182
7847 -182 156 594 740 -214 -347 572 884 -231 379 -131 209 -704 321 -587 577 893 167 -549 -613
7866 -613 354 196 301 -691 980 -303 309 -521 -141 -410 -400 -738 -330 -320 -1724 -1327 -296 -210 827
7885 827 -235 -281 -292 452 -1 248 227 -848 -499 -495 -36 -197 -139 -1213 -273 -583 417 -630 316 162
7905 162 -484 -1176 -308 -141 -545 -102 -480 110 -272 66 51 161 410 83 172 -300 -373 120 25 -1337 870
7926 870 68 426 -402 -624 957 446 -310 -162 436 98 -386 122 265 244 -1182 -381 -250 -1749 -174
7945 -174 14 787 -362 392 691 92 196 756 -326 -259 327 -241 640 -258 114 223 272 -296 557 1141
7965 1141 67 634 -703 230 696 -716 -1020 635 -467 836 575 146 -279 -515 -459 11 1362 -109
7983a09l80L26n83N76n8O37j11j93l38K003k052q90J131m58R68j576N83Q32r30
8002f22P38j342L73J009Q15p43q25K359j244q76J155j366M98M37o57J65j6m59
8020f01L52O41j20m67Q63j503L72Q31J89m87p51j06J411J65j206o67J418k17k42
8039a25M59n19Q63J64j514J054q34M84L70r09N65L49N28r25k68R64N75j491N45
8058C35J62o7k58M16p14N69n45N02j469J263P3p77R80J070j949P93O23j056J002
8077I53m39M8r11L66K43n34l90J426r64L87j030M81P24K45o26O07q79R10p83J104
8097I38o96K05p84Q25r72l30K771j710k59l66N61j75l67QJ81n52J368n0p51n46
8117g01M06N36K37j26J02j318Q96j32K6Q9r3K67k17k76K13M61o73K70J18l55l2
$$ plain form
7983 -109 -489 -163 -746 -170 -228 409 298 105 -233 1770 -282 -1172 -41 -499 469 -1107 -524 308 -622
8002 -622 116 -1226 -853 156 971 228 -597 1762 518 -358 797 -569 -71 366 -291 -126 -142 -601
8020 -601 -249 392 272 -195 668 -835 -463 368 557 70 -681 -787 624 789 -417 -1084 334 117 -125
8039 -125 334 -185 678 842 -672 382 -452 32 402 -507 58 407 935 10 -258 706 1281 -210 335
8058 335 497 430 172 588 -126 443 -102 400 -1069 194 267 -510 470 1540 -409 384 1007 -49 953
8077 953 514 562 -349 17 260 -274 -664 762 -202 185 -845 -364 360 605 -21 586 -293 617 -166 938
8097 938 242 447 -337 488 -484 -814 1957 247 -12 -378 183 8 -359 -351 -170 -722 646 596 -155 -701
8117 -701 -295 241 478 352 454 -864 32 -100 -74 15 -78 189 -28 -304 -91 370 -303 -33 85 -270 -302
8138c02Q8P89l22L53j521P57O34Q6j243J697l39j608P58M66n85j227K140r70L99
8157E0J51l86M37j673J504M23p69m22N26kM16q08M17L7L08o73P98k09p31k48J064
8178B10r21N12O80q18r2K02k48J75N99O24r10p13J96
$$ plain form
8138 -302 -214 575 253 606 -915 -158 476 562 -681 1016 677 -931 -173 293 -292 -1519 621 -349 50
8157 50 201 -185 252 -1421 83 506 -263 -685 -159 -161 255 -553 -136 -99 209 -464 334 125 -606 -854 210
8178 210 -711 -199 481 -337 -429 -227 -475 -300 299 923 13 -700 -504
8191e04
$$ Imaginary data points
##PAGE= N=2
##DATA TABLE= (X++(I..I)), XYDATA
0@%%%%%%%%%%Mj12K16k16K16k17L25m32M33n41O49p53Q77r89J179j359J531j734
28i23J970k225K506k816L160l545L962m422M916n463O066o714P443q251R136j0113
44e313J1203j2422J3791j5354J7136j9187K1606k4496K8010l2387L8034m5639
56b5018N6484p3346J03409j73231O40370J85908j205963R4993P79796J23743p67122
67b59977n9913N82797J40513n44160j24665L86451J74145k90811j10910J50896
77D4366P2019j08494M286N5158l5572n4700P4186K5713r1817l2592J22976L5160
89A10689j40268p9273J43073J24372j14929j79705P1082K05428k4216k34685k2312
100a40744K50100O5966k69876j14944K66660J56869k58722j92152K33938K04643
$$ plain form
0 0 0 0 0 0 0 0 0 0 0 0 4 -108 108 -108 108 -109 216 -216 217 -324 325 -428 449 -540 639 -720 811 -923
28 -923 1047 -1178 1328 -1488 1672 -1873 2089 -2333 2583 -2880 3186 -3528 3915 -4336 4800 -5313
44 -5313 5890 -6532 7259 -8095 9041 -10146 11460 -13036 14974 -17413 20621 -25018
56 -25018 31466 -41880 61529 -111702 528668 714576 -491387 -396394 383402 507145 -259977
67 -259977 -319890 262907 403420 -140740 -265405 121046 295191 4380 -106530 44366
77 44366 116385 7891 12177 67335 31763 -22937 51249 76962 -14855 -47447 75529 110689
89 110689 -29579 -108852 34221 158593 43664 -136041 -64959 140469 116253 -118432 -140744
100 -140744 109356 175322 -94554 -209498 57162 214031 -44691 -236843 -2905 201738
110B01738k12225k09157J88856J98466j74334j87271J57472J66262j46543j41275
120a58011J36784J07021j37715p1167J39682L9284j51637j6096J62291j803j71432
131a22799J0636J77654j5294j80944J4214J83406o628j80956m807J74050J8931
142F7463j57691l0966J38952L9498j18506m5723J06049N6770q5366o5730O5789
153b9461P4920m3602p0503L2130O9538k5601o6719K7704P1197k2767o6733K6667
165b3230O3387l1889n5711N0557N8611o1998o4040P8453P3865q5001p7951R5525
177B0578Q5336r9853r0085J07353R8971j06920j00567J07458J01550j03482r7199
188g6860J02839R4299r9594q6183R5721Q2864q8987p6419Q1965O9487p4731o2068
$$ plain form
110 201738 -10487 -219644 -30788 167678 -6656 -193927 -36455 129807 -16736 -158011
120 -158011 -21227 85794 -51921 -123088 16594 55878 -95759 -111855 50436 48633 -122799
131 -122799 -112163 65491 50197 -130747 -116533 66873 60245 -120711 -125518 48532 67463
142 67463 -90228 -121194 17758 57256 -61250 -106973 -924 55846 -29520 -95250 -29461
153 -29461 45459 1857 -68646 -36516 33022 7421 -59298 -31594 39603 16836 -49897 -23230
165 -23230 40157 8268 -47443 3114 61725 -273 -64313 14140 88005 3004 -74947 20578
177 20578 105914 6061 -84024 23329 122300 15380 -85187 22271 123821 20339 -76860
188 -76860 25979 120278 20684 -65499 30222 113086 24099 -52320 29645 99132 24401 -37667
200c7667P3606N3735p3071m7629O7256M6517o6395m3692O2415M0839o3716m1337
212b9139O2940M0751o2980m8345N8643N2918n4637o2146M6628O4978m5100p0331
224d5820M0011P3146l9684q4038L4592Q6241l3017q8437K7476Q3023l0611q6690
236f3808L0497Q5662l1572r0114K4829Q8644k7854q6670K7259Q2698l1673q6213
248g8315L4371Q4173l6375q4384L2008Q2860l5785p8775L7390P4996l6879p7720
260h2435L4784P7966l0935p7126K5851P4597k3708p2485K4532P3393k1678p3624
272g0868J7153P4332j1174o8609R066O9013q697o5344O950O8918m316o4533P18
285d7391O8067K911o4393k677O8420M168o8720k346P2740O043p0099l648P0469
$$ plain form
200 -37667 35939 89674 16603 -31026 36230 82747 16352 -27340 35075 75914 12198 -29139
212 -29139 33801 74552 11572 -36773 21870 74788 20151 -41995 4633 69611 24511 -45820
224 -45820 -5809 67337 27653 -56385 -21793 64448 31431 -57006 -29530 53493 22882 -63808
236 -63808 -33311 52351 20779 -69335 -44506 44138 16284 -70386 -43127 39571 7898 -78315
248 -78315 -43944 40229 3854 -80530 -48522 34338 -1447 -80222 -42832 32164 -4715 -82435
260 -82435 -47651 30315 -620 -77746 -51895 22702 -1006 -73491 -48959 24434 2756 -70868
272 -70868 -53715 20617 9443 -59166 -50100 18913 10216 -55128 -48178 20740 16424 -48109 -47391
285 -47391 20676 23587 -40806 -43483 24937 29105 -39615 -41961 30779 36822 -33277 -36925 33544
298C3544O327o6833n849O8398P584o6340m408O7079J0651o6196r200O6589J1570
311E2916o3060j0451O4610J0762o3850r628O4876J1580o0943j2584N9221J2906
323E6355n5105j3162N6664J4047n6864j4526N5759J6931n5608j7413N3888J6673
335E7639n4184j7513N4863J8143n4836k2119N2692J8268m8169k1516M9102J7601
347D9971n0453k1558M8434K2549n0391k5036M7000K3529m8357k4054M6328K0026
359C7988m8401k3373M7510K1704m7809k5717M4640K2145m5410k3598M4080K1214
371B4973m5315k8676M6291K6063m5489k6630M1713K5036m5012k5592M2437K8106
383A7905m3415l0635M0614K9293l7861l0506L8639K8530l9238l1197L8204L4778
$$ plain form
298 33544 39871 -26962 -32811 35587 43171 -23169 -27577 39502 50153 -16043 -25243 41346 52916
311 52916 -10144 -20595 44015 54777 -9073 -18701 46175 57755 -3188 -15772 43449 56355
323 56355 1250 -11912 44752 58799 1935 -12591 43168 60099 4491 -12922 40966 57639
335 57639 3455 -14058 40805 58948 4112 -18007 34685 52953 4784 -16732 32370 49971
347 49971 -482 -22040 26394 48943 -1448 -26484 20516 44045 -4312 -28366 17962 37988
359 37988 -10413 -33786 13724 35428 -12381 -38098 6542 28687 -16723 -40321 3759 24973
371 24973 -20342 -49018 -2727 23336 -22153 -48783 -7070 17966 -27046 -52638 -10201 17905
383 17905 -25510 -56145 -15531 13762 -24099 -54605 -15966 12564 -26674 -57871 -19667 15111
395A5111l9218l2848L7281L3702l6632l2854L7249L3964l7456l3680L7878L6183
407A8680l5454l3778L4244L5803l1978l5314L4563L7469l3665l8480L7155M0276
419B9521l4076l7634L4393L9812l1816l8917L4555M0676l1946l7904K9564M3009
431C9237k5708m0215K6966M0306k4678l9874K6953M3445k3555m2726K2648M3271
443D6070j9270m0517K1013M1561j9656m2769J9753M3980j7097m2665J5858M3584
455D9845j5749m2863J4403M4539j4614m5814J3779M5775j3315m5579J1712M4087
467D6206j2806m4468J1052M3152j0074m6776Q029M5789q129m5016N507M2249o769
480B7946m3626N403M3603p404m6385L782M2882l374m2675L026L8709n086m0508
$$ plain form
395 15111 -24107 -56955 -19674 14028 -22604 -55458 -18209 15755 -21701 -55381 -17503 18680
407 18680 -16774 -50552 -16308 19495 -12483 -47797 -13234 24235 -9430 -47910 -10755 29521
419 29521 -4555 -42189 -7796 32016 200 -38717 -4162 36514 4568 -33336 -3772 39237
431 39237 13529 -26686 280 40586 15908 -23966 2987 46432 22877 -19849 2799 46070
443 46070 26800 -13717 7296 48857 29201 -13568 6185 50165 33068 -9597 6261 49845
455 49845 34096 -8767 5636 50175 35561 -10253 3526 49301 35986 -9593 2119 46206
467 46206 33400 -11068 -16 43136 33062 -13714 -5685 40104 31975 -13041 -7534 34715 27946
480 27946 -15680 -10277 33326 25922 -20463 -16681 26201 22827 -19848 -16822 21887 16801 -23707
493b3707J449M0520k635m0858k940L9246K076l9566m040M0233l34l9732l215L7771
507D268M653l9178n849L7180N108l8593m733L7098M240l7242p492L7654R110l7903
521c1679r113L5431Q960l6642o680L6705P229l6258r064L6782R488l3660r282
534c7783L4376Q943l3315p611L4703J2116l6762j0313L4747J3134l2661r658L4058
547C974J0109l2391r929L4210J2474l0842j0823L0823J2826l0100r175L0446J3831
560B5433l0557j2300L2233J3871k8792j4121L1348J4179k8687j3298K9460J6946
572C5715l0117j4649K9429J7611k8239j7329K9686J6846k7933j6191K9039J7821
584D1689k8721j9562K8817K1246k8806j9439K7356J8900k8548k1492L0253J9931
$$ plain form
493 -23707 -22258 18262 15627 -25231 -28171 11075 13151 -26415 -30455 9778 9444 -30288 -33503 4268
507 4268 8921 -30257 -36106 1074 6182 -32411 -37144 -46 4194 -33048 -40540 -2886 6224 -31679
521 -31679 -40792 -5361 3599 -33043 -39723 -3018 4211 -32047 -41111 -4329 5159 -28501 -37783
534 -37783 -3407 5536 -27779 -35390 -687 11429 -25333 -35646 -899 12235 -20426 -30084 3974
547 3974 14083 -18308 -28237 5973 18447 -12395 -23218 7605 20431 -9669 -18844 11602 25433
560 25433 -5124 -17424 14809 28680 -112 -14233 17115 31294 2607 -10691 18769 35715
572 35715 5598 -9051 20378 37989 9750 -7579 22107 38953 11020 -5171 23868 41689
584 41689 12968 -6594 22223 43469 14663 -4776 22580 41480 12932 -8560 21693 41624
596D1624k7350k2651K6846K0257k6687k1129K5533K1604k8910k2515K6468K1883
608C4973k6409k4606K5695K1736k7172k1893K3617K1247k3987k4168K1932K1861
620B2826k2085k4985K0622K3368k2364k3527J9726K4274k3211k5923J8233K5691
632A2645j7106k7384J5788K6501j8445k6866J7148K7033j7253k7816J2144K7597
644C986j1421k8240J1404K8420j3525k8630J3442K9793j1472l1664J0714L1556
656D363j1553k9691J1484K9985j0284k9921Q583L2625q256k8720Q416L0211r373
669b131k8612J0009L1056r550k8168R500L0220p973k8709R294K9178o822k7650
682b0358Q814K8119n216k7771O450K7461l505k3874M210K4228l358k4818O103
$$ plain form
596 41624 14274 -8377 18469 38726 12039 -9090 16443 38047 9137 -13378 13090 34973
608 34973 8564 -16042 9653 31389 4217 -17676 5941 27188 3201 -20967 965 22826
620 22826 741 -24244 -3622 19746 -2618 -26145 -6419 17855 -5356 -31279 -13046 12645
632 12645 -4461 -31845 -16057 10444 -8001 -34867 -17719 9314 -7939 -35755 -23611 3986
644 3986 -7435 -35675 -24271 4149 -9376 -38006 -24564 5229 -6243 -37907 -27193 4363
656 4363 -7190 -36881 -25397 4588 -5696 -35617 -27034 5591 -2665 -31385 -22969 7242 -2131
669 -2131 -30743 -20734 10322 772 -27396 -17896 12324 4351 -24358 -15064 14114 7292 -20358
682 -20358 -11544 16575 11359 -16412 -9962 17499 13994 -9880 -5670 18558 15200 -9618 -3515
695c515K5933k781k2855J816K3089q53k2012K003K2720j00k2390j0K3901K262
709B7208k3168k869K2794K971k1781l839K5187J595k3821k736K5828K406k4329
722E446n278K3440N177k4726m723K5026L545k5322o663K5700O672k6420o647K4552
736A9779L262k5394m687K6082L143k7538m029K5630J251k4324l929K4353J241
749A4840k6752k342K4375K251k4593m352K0599L331k2766j836K0962J022k2033
762a7294l524K0397K778k0388l297J7661K812j9177m950J8118O889j8172r244
775b7391J7532Q328j8070r182J7743R668j8347r425J8045J1240j9004j0703J9188
788a0378J2288j8851j3208K0367J4432k0340j4997K3274J5573k1956j5238K0981
$$ plain form
695 -3515 22418 19637 -3218 -1402 21687 20834 -1178 825 23545 23445 1055 1045 24946 27208
709 27208 4040 1171 23965 26936 5155 1316 26503 28098 4277 1541 27369 29775 5446
722 5446 168 23608 28785 4059 -664 24362 27907 2585 -4078 21622 28294 1874 -4773 19779
736 19779 23041 -2353 -7040 19042 22185 -5353 -9382 16248 17499 -6825 -10754 13599 14840
749 14840 -11912 -14254 10121 12372 -12221 -16573 4026 7357 -15409 -17245 3717 4739 -17294
762 -17294 -20818 -421 2357 -18031 -21328 -3667 -855 -20032 -24982 -6864 25 -18147 -27391
775 -27391 -9859 -1531 -19601 -28783 -11040 -1372 -19719 -29144 -11099 141 -18863 -29566 -10378
788 -10378 1910 -16941 -30149 -9782 4650 -15690 -30687 -7413 8160 -13796 -29034 -8053
800h053J8032k1964j4050K3888J4499k3289j4476K4833J5116k0311j3665K0673
812A233J5441k1126j2497K1594J4093k0233j2424J9577J4176j7685j0172J5846
824G823J2419j5023j0389J5798J1749j3870j1578J3038J2811j0454j2337J0559
836A0546J3884j0240j3604R379J6769q720j9366R376J7571o381j8340Q158J8219
849B7251p511k0568O754K1590o649k1500O358J9604o410k1046Q294K0293r694
862A6766k3593R072K1793q170k3167Q663K0545j1567j9698R357J8957j0670k0567
875a2279R627J8063r970j9990J0809J5835j0180j6308Q103J5408r390j5974P748
888h498J3243p206j3481O080J0455m269j2366K356J3239m755j3245K459J1506
$$ plain form
800 -8053 9979 -11985 -26035 -2147 12352 -10937 -25413 -580 14536 -5775 -19440 1233
812 1233 16674 -4452 -16949 4645 18738 -1495 -13919 5658 19834 2149 -8023 7823
824 7823 20242 5219 -5170 10628 22377 8507 -3071 9967 22778 12324 -13 10546
836 10546 24430 14190 586 9965 26734 18014 -1352 8024 25595 19214 874 9032 27251
849 27251 19740 -828 5926 27516 20867 -633 5725 25329 18919 -2127 6167 26460 16766
862 16766 -6827 2245 24038 15868 -7299 1364 21909 10342 -9356 1 18958 8288 -12279
875 -12279 -2652 15411 5441 -14549 -3740 12095 1915 -14393 -6290 9118 -272 -16246 -8498
888 -8498 4745 -2461 -15942 -9862 593 -3676 -16042 -13686 -447 -5202 -18447 -15988 -4482
901d482j372j1491k97J2913r91j4951K87J5357J31j4203j592J3933J874j4927
915a9811j083J6040J461j6801r23J7085L061j8965r20J8719J1j8090K264K0246
929B294j356j9814J389K1585k156j7521K008J9577k401j7435K725J8505j203j6892
943a0695K764J6631k629j3613K138J6681k049j4434K932J5773j155j4170K292
956D66J3095O81j2930J41J4464R45j3614j676J5226L091j2736l201J1848M354
970B0154j2899m234J3315P561j5488p216J4135P236j3717q425J4458Q291j4727
983H444r400J5004R654j5895j0863J7329Q710j7445q885J7296N950j7757p450
996e308J6808P644j7755p874J5123O652j5849q175J5168O399j5772q360J4773
$$ plain form
901 -4482 -5854 -17345 -17642 -4729 -5720 -20671 -20384 -5027 -4896 -19099 -20691 -6758 -4884 -19811
915 -19811 -20894 -4854 -3393 -20194 -21117 -4032 -971 -19936 -20856 -2137 -2126 -20216 -17952 2294
929 2294 938 -18876 -17487 4098 1942 -15579 -13571 6006 3605 -13830 -11105 7400 6197 -10695
943 -10695 -7931 8700 6071 -7542 -5404 11277 9228 -5206 -2274 13499 12344 -1826 466
956 466 13561 14242 1312 1453 15917 16862 3248 1572 16798 19889 7153 3952 15800 20154
970 20154 7255 3021 16336 23897 8409 1193 15328 22564 8847 422 14880 23171 8444
983 8444 -956 14048 23702 7807 -3056 14273 22983 5538 -3347 13949 19899 2142 -5308
996 -5308 11500 19144 1389 -6485 8638 15290 -559 -8734 6434 12833 -2939 -11299 3474
1009C474Q274j5120q880J3230M583j2160p136J2187O645j3075q592J0064Q746
1022B240r098r872O932J0076r642r490R077R993q949j0911O571J0467n510j1435
1036a9551P019J0842p466j2635O733J3982o499j3651O723J2767o602j3276P607
1049a4007J3676o309j4807Q137J4032o557j2948P100J3553o851j1970P437J2342
1062B828m916j2461O255J3091m428j1193M472J3362m820j0560M586J2064k717
1075E563j1713L336J1905l342r445N040R846l312r070L448R480j155r160J087
1089B508R690K37r904K916Q968j113q266J291R092M0j0297J744Q053k64q347L53
1105F701R590k775p266p56R660J578j0704k526J1236k72r458j14J0039j639j0280
$$ plain form
1009 3474 11748 -3372 -12252 978 5561 -6599 -13735 -1548 5097 -7978 -16570 -6506 2240
1022 2240 -6858 -16730 -9798 278 -9364 -18854 -9777 216 -8733 -19644 -13073 -2606 -8116 -19551
1036 -19551 -12532 -1690 -9156 -21791 -15058 -1076 -7575 -21226 -14503 -1736 -8338 -21614 -14007
1049 -14007 -331 -6640 -21447 -13310 722 -5835 -18783 -11683 1870 -4981 -16951 -9514 2828
1062 2828 -2088 -14549 -8294 4797 369 -10824 -6352 7010 2190 -8370 -3784 8280 5563
1075 5563 -6150 -2814 9091 5749 -3696 1344 11190 7878 -1192 2256 11736 10581 1421 2508
1089 2508 12198 12435 2531 5447 14415 13302 5036 6327 15419 15459 5162 6906 14959 14695 6348 6701
1105 6701 16291 13516 6250 5494 15154 16732 6028 3502 14738 14466 5008 4894 14933 13294 3014
1120C014rR969j428q200M45P721k208q659m30J0283j327j0199j484R644j680r275
1136c823K189Q308l541r243M78Q185r96q207p22O216J068q940O50P152n39r597
1152a1362L69Q843l36r867j485R250K21r640Q70Q138r49r172q56R313J518q982
1168a4127n23P435Q79p613k472R710K061r240k293R154K177p641k648J0858J707
1183b576j0233j097R664L011q952k154Q342L611q592j244R298K714q252l780R882
1198c58M625q322l366R659L379q171k074R031M012q017m731Q912N122q078l084
1213a461Q925M686p541m630Q932N087q333m442P500N115o988m036O738N460p474
1228G538l565N854O720o614o962N334O873m920n407N046N526n927o370N531O495
$$ plain form
1120 3014 3005 12974 11546 3346 3791 11512 9304 645 215 10498 9171 -1028 -2512 7132 5452 -3823
1136 -3823 -1634 6674 3133 -6110 -5632 2553 1557 -6650 -7372 -1156 -88 -9028 -8378 -1226 -1765 -11362
1152 -11362 -10993 -2150 -2486 -12353 -13838 -4588 -4367 -14007 -13137 -4999 -5948 -15120 -15976 -6663 -5145 -14127
1168 -14127 -14650 -7215 -6336 -13949 -16421 -6711 -4650 -13890 -16183 -7029 -4852 -12493 -15141 -4283 -2576
1183 -2576 -12809 -13906 -4242 -1231 -10183 -12337 -3995 -384 -8976 -10220 -922 1792 -6460 -10240 -358
1198 -358 4267 -4055 -7421 2238 5617 -2554 -4628 4403 8415 398 -4333 4579 9701 1623 -1461
1213 -1461 7464 12150 4609 -21 8911 13998 5665 1223 8723 13838 6850 2814 9552 15012 7538
1228 7538 3973 9827 16547 9933 2971 8305 15178 10258 4851 9897 15423 9496 3126 8657 15152
1243A5152n022o676M938N189o403n104M696O172n367p194M646O192n138p602M565
1258C044O008l963q490N224O051m998p505M665O423o077o048M269M676n611n278
1273g610M592M571l740p225L591O764m878n692L549L808l630o089L036M463j649
1288f139n690K294M643k628n194K487O859l967o460K767O494j642o657J548M777
1303f508j832l807K081N850l652m295J896O137j547o364K779O845k278n712K386
1318h021O859m87p642J745Q613j878o982K901N902m92o593R65J0100k307o978
1333d295K226O763q15n854K926P018j985p966L220Q499j042p428K274P066k429
1348H178n831J711P780k449o433K960O623k338n450J510O453m01p357J580M741
$$ plain form
1243 15152 10130 3454 8392 13581 7178 2074 6770 12942 7575 381 5027 11219 6081 -1521 3044
1258 3044 9052 5089 -3401 1823 7874 2876 -4629 36 6459 382 -5666 -1397 3279 -2332 -7610
1273 -7610 -3018 1553 -2187 -9412 -5821 943 -3935 -9627 -6078 -2270 -5900 -11989 -8953 -4490 -6139
1288 -6139 -11829 -9535 -4892 -7520 -12714 -10227 -3368 -7335 -13795 -11028 -4534 -6176 -12833 -11285 -6508
1303 -6508 -8340 -12147 -10066 -4216 -7868 -12163 -10267 -4130 -5677 -12041 -9262 -2417 -4695 -10407 -8021
1318 -8021 -1162 -1649 -9291 -7546 1067 -811 -7793 -4892 1010 518 -6075 -5110 4990 2683 -4295
1333 -4295 -2069 4694 3879 -1975 951 7969 5984 -1982 1238 9737 8695 1267 3541 10607 8178
1348 8178 2347 4058 11838 9389 2956 5916 12539 10201 4751 6261 12714 12313 4956 6536 11277
1363A1277J257p400J414O045o37o978J228N358P1o251n56N981k54n520j711O993
1379A0317o42n955j409N408J218o618k893Q051J103p559l735P270K307o999l263
1394c399N775K769p597l550P385J493o893k429M831K756o977k213O270J315o654
1409g118k261M852L269p053j884N324J971o739j409M196L780n858l841N521K337
1424d913m405k190L659K133m174k455M926K215l502l173L795L948l393l583L225
1439g887M737l329m277L189M988k363m736M336K403j472l661L262N850m807m306
1454h073N052M812l457l583L708N712l999m686M104N478k635m718M076M424l042
1469C173m904M166N287l112l160L877K972k401l527L795L647l218l501M300K092
$$ plain form
1363 11277 12534 5134 6548 12593 11956 4978 6206 11564 11635 5384 4828 10809 10555 5035 3324 10317
1379 10317 9675 3720 2311 7719 8937 2319 -574 7477 8580 1021 -2714 4556 6863 -136 -3399
1394 -3399 2376 5145 -2452 -6002 1383 2876 -4017 -6446 -1615 1141 -5836 -8049 -1779 -464 -7118
1409 -7118 -9379 -4527 -1258 -8311 -10195 -4871 -2900 -9639 -11048 -6852 -3072 -8930 -12771 -7250 -4913
1424 -4913 -9318 -11508 -7849 -5716 -9890 -12345 -7419 -5204 -8706 -11879 -8084 -4136 -7529 -11112 -7887
1439 -7887 -3150 -6479 -10756 -7567 -2579 -4942 -9678 -5342 -2939 -4411 -8072 -4810 1040 -3767 -8073
1454 -8073 -3021 1791 -1666 -5249 -1541 4171 172 -4514 -410 5068 2433 -2285 1791 6215 3173
1469 3173 -1731 2435 7722 4610 1450 5327 8299 5898 2371 6166 9813 6595 3094 7394 9486
1484I486k001l239L074M764m548j619J732L006k845j775K947K308l481l589L108
1499G328M328l420k806J962K083k764l550K399L703k834m351J522M724j362m374
1514B588J293L973l334m733J070N018k042n382O10N152k136m711J187O078m947
1529c16n665K881L891j547o142J964N253k913n334J255O580l064p122L652N887
1544g40m090o182L049M494j834o232M049M400k662m786J184N218j287m532J286
1559h665L844j213n024J707N037n83m678J77N764j014l861l37N206J369n605P07
1575g169M741J889m741k086O472Q55n898L37O336J071o361l30N914J791n405j493
1591d077P243J022m917r40N282K341n676k030O442K842m858k217N467J894n229
$$ plain form
1484 9486 7485 4246 7320 12084 7536 5917 7649 10655 7810 6035 8982 11290 7809 4220 7328
1499 7328 11656 8236 5430 7392 9475 6711 3161 5560 9263 6429 2078 3600 8324 6962 2588
1514 2588 3881 7854 4520 -213 857 5875 3833 -1549 -939 4213 2077 -2634 -1447 4631 -316
1529 -316 -5981 -3100 791 -756 -6898 -4934 319 -2594 -7928 -6673 -93 -3157 -10279 -6627 -740
1544 -740 -4830 -11012 -7963 -3469 -5303 -11535 -7486 -3086 -5748 -10534 -9350 -4132 -5419 -9951 -8665
1559 -8665 -4821 -6034 -11058 -9351 -4314 -4897 -9575 -9398 -3634 -4648 -8509 -8846 -3640 -2271 -7876 -7169
1575 -7169 -2428 -539 -5280 -7366 -894 -39 -5937 -5600 736 1807 -4554 -4884 1030 2821 -2584 -4077
1591 -4077 3166 4188 -729 -1669 3613 5954 278 -1752 4690 7532 2674 457 5924 7818 2589
1606B589K33M512J436n420j087M647L277m777j821M956J163m664l58K870K922
1621A0478m487j804L446J655k420k882L211J906j685l835L678J662l340k340J576
1636D819L259k465k853J168L912m519l185K942M356l347m107K210K958l044l456
1651a352L021J786l164l311J831L870l755l152L512J638m137k851L043K464l289
1666c846k843K571L125l012l034K129R71k870j863K473L003l161k809K372J881
1681d913k082k682L205J601j828k961K729K531j768l805K753J948r97k166J686
1696f749K364j660k681K662K737j123j539R06K764k749j297K695L614l344j714
1711e114J633L471k226q91J064L553j256m248K702M829k058l537K656K585o69
$$ plain form
1606 2589 2822 7334 8770 3350 2263 6910 10187 5410 3589 8545 9708 5044 4686 7556 10478
1621 10478 5991 4187 7633 9288 6868 3986 7197 9103 7418 3583 7261 8923 5583 3243 4819
1636 4819 8078 5613 2760 3928 7840 3321 136 3078 7434 4087 -20 2190 5148 2104 -1352
1651 -1352 1669 3455 291 -3020 -1189 2681 -1074 -4226 -714 924 -3213 -6064 -3021 -557 -3846
1666 -3846 -6689 -4118 -993 -4005 -7039 -4910 -3939 -6809 -8672 -6199 -3196 -6357 -9166 -6794 -4913
1681 -4913 -6995 -9677 -6472 -4871 -6699 -9660 -6931 -4400 -6168 -9973 -7220 -5272 -6269 -8435 -6749
1696 -6749 -4385 -6045 -8726 -6064 -3327 -4450 -5989 -5083 -2319 -5068 -6365 -3670 -56 -3400 -5114
1711 -5114 -3481 -10 -2236 -3127 -2063 1490 234 -4014 -1312 3517 1459 -2078 578 3163 2494
1726B494k759K715M628k277n013L873L570j241l313J352L537j271m778M040K719
1741H276j446m506L203L425j640l769J897L666k376k077J045M513k501l629N96
1756D677L971ll891o5K941M16n352J220M586l55l759j246K229P40m285N52L013
1773E389m09l752j99M376j729m197n79M312l59m342o31L083J059m320j277L713
1789A38P87l824o18L126j108l645N28K119Q94l398j861M229o75l597O51K447J94
1806c613m218K57L347J027l488j016K754O27l583m54L031Q70j553k033K077J477
1822d491j285k260K227J586j485j733L091Q72o04k618K676J962j808r42J817R34
1838b061r05p05K334J260k242L65j91M370k983r43J61L555j153k410L864J083
$$ plain form
1726 2494 -265 2450 7078 4801 -212 3661 7231 5990 2677 4029 7566 6295 1517 5557 8276
1741 8276 6830 2324 5527 8952 7312 3543 5440 9106 6730 4653 5698 10211 7710 4081 4677
1756 4677 8648 8645 4754 4689 7630 8046 2694 3914 8500 8145 4386 3140 5369 6109 1824 2376 5389
1773 5389 4980 1228 1029 5405 3676 -521 -1100 3212 2853 -1489 -2120 963 2022 -2298 -3575 138
1789 138 925 -2899 -3517 -391 -1499 -5144 -4616 -2497 -1603 -5001 -6862 -2633 -3308 -6905 -6254 -3807 -3613
1806 -3613 -7831 -7574 -4227 -3200 -6688 -7704 -4950 -4323 -7906 -8360 -5329 -4459 -6012 -8045 -5968 -4491
1822 -4491 -5776 -8036 -5809 -4223 -5708 -7441 -4350 -3478 -4082 -6700 -4024 -2062 -3870 -4812 -2995 -2061
1838 -2061 -2966 -3671 -1337 -77 -2319 -1954 -2145 2225 -758 -1701 -1540 2015 862 -1548 2316 3399
1854C399k793p80K395J927k25k256J472J141q34j601K813J896j283k476J764K931
1870G490j963k036K711K051m315J431R61R11p55k601K831J16j453j264L063R93
1886H171k426j221Q84J874k249r23M43J085k438L33J019J4r61k150J489J278j617
1903B605j061J310J906k579k923K864J61j153j353j159L754k533j676L2K513k688
1919a980k130J246K874j635k849O16K431j878k406J589K722k871k509J293K260
1934c227k082j780J168K299k270k486K354L033k525k311J640J992j927k247K984
1949e385K059k000l099K778J852l67l735K262L246p98l673J754J682j15k395K410
1965c524J896m63j491m33L239m25k216L14L479o69j778m09M399Q74l299J92K670
$$ plain form
1854 3399 606 -174 2221 4148 3923 1667 3139 4280 3446 1845 4658 6554 5271 2795 4559 7490
1870 7490 5527 3491 6202 8253 3938 5369 6330 7241 6486 3885 6716 6832 5379 4115 7178 8171
1886 8171 5745 4524 5408 7282 5033 4110 4553 5638 3200 3533 4552 4566 3605 1455 2944 4222 2605
1903 2605 1544 2854 4760 2181 -742 2122 2283 1130 -223 -1382 2372 -161 -1837 -1805 708 -1980
1919 -1980 -4110 -2864 10 -1625 -4474 -3858 -1427 -3305 -5711 -4122 -1400 -4271 -6780 -5487 -3227
1934 -3227 -5309 -7089 -5921 -3622 -5892 -8378 -6024 -2991 -5516 -7827 -6187 -4195 -6122 -8369 -5385
1949 -5385 -3326 -5326 -8425 -5647 -3795 -4162 -7897 -5635 -2389 -3187 -6860 -5106 -3424 -3539 -5934 -3524
1965 -3524 -1628 -2091 -3582 -4015 -776 -1201 -3417 -3103 376 -293 -2071 -2480 1919 2793 -506 -314 2356
1982B356R44k279m09L863j11l542m26L834J135j607n89J101K06j566K07L401N34
1999G052k857j155K710Q17j008j704L473o63j731q19J946Q35j885l35J246O29
2015F551p41j318J634K59k436o60J576K199k882q97O44P24j005j066J741r56r68
2032B399l02j76J510q59k359m2J334j163j294O57J675j441j149N04J90j67k144
2049b827R07K06o68j476R26J527k146j894K056K86j060p70J182J089j886j138
2065e686J581J064k327m15K82J063j505k96J898j016J42j313K528O61k809L53
2081e795K811j802j191L44J372Q79k658K094N86P72j932O57J696M34k189R15J674
2098a333J68j955N62J392J251j604l54L041q9k543J516J253Q49j185p19L336q37
$$ plain form
1982 2356 3300 1021 612 4475 4364 822 396 4230 5365 3758 3169 4270 4476 2910 3117 6518 7052
1999 7052 4195 3040 5750 6567 5559 3855 7328 6665 4934 4115 6061 6896 5011 4676 5922 6551
2015 6551 5810 4492 6126 6385 3949 3289 4865 7064 4182 3285 3929 4653 3648 2582 4323 3367 2399
2032 2399 2097 1921 3431 2572 213 171 1505 342 -952 -295 1380 -61 -1210 -706 -516 -683 -2827
2049 -2827 -1920 -1714 -2382 -3858 -2932 -1405 -3551 -5445 -3389 -3103 -4163 -4933 -3751 -2662 -4548 -5686
2065 -5686 -4105 -3041 -5368 -5783 -5501 -4438 -5943 -6239 -4341 -5357 -5215 -6528 -4000 -3339 -6148 -5795
2081 -5795 -2984 -4786 -5977 -5633 -4261 -3382 -6040 -3946 -3360 -2588 -4520 -3863 -2167 -1733 -3922 -3007 -1333
2098 -1333 -1165 -3120 -2558 -1166 85 -1519 -1873 1168 1079 -1464 52 1305 2154 969 250 3586 2749
2115B749o53l38J373J168k110m97K413J361k049j331J576J911j381k203L247K289
2131G525k097k874K956J988k530j792K562J516l391P36J151J578j661l288J784
2146D163L120k326k084K295J683l339j787O58L190k309j140L61R02j28k146J010
2162B123J145j775j224O07J609j637k061Q22J989p94j846J34J375n13j952M64
2178a534O55n10j651p48J241J18p29j398K974n43k925J267q8J482k414L4R95j374
2196e148k42L68O29M42j863k13K432j168J10l75P35J269k836J065P88k29q04K72
2214d768R07K290l248Q23J141M0o67r09J603N47j296L4J792O25j755R34O99K85
2232i23n71K90J85J542M69j291J453M16j83j190J528p26K35P68J93J437j077L49
$$ plain form
2115 2749 2096 1758 3131 4299 2189 1692 4105 5466 3417 2086 3662 5573 4192 1989 5236 7525
2131 7525 5428 2554 5510 7498 4968 3176 5738 7254 3863 4599 5750 7328 5667 2379 4163
2146 4163 7283 4957 2873 5168 6851 3512 1725 2383 5573 3264 2124 2485 3387 3259 1113 2123
2162 2123 3268 1493 269 876 2485 848 -1213 -391 1598 804 -1042 -908 467 -46 -1998 -1534
2178 -1534 -879 -1389 -3040 -3788 -2547 -2429 -3158 -4556 -1582 -2125 -5050 -3783 -3871 -2389 -4803 -4769 -3774 -5148
2196 -5148 -5390 -5022 -4393 -3951 -5814 -6027 -3595 -4763 -4653 -5028 -4293 -3024 -5860 -4795 -4007 -4236 -5040 -4768
2214 -4768 -3861 -1571 -4819 -3996 -2855 -2815 -3482 -4391 -2788 -2241 -3537 -3503 -1711 -1086 -2841 -1907 -1208 -923
2232 -923 -1494 -1204 -1019 523 992 -299 1154 1570 1387 197 1725 999 1234 2002 2195 3632 2555 2904
2250B904j7m6l11P36J023L37o57j77N09Q35j593l90J360O23j945R27P34O72j205
2269D319o34J228N71j664l15J952j151n63k80K102j084j328n2J433j471j123j32
2286A808K595n53k593J383L98j1j740o89J863j1k783o02K149M86k000j322J526
2303i6L49p55k424J663J61j041k63P14Q11k133p12J046O71j207o51Q99J199k145
2321c914j173Q90J809k525p09J933Q26j247p63K84K095k327k126L098L61l58k274
2338f120K551N13k017q84J638J641m21k063O80K010J92o18R35O69j284l21L7K765
2356i7j551j010J363J621q38j580J366J668j325p63J215Q61P20k131N27K513m72
2373B087j401R02P99Q33j777O20K118p03l22L39K37J054k466m9K501L56k181J185
$$ plain form
2250 2904 2887 2841 2530 3266 4289 4626 3969 3792 4301 5136 3543 3153 4513 5136 3191 4118 4852 5524 4319
2269 4319 3685 4913 5484 3820 3505 5457 4306 3743 3463 5565 4481 3153 3101 4534 3063 1940 1808
2286 1808 4403 3850 1257 2640 3038 3027 1287 598 2461 2450 -333 -935 1214 1700 -300 -1622 -96
2303 -96 253 -502 -2926 -1263 -1102 -2143 -2406 -1692 -881 -3014 -3726 -2680 -2009 -3216 -3867 -2968 -1769 -3914
2321 -3914 -5087 -4197 -2388 -4913 -5622 -3689 -2863 -4110 -4873 -4589 -2494 -4821 -6947 -3849 -3488 -3846 -6120
2338 -6120 -3569 -3056 -5073 -5957 -4319 -2678 -3099 -5162 -4482 -2472 -2280 -2898 -1963 -1294 -2578 -2899 -2862 -97
2356 -97 -1648 -2658 -1295 326 -512 -2092 -726 942 -383 -1146 69 930 1650 -481 46 2559 2087
2373 2087 686 1588 2387 3220 1443 2063 4181 3478 3156 3495 3732 4786 2320 2271 4772 5128 2947 4132
2391D132J276k6j516L2J02J055r29j03J250L76k909l75K344K9p48l36Q99J17j952
2410B718L69L43l5k90r71j57O0l51Q11J091j445j306J12Q21J107k247j09K2j2
2429E31j672Q46L23k39j101j322l34K493j90m13r29j453J113p10J274N63k314
2446c534o09O37P05j115O72Q2r3r23O03P5o71j182J068L07J109k221N12J810j140
2465c908r93l72J672N23j232j05J935j908N92r00J932k1j403K73J311P84j178
2482b998o2J369L14q47r9K204l79j483k70K110K79o25J9J773N69k239R95Q39P59
2501B228j150K89l8J573p88j001K039P91m79j831O33K671k281nJ658P42j068n81
2519C402J000o63j50j144K350j33k68k581L013M58j779j803J736K035j812j053
$$ plain form
2391 4132 5408 5382 3866 3898 4000 5055 4126 4023 5273 5649 2740 2365 4709 4738 3990 3654 4553 4670 2718
2410 2718 3087 3430 3395 3105 2134 1977 2037 1686 2497 3588 2143 837 949 1770 2877 630 521 543 531
2429 531 -1141 -295 28 -211 -1312 -2634 -2968 -475 -665 -1078 -2007 -3460 -2347 -3057 -1783 -1220 -3534
2446 -3534 -4143 -3506 -2801 -3916 -3244 -3162 -3255 -4178 -3575 -3500 -4171 -5353 -4285 -3978 -2869 -5090 -4578 -2768 -3908
2465 -3908 -4901 -5273 -3601 -3078 -4310 -4415 -2480 -4388 -3796 -4696 -2764 -2785 -4188 -3915 -2604 -1820 -2998
2482 -2998 -3060 -1691 -1377 -2224 -2323 -119 -498 -1981 -2251 -141 138 -487 -468 1305 1874 -365 630 1469 2228
2501 2228 1078 1367 1329 2902 2114 1113 3152 3943 3464 1633 2266 4937 2656 2651 4309 5051 3983 3402
2519 3402 4402 3739 3589 2445 4795 4662 4394 1813 4826 5284 3505 1702 3438 5473 3661 2608
2535B608R21K077k127j689J268J663k304r85K033L45r35j481m34K339j672j151
2551D76M94J380j430j648J787l08N37k006M65J124o07k452P02J543j068j515l86
2568b912J669R4k085J557L01p09j460J40K246p75k276R52J65R51q35l08J284l10
2586b311k096l29J465O91j211n50J095Q81j871m78J585on59q41K105L90k810K21
2604d629K079P56j494m70J844P66l342K427O22j60l2Q74K49l30K7J44P08pl02
2623b70P20n76k78o82K018k53P83K11j29q7Q59j567n75K701nj160J071L85q67
2642B299K83n1J71J235j028P60M89P8q37K15j00j58m69%J330p81m06J53J405j491
2662C097oM10J186r83j749O19J854j249L47n00r72P65k064N40K151j179o82n67
$$ plain form
2535 2608 3529 5606 3479 1790 3058 4721 2417 1432 3465 3810 2875 1394 960 3299 1627 476
2551 476 970 2350 920 -728 1059 751 1288 -718 -253 871 264 -2188 -1486 57 -1011 -2526 -2912
2568 -2912 -1243 -1149 -3234 -1677 -1376 -2085 -3545 -3405 -1159 -1934 -4210 -3258 -3093 -2142 -2977 -3285 -2001 -2311
2586 -2311 -4407 -4736 -3271 -2580 -3791 -4341 -3246 -2365 -4236 -4714 -3129 -3135 -3694 -4535 -2430 -2040 -4850 -4629
2604 -4629 -2550 -1794 -3288 -3758 -1914 -1148 -4490 -2063 -1441 -1601 -1633 -759 -510 -840 -813 -669 39 32 -270
2623 -270 450 -126 -404 -1086 932 679 1462 1673 1544 1457 2316 749 174 2875 2870 1710 2781 3166 2299
2642 2299 2582 2531 2702 3937 2909 3669 4158 4236 3399 3614 3514 3356 2887 2887 4217 3436 3030 3183 4588 3097
2662 3097 3091 3501 4687 3704 1955 2574 4428 3179 3526 3026 2054 2819 755 1295 3446 2267 1585 1018
2680A018P71j223m41M7P88j082j44JO21j048k46k86Q79Q02j453p79N8J198k055
2699b574N41N45n74n80O8K12R49k125M09N81L66p82p59J461j025j036O01L31J418
2718a973j701o49J151J036j232j489R55J804j632k52J453m17j1q97J373k1n19
2735c021p23J937k32PJ72q65K887j769p77J309J722j464r00Q72O8P62p21N22N80
2754C66m74k53J222l70J235j934Q51J125Q44j839J196J532o75p51j50Q24p3J12
2772B788n07Q61j45r04O96J052O53j072r31N98n09O90Q26K00j002q03L21R91m48
2791C355J87k24L08j03o76K29L12o16j329n31K243k73j234P19M22j894O77l59
2809A213M30R0o83k12K19q53j024Q31p02N05j90J49J78o87j144M07M60l36j85
$$ plain form
2680 1018 1789 566 125 172 960 -122 -266 -265 356 -692 -938 -1224 -345 457 -996 -1775 -1717 -519 -2574
2699 -2574 -2033 -1488 -2062 -2642 -2574 -2362 -1413 -3538 -3129 -2548 -2182 -2964 -3723 -2262 -3287 -4323 -3722 -3391 -1973
2718 -1973 -3674 -4323 -3172 -2136 -3368 -4857 -3902 -2098 -3730 -3982 -2529 -2946 -2957 -3854 -2481 -2502 -3021
2735 -3021 -3744 -1807 -2039 -2032 -1860 -2725 162 -1607 -2384 -1075 647 -817 -1717 -845 -777 -15 -736 -214 366
2754 366 -108 -361 861 491 1726 -208 643 1768 2612 773 1969 3501 2826 2075 1925 2749 2676 2788
2772 2788 2281 3142 2997 2093 2789 3841 4494 3422 2491 3089 2580 3270 4096 4296 3294 2491 2812 3803 3355
2791 3355 3542 3318 3626 3523 2847 3076 3388 2772 1443 912 3155 2882 1648 2367 2789 895 1572 1213
2809 1213 1643 1733 1050 838 1057 204 -820 11 -691 -186 -376 -227 -49 -736 -1880 -1473 -1013 -1349 -1534
2828a534N83m55r52m61P60M6J96k50r41J025o37q38p7O43K46j115l57N47j06r0
2848c767K27Q79m7j802O79J437j812K58J133o98R09j274k43P03J001J124j264
2865b557P60j325K77J336J48k77q49P83J286j486K18P60J272o95k66r27J683k25
2883h4P80j139J425M12j512O05Q40J9q07K211o61n89j275J904L47J88N31k061
2901A134J945O23j108p02J254M46j171j36K293j771j052J083L62J570k381o51
2917A738J828J21p69n81O71P16j238j770M23K472j669N46J125j425q00L9Q70m75
2935A822o46%j66L13M19j622N46p6m19k37M16P68k286K81N70l66L56j063J556
2954A66k41o92j805j00N30Q7r60J212N22k061K396j549N63R39j766L99j098L38
$$ plain form
2828 -1534 -951 -1406 -2358 -2819 -2059 -2013 -1817 -2067 -3008 -1983 -2620 -3458 -3535 -2892 -2646 -3761 -4118 -3571 -3677 -3767
2848 -3767 -3540 -2661 -2708 -4510 -3831 -2394 -4206 -3948 -2815 -3513 -2604 -3878 -4121 -3418 -2417 -1293 -2557
2865 -2557 -1797 -3122 -2845 -1509 -1361 -1638 -2487 -1704 -418 -1904 -1686 -926 346 -349 -615 -1542 141 -84
2883 -84 696 -443 982 1394 -118 487 1327 1346 539 2750 2089 1500 225 2129 2476 2664 3195 1134
2901 1134 3079 3702 2594 1892 3146 3592 2421 2285 4578 2807 1755 2838 3200 4770 2389 1738
2917 1738 3566 3687 2918 2337 3008 3724 2486 716 1139 3611 1942 2488 3613 2188 1388 1427 2297 1822
2935 1822 1176 1176 1010 1323 1742 120 666 590 171 -66 350 1118 -1168 -887 -317 -683 -327 -1390 166
2954 166 -75 -767 -2572 -2672 -2142 -2055 -3015 -1803 -1281 -3342 -946 -2495 -1932 -993 -2759 -2360 -3458 -3120
2972c120j35K76L1n6Q1k08J31L58q41Q1J882j414K99k56J23k60K79J384n70j033
2992b968m93M65J609j32k47M49l5o36J42L45O40o6j57K037j103j134L90N22J57
3011b15N15l4q8N09n32Q08M10k09n24Q74J49L98j430O37Q14q07L32M40O90n55
3031B182j88L25k95J176j581L79J197O53j428K77J195k32k20r48J349j015Q33
3048C659j202P33l74o22p19J636j063L58m96R65J18n28j561J691q10n00j20R35
3066B100n36j351J149o40J40l00l60j159K150p00j405P99J098j479k50r82L15
3083a411J136j504J186n52K36o66k37P72n43k90n43J004r78j44r01J207q84q80
3101c992J525k08O49m49n90P88l2j168k9J472R95k767J066K43N02l52j634K170
$$ plain form
2972 -3120 -3255 -2979 -2948 -3004 -2923 -3131 -3000 -2642 -3483 -3402 -1520 -2934 -2635 -2891 -2768 -3028 -2749 -1365 -1935 -2968
2992 -2968 -3461 -2996 -1387 -1519 -1766 -1317 -1352 -1988 -1846 -1501 -861 -927 -1084 953 -150 -1284 -894 -372 -215
3011 -215 300 266 178 687 155 963 1373 1164 640 1514 1663 2061 631 1268 2082 1275 1607 2047 2737 2182
3031 2182 1994 2319 2024 3200 1619 1998 3195 3848 2420 2697 3892 3660 3440 2492 3841 2826 3659
3048 3659 2457 3190 2816 2194 1475 3111 2048 2406 1910 2875 2993 2465 904 2595 1785 1285 1165 2100
3066 2100 1564 213 1362 722 862 562 202 -957 1193 493 -912 -113 985 -494 -744 -1726 -1411
3083 -1411 -275 -1779 -593 -1145 -909 -1575 -1812 -1040 -1583 -1873 -2416 -1412 -2390 -2534 -3435 -2228 -3112 -3992
3101 -3992 -2467 -2675 -2026 -2475 -3065 -2277 -2309 -3477 -3506 -2034 -1039 -3806 -2740 -2497 -1995 -2347 -3981 -1811
3119a811L85j916K05J783l61J33j33O97k36r57N09Q39o85J874j900J369l29r59
3137a493P18j73J704J25k94N83o39n68o8Q31J192j133p23K060o36p09J2P96L07
3156A892J006r41P03M48j696L33M37Q24L0p50l6J333j028K12j742J914J63n54
3174B548p56J719r09l24P89L52j171o68R65L55j20p58k56M12l37m30J02M1J17
3193A671n55R59p91q36k84Q28K50j431L75l5L4k67O9L07j594O86o95L10Q27j825
3213a997O09k23J130j399l39k67R69J98j397J164M38l71r60J588j345l81p18O32
3231b669j87K32l88J5P57J1j009J626l91j396J526p29L62Jk82Q49L5l77k09M81
3251a742O59j450K88J87J855j542K53P66J68n81m60L75R63J75j14j88Q8R43q79
$$ plain form
3119 -1811 -1426 -3342 -3137 -1354 -1715 -1582 -1715 -1018 -1254 -2211 -1702 -863 -1548 326 -1574 -205 -534 -1493
3137 -1493 -775 -948 756 881 587 1170 531 -37 -105 726 1918 785 62 2122 1486 777 789 1585 1892
3156 1892 2898 1957 2660 3108 1412 1745 2182 3006 3036 2286 2250 3583 2555 2767 1025 2939 3102 2548
3174 2548 1792 3511 2602 2278 3067 3419 2248 1580 2545 2900 2780 2022 1766 2178 1841 1411 1513 1554 1671
3193 1671 1116 2075 1284 448 164 992 1242 -189 186 151 185 -82 -13 294 -1300 -614 -1309 -999 -172 -1997
3213 -1997 -1388 -1611 -481 -1880 -2219 -2486 -1517 -1319 -2716 -1552 -1114 -1485 -2445 -857 -2202 -2583 -3301 -2669
3231 -2669 -2856 -2624 -3012 -2997 -2240 -2229 -3238 -1612 -2003 -3399 -1873 -2602 -2240 -2239 -2521 -1672 -1637 -2014 -2223 -1742
3251 -1742 -1083 -2533 -2245 -2058 -203 -1745 -1492 -726 -558 -1139 -1599 -1224 -261 -86 -200 -388 -300 643 -236
3270b36O44L49r74j264J654L68N46l91k12J461j34mm07N74l04o69J292R60o44
3289B609p08K29J108r25m58o44R24P47R2o91N54p76J44J191j212K033j738O97
3307C176n96o61L8l91J013l64J72K58p33Q41k46k8j210L10l30k34L46k45k09o11
3327B96l6J279p08j268R83J48K92j492L62j04r47Q21k52J36K76r34l46M45Mm46
3347a491p79K381k154L49M36J85j461J84N40K73j011L84k7k71n63J078q37l18
3365c102K60M61O43K16j134J424p51n25m07N97Q89j051P42l85n78K092j242R35
3383i16q6j011J230j228Q47M99n65J73P17j44K96j291J945j191n52R82R95O32
3401A332j257j493J760J662j781J595r23J098j282k85J070M44j607J879l09J16
$$ plain form
3270 -236 408 757 -217 -1481 173 541 1087 696 484 1945 1811 1807 1400 1974 1670 1001 2293 3253 2609
3289 2609 1901 2130 3238 2313 1855 1211 2135 2882 2974 2283 2837 2061 2205 3396 2184 4217 2479 3176
3307 3176 2580 1919 1957 1566 2579 2215 2387 2645 1912 2753 2507 2479 1269 1579 1249 1015 1361 1116 907 296
3327 296 260 1539 831 -437 546 694 986 -506 -144 -248 -1195 -374 -626 -490 -214 -1148 -1494 -1049 -1045 -1491
3347 -1491 -2270 111 -2043 -1694 -1258 -1073 -2534 -2350 -1810 -1537 -2548 -2164 -2191 -2462 -3025 -1947 -2784 -3102
3365 -3102 -2842 -2381 -1738 -1522 -2656 -1232 -1983 -2508 -2915 -2318 -1429 -2480 -1738 -2123 -2701 -609 -1851 -916
3383 -916 -1002 -2013 -783 -2011 -1164 -665 -1230 -1057 -340 -484 -188 -1479 466 -725 -1277 -295 700 1332
3401 1332 75 -1418 342 2004 223 1818 895 1993 711 426 1496 1940 333 2212 1903 2019
3417B019J051k119J151O6P50r20K16R25r33K68m91r0j10N04m60L94J97J71j095
3436A494Q15j558J133L43l04j64k99N45M67j872J125j579J050l82N4j11Q43q75
3454G25O77q53O66k91j88n03L86j56m98N39M57j725J36O73m15J71r62k03O52O50
3474f2j029R2j425J450j279N05O22o55q71M94j23j55l52R50J034j561n65J664
3492a266p4j192L82j14J075j389M67L69j27j0m02L65J55M05m92l88N86N10J062
3511g8j083p12K17m75M15P80N70j095K84N89o6J17l35n9J306m46m75J099J92j222
3531d77J326l77L07j848J116P06o9K23P55m01Q07j105P62O90p47Q27q99P39r1
3550B244r47N46M76o60q2j58M40l22N73k29n00O98o03P84J029j812L25O57p27
$$ plain form
3417 2019 3070 951 2102 2168 2918 1998 2214 3139 2206 2474 1983 1893 1783 2287 1827 2221 2418 2589 1494
3436 1494 2309 751 1884 2227 1923 1759 1460 2005 2472 600 1725 146 1196 814 868 757 1600 725
3454 725 1402 549 1215 924 736 233 619 463 -35 504 961 -764 -628 45 -370 -199 -1161 -1364 -712 -62
3474 -62 -1091 -999 -2424 -974 -2253 -1748 -1126 -1781 -2652 -2158 -2281 -2436 -2788 -1838 -804 -2365 -2930 -1266
3492 -1266 -1340 -2532 -2150 -2264 -1189 -2578 -2111 -1742 -1869 -1879 -2281 -1916 -1761 -1356 -1848 -2236 -1650 -1140 -78
3511 -78 -1161 -1873 -1656 -2131 -1716 -936 -366 -1461 -1177 -588 -654 -537 -872 -931 375 -71 -546 553 745 -477
3531 -477 849 472 779 -1069 47 753 684 907 1662 1261 2068 963 1725 2415 1668 2495 1596 2335 2244
3550 2244 1297 1843 2319 1659 1577 1419 1859 1537 2110 1881 1381 2079 1476 2260 3289 1477 1802 2459 1732
3569A732r25K62Q56m56j91R80j153L37N22j956l48J489P32p55j18j333K125k170
3587c70r52K152j331J078j129R84j432Q9l7N61rO82k96n47j279m1O93J46p44K41
3607a541kJ017j304j004M46J654k61q25p73L53L6O00P65o86l78j021Q17k55K68
3626b094j94k07N64Q26j231n15K135j019N55o11J09P72j093N96L47Q3r16j19J949
3645f3m0q6l84J461q47k218J572K04N63o12k20N11Q43o47n44J333o4m44O94p4
3665I38M0o86Q43k06J10P36p07M08N98j034k2P48Q59Oj667P89K82k05j233J169
3685A766J82P13O7l01q06O14O57j043K29L49j355Q53j04k8j097M13N23q12k57
3704E63o5J214p70J074p80n18O88p64P75j399K15L40M04q50k36N40j032J31R80
$$ plain form
3569 1732 807 1069 1925 1469 1278 2258 1105 1442 1964 8 -340 1149 1881 1126 1008 -325 1800 -370
3587 -370 -1322 830 -501 577 -552 432 -1000 -911 -948 -387 -396 286 -10 -557 -1836 -1877 -1184 -1038 -1782 -1541
3607 -1541 -1543 -526 -1830 -2834 -2388 -734 -995 -1820 -2593 -2240 -2204 -1604 -839 -1525 -1903 -2924 -2107 -2362 -2094
3626 -2094 -2288 -2495 -1931 -1105 -2336 -2851 -716 -1735 -1180 -1791 -1682 -910 -2003 -1407 -1060 -977 -1893 -2012 -63
3645 -63 -103 -189 -573 888 41 -2177 -605 -401 162 -450 -670 -159 684 37 -507 826 762 318 1012 938
3665 938 978 292 1135 929 1039 1775 1068 1476 2074 1040 1018 1766 2625 2631 964 1753 2035 1830 597 1766
3685 1766 1948 2661 2728 2427 1621 2235 2892 1849 2078 2427 1072 1925 1821 1793 696 1109 1632 820 563
3704 563 498 1712 942 2016 1236 718 1406 642 1417 18 233 573 977 127 -109 431 -601 -470 510
3723E10j04N21n23K79r36j396K645j724k39L05R29r85k270J264P22M79j745J004
3741a264O58j475l90n35J521L04r64N07l99Q45n67O77k48j768J0O33J073j041
3759b423M23J32j019K52N08J21J86L40j58J258r06J352j199l41J62R66M25l8p5
3778c4r7j052L99N37J68r32R36M7N14j99O3Q8K04n54O72j25K35L28n22J377j478
3799E75K25o13J292q32J74J136Q55j193k59K45O06j429N2M54J007n19k11M1m70
3818A136R29k66O20k53n91q72J303j267J082L57j078N51q3rM21r85r5J331j155
3837A076j32O46j586J001M36j052r39L02J091q39k83j2J84N75j281N69m46M48
3855b42L0j23j334J419n7q94L1j98K48q66K68K24n59p1R5M31K68NO70l22J80l47
$$ plain form
3723 510 406 927 404 683 -253 -1649 996 -728 -967 -662 267 -718 -2988 -1724 -1002 -523 -2268 -1264
3741 -1264 -606 -2081 -2471 -3006 -1485 -1181 -2145 -1638 -2037 -1192 -1759 -1082 -1330 -3098 -3088 -2455 -1382 -2423
3759 -2423 -2000 -1868 -2887 -2635 -2127 -2006 -1820 -1480 -1638 -380 -1286 66 -1133 -1474 -1312 -346 79 41 -34
3778 -34 -131 -1183 -784 -247 -79 -1011 -75 -28 486 287 350 438 642 88 760 635 870 1198 676 2053 575
3799 575 800 187 1479 647 821 1957 2812 1619 1360 1605 2211 782 834 1288 2295 1776 1565 1606 1136
3818 1136 2065 1799 2419 2166 1575 703 2006 739 1821 2178 1100 1651 1568 1559 1980 995 900 2231 1076
3837 1076 944 1590 4 1005 1441 389 -550 -248 843 4 -279 -291 -107 468 -813 -244 -690 -242
3855 -242 -212 -335 -1669 -250 -307 -1201 -1170 -1368 -1120 -1986 -1718 -1494 -2053 -2124 -2029 -1598 -1330 -1325 -655 -977 -797 -1144
3877a144j068K93n35R07p97M47n57J250k84J3m6J78M69r83K38j20L10r53K331
3896e1p89j89j39k29j66J827k81q0n67o21J529j024Q77j64j50N61j165j09K102
3915A172n26q71O62K50Q4k34K81N3O33n84N8M49j002R06p83J220j805Q64j99J514
3935B142o96m55Q67J29Q91l182J383M42n27O02J351j250M06q97K00l64K80J91
3953A513J01o72O89j96o5J221m68j295K19J148J2j292M5Q64j065N86M09p38p25
3972B91k82l42J160j016L01j09P90j329o2o4m63R75m96L49N2K43r51J024j086
3991a015R53j316p3n31J393p04R9M67n11P02q44L43L19j763J23Q67O63m16j83
4010a427N53j020N07j91J69J05J32R25r80p47J035p44R57q76l91Q59r1L05O4L79
$$ plain form
3877 -1144 -2212 -1919 -2454 -1547 -2344 -1897 -2454 -1204 -1488 -1475 -1521 -1343 -874 -1857 -1619 -1739 -1429 -2382 -51
3896 -51 -840 -1029 -1168 -1397 -1563 264 -17 -97 -664 -1285 244 -780 97 -67 -217 344 -821 -930 1172
3915 1172 646 -225 437 687 771 537 818 871 1504 920 978 1427 425 1331 548 1768 -37 827 628 2142
3935 2142 1446 991 1858 1987 2878 -304 1079 1521 994 1596 2947 1697 2103 1206 1406 1042 1322 1513
3953 1513 1614 942 1631 1435 1370 2591 2123 828 1047 2195 2207 915 960 1824 759 1345 1754 1016 291
3972 291 9 -333 827 -189 112 3 793 -536 -598 -662 -1125 -150 -646 -297 -245 -2 -953 71 -1015
3991 -1015 -62 -1378 -1451 -1982 -589 -1293 -1194 -727 -1238 -536 -1380 -1037 -718 -2481 -2358 -1491 -828 -1244 -1427
4010 -1427 -874 -1894 -1387 -1578 -1409 -1304 -1172 -247 -1227 -1974 -939 -1683 -726 -1602 -1993 -1134 -1225 -920 -856 -477
4030d77N53m99q5p78N80K80p18M25M42M78q77K75K30o03R95Q43p74N24j254L77
4050f3N97m42M72O45j037J63L91J067p19m04J025j531O64J01O54m88m05O70j42
4069A218m96J570j187J4P73j031Q19j099Q66l88k01j050J156j002J425J60j49
4086A398j88L7P13r95p47O86n67j37k45J447p62l00L16l96M01m30J61J17p4L6
4106D71M4J46n10n24R78l65r51n27N0J251K62j173Q42j518L36R3N11N20k03q20
4126a087q15Q62j33QM6J393k662K55J202m77M30n22N57j1r42J410m30l36k6J48
4146a130j358R9Q6J136o07L11J383k627K644j363J31p81J073L72L15k10L22q41
4164a045n13Q60K82km54M2k45Q58Q5k7k94R4J683j839n42R25J31J745j062R62
$$ plain form
4030 -477 76 -423 -508 -1286 -706 -426 -1144 -719 -277 201 -676 -401 -171 -774 221 1064 290 814 -440 -63
4050 -63 534 92 564 1209 172 335 726 1793 1074 670 1695 164 828 929 1583 1095 690 1360 1218
4069 1218 722 2292 1105 1119 1892 861 1680 581 1447 1059 858 -192 964 -38 1387 1547 1398
4086 1398 1210 1247 1960 965 218 904 337 200 -45 1402 640 340 656 260 661 231 392 509 435 471
4106 471 515 661 151 -373 605 240 -711 -1238 -1188 63 325 -848 -6 -1524 -1188 -1095 -584 -64 -267 -1087
4126 -1087 -1902 -1040 -1173 -1165 -1119 274 -2388 -2133 -931 -1408 -978 -1500 -943 -954 -1896 -486 -916 -1252 -1278 -1130
4146 -1130 -2488 -2389 -2303 -1167 -1774 -1463 -80 -2707 -63 -1426 -1295 -2076 -1003 -631 -316 -526 -204 -1045
4164 -1045 -1558 -698 -416 -418 -872 -830 -1075 -217 -132 -159 -453 -359 1324 -515 -1057 -132 -1 1744 682 1644
4184A644n79j640J752O75l31o30M33o86N43j44l77J516j423Q40o21N36O35j155
4202I88o30J462R42j995J302O45j593m59p3j3J040J08l46R51j457K68O40m58r55
4221C67j13p7J401k134L47J204j183L67Q52p65l74o49J61P09r9J35P79k53p39
4240f4m78L42m06M15K22o88m42j46J006q32J9j57M78L93r19J95J685k071O02k64
4260a110J09q79L44j51L54k87o48J093Q78p82m23M66J68P15j543k97J393j156
4278a756R67p62n91J790j873Q44NO82n09L57P03p26L01J97P78J18j692J150j13
4297a30P02l61p98M82P50p15%m97J385n4j347M37O13K43P25k84j465K5J283J50
4317A144p5O4J03L94o17J68O59j152Q69l85n55k28Q99j25N86k01p07M91m44O99
$$ plain form
4184 1644 1065 -575 1177 1852 1521 891 1324 638 1181 1037 660 2176 753 1593 972 1508 2143 988
4202 988 358 1820 2762 767 2069 2714 1121 662 589 576 1616 1724 1378 2329 872 1140 1780 1322 367
4221 367 254 177 1578 -556 -209 995 -188 179 1031 266 -108 -757 -596 113 14 149 928 675 -64
4240 -64 -542 -200 -606 -191 31 -657 -1099 -1245 -239 -1071 -1052 -1209 -731 -338 -1257 -1062 623 -1448 -846 -1110
4260 -1110 -1001 -1880 -1536 -1687 -1333 -1620 -2268 -1175 -297 -1079 -1502 -1036 -868 -153 -1696 -1993 -600 -1756
4278 -1756 -789 -1551 -2142 -352 -2225 -1381 -1376 -694 -1203 -846 -143 -869 -568 -371 407 525 -1167 -17 -130
4297 -130 572 211 -587 -105 645 -70 -70 -567 818 764 -583 -146 467 710 1435 1151 -314 -289 994 1144
4317 1144 1069 1133 1236 1630 1013 1181 1840 688 1557 1172 617 389 1288 1163 1749 1548 841 1332 888 1587
4337A587o33N80M75j013J094n26p79O07r9p19Q53L96j689k93J169j006L00J516
4355A820j047J94J048l18l75l65k26r03P36J06l50m15K00j18j009J258m52o21
4373h37O5l64M86l73k32n54R59O1R05q69j481P11k90P69K19j316R38M1o2L56o32
4394a500M43R1K8m16r07J035m32P57q24Q65m81K82m04n99O20N41M15q78k07m00
4414a971O55L24O05l80M72j32j70M95j11j72k25P54l91L10L71j403J323j376J728
4433G06p71M26M61r67J764j054n39P18k60k54K35L00K19N60m78n11J21j64n12
4452@J997j770M27M16q03M79K27l77O31r44K08O50m42P36j85k69L80j596J453
4471A218r83K010k264J323m62M45K56j241M90q46R39j33L88o98K95O0p44J344
$$ plain form
4337 1587 954 1534 2009 996 2090 1564 785 1392 1293 574 1427 1823 134 -159 1010 4 304 1820
4355 1820 773 967 2015 1697 1322 957 731 -172 564 670 320 -95 105 -13 -1022 236 -216 -837
4373 -837 -772 -1136 -650 -1023 -1255 -1809 -850 -789 116 -753 -2234 -1523 -1813 -1044 -825 -2141 -1203 -1162 -1224 -868 -1500
4394 -1500 -1057 -966 -938 -1354 -2261 -1226 -1658 -901 -1725 -860 -1341 -1059 -1463 -2062 -1442 -901 -486 -1364 -1571 -1971
4414 -1971 -1316 -992 -387 -767 -295 -427 -597 -102 -213 -385 -610 144 -247 63 434 -969 354 -1022 706
4433 706 -65 361 822 -145 1619 565 26 744 484 230 465 765 984 1544 1066 555 676 512 0
4452 0 1997 227 654 1070 267 746 973 596 1227 283 491 1141 699 1435 1250 981 1361 -235 1218
4471 1218 235 2245 -19 1304 842 1287 1543 302 792 -54 885 752 1140 442 737 797 53 1397
4489A397j455l16O12j2j026J086l38r1K77j12O47l84p45r71O50l6J90J65r15j75
4509a552M83k76L68R21q55J93M28j368q9K106j085K74r81J046j589O17m45N05
4527a299k52L14J85N43j58o54j07L70J86k59R42n70L42L43p51J25J21n99M26P02
4547e0j049J447r07K38J39Q1k95p09N28K72Q18O90o41j73j556K353j106l5L94
4566D39n97J039j013J85L38m4k37J250o77r23J799p05O09ll83r83K009n53j497
4585E3J018K68M64m23P3q59R0N79j417N56N65N69m76N59j176P58M91o92n18J449
4605A931o80r46M1J000o14k30P11j759P36j83m37N45L6M49N85n86p24R72p76r51
4625h80M21N21K48q68K89N02r30N06o50J55K34j090N66l74O27p90J091j393j03
$$ plain form
4489 1397 -58 -374 238 226 -800 286 -52 -143 134 22 669 285 -460 -1431 -781 -817 -627 -462 -1377 -1552
4509 -1552 -1069 -1345 -977 -56 -911 -718 -290 -1658 -1747 359 -726 -452 -1433 -387 -1976 -1359 -1804 -1299
4527 -1299 -1551 -1237 -1052 -509 -667 -1321 -1428 -1058 -872 -1131 -189 -759 -417 -74 -825 -700 -579 -1178 -752 -50
4547 -50 -1099 348 -559 -321 -182 -101 -396 -1105 -577 -305 513 1203 562 389 -1167 1186 80 45 439
4566 439 -158 881 -132 53 391 347 110 1360 683 -240 1559 854 1463 1460 1077 94 2103 1550 53
4585 53 1071 1339 1803 1380 1453 594 684 1263 -154 402 967 1536 1060 1619 443 1201 1692 1000 482 1931
4605 1931 1251 305 346 1346 732 502 1213 -546 190 7 -430 115 151 600 1185 599 -125 847 71 -880
4625 -880 -459 62 310 -558 -269 233 -697 -191 -841 -686 -452 -1542 -976 -1350 -723 -1513 -422 -1815 -1918
$$ [...]
##END NTUPLES=NMR FID
##END=
