##TITLE=1H_UK-8'
 CDCl3, 108 sc, 
 30.7.2020
##JCAMPDX= 6.0         $$ Bruker NMR JCAMP-DX V2.0
##DATA TYPE= NMR FID
##DATA CLASS= NTUPLES
##ORIGIN= UXNMR, Bruker Analytische Messtechnik GmbH
##OWNER= root
$$ XWIN-NMR		Version 3.5
$$ Thu Jul 30 13:00:48 2020 Russian Standard Time (UT+4h)  she@DPX200
##.OBSERVE FREQUENCY= 200.1315
##.OBSERVE NUCLEUS= ^1H
##.DELAY= (6, 6)
##.ACQUISITION MODE= SIMULTANEOUS
##.ACQUISITION SCHEME= undefined
##.AVERAGES= 108
##.DIGITISER RES= 18
##SPECTROMETER/DATA SYSTEM= spect
##.PULSE SEQUENCE= zg30
##.SOLVENT NAME= D2O
##.SHIFT REFERENCE= (INTERNAL, D2O, 0, 15.7039)
##AUDIT TRAIL= $$ (NUMBER, WHEN, WHO, WHERE, WHAT)
$$ ##TITLE= Audit trail, XWIN-NMR		Version 3.5
$$ ##JCAMPDX= 5.01
$$ ##ORIGIN= Bruker BioSpin GmbH
$$ ##OWNER= she
$$ F:/spectra/data/she/nmr/H-F/1/audita.txt
$$ ##AUDIT TRAIL=  $$ (NUMBER, WHEN, WHO, WHERE, WHAT)
(   1,<2020-07-30 12:58:33.32 +0400>,<she>,<DPX200>,
      <continue with go, POWCHK disabled, PULCHK disabled
       configuration hash MD5:
       00 E9 B6 7A A2 85 ED C7 34 08 36 98 17 FE 4E 26
       data hash MD5: 16K
       94 F9 16 18 84 EF B7 25 1C 2E 16 00 7F 13 E8 B2>)
$$ ##END=
$$ 
$$ hash MD5
$$ 45 F2 D1 AB AA 14 13 AD 69 3D 98 12 4D F8 74 5F
##$RELAX= 
##$RELAX= 
##$RELAX= 
##$RELAX= 
##$RELAX= 
##$RELAX= 
$$ Bruker specific parameters
$$ --------------------------
##$DU= <F:/spectra>
##$EXPNO= 1
##$NAME= <H-F>
##$PROCNO= 1
##$TYPE= <nmr>
##$USER= <she>
##$AMP= (0..31)
100 100 100 100 100 100 100 100 100 100 100 100 100 100 100 100 100 100 
100 100 100 100 100 100 100 100 100 100 100 100 100 100 
##$AQSEQ= 0
##$AQ_mod= 1
##$AUNM= <au_zg>
##$AUTOPOS= <>
##$BF1= 200.13
##$BF2= 200.13
##$BF3= 200.13
##$BF4= 200.13
##$BF5= 200.13
##$BF6= 200.13
##$BF7= 200.13
##$BF8= 200.13
##$BYTORDA= 1
##$CFDGTYP= 0
##$CFRGTYP= 5
##$CHEMSTR= <none>
##$CNST= (0..31)
1 1 145 1 1 1 1 1 1 1 1 1 1 1 1 1 1 1 1 1 1 1 1 1 1 1 1 1 1 1 1 1 
##$CPDPRG= <>
##$CPDPRG1= <>
##$CPDPRG2= <>
##$CPDPRG3= <>
##$CPDPRG4= <mlev>
##$CPDPRG5= <mlev>
##$CPDPRG6= <mlev>
##$CPDPRG7= <mlev>
##$CPDPRG8= <mlev>
##$CPDPRGB= <>
##$CPDPRGT= <>
##$D= (0..31)
0 1.2 0 0 0 0 0 0 0 0.06 0 0.03 0 0 0 0 0.0002 0 0 0 0 0 0 0 0 0 0 0 0 
0 0 0 
##$DATE= 1596099166
##$DBL= (0..7)
120 120 120 120 120 120 120 120 
##$DBP= (0..7)
150 150 150 150 150 150 150 150 
##$DBP07= 0
##$DBPNAM0= <>
##$DBPNAM1= <>
##$DBPNAM2= <>
##$DBPNAM3= <>
##$DBPNAM4= <>
##$DBPNAM5= <>
##$DBPNAM6= <>
##$DBPNAM7= <>
##$DBPOAL= (0..7)
0.5 0.5 0.5 0.5 0.5 0.5 0.5 0.5 
##$DBPOFFS= (0..7)
0 0 0 0 0 0 0 0 
##$DE= 6
##$DECBNUC= <off>
##$DECIM= 24
##$DECNUC= <off>
##$DECSTAT= 4
##$DIGMOD= 1
##$DIGTYP= 9
##$DL= (0..7)
0 120 120 120 120 120 120 120 
##$DP= (0..7)
150 150 150 150 150 150 150 150 
##$DP07= 0
##$DPNAME0= <>
##$DPNAME1= <>
##$DPNAME2= <>
##$DPNAME3= <>
##$DPNAME4= <>
##$DPNAME5= <>
##$DPNAME6= <>
##$DPNAME7= <>
##$DPOAL= (0..7)
0.5 0.5 0.5 0.5 0.5 0.5 0.5 0.5 
##$DPOFFS= (0..7)
0 0 0 0 0 0 0 0 
##$DQDMODE= 0
##$DR= 18
##$DS= 0
##$DSLIST= <SSSSSSSSSSSSSSS>
$$ [...]
##$SUBNAM2= <"">
##$SUBNAM3= <"">
##$SUBNAM4= <"">
##$SUBNAM5= <"">
##$SUBNAM6= <"">
##$SUBNAM7= <"">
##$SUBNAM8= <"">
##$SUBNAM9= <"">
##$SW= 24.9337058887773
##$SWIBOX= (0..15)
0 0 2 0 0 0 0 0 0 0 0 0 0 0 0 0 
##$SW_h= 4990.01996007984
##$TD= 16384
##$TD0= 1
##$TE= 0
##$TE2= 300
##$TE3= 300
##$TEG= 300
##$TL= (0..7)
0 120 120 120 120 120 120 120 
##$TP= (0..7)
150 150 150 150 150 150 150 150 
##$TP07= 0
##$TPNAME0= <>
##$TPNAME1= <>
##$TPNAME2= <>
##$TPNAME3= <>
##$TPNAME4= <>
##$TPNAME5= <>
##$TPNAME6= <>
##$TPNAME7= <>
##$TPOAL= (0..7)
0.5 0.5 0.5 0.5 0.5 0.5 0.5 0.5 
##$TPOFFS= (0..7)
0 0 0 0 0 0 0 0 
##$TUNHIN= 0
##$TUNHOUT= 0
##$TUNXOUT= 0
##$USERA1= <user>
##$USERA2= <user>
##$USERA3= <user>
##$USERA4= <user>
##$USERA5= <user>
##$V9= 5
##$VALIST= <valist>
##$VCLIST= <CCCCCCCCCCCCCCC>
##$VD= 0
##$VDLIST= <DDDDDDDDDDDDDDD>
##$VPLIST= <PPPPPPPPPPPPPPP>
##$VTLIST= <TTTTTTTTTTTTTTT>
##$WBST= 1024
##$WBSW= 4
##$XGAIN= (0..3)
0 0 0 0 
##$XL= 0
##$YL= 0
##$YMAX_a= 930555
##$YMIN_a= -497209
##$ZGOPTNS= <>
##$ZL1= 120
##$ZL2= 120
##$ZL3= 120
##$ZL4= 120
##$ABSF1= 10
##$ABSF2= 0
##$ABSG= 5
##$ABSL= 3
##$ALPHA= 0
##$AQORDER= 0
##$ASSFAC= 0
##$ASSFACI= 0
##$ASSFACX= 0
##$ASSWID= 0
##$AUNMP= <proc_1d>
##$AZFE= 0.1
##$AZFW= 0.1
##$BCFW= 1
##$BC_mod= 2
##$BYTORDP= 1
##$COROFFS= 0
##$CY= 11.3945322036743
##$DATMOD= 1
##$DC= 2
##$DFILT= <>
##$DTYPP= 0
##$F1P= 16.9975609425685
##$F2P= -3.02152046262296
##$FCOR= 0.5
##$FTSIZE= 0
##$FT_mod= 4
##$GAMMA= 1
##$GB= 0.15
##$INTBC= 1
##$INTSCL= 1
##$ISEN= 128
##$LB= 0.24
##$LEV0= 0
##$LPBIN= 0
##$MAXI= 10000
##$MC2= 0
##$MEAN= 0
##$ME_mod= 0
##$MI= 1.114404
##$NCOEF= 0
##$NC_proc= 0
##$NLEV= 6
##$NOISF1= 3.799351
##$NOISF2= 2.8
##$NSP= 1
##$NTH_PI= 0
##$NZP= 0
##$OFFSET= 15.70392
##$PC= 1
##$PHC0= -9789.891
##$PHC1= 7.40092
##$PH_mod= 1
##$PKNL= yes
##$PPARMOD= 0
##$PSCAL= 0
##$PSIGN= 0
##$REVERSE= no
##$SF= 200.130013532006
##$SI= 16384
##$SIGF1= 3
##$SIGF2= 2
##$SINO= 400
##$SIOLD= 16384
##$SREGLST= <1H.CDCl3>
##$SSB= 0
##$STSI= 0
##$STSR= 0
##$SW_p= 3612.71676300578
##$SYMM= 0
##$S_DEV= 0
##$TDeff= 0
##$TDoff= 0
##$TI= <>
##$TILT= no
##$TM1= 0
##$TM2= 0
##$TOPLEV= 0
##$USERP1= <user>
##$USERP2= <user>
##$USERP3= <user>
##$USERP4= <user>
##$USERP5= <user>
##$WDW= 1
##$XDIM= 8192
##$YMAX_p= 0
##$YMIN_p= 0
$$ End of Bruker specific parameters
$$ ---------------------------------
##NTUPLES= NMR FID
##VAR_NAME=  TIME,          FID/REAL,        FID/IMAG
##SYMBOL=    X,             R,               I
##VAR_TYPE=  INDEPENDENT,   DEPENDENT,       DEPENDENT
##VAR_FORM=  AFFN,          ASDF,            ASDF
##VAR_DIM=   8192,          8192,            8192
##UNITS=     SECONDS,       ARBITRARY UNITS, ARBITRARY UNITS
##FACTOR=    0.0002004,     1,               1
##FIRST=     0,             0,               0
##LAST=      1.6414764,     0,               0
##MIN=       0,             -497209,         0
##MAX=       1.6414764,     930555,          0
$$ Real data points
##PAGE= N=1
##DATA TABLE= (X++(R..R)), XYDATA
$$ [...]
3009a521p67Q9p1M73q93M28J27j331J407n6p24n92K36N91L72n68m15p92K107L63
3029a537p91n75J722r8l30k75m02N13L56M9R96j527N83O4O9P71J19K42J25N0q2
3050D2J14k27P2m91J152J109j375k30Q12Qk24J77q71O90k43q0R33p5J143m71m7
3071A918m35J469n54rL06j114J501j124O56l31J000j176M01K65q39J018o75R8
3089B375r69J145J053k0j271M55J22p36n20R38j736J597j298m5J109j294J83j001
3107H7J323r15L85l64K53L44P96j713Q06j22j220N10n4k51k84j12M70j079P3K08
3127h59M62q81N6P38j424K07J11k13m43o12O92J16N7j52q12J052k51j68K75r05
3147b954J030q81J116l61k51m60P36m32J91L72N84l82p50M3o24J134m65P46j315
$$ y = [-1521, -2288, -2199, -2270, -1797, -2690, -2262, -2135, -3466, -2059, -2115, -2839, -3431, -3195, -2604, -2232, -2800, -3215, -4007, -1900, -1537, -2328, -2903, -1181, -1279, -1609, -1884, -2286, -1773, -1417, -1368, -372, -1899, -1316, -1252, -1183, -412, -293, -51, 74, 124, 42, 156, -71, 1, -490, 662, 1771, 396, 166, 978, 986, 762, 939, 68, 758, 515, 435, 1368, 1293, 2436, 1965, 1918, 1483, 2952, 2398, 2389, 2695, 1581, 3082, 1958, 2614, 2283, 3283, 2107, 2508, 2773, 1934, 2952, 2277, 2375, 1406, 2551, 3604, 3584, 2313, 2768, 2890, 2154, 1634, 2572, 836, 2433, 1135, 1090, 2199, 905, 1088, 87, 1410, 495, 880, 516, 769, 1113, 1909, 196, 1002, 880, -340, 170, 116, -135, -419, -531, -61, -1140, -1067, -859, -397, -1278, -1222, -484, -1908, -1701, -1590, -1803, -2246, -2858, -2166, -2050, -1993, -2145, -2957, -1905, -2156, -2324, -2049, -2954, -1924, -2805, -1689, -2050, -2301, -2761, -2025, -2457, -2266, -1894, -1310, -1692, -2442, -2399, -3023, -1889, -2354, -1608, -2923]
3166b923R44N48o43R12N48K07q97P08L78o00p8n47N67O15j53J302q78Q46j31M14
3186A139l84m44N15j80M41K11m22J426j390l46J911j452K43Q9J018k21j32J646
3204C668p35q64K11R68j056J75N62n33N60J08k25m54l03N39L1j319J579m82q19
3223A611J93n8J45r1M97j80K40j751Q62L05n60N81l29j123N95o38O79j210R8Q62
3243G28m39K40j628P37N6K82r89J50O34l07p7n3J82m92r0r37J548j366N07o35
3263a949n5l79J320j614o0J076k81o60k09P89m45J066j588J039l01L18o26N31
3281b028m38k6l69o80J766m18Q92n58r0q27J271l21R81j770R37M35n50J759j119
3300a153O43q17J294K94j175J068m07M9l05L91J79j21m2K83Q8m27j01R23m48R13
$$ y = [-2923, -1979, -1431, -2074, -1162, -614, -407, -1304, -596, -218, -818, -896, -1443, -876, -261, -414, 888, 10, 856, 725, 1139, 755, 311, 826, 646, 1087, 1298, 876, 2302, 912, 566, 2477, 1025, 1268, 1357, 2375, 2154, 2022, 3668, 2933, 2069, 2280, 3248, 2192, 2367, 2929, 2396, 2956, 3064, 2839, 2385, 2082, 2621, 2652, 1333, 2912, 2430, 1611, 1804, 1746, 1891, 1800, 2297, 2117, 2357, 606, 1468, 1773, 1213, 1794, 1465, 342, 937, 299, 978, -232, -134, 728, 289, 529, -1099, -362, -306, -24, -1013, -863, -229, -536, -613, -666, -484, -976, -1066, -2003, -455, -1821, -1314, -1949, -2004, -2383, -1063, -2677, -2737, -1661, -1942, -2602, -2811, -2022, -2467, -1401, -2989, -1950, -2251, -1933, -2559, -2028, -2466, -2492, -2861, -3541, -1775, -2193, -1301, -1859, -1949, -2776, -1505, -1826, -845, -2615, -1678, -1243, -1793, -34, -1153, -510, -1327, -33, 261, -914, 154, -253, -204, -509, -118, 61, -60, -102, 181, 269, -158, -259, 664, 216, 1129]
3320A129m65L88j292K331k231J061K478j092r30l76O24O72l72l28K150j491K02
3337B458n77k23R08n59O46j770J752m04m8L12k85N37M73j110K50k79L58J64m30
3356B173n77n49J349j978Q16P93j177N08j93k89K99p43R63j391O67J92k57o26
3374b0k50R97j739K77l90J07m21L03P59p20Q50l32r7r52K37o01J581j346n6J49
3394a664N63p30k86J555L15j524m95m69P27k19j66j96P17J92l46J62M06M28j153
3413b183J605k013K49L65O47q05k76P75k3J44N39q15R26n99R93j076n67J376k09
3432i47O45n6J24n86O52pq6O32p60m21K0O90L05j147J718k07K35M4k35n44O51
3453G20k29O07M45m35j528J615R91j123N55Q61p86O15K01p64p2k15J145n25L05
$$ y = [1129, 664, 1052, -240, 2091, -140, 921, 3399, 2307, 1377, 1001, 1625, 2297, 1925, 1597, 3747, 2256, 2458, 1881, 1658, 2566, 2007, 2653, 883, 2635, 2231, 2183, 2495, 2210, 2747, 3220, 2110, 2360, 2081, 2439, 2603, 2173, 1596, 1047, 2396, 418, 1234, 2027, 850, 1358, 1165, 876, 1175, 432, 1395, 4, 671, 863, 606, -20, -270, 727, -1012, -735, -1125, -1018, -1439, -1136, -377, -1097, -247, -579, -676, -1628, -1391, -1992, -411, -1757, -1813, -1664, -1101, -1831, -2117, -562, -247, -1771, -2266, -2735, -2008, -2227, -2393, -2589, -1872, -1680, -2026, -1864, -1458, -1030, -2183, -578, -2591, -2342, -1977, -1330, -2135, -2411, -1636, -1659, -1515, -976, -1791, -865, -1464, -471, -1547, -2114, -738, -947, -302, -358, -234, -820, -168, -175, -261, 371, -389, -810, -790, -100, 205, -942, 776, 569, 804, 848, 613, 69, 720, 491, 1098, 1543, 1108, -420, 1195, 2186, 1063, 1618, 2479, 1693, 2308, 2509, 1745, 1673, 1458, 2603, 2078, 2383]
3472B383J1m02J315j760J140p07k14P13j946L09Q74L54k07m21L95J33o75Q39j092
3491A042M29k3n39N97k088K118k52n04o07J221m89r24m19N55l74j76L80p1j727
3510a851R65j82j2P26Nk38m71J91p81N40q42Q47j848P87J170l08M1k86l13R58
3530i02n28o37K40j55M18q93O15L8rn95l35J083L29q37n9o34O02J394l81k02o14
3551b062j35J194m87n21K3J270l61l35j04J51J421J01j299o44M97J596j610J397
3569I2j429J789o43P27Q18j364O63M55p62L91N31L1o03K63l8Q09m40J74k71J311
3589B504R5j511P13n98R08j471O28J303j412O3J070j35j70q39J238L38j338M62
3607A848O58j304J227r76o70Q07K14K71m78N7k27O65q03P31j038j080J748R4q98
$$ y = [2383, 2394, 1992, 3307, 1547, 2687, 1980, 1766, 2479, 533, 842, 1716, 2070, 1863, 1442, 1837, 1970, 1295, 2134, 1042, 1471, 1448, 909, 1506, -582, 1536, 1284, 780, 173, 1394, 905, -19, -438, 117, -257, -433, -53, -124, -1851, -886, -1068, -1080, -354, -349, -587, -1058, -867, -1648, -1108, -1950, -1103, -2951, -2164, -994, -1302, -1261, -1547, -1860, -902, -1430, -2067, -1827, -1982, -1564, -2457, -1842, -1804, -1813, -2408, -2743, -1660, -1331, -2168, -2227, -2861, -2259, -865, -1246, -1448, -2062, -2197, -1003, -1490, -2011, -1988, -718, -1079, -1414, -1518, -1367, 54, 155, -1144, -1788, -1291, 305, -1305, 92, -1337, 452, -191, 536, 1354, -10, 653, 1108, 346, 737, 1268, 1299, 696, 959, 921, 1730, 1290, 1464, 1193, 2504, 2599, 1088, 1801, 1203, 2111, 640, 1268, 2571, 1159, 1222, 2292, 2157, 1987, 1148, 2386, 2724, 1386, 1848, 2506, 1202, 2429, 1453, 783, 1590, 1804, 2075, 1597, 1654, 1427, 2092, 1289, 2020, 982, -98, 1650, 1744, 846]
3626H46J054p08k95k50k82j0o43Q01q56P07l09q82N70j829J843M71p42p62J314
3645C8l13m72P22j406L23J78k47j44k53N2Q91k97j040J27O33p20k86J319j431
3664b326J618o39o52N10M78j747J718o44n52O46n60O31n60Q5Q80q62m23J346P09
3683c44n77l59l9o99J028J40L83J53j220M01L53o25J031K56l29N66M1J61J40J6
3703D77N46R85r47p52m53J417m92m75k11Q61P79j73p28M58l22O66L35m70k77l5
3723A189J076m57O87o17p8J89p72K079j614J249j742J001n27M75J34j024M8L03
3741A599L74j205L48Nk22Q6J134p89k53O1K29O5l42n56p2P74M4oj355J37m2J011
3763A025j175N34l34k97J04l3n00J051j483M12K58N0n90N25p53n86M20K45j723
$$ y = [846, 1900, 1192, 897, 647, 365, 355, -288, 513, -343, 364, 55, -827, -257, -2086, -243, 228, -514, -1276, 38, -275, -747, -25, -1431, -1108, -930, -1177, -1321, -1574, -1522, -631, -928, -1968, -1841, -1208, -1928, -2214, -895, -2326, -708, -1347, -1999, -1489, -1011, -2758, -1040, -1684, -2236, -1590, -2150, -1519, -2079, -1994, -1114, -1976, -2399, -1053, -344, -921, -1280, -1319, -2018, -990, -850, -467, -314, -1534, -1133, -780, -1405, -374, -118, -447, 119, 160, 321, 461, 477, 1023, 2008, 1061, 309, -144, 1273, 781, 306, 95, 956, 1735, 1562, 834, 1292, 970, 1636, 1971, 1501, 1224, 1189, 2265, 1808, 2495, 1878, 1800, 1989, 1217, 3296, 1682, 2931, 1189, 2190, 1663, 2138, 2272, 1248, 1296, 1599, 1973, 768, 1116, 1121, 899, 985, 2119, 1330, 1077, 1138, 1367, 1432, 1090, 534, 462, 1236, 1280, 1274, -81, 56, 14, 1025, -150, 384, 50, -247, -143, -176, -676, 375, -1108, -696, -438, -388, -978, -453, -1206, -1792, -1372, -1127, -2850]
3782b850K080m76K89j308Q96J3o6n87n0K84j024J892p52k48l86O06J14L75l27
3801a525m54N88j191J759n68r28M99l39L25L26O3L60l71J13K96J77m40J021j070
3820a359J298j14j096J339J63j283k51Q95J453p77l69N64j602J634k24J21N39
3837I31M29k36J0l4j42J60l28k76L21J616j180j15l09K67J81m34J250m47m46P31
3857A949k12O13J69n45n76Q19o90Q15r60N0J057r20o4M34n49l5j51M47r27J38
3877H62l51L60L0k95P73r8j336J373P09n25j660j47J235r55L96n50m45J095j370
3896h99J472j298j17M78K34k81lL03p31n24P96o62K17M77q05l2K81K84j046K11
3916a645q8K014k389J267l03r25Q39m27N12Jn72n08j61J028m32K73r45K348k01
$$ y = [-2850, -770, -1246, -957, -2265, -1369, -1356, -1422, -2009, -2059, -1775, -2799, -907, -1659, -1907, -2293, -1687, -1573, -1198, -1525, -1979, -1391, -2582, -823, -1391, -2319, -1820, -2159, -1834, -1508, -1445, -1085, -1456, -1343, -1047, -870, -1310, -289, -1359, -61, -175, -1271, 68, 231, -1052, -1303, -408, 1045, 268, -101, 463, -1139, 495, 271, 392, 931, 1360, 1124, 1134, 1100, 958, 1118, 790, 514, 835, 2451, 1271, 1156, 847, 1114, 1295, 861, 2111, 1664, 1218, 1949, 1737, 2350, 2519, 1974, 1398, 2217, 1527, 2342, 1382, 1432, 2489, 1569, 1505, 1939, 1390, 1355, 1204, 1651, 724, 862, 511, 871, 901, 606, 1379, 1281, -55, 1318, 2027, 1502, -158, -305, 930, -25, 371, -179, -624, 471, -899, 573, -725, -842, -364, -130, -411, -414, -111, -842, -1366, -570, -1232, -1015, -538, -1343, -1375, -1094, -810, -1856, -1645, -1733, 281, -2108, -841, -1144, -2069, -1230, -1657, -1145, -1144, -1716, -2224, -2385, -1357, -1789, -1516, -2461, -113, -314]
3935c14j825O69n11L30L88K77q72R54m91p0J189j480J252m94R22n28J232r36j729
3954b037J259O85k38M86O24J24l47J29l35R8m61R48p21J040j094Q02L88L50m13
3973A287r71L36J666r44j176O30L18K68q54J862j408Q62J168k406J561j623P10
3990A286Q18k10m72J224K12k026MO17o91J640n05j050M63J76l12Nq06K41R89k48
4010A355q73M34r42J369p56R58j171J075j435Q86p71n37n41J066M30r49k16N58
4028f0o86N71K69o46l03Q89q63j39r72J142q52J357j244J51j38m41Q25N25ko61
4048a278L92r25q10J513o3L48j715j94O11J42M00j296J512k46O77q57N01n70J82
4067a676M06O50k17k63l96J122n86j74J46J92J034p42r13Q02j48K91K66o86P75
$$ y = [-314, -2139, -1470, -1981, -1651, -1263, -986, -1858, -904, -1395, -1465, -276, -1756, -504, -998, -76, -604, 628, -308, -2037, -778, -93, -331, 155, 779, 903, 556, 685, 350, 448, -13, 935, 214, 1254, 160, 962, 1350, 1700, 1287, 316, 652, 2318, 1374, 198, 828, 1146, 1414, 560, 2422, 1014, 1876, 3044, 638, 2199, 576, 1286, 2104, 1894, 1422, 2646, 2858, 832, 836, 1453, 762, 2402, 1897, 847, 1310, 1486, 1174, 1179, 373, 614, 1603, 1355, 482, 916, -26, 1343, 587, 1545, 374, 1449, 14, 900, 129, -408, -949, 117, 547, -402, -618, -60, -746, -175, 94, -552, -855, 34, -829, -968, -1940, -798, -1650, -293, -1537, -1386, -1524, -1965, -1140, -615, -617, -1278, -886, -1811, -2621, -1108, -1171, -823, -2538, -2732, -2121, -1979, -1579, -2875, -1363, -1609, -932, -1789, -1288, -1858, -1676, -1270, -620, -837, -1100, -1496, -374, -960, -1134, -988, -796, 238, -504, -1417, -615, -763, -472, -206, -892, -117]
4086a17o9k14N70o84R45l29p78P30m10J153m45J280j704Q85r0J05N84j277Q37
4105I72l51j14J333Nr08O69J72l60M5Q64K8r79r0R2p55Q17l88M98j548J056r3
4126I65j87J163p42L0Q9L98j732J056J91j021J780o78Q5j246J056r9j088k30J683
4145A473N36k075M13L43m85Q96p46p13J551j632k0M97l32l93Q70q10J292j894
4163a229J249P3j012N79n64K20r49Q25r73J062k16m02l03J94J67m95l52J350q92
4182a668L71R6O20j117l47J247j554P90L0l22O34r8M99N85n68k04J62k72q3j31
4202a330J071L42j589J135j23J56q33M25P91j503J062m38O45j38N0N89j657J227
4220a18K82M16j23r33O84P84j469J011n3J016q12J52J31k7n85Q62N5m97R93J31
$$ y = [-117, -186, -400, 170, -514, 431, 102, -676, 54, -356, 797, 352, 1632, -72, 813, 723, 828, 1412, 135, 972, 621, 507, 1840, 1845, 937, 1606, 1778, 1418, 1463, 2327, 2355, 1376, 1286, 1378, 623, 1440, 1052, 1550, 2, 1058, 965, 778, 1941, 1199, 1229, 1318, 1716, -16, 1040, 1231, 210, 1990, 1312, 1397, 151, 1207, 1108, 20, -210, 1473, 2009, -66, 347, 690, 205, 1101, 355, -358, 1193, -439, -459, 38, -294, -687, 183, -627, 665, -1229, 20, 93, -919, -340, -904, -684, -1633, -808, -1781, -719, -935, -1337, -1640, -1446, -1279, -1774, -2126, -776, -1668, -1297, -1201, -581, -1698, -2045, -798, -2352, -1562, -1532, -1854, -1220, -1318, -819, -234, -802, -1006, -844, -1116, -1199, -1330, -259, 83, -1506, -371, -494, -338, -1171, -746, 45, -1458, -396, -834, -189, -327, -277, 312, -1345, -118, 164, 580, 457, -476, 208, 992, -477, 534, 481, 1497, 685, 837, 968, 941, 356, 1218, 1273, 776, 1769, 1900]
4240A900L30j439P18k84n08m71N4J94R45M0j005N03Q82j139o98J809p81P00j42
4259A608j024N57p6j069J292R04j189q06l86J227K69l58K04k44p66J547r70j82
4277E38j50j15J65q27P28j064J464n76r6o08J019j212J184q63L7L24j201J019
4295b34j204Q07k21M54n16L55o12N74k65n58J71N63j200N34O52l18L13n60J14
4314a151k97l08J078J045j517L69l37M21n93m36J000K60O09p09r64m2N04r0O32
4333e26o59L5k75L91L23M39O34o33p39P96q86N35J472j183N38r82j5P22l07J017
4353F97l39l56k87O87j86R29p8q65Q25M06L34k319K012m09p46R22K17L78N5r56
4373I21N2J34O2Q2r53M80r13N79K95j7J54Q83j312M54M11K55l31p30J096K48j255
$$ y = [1900, 2230, 791, 1509, 1225, 717, 246, 300, 494, 1439, 1479, 474, 977, 1859, 720, 22, 1831, 1050, 1750, 1608, 584, 1141, 1065, -4, 1288, 2192, 1003, 197, -189, 1038, 1307, 949, 1153, 909, 143, 1690, 720, 538, 388, 273, 438, -389, 339, -725, 739, 163, 67, -541, 478, -734, 450, -413, -376, -52, -1253, -234, -1438, -631, -852, -398, -914, -559, -1171, -597, -862, -1420, -1249, -686, -1886, -1352, -700, -1018, -705, -1265, -1151, -1448, -1756, -678, 367, -1150, -781, -1118, -697, -1290, -1726, -726, -466, 143, -566, -1530, -1572, -1068, -1158, -526, -1185, -1150, -1425, -1034, -711, -272, 362, -271, -1010, -214, -1100, -565, 907, -276, 262, -720, -735, -13, -320, 697, 358, 2, -285, 402, 216, 1145, 1067, 202, 1027, 1433, 1767, -552, 1460, 1051, 305, 1227, 1444, 1822, 1877, 921, 973, 1107, 1169, 1251, 298, 778, -135, 444, 739, 722, 876, 1759, 447, 901, 1312, 1567, 1236, 506, 1602, 1850, 595]
4394E95N91J89l80j125N21K59m39J118j995O44N66k09n98J211n20l13n37N54J55
4413B87j481Q39m16J014M9K67p90j164J158o85N73k96m69J49m17j36O32M82k72
4432f76l48m05L15M30M91k95q35N67p99M33n04m35J344J90k347K384p75j44k09
4451a618J117j016P68l87j36Lj05N68M26m85o5M98K77j085M39M2n4k2j034J203
4471f66J073q15Q8P09r41K49N65m83O31M70L04j124M60M30q95P83j262J419j184
4490a89Q35R47p08J55k62R4J006o05K09j60l82J00p1p4O42m72K97N01M86j506
4510H43L26l08J20j02q3j01p82R64Mo21O79o90J170p02r2O44j9k1m70j87J658
4531B230k176K29J80m00K87J82k09p99L38r4N79l80m27J010p13k15l9p15Q00r56
$$ y = [595, 1186, 1375, 995, -130, 391, 650, 211, 1329, -666, -22, 544, 335, -263, 948, 428, 115, -422, 132, 287, -1194, -355, -771, 243, 292, 559, -231, -1395, -237, -922, -349, -645, -1114, -965, -1382, -1518, -886, -404, -676, -1024, -1429, -1114, -684, -193, -488, -1323, -756, -1555, -1122, -1626, -2061, -717, -527, -2874, -490, -1265, -1409, -1618, -501, -1517, -749, -1136, -1272, -1269, -1374, -806, -380, -865, -930, -432, -155, -1240, -801, -759, -813, -835, -1869, -666, 407, -408, -320, 389, -552, -303, 262, -221, 410, 880, 1184, 60, 520, 950, 55, 838, -424, 995, -189, 646, 1593, 885, 1040, 778, 872, 1878, 1273, 1482, 1322, 940, 1040, 969, 895, 1537, 1065, 1362, 1863, 2349, 843, 1169, 861, 981, 879, 796, 695, -87, 877, 881, 260, 939, 249, 1419, 717, 625, 1269, 1250, 1229, 759, 572, 2230, 54, 283, 463, 63, 350, 532, 323, -476, -138, -232, 347, -33, -460, 550, -163, -378, -417, -1132, -332, -1288]
4551a288M99R58p96M6m50m78J699p63p62J168r80o55J068j17j513Q35M88n94p31
4570b366K474j508RJ194j900J618j301K39M28K11m1L13M1j846J760j289J283O28
4588e3n59Q88j053J12o11O69k88L35M22o98R45m43p50J452n44j74J117n46p80
4607e59J472q27O50J71o78m73P61l43Q1J06K29k46L06J134j323k5J151j428J15
4626B74n9J731m59j282L73k39K23Q85K98l13j76J17N0m4L00j098R26L72l33j695
4646a49K142l20k006K231j509J298j304N21n82o02P80k04j92J8J166q04K64m92
4664B56J049q59J59K33n56l64J69L66j717R32j96J098l65p13L28R32j245K60k81
4683e14k03k19R76o13R7q20J426q91j24m80P16P0n82n86J141K61k33l82Q00n84
$$ y = [-1288, -789, 169, -627, -581, -1031, -1509, 190, -573, -1335, -167, -1147, -1802, -734, -851, -2364, -1529, -1041, -1635, -2366, 108, -1400, -1391, -197, -2097, -479, -1780, -1541, -1113, -902, -943, -630, -589, -2435, -675, -1964, -681, -53, -612, 276, -777, -665, -1276, -607, -895, -560, -138, -836, 109, -334, -1084, 368, -176, -350, 767, 221, -559, 913, 86, 736, 907, 229, -244, 517, 174, 255, 361, 590, 344, 650, 1784, 461, 436, 1587, 159, 274, 215, 1946, 1487, 205, 578, 339, 562, 1447, 1745, 1432, 1256, 1373, 1423, 1379, 1679, 581, 1507, 1879, 1546, -149, 1993, 1673, -333, 1898, 389, 1687, 383, 904, 322, -280, 500, 296, 104, 122, 1288, 484, 748, 256, 1305, 446, 605, 838, 282, -82, 87, 453, -1264, -332, -528, 570, 205, -508, -180, 752, -493, -233, -514, -717, -936, 40, -573, -476, -1296, 130, -761, -885, -1365, -649, -579, -1161, -1747, -606, -345, -578, -960, -160, -744]
4703g44N42j366j19L23m25J686j732J235k3n40Q16l34k71n28J115j831J354k54
4721a096N83l30L98K64k71n55j57j98M30k85Q63j51J4O9l25L70K77M99l87O84
4741F96j219O60q57R02j48R24J77m26n24J90J217j390J444k185J128O70n16q46
4759a03M01J366r99m74K355k548J341l21M41o78M13n35J07o13O17L71j067J246
4777A320l40O6q25o59J221J1m49p78O07J08J000j749J414Q0j806N12k25J084M82
4796A074q64k03N06j36O44j591N22j04j18p29J569m19K28j136L78R14l54P0j301
4815a050K753k614J063n16q81J168j462J244j01L4j481J197M95j371N56Q03K7
4832a36J18j151N71r6p22L97K09j013J017M26m71O17n11K60N2k55J92n90N64q55
$$ y = [-744, -202, -1568, -1687, -1364, -1789, -103, -1835, -600, -623, -1163, -347, -681, -952, -1480, -365, -2196, -842, -1096, -513, -843, -445, -181, -452, -1007, -1164, -1362, -932, -1217, -354, -505, -491, -422, -747, -377, -100, 399, 12, 696, -523, 137, -720, 182, 34, 958, 1135, 709, 185, 375, 1592, 202, 1646, -539, 589, 1259, 743, -103, 298, 1664, 665, 191, 2546, -2, 1339, 1018, 1459, 781, 1194, 659, 766, 153, 770, 1141, 74, 1320, 980, 1046, 221, -438, 783, 794, 345, -433, 174, 282, 1282, -467, 947, 1027, -779, -267, -492, 592, 1074, 210, 7, 513, 377, 1021, -570, -48, -152, -270, -999, 570, 151, 379, -757, -379, 535, 181, 251, -1050, 1703, -911, 152, -364, -1245, -77, -1539, -295, -396, -362, -1843, -646, -151, -1522, -966, -163, -136, -18, -1169, -598, -694, -1416, -1019, -810, -1823, -806, -380, -851, -234, -745, -485, -433, -688, -496, -1086, -522, -1377]
4852a377J679k23J41m68M87K76j20p66K91p31M70N29r73Q90L60J23M6p4j412O13
4872b39m63q26K249l62L0k50mj93J274q79P35j043J066L93j201j89M94N94q16
4891C70J210j398J510j885Q82k69j84Q98m56p64J026k79J046j757k0J237j823
4908f56O58k15O82J9J430j371O37m48K52J70J79j675J343L51j721O22J34k36M
4927A59J18K6o05l50P62j81N65q57Q38J22n56q00P40l60J501k135Q07m65L97j79
4947d53k30J562j559j3J54MN9k67l34K39O8j68o35Q51l13N01j346R09o70J716
4967G5j731P11l80P94K73K05p39L2N34l51l81M6n49P15J085j515N02m0J370j650
4987i94K84J45O43k49p45R72K15N03p65p32R28O77K39M78j623N34n39j22N3P35
$$ y = [-1377, 302, 79, 220, -248, 239, 515, 395, -371, -80, -811, -341, 188, -785, 105, 465, 588, 634, 560, -852, -239, -702, -1528, 721, 359, 389, 139, 135, -58, 1216, 337, 1072, 29, 1095, 1488, 287, 98, 592, 1186, 370, 1580, 182, 1692, -193, 689, 420, 236, 1134, 678, -86, 940, 661, 1707, -50, -70, 1167, -656, 2, -213, 469, 488, 1918, 547, 1184, 736, 988, 1158, 1337, -338, 1005, 1356, -365, 257, 391, 155, 159, 277, 303, -302, -652, 110, -71, 494, -363, 475, 597, 41, -759, -19, -379, 1122, -1013, -206, -671, -274, -453, -683, 879, -680, -693, -539, -535, -476, -743, -1077, -838, -770, -938, -1573, -722, -1035, -534, -1880, -971, -1641, 75, -1656, -945, -1325, -531, -258, -53, -792, -760, -226, -577, -958, -912, -1461, -746, 339, -1176, -674, -714, 656, -994, -710, -565, 78, -171, -916, 56, 271, 774, 9, -723, 205, 882, 1121, 1599, -24, 510, -29, -151, -98, 637]
5007F37n67l6l79J958k20n63n00O86m12k19J259j608J210k71m10J12l93K37P2
5026E93L34N30q42M27J38r41J69O7O73P87j482o98L094k013p54J030o05o36O78
5045E49k00r87N36P20K00l08n82J74qj119O35Q62j712J334J144n96m74l08N24
5064C84p6L73k58n12K10M73q36n21N20P2J09p40l75q9J198r33J430p05j02p27
5084a105M95J267q92L18p20K39n28J040p23j006J613n58L13l79m58L7J89J500
5102F42r04P6p64n07O23L43K33m7L37p87L50o73O50l15R13k13n94j029K225p62
5122b03m97K019j509m85N18n38Q18k97P6j24j47K33O85K28L60j422J290j476R52
5141D81j54J85n00K06O68l57J405j925J655q33o30J035j053L95L5J06K24K61j52
$$ y = [637, 70, 34, -345, 1613, 1393, 830, 330, 1016, 604, 385, 1644, 36, 1246, 975, 565, 677, 284, 521, 593, 927, 1457, 615, 1042, 1180, 239, 408, 475, 1148, 1935, 453, -245, 2849, 836, 82, 1112, 507, -129, 549, 349, -638, -102, 618, 818, 510, -72, 102, 94, -1025, -390, 472, -1240, 94, 1238, 642, 168, -140, 384, 308, 681, 423, -89, 121, 594, -242, -763, -243, -171, -62, -802, -1177, -1266, -68, -1001, 429, -276, -378, -1105, -610, 657, -235, 83, -637, -398, -926, 114, -609, -1615, -2, -560, -247, -626, -1084, -1047, -858, 642, -262, -186, -950, -1457, -834, -491, -258, -305, 32, -755, -405, -1078, -428, -743, 170, -43, -637, -1666, 559, -203, -700, 1319, -190, -675, -157, -695, 123, -174, -98, -222, -369, -136, 549, 777, 1137, -285, 1005, -471, 481, 327, 512, 12, 218, 886, 529, 1934, 9, 1664, 831, 201, 1236, 183, 578, 613, 719, 943, 1204, 1052]
5160A052L10J5q45K64o17Q36L42j297J136o09M02n44R91k409J087J160k36p18
5178C20j31M29R9l25L69L25r92m9J93n11J399r22J034j448J35J005j321j33R71
5197D47j077Q49K12m50L99r13M05M52q8r91J075j405J728Mn81M13l37j244N88
5216e14K16o74J062j180N34k8o00J323r37M60J75n78N79q59j13r5J119k37q42
5235a189J34J176j010O8O65j089R00l68K04k91J89J035O65j435P44q38N4l89J065
5254B90k40R47j996P77N77n50l10O93p15J389k0q57q30J178O11O23M47j111m22
5273D81J20l19L03l3O4O4k82N33j554K14P85O80l62O28j100j12O31l13R60j293
5293I5N35p43J216j335P7J143n56P99k99o19J08m00L59M75p03k01J113n41j214
$$ y = [1052, 1362, 1377, 532, 796, 179, 1015, 1357, 60, 1196, 587, 989, 445, 1436, -973, 114, 1274, 1038, 320, 189, 618, 717, 392, 761, 1086, 94, 45, 238, -273, 1126, 204, 1238, -210, -75, 930, -391, -524, 447, -630, 219, 431, -19, 380, -533, -128, 324, 236, -755, 320, -1085, 643, 647, 66, 479, 142, -1102, -514, -298, -972, 90, -1090, -556, -584, -1184, 139, -798, -338, -163, -741, -162, -1021, -1134, -1229, -110, -347, -1189, -1055, 121, -889, -821, -156, -1245, -345, -713, -509, -800, -611, 424, 1089, -346, 398, -440, -386, -775, 290, 50, 997, -999, -222, 355, -195, -505, 188, -527, 862, 842, -15, -845, 333, 944, 1567, 2014, 903, 481, 601, 282, 585, 552, 616, 680, 398, 931, -623, -409, 376, 1056, 694, 1322, 222, 110, 741, 428, 1388, 95, 630, -113, 1103, -232, -155, 988, 432, 1231, 932, 313, 421, 21, 380, 855, 152, -49, 1064, 523, -691]
5312f91J751l25r79O36M0j281P43J48m03N12O16o55l04j347J098j05J82J351k146
5331a159Q80o72J039l37N70j282Q65j22j38l66N35p62R07k18p60M0M69L40L6M65
5351C30m0K08m10m26q43O19j7K20K53r40M55j91m63L59R46p16j71K31J044j013
5371e65P01j117L95Q30k24Q3K48m79q6L22m16N29N94p4n27J272j611j231J224
5390a32J261l00j155J298j083o26N10m31Q53N27n83J90J010j270Q86q21L96J5
5408E45J93J55k95M43p5j74k90O65q21N2L30N3o62L56j57J067l17o05J77n22j6
5429A02M66J74j50K77q80r9r49R08R45l88q06n2R19J75o49j59k40R07J6k08Oj75
5451A40o02J989r10j702J157k4P00j222l6M40O96q23o72J393j259J305j238j6
$$ y = [-691, 1060, 735, -244, 392, 432, -849, -106, 42, -361, 151, 767, 112, -192, -1539, -441, -546, -364, 987, -1159, -279, -951, 88, -249, 321, -961, -96, -218, -356, -722, -187, -949, -42, -260, -1020, -980, -511, -171, -135, 330, 290, 498, 88, -338, -1181, -562, -579, -359, -106, -1046, -591, -782, -1245, -886, 60, -656, -827, -596, 448, -565, 136, -981, -586, 244, 20, 103, 351, -128, -214, 108, -308, 221, 815, 741, 214, 1486, -125, -1356, -132, 1129, 829, -326, 972, -111, -737, -227, -658, 195, 722, 139, 329, 1339, 69, 955, 134, 530, 545, 738, 893, 598, 1041, 966, 792, 502, 1167, 346, 398, 728, 781, 119, 475, 318, 1385, 1068, 463, 640, 118, 102, 568, 742, 592, 869, -11, -110, -1059, -151, 794, 406, -400, -452, 467, 642, -7, -166, -406, 501, 517, 309, 315, 140, -462, 1527, 617, -1085, 72, 48, 748, -474, -510, -70, 626, -197, -869, 524, -735, 570, -668, -684]
5469f84O92j269J815j559J146p88J53O35r78K37k3R3n3O21M37k48M5j502M99j470
5489b201J661k17L51k95n45N13P69j4j538K81L28Q14L74o69l37l68J123j5r22
5508i07P62K80q44R23L98p80M29o83J247n94l07j65N86J69r1L89q21P0p24O33
5528c0J78J94k08j31R07n37K14j87j53L49k1m76lL67k23J124o01M40q86N10l65
5549D62k45j90R54m02M75K57q50K64j33K97q09J296o52l3L93j337J3L46k72O1
5569a05P78p71K64J024r58j114k05J338k43p26J33K24P59n77P47j240O71J041
5587A040k106J023N16o66O15j028L17M3K0l03M62n51J025k76p68j249K037j495
5605a344P54L75j014J370n83j028J319q59P28o05K97j57M79N35r11J63o31J045
$$ y = [-684, 8, -1261, 554, -1005, 141, -647, -494, 141, -837, -600, -623, -530, -583, 38, 475, 227, 272, -1230, -731, -2201, -540, -757, -406, -701, -1246, -733, 36, 22, -1516, -1235, -907, -93, 281, -388, -725, -1093, 30, 15, -907, -145, 135, -709, 214, 612, -168, 261, -422, 825, 231, -76, -241, 345, 514, 423, 812, -9, 61, -663, -30, 148, 342, 134, 3, 910, 373, 587, 400, 247, 596, 575, 99, 96, 463, 240, 1364, 763, 1203, 317, 827, 462, 217, 27, 981, 579, 1054, 1311, 461, 725, 592, 889, 80, 1376, 724, 691, 1084, -253, -240, 106, -166, -105, 673, -98, 166, 1190, 232, -882, -1087, 251, 8, -718, -585, -361, 398, -179, 568, -672, -1, 1040, -1066, -43, 473, -193, 422, -606, -289, -246, -226, -529, -67, -618, 407, 131, -637, -1886, 151, -1344, -590, -215, -1229, 141, -442, -1470, -151, -1010, -282, -887, -590, -747, -268, 267, -644, -481, -1112, -67]
5623f7J09K80r03L82j41j276R82K82j90J186j527L88J75J24l26M95K41r21J59
5642e48J174m28j2L87j324J297M30j551J274k44m59l73J879j108k70m86P4n8Q20
5661D74k47K25p95r5M4J63J369o83L24n69o8L08L30k56j33Q24r12l31k24Q60r28
5682c20Q73o17Q20J109k031J77J586l44l97R1n44M38j71K20n63N31j781J396m14
5701E9k58J022J08j199K05O27r55P25j133K0L62N06j139J549k88m61J87k22l10
5720e95P45L49j233R24n05O53j170O32M22q66N19L65o75O14q37O41k98j73J6J61
5740c11J81N36j164k65J266l1K4l57K67j130L8J626j378N2L62R0q5q50R86j200
5760a343J427j261J586J6k02r10P93j61m92J001r05N36N5p38K90j42m10P23Q13
$$ y = [-67, 42, 322, -581, -199, -340, -1616, -634, -352, -542, 644, -883, -495, -320, -196, -522, -27, 214, -707, -548, 626, 198, 186, 573, -751, 546, 976, -575, 699, 455, -4, -377, 1502, 394, 124, -362, -288, -346, 474, 227, 452, -343, -438, -394, -231, 1138, 455, 779, 210, 142, 450, 780, 524, 391, 1215, 303, -28, -252, 608, -320, 553, -64, 756, 1865, -166, 11, 1597, 1253, 856, 947, 403, 841, 670, 890, 327, 858, -923, 473, 59, -199, 823, 931, -268, -63, 564, -391, 334, -799, -779, -417, 89, -1050, 499, 211, -250, -63, -285, -595, 150, 499, -734, 190, -315, 338, -832, -200, 222, -644, -125, 240, -435, 179, -658, -17, -315, -488, -472, -311, -130, 406, -758, -1023, 243, 212, 236, -121, 146, -984, -946, 680, -698, -646, -284, -194, -279, -1129, -143, -1343, 84, -1177, 409, 425, 223, -687, 106, -55, -547, 454, -451, 85, 140, -598, -308, -450, -860, -137, 676]
5779F76O65j353N79P4L70q14K99M1O85l13j387J160l12Q69n54J2r7j77N64N44
5799A531j517j92O07n76j20P7R53p73L76k94R65p60J87Q5P79m99N0r24k77Q69
5819E47J11j028P02P21j04p65m57N88q72L57M59J12j20J25j54j91O20m98k79J14
5839a2K52j023M64J066N61j718J283p76j41m33K99l94M61J164m37j51j178J092
5857C79k01j71l23K39L4p00P79o16j069J847o2O66j890J637j363J501q12n0l79
5876e54k11M21M35n09n96P95J2J73p45Q26k052J777p83l13M64L07J108l56q33
5895f34J025p15k53R52J040j639J726n75j105P04n24p61R49J170j752O29m57k90
5913e10O77P3n8K72r1p14O67k85J17J94J71M80m60n23K05j77M22k59j38o9J019
$$ y = [676, 1341, -12, 567, 641, 1011, 197, 496, 537, 1222, 909, -478, 682, 370, 1239, 685, 697, 600, 423, 987, 1531, 14, -178, 429, -147, -267, -190, 763, -10, 366, 72, 1037, 277, 464, 549, 1328, 829, 879, -45, -322, 547, 658, -370, 332, 1053, 949, 184, -273, 315, -557, -200, 259, 371, 251, 376, 222, 31, 651, 153, -126, -12, 240, -783, -319, 747, 1308, -410, 873, 97, -44, -477, -178, -572, -111, 1053, 616, 465, -713, 379, 178, 7, -316, -77, -43, -743, 36, -580, -1649, 198, 136, 802, -1088, 549, -814, 687, -125, -175, -554, -765, -344, 91, -418, -1014, -219, -207, -34, -779, 47, -2005, -228, -1011, -1324, -860, -553, 555, 199, -634, 391, -324, -577, 375, 1415, -224, 1502, 927, -178, 526, 2, -759, 190, 1360, -392, 237, -220, -510, 167, 240, 182, 454, 363, -351, 316, 31, 148, 342, 513, 993, 533, 10, 215, 38, 460, 201, 63, -6, 1013]
5934A013j207L94o61L43Q31O5m66o42O84R16j648J3J307j185J323j063J390p28
5952F79J63j364m24Q26M47j469K919k005O68j137J145Q86j993k89J441j22j396
5969a025J418j98J03j044J97N37O25p48L68r17J275O76q86l02n15m13j58J286
5987B79Q77j398J56J67j058j59J234L61j230J39L29n49M50K44O31m55L74m20j365
6006a393N62j97J220O29j668N36N00p30M27M8N74k60p9r13n17J082p87N26L66
6025g4r23K67K93L31J115j367l61J520p78l57M61jO67o02j2J42r92M35O36K29
6045F29J09l05j186K000k46j061R68r65N62m5m5L49j278M73k50Q19q48Q68q0p01
6065b33J144M12r91k35K63J63J17k79O13q28m78J40k9M59k14K04K96k05k99K08
$$ y = [1013, -194, 200, -461, -118, 713, 778, 312, -330, 354, 1270, -378, -365, 942, -243, 1080, 17, 1407, 679, 842, -522, -946, -120, 327, -1142, 1777, -228, 440, -697, 448, 1334, -659, -948, 493, 371, -1025, 393, 195, 298, -746, -549, -12, 613, -135, 233, -684, 591, 1267, 381, 79, -436, -849, -1007, 279, 1156, -242, -86, 81, -977, -1136, 98, 459, -771, -632, -303, -852, -402, -158, 473, 18, 392, -28, -1393, -831, -1028, 192, 821, -847, -311, 189, -541, -114, -66, 508, 248, 169, -744, -1261, -179, -966, -440, -74, -997, -730, -437, -106, 1009, -358, -719, 801, 23, -334, 127, 126, 793, 191, 179, 321, -671, -236, 400, 629, 738, 433, -753, 1247, 1001, -60, 908, -57, 505, 460, 415, 764, -514, -41, -291, 528, -320, 548, 468, -233, 911, 1323, 332, 97, 360, 523, 640, 361, 974, 146, -332, -192, -221, 238, 24, 228, 524, 319, 20, 228]
6085B28M36p34J39m0M29p12N37N93j046Q69m54j590J267L99j63k24k38l50L08
6104c46m04K16K02L32k8m1l55R46n67k43L69k2J222j469J054j405M09k51O30j178
6124i29J65M75m15l3M07J321j358n4p00J952j608L95j70J017j813J552q99K82
6142d13M04j360N63N23O54j440J138m8N14m32k22k66Q31j101P34L34j004J477
6160H86j184O21j83j84O42j280R57K26m39K83r9p6q60J036j30q39J214M46j353
6179c16M39K22j099L94O88l87Q95J54j538l92Q71k89M96L25l17K60l66J046o83
6198D03J024n58j000j48K91K5n04k80J787k31K0j308O03Q40j331O04m03K24n07
6217d49K129j232o97J78O74j139O91o04J071j750R67L96q01J030r33Q65N1n58
$$ y = [228, 664, -70, 69, 29, 458, -254, 283, 876, -170, 699, 245, -1345, -78, 321, 158, -66, -304, -654, -346, -750, -534, -332, 0, -28, -69, -424, 522, -45, -288, 81, 59, 1281, -188, 866, -539, -130, -381, 249, -929, -764, -289, -704, -737, -330, 991, -367, -421, -1121, 831, -777, -382, -552, 465, -1348, 204, -695, -413, -9, -1369, -806, -283, 371, -1069, 69, 21, 535, 103, -119, -385, 446, -655, 79, 413, -591, 886, -298, 323, 140, -44, 598, -682, 275, 501, 62, 345, 246, 170, -690, 346, 216, -623, 591, 1037, -316, 123, 345, -754, -360, 328, -59, 836, 990, -548, -940, -69, -358, 138, 463, 146, 406, 40, 1086, 403, 1427, 869, -131, -279, 12, 37, -467, -747, 1040, 809, 829, -479, 124, 964, -367, 237, -166, 58, -449, 1680, 448, -249, -71, 603, -536, 155, -449, 622, -1128, -161, 235, -566, 464, -469, 396, 447, -111]
6235a11j42K24L26l24J4q56Q52N44m79J41p62P30k74J003j413L3K69L96j204P40
6255b93J39L06j85R9j000N24L66J100q31r56N81Q68K31j483J059j192o18K333
6273A048o82j97J92j357J494N01j175J056j194n08J998j026P53j168Q0r9M37O8
6291B21m6P3j58l19M52N78J5p61l70L08o68O92P4J4j002J630r56J39J81K83P02
6312A082p58j145L77M32m55Q29J28r88P93J95M62o48O0r78J219n51j69L92q02
6331e25J423j179L84N52k03o71J150q25r77J49J329m49k33L55m67Q59m22M34j836
6350a152J634Q61j734M08O14L59q99l98Q74k89j005R85N90j599J459n32J173j829
6368d80Q93q64M21n07p75J006N67q3q41j69J022p99J580l89j288K18j51O46j95
$$ y = [-111, -253, -29, 297, -27, -13, -869, -17, 527, 48, 189, -573, 157, -117, 886, -527, -494, -225, 171, -1033, -293, -154, 152, -33, 66, -934, -410, -44, 1056, 225, -731, -150, 718, 949, -534, 525, -667, -1285, 1048, 366, 169, 361, -996, 498, 999, -176, 880, -314, -822, 1176, 150, 903, -265, -185, -284, 153, 221, 175, 248, 90, -229, 223, 801, 816, 55, -315, -7, -675, 17, 91, 105, -897, 733, -223, -84, 97, 380, 1082, 324, -821, -444, -12, -467, 362, 490, -498, 295, 490, 952, 304, 364, -614, 605, 54, -115, 277, -525, 898, -281, 103, 655, 452, -219, 931, 106, -871, -722, 607, 158, -75, 280, -187, 672, 250, 684, -1152, 482, 1343, -391, 17, 631, 990, 91, -307, 567, 278, -727, 258, 848, -751, 708, 176, 1349, -480, 413, -451, -30, -537, -1312, -306, 261, 178, -663, -832, 190, -609, 971, 582, -706, -488, -639, 7, -188]
6387a88r26J277N80k354J862j057O62p9n43P41N79j434R15p44K2J029J80q59j93
6406e30P76j238J345j008L99l41M29m32L57K24N12k78k02j427J576L6K2n68P40
6425C92L27q44M16J9L6l16p68J301k75m55J00M57j289J009j23o30K56J12p7n40
6445h92K461j093l60K93j54j28J41L20O49j052O73k22l76k36M37j2m90l49q5Q54
6465C79n92J37j55J250j979J395r44J357k81p05O89K70K63r7j157J28L06L90p0
6484E84O6k60p75R52r1n47l45K75j01n8o45Q62n35J50l22R27J343j887O68l28
6504f7p19R47K36j89k50J31l0n97N04q81J558j415L39J061l38k25P38j697J288
6523C94r32P08N83r82r5j26J074j743J576o01k42j31k40O44k54K44N12k88j233
$$ y = [-188, -1114, 163, 743, -1611, 251, -806, -144, -223, -766, -25, 554, -880, 35, -709, -687, 342, 522, -337, -530, 246, -992, 353, -655, -256, -597, -168, -600, -243, -19, 493, 215, 13, -1414, 162, 198, 220, -348, 392, 719, -125, 291, 310, 346, 30, -738, 563, 288, -167, -67, 390, -899, 110, -13, -643, -387, -275, -352, -892, 1569, 476, 116, 409, 255, 127, 268, 588, 1237, 185, 858, 636, 260, 24, 461, 449, -41, -390, -475, 379, -213, -76, -231, 1019, -960, 435, -509, 848, 567, -138, 551, 821, 1084, 987, -170, -42, 264, 654, 584, 650, 390, -385, 567, 476, -71, -416, -141, -242, -300, -945, -83, -618, -468, -790, 137, 1480, -407, 261, -67, -786, 161, 397, 208, -42, 89, 59, -538, -34, -915, 643, -772, -433, 628, 290, 65, 803, -894, 394, -538, 170, 753, -229, -324, -450, 624, -1119, 457, -144, -386, -517, -757, -113, -367, -123, 389, 101, -1132]
6542a132N36M55J24j79M5j71j9L58o02j45M68R41j483K73J117n82L6N26m49n68
6562d51J572j736J19M99k28Q20J89l26r14R67J030j876j00P37O7nm70R50j629
6581g85K299n28j193l44K76L68J068j424J346O04j632J04M22p92J05l37R73J83
6599G13q96N24n54M47l69N66p71Q85j012R28k92l4K9p8r59J057J31k90O6n73M55
6620b7M04p96n4O97r05Q62q77N33j04O07j374P35Q81n44K19j114J064l85J032
6639H54j703L29l37R04j209J524J76q04k42J113p59m95L91L73m6j49m02J107p18
6658i3p05m46P96m37Q15N29j277J397q95J597j422N97J84j011K64J00L26J52p7
6677C94l07L29j322J595j291M62O07r77M24l48J120j038k11J497q65P0L01k73
$$ y = [-1132, -596, -141, -17, -196, -151, -322, -341, 17, -585, -730, -262, 679, -804, -531, 586, 4, 40, 566, 117, -451, 1121, -615, -496, 3, -225, 595, 784, 458, -456, 511, 1541, -335, -435, 302, 369, 364, -106, 844, -785, 1514, 986, -207, -551, -275, 93, 1161, -263, 1083, 1687, 55, 159, 581, -211, -106, -443, 530, 713, -183, 341, -213, 234, -135, 431, -340, 545, -467, 461, 169, 135, 164, 86, -873, 184, 315, 25, 91, -482, -27, 377, -419, -473, 224, -681, 181, -696, -163, -267, 340, -1034, -299, 582, 38, 257, -857, 207, -178, 854, -849, -520, -857, 47, -1162, 362, 538, -266, -508, 605, -154, -649, -258, 115, 69, -80, -482, 625, -93, -798, -1244, -448, -885, -70, 459, -818, 579, -316, 1281, -141, 456, 640, -371, -107, -7, 319, 471, 394, 87, 416, -906, 689, -602, -140, 467, -510, -86, -434, 686, -352, -563, 934, 69, 139, 440, 167]
6695A67J11M69l07p06M1M59j459J878j184k23J599o07rj097N0J423l96n76J115
6714G48l29R31j151N91k41ml08R2j089O28J240j987J614l37J77rj096J68J297
6733I35M0l11L8j736P02Q66j73r55J013Q87k59j221L2j96J111l92k9r54Q55p09
6753d56R42r02R40l38j09O33j26j342K13P05k25p71O51k18N91J73o53L34Q16l81
6773D77j224P95J09o0j6o57P0O72K56q11k07P42j579N02J561q81N22p26k26J581
6793I00j741R71l68m07J67J050m94m28m43L20N05P54r09j66O19l69n66J059j0
6812D44o08L10o51Q59q24P28O05j594N36m20J95P52k95q72P93q9R78o47o19O37
6832B18K89r85K73k3L78K55n64M57m68L40M30r46M76N4R0K65l69r2M85r55R64
$$ y = [167, 278, 747, 440, -266, -225, 234, -1225, 653, -531, -754, 845, 238, 229, -868, -818, 605, 209, -367, 748, 419, 1350, 199, 790, 549, 545, 237, 329, -760, -132, 1108, -879, 735, 398, 575, 566, -530, -362, 935, 975, 664, 702, -1034, -332, 534, 361, -594, 419, 1306, 1047, -174, -142, -338, 773, 381, 352, -602, 253, -456, 486, -416, 524, 186, 77, 710, 584, -758, -545, 160, -65, -836, -185, -403, 188, 361, -292, 42, 858, 477, -747, 48, 157, 97, 81, -576, -506, 166, 422, -389, -596, 146, -1433, -931, 630, -251, 271, -455, -681, 900, -841, 130, -238, -645, -478, 572, 78, -350, -793, -473, 32, 786, -123, -289, 330, -39, -605, 454, 444, -164, 146, -505, 354, -470, 258, 863, -731, -195, -615, -420, 332, 37, -835, -42, -131, 847, 200, -419, 218, 507, -478, -205, -228, 150, 405, -159, 298, -170, 170, 600, -346, 130, 184, 274, 539, 170, 78, 563, -392, 572]
6853E72j087L78L39K37j47ro70O99m17O1M0l89o2j61O12n87Q0O43J50J74j28n94
6875b66q9R27o67J20l60J06L78m77Q82j365P88j318R27J65J053j436K10L66J71
6894A15J46n05m06J921j206j53j6k19K16K19J57j043L24O9l03P86m50L24j85J31
6914g8l81J37L87k59m06n85M20K8O29L6K14m09J140k41j703J306j03l64N63j0
6934C21k86m05K53j160L09J680j259J140r20J131q54J34o61n16J529n80K73J82
6952C11l43r02J128j01k65j13K79n76O58o4J46l68R02m83m23J388j285k50K9J006
6972F74m87k8M13r8L73m09l45j64K19L95n06r8K26P63j106r59J386J3m23l12J449
6993I76j264J179p31k37R49M19j820M81L9J18l89O3J292j518Q66n76l16R62l28
$$ y = [572, -515, -137, 202, 439, 292, 283, -387, 312, -105, -44, -4, -393, -455, -616, -4, -591, -511, 132, 282, 456, 328, -266, -355, 572, -95, 25, -335, -229, 149, -328, 554, -811, -23, -1341, -414, -249, 804, -632, -422, -56, 115, 261, -244, -650, 1271, 65, -88, -104, -323, -107, 112, 269, -774, -450, -381, -684, 102, -348, -24, -209, -78, -459, -322, 65, -194, -600, -1185, -765, -737, -108, -72, 142, -267, 873, 632, -1071, 235, 132, -232, 331, 321, 35, -370, -117, -1277, -968, 712, -547, 593, -327, 804, -50, 84, -577, -1093, 436, -144, 129, 311, -32, -934, 194, 93, -172, -285, -6, -582, 76, 12, 158, -210, 692, 209, -214, 1174, -111, -361, -332, 674, 187, 159, 572, 474, 847, 438, 93, -71, 148, 543, 37, -61, 165, 928, -178, -1137, 249, 262, -161, -473, 976, -288, 891, 160, -77, 872, 1291, -529, -48, -9, 109, -280, -217, 1075, -443, 423, -153, -469, 493, 165]
7012A65n37N91j64p4l85P04O2n31J84o67J298o72m1K02K51k59j113J377p38N14
7032A67J27%K42j531Q91L56j27j166J066P33K25j677N43o61N54k9Q80j714J249
7051A28k53J73n31N55m16J94J36r5Q60qo2k80j26k92R25j392j69N9P44j345Q98
7072b97J055j197k62J48J021n30Q4M55r24n88O57J271p60L92k94p74O92K88j266
7091h29O38m33Q20M23n11K23m53N36r62k0R98k16m32J44k20M04J316j295P18j278
7111d29P89K02K81p85Q1r95J640p93K20N52M57j048l04O90J23p6o42j3l01Q48
7131D97j029K91k60M37o84O51q88L60L55M97l85k95j40J354j414J268l47O33j239
7150c38P87J52m27j31M65j036O46j039J098p42j99M44P20o74q94J088J64P88j311
$$ y = [165, -372, 219, 55, -19, -404, 300, 362, -169, 15, -652, 646, -26, -67, 135, 386, 127, -986, 391, -347, 167, 294, 294, 536, -995, -104, 252, 125, -1041, 25, 758, 983, -694, -151, -812, -258, -287, 593, -1121, 128, -125, 48, -483, 72, -344, -150, -14, -109, 751, 743, 681, 401, 275, -17, 908, -484, -653, -594, 150, -1195, -297, 758, -439, -701, -553, 468, -62, 22, 477, -447, -1035, -378, 893, 133, 525, 231, -543, 149, 437, -829, -191, -624, 196, 619, 108, 331, -122, 414, -548, -568, 430, 214, -218, -74, -294, 110, 1426, 131, 849, -429, 360, 562, 843, 58, 139, -856, 784, -9, 211, 763, 1220, 172, -132, 558, 681, 605, -37, -50, -351, 497, -532, -241, -501, -64, -748, -97, -985, -625, -270, 227, -158, -453, -593, 761, -653, 615, 268, 901, -338, 449, 601, 174, 43, 508, -528, 118, -921, 177, -565, -764, -320, 400, -274, -1168, -80, 84, 872, -439]
7169d39J656j922j27L14M05J43Q17m9q11r85q6Q85M5J35J5O9j47j74O35m38Jk64
7191c22L77k1M25j114O73j47l21k98n06J513j6J41k48J080j434o28N62J478j556
7210c62N57o83M87p2J345j362J87N14o01R31m97K41j43J78o12J45o81m21R67M21
7230E39m00n21L81P87J36j271N91Q79q70p15Q63o3K60r07K0K38M90k93o25L51
7250a30p03M28o97K77R69k01M18q81J009r95L83n40K85J588j144j450J477j182
7268a089P69M66%R0M09l02j373J068K0q1n35N49J85K46j359P6o9J112q1O1q39
7289f77j30J401m12O49j117N79j00n38J3M68p04J98J022j98p06M04r76R56N70
7308G02j39j324Q99L37j02r01J342m75j066Q33l89N19j053O24J10N33m88m19K66
$$ y = [-439, 1217, -705, -832, -518, -113, 30, 847, 798, -13, -998, -1084, -199, -154, -19, -4, 65, -82, -256, 379, -59, -58, -322, 55, 34, 459, -655, 18, -129, -450, -748, -1254, 259, 243, 384, 136, 1216, -218, -846, -284, 1194, -362, 195, -488, -1, -73, 1272, -90, 97, 611, 10, 941, 444, 685, 542, 720, 108, 253, -428, -849, 118, 539, 139, -382, -1, 786, 922, -349, 242, 1121, 251, -464, 399, 336, 596, -311, -291, -53, 437, 144, -481, -130, -833, -405, -1102, -825, 144, -57, 361, -520, 489, -506, -123, -663, -378, 1210, 66, -1384, 93, -1089, -320, 146, 146, 236, 645, 343, -1030, 38, 58, -23, -558, -9, 176, 422, -937, -861, -930, 182, 101, 162, -677, -807, 594, 182, 831, -286, 293, 193, -345, -332, 136, -568, -370, 652, 454, -252, 152, -824, 132, 702, 563, -761, 138, 475, 373, -528, 814, 339, -727, 106, -283, 236, -817, -193, -83, 450, -38, -457, -191]
7327a91l37J073r93P4P08Q9l32o25O29q76J134NJ28o82N19L13J91r88J72P97j183
7348c75M40O08p08K04M4n83O79j259J015n83M75k17J340j219k15L51O3l13n97
7367h50L69Q34j7p70J050l64m53P0M99j394J688k47o1k26j115P34n7l55K64P12
7387C11K12J76M76n86l81p71P24k75K17J12L07K24q13n53O14q62K032j299J359
7406A224m38q75p6J037j26q25R56j618J34J099P50j118K88K02l87M37L22j78m43
7425C65j408J165k3L15o17j58k05P55q48J108m29m07K77m34R64p25L72L03J13
7444D83j024J763j134K49j395J298Q00j511P48o01m2O24K00j52j09L9L99J055
7462A690j708N23j046N67N16r79J69P94l50l27M2J52N87K3j137N17p62M90L85
$$ y = [-191, -528, 545, -448, -374, 334, 423, 91, -534, 95, -781, 353, 358, 486, -196, 323, 636, 827, -161, 11, 808, -375, 65, 673, -35, 169, 213, -370, 309, -950, 65, -518, -43, -260, 1080, -139, -354, -3, 60, -253, -850, -481, 353, 336, -434, 616, 252, -201, -131, 368, -1026, 662, 415, 354, 128, -987, -253, -310, -665, -401, 311, 523, 699, 1175, 589, 208, -563, 161, -114, 103, 215, 522, 746, -67, -620, -6, -868, 1164, -135, 1224, 786, -89, -165, 872, 746, -79, 877, -741, -607, 492, 1242, 124, 412, 614, 227, 664, 986, 808, 365, -1043, 122, 99, 414, -203, -361, -566, 189, -659, 449, 20, -387, -110, -544, 420, -305, 67, 370, 483, -541, 1222, 88, 337, -1058, 240, 1040, -471, 277, -324, -366, 258, 458, 306, 197, 236, 635, 1690, -18, 505, -541, 26, 542, -437, -268, 526, 176, -151, -109, 43, 630, 653, -484, 33, -729, -239, 146]
7481A46l29R05q54q37J111K42K08l67P50j121k1P4k91k61N89j195K89J872j001
7500i1l49m94P10m78J678j315L03j31K38n37O47L49M27j127J176n92r31R69n62
7519a10K68L70j240Q58q61K36L55k20J556j382k70O22K88j053P83K58O05j168
7537a05J00L00k9Q5j567J032m82J224j049J251j223m72o76J067j48Q09R2k57l24
7556c72Q64p24K43K32M12j435J039J022j936P16J88n06K55J37Q02m34l00j74l22
7575b93L60q41J209r79M93O50J76o38q25J126p91K73O8K38j30J018q23p5p33K679
7595B162j645m0j6q35J65L82K14k57K24n79P40l75j1j082P5J312M25l13N95n50
7615E91p60N02o53q2k21N80o70P65J02M05k69p3j76n85J030j876K421j256J5P07
$$ y = [146, -183, 722, -132, -969, 142, 384, 592, 225, 975, -146, -167, -93, -384, -645, -56, -1251, -962, 910, -91, -440, -934, -224, -702, 976, -339, -36, -167, 71, -466, 181, 530, 957, -170, 1006, 414, -517, 452, -110, 158, 528, -712, 146, -715, -479, -124, -344, 1212, -170, -440, 182, 470, -583, 200, 458, 1063, -105, -5, 295, 266, 351, -1216, -184, -666, 558, -491, 760, -463, -935, -1611, -544, -692, 117, 209, -48, -372, 492, -232, 11, 243, 655, -780, 259, 1281, -655, 61, 249, -257, -2, 135, 937, 503, 203, 29, -293, 67, -774, 435, -544, -51, 599, 775, 137, -688, 438, -353, -80, -12, 226, 96, 1114, 291, 216, -517, 2162, 517, 477, 461, -374, -209, 173, 387, 130, 354, -225, 515, 140, 129, -953, -878, 434, 859, 546, 1141, 591, -169, 333, -320, -402, -623, -43, -713, 52, 154, 559, 290, 217, 41, -544, 486, -1390, 1031, -225, -210, 497]
7635D97L2o35Q33k38l51P70j860K129j058k42O63m37N13l43k4k50J313j272j13
7654g3j37N25j230M75Q60p07O72p37P31l04J95l78N38k32o90J142r25o88P47J65
7674e1l19JR7N1J86l93K24O68k94o00r06J850j569Q63N2J044m93J80r32o38Q28
7695a51k44n27Q01K64j104J903j112M28k56o20J980j501j23Q61j780K01M16J017
7713D53r2M41r42K40N4l71J920j933r27J322J80n60O38l14m5ll05p79J243k88
7733f8K36j318N82k25o68K22O80J078n25j12Mn57M47P17l06l45m56P6O43k98l84
7754e77J868j760K4P48q85J025j019K66M22j54M23k08o08K68m72M81L62n43L37
7773bj69M8j356J173p7Q47j156J144j756J650M42q92n88J77N07P3k99k37P14P97
$$ y = [497, 529, -106, 727, 489, 138, 908, -952, 1177, 119, -123, 540, 103, 616, 273, 249, -1, 1312, 40, -73, -210, 315, -915, -440, 420, -287, 385, -352, 379, 75, 270, -108, 430, 198, -492, 650, -275, -963, -216, -51, -370, -369, -272, -221, -35, -428, -204, 464, 170, -430, -1336, 514, -1055, -192, -140, 904, 411, 591, -341, -979, -151, -395, -922, -121, 143, -961, 942, -170, 258, 2, -618, 1362, -139, -262, 599, -1181, -980, -564, 453, 361, 802, -140, 100, 154, -217, 1703, -230, -1157, 165, 345, -215, 423, 109, 64, 61, -244, -1023, 220, -68, 168, -1150, -568, -793, -1461, -1239, -559, 519, -6, -118, -114, -671, -224, 493, 187, -158, -614, -538, 105, -193, -577, 1291, -469, -445, 303, -582, 443, -576, -310, 112, -42, 381, 173, -435, -167, -639, -158, 204, -339, -2, -171, -123, -1479, -306, -383, 464, -692, 452, -1304, 346, 788, -104, -692, -515, -8, 65, -234, -471, 243, 1040]
7793A040k136J400r05N49M52n60Q35r06m12R39r53k71N12K27L86Jq1m29J48L84
7813B20k45Q67j588O19K12r39P44n70J453k62j27m12K92N51j711J151j66j44R78
7832I23K42j309k6Q04j356r10J735o34J081K30j110N84p35P77n68M7l29j56N99
7851a11P45J80n86n1l96k87R90j378M76J045L11o35l99J3L30O59P4L26r66J010
7871A350j236J431p15J66j830M19K96P39K20j315O54J170k351J005m16L04M66
7888C57r83M08J246j086L48o58P99k43l29N63K93j62o97J68M80m69P30o49l22
7907b06J520n17p10Q04r77o89N06O17q0l73M97K09L25o37m34k60J259r22J403
7926A335p47j177J453j503N56R94q77L5m83M28L28k47n85J120J5m07k93J67j98
$$ y = [1040, -1096, 304, -601, -52, 400, -160, 675, -231, -643, 296, -657, -928, -416, -189, 197, 198, 117, -312, -164, 220, -25, 842, -746, -127, 85, -854, -110, -680, 773, 511, 384, -28, 264, 815, -896, 255, 89, -55, 923, 1165, -144, -170, 634, -722, -1632, 103, -531, 550, 780, -330, 254, -481, 296, -272, -225, -554, -710, -111, 634, 814, 228, 177, -219, -506, 484, -894, -418, 627, 938, 303, -96, -83, 247, 906, 980, 1306, 340, 1350, 114, 1545, 830, 996, -834, -415, -119, 620, 840, -475, 179, 1349, -1002, 3, -413, -109, 357, -626, -218, 1028, -58, 290, -368, 431, 188, -141, 422, 715, 553, -144, 24, 504, 35, 765, 116, -206, 1314, 797, 87, 891, -86, -775, -269, 348, 268, -105, 392, 601, 926, 289, -145, -405, 854, -68, 1335, 588, -589, 864, -639, -83, 911, 34, 69, -414, 14, 342, 95, -490, 630, 645, 238, -55, 112, -86]
7945h6q10J171j21l6l26j15O71m58j128K62J024J53o38J133j192K75N96L67l78
7964C64J7M41j621K40J54q40J501q11O05M19l18j75j87m12R84n74n07O08P14o10
7984hj4l01L95o3O48j70J13j90J41o49J064m16j381L12L64Q72Pk124J265J15M55
8005D35m49n38R76j30o01j86Q09P15n16q83L07J23m26n91R11q68QL53LP10n77
8026d15L77j126J568K39j019r05O02O32K04nl24m43P49K26K9j329P75N40p14Q98
8046E59j544J345n22M77o7m56O38k27n63O83o55J392l35j339J348n44l22P63r33
8065c02j9k73J590j461R1Q90l6K39l02k58k14J161n72M60n01m16P45q59l47m07
8085g91L4M37N20n88L01k25N03N39j039J315o83o56M46K04l88J3o76J337j7n90
$$ y = [-86, -896, 275, 154, 118, -208, -323, 348, -110, -1238, -976, 48, 201, -437, 696, -496, -221, 375, 742, 364, 381, 822, -799, -559, -405, -1245, 256, -555, 50, 469, 151, -24, -211, -623, 361, -213, -720, -112, 602, -8, -22, -323, 72, 9, 657, 487, 600, 410, 551, -98, 966, 550, -831, -519, -155, 717, 724, -1400, -135, -20, 435, -14, -552, 424, 294, -307, -493, 316, 1031, 515, -368, -61, 62, -364, -955, -44, -912, -904, -551, -548, 162, -415, -38, -1164, 404, 643, -376, -1281, -679, -47, 157, 152, -172, -615, 134, 360, 389, -940, -165, 375, -339, 559, -985, 360, -162, 315, 248, -208, 430, 203, -360, 323, -332, 1060, 725, -614, 734, 190, -132, 631, -302, -321, -594, 996, -465, -374, 516, 480, 719, 417, 159, -55, 1106, 534, 994, 493, 77, 822, -37, -384, -791, -757, -320, 200, -388, -87, -312, 191, 730, -309, 1006, 323, -333, 113, 317, -71, -58, -734, 603, 586, -4]
8105dj63J427q70j91r33O54n89J389o90O02q37P23J37q68m87L11K11j66M62M08
8125E26j89J0j68l09N87l4r04R65j329O25K85K32O30j704j26J435j05j83N24j328
8145e60O62j29n44k25J047m97K87L65p36N78j69m04m30J887k094J993n92l41l75
8164b77M18N21j703P78J096j640J863j906N84m36K32J293k68O20r30l3k28J009
8182I93j188K9l4j189Q81J199m44nK05
$$ y = [-4, -167, 1260, 390, 199, -734, -80, -669, 720, 30, 632, -205, 518, 655, -213, -700, -389, -178, -344, 118, 526, 337, 347, 179, -130, 457, 423, -481, 484, -845, -220, 65, 297, 927, -777, -903, 532, 427, 244, 768, -560, 102, -27, -571, -796, 251, -246, 41, 406, -330, 248, 79, -325, -755, 1132, -962, 1031, 439, 98, -277, 141, 662, -1041, -263, 833, -807, 1056, -850, -266, -702, -470, 823, 555, 1175, 245, 212, -16, 993, -195, -166, -200, -1389, -508, 691, 247, 242, 447]
8191D47
$$ Imaginary data points
##PAGE= N=2
##DATA TABLE= (X++(I..I)), XYDATA
0@%%%%%%%%%%J07k15K16k16K16l16M24m32N32o40P38q48R73j157J307j477J689
27I01j939K210k490K806l157L543l967M433m948N506o113O785p522Q338r230J0210
43E366j1309J2530j3897J5425j7167J9169k1470K4169k7402L1339l6246M2574
55B3081n1102O3288q2270J16181j95368P28008L28737j298265j29499N65121K58601
66C26513l70899J37987K89043k59429n58440J85757N56924Q7544l78318q9494
76g2812J06993m9816r8698K10267K02474j32496k74780j6486J31795O4543J2098
87H3082N2265m8362j70396q6467J47724J71025l0854j54484l0989O8473j8792
98a7775p3560Q8279J63127o9117k36960j1665K12928M8884j58759l887J51974
$$ y = [0, 0, 0, 0, 0, 0, 0, 0, 0, 0, 0, 107, -108, 108, -108, 108, -208, 216, -216, 316, -324, 414, -434, 539, -618, 689, -788, 901, -1038, 1172, -1318, 1488, -1669, 1874, -2093, 2340, -2608, 2898, -3215, 3570, -3952, 4386, -4844, 5366, -5943, 6587, -7310, 8115, -9052, 10117, -11353, 12816, -14586, 16753, -19493, 23081, -28021, 35267, -47003, 69178, -126190, 601818, 930555, -367710, -497209, 67912, 326513, -44386, 93601, 382644, 123215, -435225, -249468, 307456, 395000, 16682, -72812, 34181, -15635, -114333, 95934, 298408, 165912, -108868, -125354, 6441, 70984, 83082, 135347, 86985, -83411, -169878, -22154, 148871, 118017, -36467, -67456, 1017, -17775, -91335, -3056, 160071, 90954, -146006, -157671, 55257, 104141, -54618, -58505, 93469]
109I3469n8385k23361M1992K62857J4308k42056m6635J75806L434j55498M7252
120h6817J86138n0915k04878J8060J72858k673j10568M0709R0535q6885j08569
131a43005Q8354J26589n4946j04152L1685N3896n2012l2050Q5714N0858q6666
142c5735p4710N8091O9444k5792l7646L6194K4856n1015l6968N3150O5775k3023
154B2621o5251j878M6247N802l2344J0914M1995j5549o2392M427O9564J6411n4968
167a4401j1169M4807j060m3687J8434O1430j3014o5694P474O0604m803m7906J6805
180G820M7285k7313n6855L0602O1350k2384n6238K2931M6413k8958m1152L9815
192B3316M5663l5166n0484L0180M6435k2295l6175K2629L0360k7093l3195K5260
$$ y = [93469, 35084, -188277, -146285, 116572, 130880, -111176, -157811, 17995, 21429, -134069, -86817, 99321, 48406, -156472, -138412, 34446, 31773, -78795, -38086, 52449, -34436, -143005, -54651, 71938, 16992, -87160, -55475, -1579, -53591, -85641, 73, 50931, -35735, -110445, -52354, 17090, -8702, -46348, -10154, 14702, -36313, -73281, -20131, 45644, 22621, -42630, -44508, 1739, 7541, -24803, -13889, 28106, 12557, -49835, -45408, 24156, 40567, -14401, -25570, 19237, 18177, -25510, -7076, 54354, 41340, -24354, -16880, 43724, 38921, -8985, 7820, 55105, 27792, -29063, 1539, 62889, 40505, -15733, 7198, 53611, 24653, -16499, 23316, 68979, 33813, -16671, 13509, 59944, 37649, 1474, 24103, 54463, 27370, -5825, 19435]
204A9435L7267j9829l4563R595K4254j0772k1339J5219K1614j7033k7574R505
216E779K7469m434k3844J372J9396o568k3737P461K6024n541l1410l148K7394
229A6213o46k4171l71K2887p375k8508J945L0100J341k9171q013K3604M62k3037
243b4740J972K5073k392l0400m755K4960O225k1285n051J6929J56k1581o55K3146
257a2398K783k0704q042J5482O173j4280j088J4479K538j7352o967K0167Q448
270a0761j3598p727J2627N239j2823m379J6911P786j2164j1708J1337J1987q008
283a5281q545J2012R957j1483j0296J2417J5399q677j0795Q440J1847o142j0445
296a1592J3797J1579q670j2755Q576J4519n472r044P878J0334p487j0404J0003
$$ y = [19435, 56702, 36873, 2310, 11905, 36159, 25387, 4048, 19267, 40881, 23848, -3726, 5779, 33248, 28814, 4970, 6342, 25738, 19170, -4567, 2894, 28918, 23377, -8033, -11181, 16213, 15567, -8604, -8975, 13912, 6537, -21971, -20026, 10074, 11415, -17756, -25769, -2165, -1703, -24740, -22768, 2305, -87, -30487, -35242, -10282, -4057, -25342, -30393, -13464, -13308, -34889, -35544, -12398, -9615, -30319, -38361, -22879, -16706, -30986, -32074, -17595, -15057, -32409, -39376, -19209, -10761, -24359, -32086, -19459, -14220, -27043, -31422, -14511, -6725, -18889, -30597, -19260, -7273, -15281, -23826, -11814, -1857, -13340, -23636, -11219, 4180, -4497, -15292, -6852, 4995, -1147, -11592, 2205, 13784, 5114, -7641, 935, 15454, 9982, 938, 8816, 19150, 11663, 1259, 11262]
309A1262J4208n911j2387N381J2817n943r022Q689J1107p687j1499P290J1643
322B9948m942r002N723Q064o403j0174P387J1360n794j3314O016R932m628j0289
336A3884N503R733o824j1827N211J0804n338j0606K967R355o066r662L886R285
350B0305o848j1241L319R038n226j1929N630Q202p211r935M056R505n945j2794
364a1074N625P866o567p999L290R284p281j0637M815Q912p133q514L639Q115p025
379a4684j0163O382R412o255j0527M433Q817m214r455N066O831l836r609N246
393b2556R680m950q863M250R846o476p592M910J0438n367q910N052J0446m475
407a4567p998N129R596l821r004O287R082k550q581M724J0081l137q934O543J0153
$$ y = [11262, 25470, 19559, 7172, 12553, 25370, 19427, 10405, 19094, 30201, 22514, 11015, 18305, 29948, 25006, 16004, 21727, 29791, 23388, 13214, 20601, 31961, 26167, 12853, 18869, 28801, 24173, 13884, 19387, 29120, 22296, 10469, 15680, 26484, 21146, 10540, 13507, 22862, 16796, 7134, 11020, 20305, 13457, 2216, 5535, 14573, 9347, -2582, 3048, 11250, 4039, -5896, -1840, 7665, 1720, -11074, -5449, 2417, -4150, -12149, -8859, 425, -6856, -17493, -12678, -3766, -10899, -19413, -15774, -7659, -14684, -24847, -18465, -9053, -15308, -25835, -21402, -12585, -16799, -26254, -21188, -14357, -18193, -27802, -22556, -12876, -17826, -26689, -22439, -12593, -19069, -26661, -21751, -11313, -16680, -25590, -20538, -10092, -14567, -22565, -17436, -7840, -11661, -20665, -14378, -5296, -7846, -16427, -11703, -1622, -4759, -13693, -7150, 3003]
422C003n157p535M668J0073j975q774O274P720k895p372M571Q973j506o285K595
437F378Q514k127o915L805Q563j297p288K606R003k600p861L263P974j697o488
452A3833J500O960l30q895K892P694j750p077J786O436j597p030J818N106m96
467B0850o812J334M464k90o987O88M798r02o639r12N467p65p927j001N588q49
483A0105p447j25L758K14n694n60L658j203n264j196M779j079n088j876M062k69
499c225o245k777N558k30o032p49L100P7n311j399M155k97l557l0L261p77m273
516a8751j93K700J399n318l60M127K21l966j87L270Q6l683Q38L614O63l738R57
533a8321M100N27k741K20L158J410p92j891M489K502l482l80L880J308k015m6
$$ y = [3003, -2154, -9689, -5021, 5052, 3077, -5697, 577, 8297, 5402, -1970, 2601, 11574, 10068, 3783, 6378, 14892, 12765, 5850, 9655, 18218, 16921, 9633, 12239, 21242, 18642, 10781, 14044, 22018, 20321, 13833, 15333, 22293, 21963, 13068, 15960, 23654, 21904, 14827, 16613, 23049, 21452, 14422, 16240, 21346, 20850, 14038, 15372, 19836, 19546, 12559, 13247, 18045, 17143, 10504, 9592, 15059, 14294, 6367, 5366, 10954, 10105, 2658, 2533, 6291, 6505, 811, 251, 3909, 2706, -2558, -3754, 1025, -54, -5142, -7018, -2956, -3225, -9470, -12247, -6689, -6919, -12951, -13700, -10600, -10523, -15834, -17233, -13078, -13375, -16932, -16962, -13701, -14478, -18751, -18944, -16244, -14845, -20163, -20523, -16396, -16175, -20141, -20328, -17058, -16972, -20655, -19817, -16203, -15540, -19278, -18321, -14221, -13694, -16435, -16215, -13057, -11647, -12439, -14330, -9841, -7339, -10821, -11201, -7321, -6013, -8028, -8074]
549h074M487J567l334N33L877J615k436Q06N171M72j160j670L987L114k917q66
565E172L752K174l405N96M306Q61k930M94L587O90k650Q92J636K956k931n21K743
582A7422K70k653R08K536P63l051M1K187l06k685j70P95R21k537j072K754r79
599A5144k245j209K335k38j830j865P93Q95k607j606J686m97l065q29J583j141
615E304k199j201Q94j27l229j150K006j436j841j341J213j224k847J310j10j070
631g048k125L53M35m27k302n17J283j395p69J43M37k453j761R22J577j163j372
648a6182N91J285j070j381J328K456j779j505J096K143j885j394L296O14k105
663a4492r65K503K021j466r09K176J800k107J63L633M83j718M07L075Q62n89m69
$$ y = [-8074, -3587, -2020, -5354, -4821, -944, 671, -1765, -959, 4212, 4684, 3524, 1854, 5841, 8955, 6038, 5172, 8924, 11098, 7693, 8289, 12595, 13456, 10526, 11020, 14607, 15297, 12647, 13539, 15175, 18131, 15200, 14679, 17422, 17692, 15039, 15947, 18483, 19246, 16195, 16236, 18423, 18117, 15432, 15262, 16057, 16978, 14441, 13369, 16123, 15144, 12899, 11690, 14025, 13787, 11957, 10092, 10885, 11780, 9173, 7567, 9253, 8756, 5691, 4862, 6445, 5304, 3105, 1904, 2798, 2671, -558, -1708, 298, -1138, -2979, -4320, -3107, -4331, -7178, -5868, -5978, -7048, -9173, -8820, -8385, -8812, -11114, -11631, -10348, -11743, -12512, -12369, -11932, -14385, -16146, -15224, -13647, -14810, -16182, -15591, -14306, -15376, -16757, -15429, -12973, -14752, -16257, -15161, -13018, -14903, -16297, -13001, -12387, -14492, -15457, -12954, -10933, -12399, -13308, -11132, -9332, -11439, -11276, -7643, -7160, -8878, -8471, -5396, -4534, -5123, -5592]
680e592L305Q6M33r67K833M57j605J079K442J380n94j115L965J07j428L57K460
697G603K058k596N27L586J024l187o24M136L14j458k71J560J720l181L35L028
713A4574K278l708o63L119R16m152q20M367N9k989m61L111M41l340j032L471L10
730A5481n341l83K559L79l491j435J473J255l369p28J726j360l093o57L364k110
746D270l047p4K735j895m325L03K429k86l766k10K616k337m227P77J656j583k594
763i558n93K533m95l336L92J532k23l108p35J890K42l752J699R08N02k998j9L239
781a1880o63k810L16L284p12k563P28M052k149j551l1L603j738j603J329M675
797g713j611l053J784M161j503k603K937K994q09l544L387K429k13l087L150L841
$$ y = [-5592, -2287, -2201, -1768, -2735, 98, 555, -1050, 29, 2471, 3851, 3257, 2142, 6107, 6214, 4786, 5143, 7603, 9661, 7065, 7592, 11178, 12202, 9015, 8391, 12527, 12841, 11383, 11112, 12672, 14392, 11211, 11546, 14574, 16852, 13144, 12481, 15600, 16516, 12364, 11544, 15911, 15970, 12981, 12520, 15631, 16072, 12732, 11700, 15171, 15481, 10140, 9757, 12316, 12695, 9204, 7769, 9242, 10497, 7128, 6400, 8126, 6766, 3673, 3016, 6380, 4270, 1223, 1149, 3884, 1989, -2336, -2033, 396, 110, -3656, -3866, -1250, -3587, -7814, -7037, -5381, -6964, -9558, -10151, -7618, -8113, -11449, -11057, -9525, -9748, -12856, -13591, -11701, -11459, -15211, -13512, -12604, -12102, -15100, -15119, -11880, -12543, -15353, -15037, -11753, -12465, -15028, -14300, -10248, -12397, -13948, -13979, -10376, -12114, -13717, -12388, -7713, -9324, -12377, -10593, -6432, -7935, -10538, -7601, -4607, -5416, -8960, -5573, -3144, -3357, -6444, -3294, 547]
813E47j154k795K714L411l84k812K665K806K25k912J629M280p43j857L21M151
829A0092m97k285J122K489n02j298J660J177L53j778p9L376j083j952O4K491l27
846A3023r07R68O74j48k521Q5M443k104l343n5L382q25k827j045L230o2l731j547
864F690K809l40k980k90K881j174k964j041K896j691k773L91M25k250o66o42J593
881H74l73k889j525K674n12l711L54K108k133j445N99M34o61j957n75J272O54
898f812k951l04N90L06j908J13Q05j167r86Q8M97M59m42j005R14J165j213j821
916a3672K566J51k717J292K901m44j123k57J748R74j923J097J647J660l079K25
932h954K410J173j499oK836N18k033J565K008K08K79K80K189r2k25j07K608l31
$$ y = [547, -607, -3402, -688, 2723, 2339, -473, 2192, 4998, 5223, 2311, 3940, 8220, 7477, 5620, 5941, 10092, 9595, 7310, 8432, 10921, 10419, 9121, 10781, 11958, 12311, 10533, 10454, 13830, 12747, 10795, 10859, 13350, 13023, 12116, 13084, 13758, 13610, 11089, 11174, 15617, 13513, 10170, 10115, 13497, 12672, 9845, 8800, 12030, 11968, 8237, 6690, 9499, 9159, 6179, 5889, 8770, 7596, 4632, 3591, 6487, 4796, 2023, 2414, 2839, 589, -77, -719, 874, 501, -2388, -3913, -1239, -1751, -5462, -5108, -3000, -5133, -6578, -5979, -5545, -6206, -8163, -8738, -7466, -6812, -9763, -10067, -9477, -9171, -11079, -10966, -10161, -11328, -12314, -12226, -11729, -11270, -11712, -12717, -11803, -10638, -11851, -13672, -11106, -10955, -13672, -12380, -9479, -9923, -11046, -11303, -9555, -8581, -10504, -9407, -7760, -6100, -9179, -8954, -6544, -5371, -6870, -6876, -4040, -3522, -5555, -3990, -1982, -1774, -1495, -1215, 974, 882, 657, 550, 3158, 2827]
950B827q90O7K573M0m64j0J244J967p47Q27l27J755j101O19R11R13l31j70P73
969A0476J026o02p79L70J900j565l11J670k07j840q71J675Q19r28j862J969O05
986A1545k457l95J415L69k190l54J951p48q78k917J625J085k055k296J465N93
1002E758k452j776J532j10j806j804K047P87k946j835J969O25l342p34J666K39
1018b182j700k092P54J313k261q10m12N59j656p00R79j52o73j862J110J234j029
1035i580j493P05R02j151q08j82K447o06k737J572K264j774k088K256J756m45
1051h962k643K425J478r37o55N60J673M79j873J371J860p80j400Q77M022n48j444
1068d497K431N83N16j638M50K656q90j474K880J480j42j581J747J359K65j109
$$ y = [2827, 1937, 2004, 4577, 4617, 4153, 4143, 5387, 7354, 6607, 7434, 7107, 8862, 7761, 8380, 9291, 10204, 9873, 9703, 10476, 11502, 10900, 10121, 10491, 12391, 10826, 10515, 12185, 11978, 10138, 9267, 10942, 11761, 10833, 8971, 10940, 11545, 9088, 8693, 10108, 10477, 8287, 7933, 9884, 9136, 8258, 5341, 6966, 8051, 5996, 3700, 5165, 5758, 3306, 1530, 3062, 2952, 1146, -658, 1389, 2176, -770, -2605, -636, -11, -3353, -4087, -2421, -2182, -3882, -5974, -5220, -3907, -6168, -6978, -7390, -6831, -8487, -9187, -8208, -8360, -9033, -10895, -9785, -8551, -9580, -11073, -10368, -9466, -10617, -11425, -11607, -9160, -9766, -12503, -10931, -8667, -10441, -12529, -10273, -8517, -8962, -11605, -9180, -7702, -8639, -9294, -8734, -7061, -6582, -8455, -7084, -5224, -6004, -7404, -6527, -2505, -3053, -4497, -2066, -1483, -967, -2605, -2155, 501, -389, -1863, 1017, 2497, 2355, 774, 2521, 3880, 4145, 3036]
1084C036J443J740k52k240K120K351j882O49K06J545l25n10O82P37J103j171L71
1101I603J04K81p29M3J866m31k372M24J465n54j117J11J188O20k043k53K861k263
1119H804j081P55m29l28k419O55J264r7k770J323N8j545k197J405Q70j329j538
1136A401J62q6o31j474p4K46j185l53j133J302o84q46o31l51p52j095J11J020
1154e053p63k032j83J548M4k386j28J694j294r12p59J901j37k220J288J003q76
1171i265j598q8K258j72j758R86J136l34l56j194K911j007N71m75K947j142j049
1188g629L23K269l32k061J842J794l25q80m18L061m25n56J11K949k09q92M71L174
1206B267o69n66Q21J329M26j494P16J682N08l67p73J664J52j046O71K673j135
$$ y = [3036, 4479, 6219, 5967, 3727, 5847, 8198, 6316, 6965, 7171, 8716, 8391, 7881, 8563, 9300, 10403, 9232, 9603, 9707, 9988, 9259, 9302, 11168, 10737, 8365, 8789, 10254, 9700, 8583, 8694, 9882, 10502, 8459, 8206, 11067, 8804, 7723, 8478, 8049, 7721, 5302, 5957, 7221, 7124, 4354, 5677, 5735, 4190, 1993, 3398, 4268, 2939, 1401, 1563, 1477, 846, -628, -702, -456, -1641, -1994, -3127, -1825, -2509, -3355, -3986, -4337, -5089, -6184, -6073, -5053, -5816, -7848, -8031, -6483, -6439, -8825, -8953, -7259, -8553, -9465, -10224, -8323, -8460, -10680, -9392, -8389, -9265, -10863, -10951, -8693, -8865, -10623, -9637, -8501, -8835, -9191, -10385, -7474, -8481, -7910, -8385, -5438, -6580, -7629, -7306, -5037, -5369, -7430, -5588, -3794, -4119, -4999, -5417, -2356, -2781, -3337, -3226, -277, -486, -1378, -907, 2267, 1598, 1032, 1853, 3182, 3608, 2114, 2830, 4512, 5020, 4653, 3880, 5544, 5696, 4650, 5321, 7994, 6859]
1223F859M12p94K805j44j587o54J563O26l44n08J150J157j794k13J573M0l056
1240G091J010J141j92l43j764J724P03l104j54J836j04q11j573J378n21o77n98
1257E042r0j17k779M02R96R48k093q16J126O67j959j568J453q4k145r14N87J85
1275a159j610n56N21R5j822j414P19L31q45l3L95j396r8L10q91J69q8j574R20
1294h026K10o77r40M31P20j25j530J360O2l12m11N65J225j103Q13N83M63r73Q70
1313f795K00P32r28M24J35J101m24L71j47O98m25J195J208M23o87p40J982N45
1331a132N90n94R57j36m24J300J288O46m69m5J850q5m39M20J328K93k28j58K23
1350E185K241q20J66j20J089j355P84N7J248j46q72J42n2M30j144O21O27p97J107
$$ y = [6859, 7271, 6477, 9282, 9138, 7551, 6897, 8460, 9086, 8742, 8234, 9384, 10541, 8747, 8534, 10107, 10147, 7091, 8101, 9242, 9050, 8707, 6943, 8667, 9370, 6266, 6112, 7948, 7844, 7033, 5460, 6838, 6317, 5640, 5042, 4952, 4835, 2056, 2458, 3454, 4402, 2309, 1493, 2619, 3286, 1327, -241, 1212, 1128, -1017, -1931, -1344, -1159, -2769, -3325, -2804, -2709, -4531, -5945, -5226, -4895, -5740, -5773, -5378, -6774, -6872, -6562, -7453, -7284, -7372, -8946, -8026, -7816, -8493, -9433, -9002, -8282, -8407, -9937, -8577, -8515, -8827, -9238, -8673, -7448, -8551, -7738, -7155, -6692, -7665, -6795, -6595, -5863, -6791, -6367, -6232, -5131, -5555, -5184, -5331, -4633, -5058, -3863, -2655, -2232, -2919, -3659, -1677, -1132, -542, -1136, -179, -315, -739, 561, 1849, 2495, 2026, 1981, 3831, 3746, 3307, 3727, 5055, 5348, 5120, 4962, 5185, 7426, 6606, 6772, 6652, 7741, 6386, 7170, 7227, 8475, 8329, 7457, 7599, 7547, 7977, 6833, 7454, 8081, 7284, 8391]
1369H391q02J026j018k06Q87r1j522J1L64J33l21j181k32Q2j79o3r9o60L87j097
1389C810J46o52j54l23o58l57n60r86K84J40j540k84j09o50o32M55q08R82m04
1408b300q96k7r9q79j900J750K26j975N46LN0j479o16J587J32j372j009J289j51
1427g120q59p36J412q2m57P31L20N1l27j265M77J940n05l02J64k31R3j028Q52
1446f872K227k26n11P32L99Q9K33K9N69J48P25m07J327R8j444K006R4L84o3O35
1466A72K63J613l96k05K695o73j489J881R40p76l43J523Q33j135j58P47J908j552
1484E848m6Q4J037L10j613J271o82J971j535O10L30J70j003j8K134j669J15k50
1502G064R39j204j31n58k31n59O53q32J292n85q02L9L69j370j816J319L28n1j255
$$ y = [8391, 7589, 8615, 7597, 7391, 8278, 8187, 6665, 6676, 7040, 7173, 6852, 5671, 5439, 5521, 5342, 5279, 5180, 4520, 4907, 3810, 3956, 3304, 3150, 2827, 2169, 1812, 1252, 266, 550, 690, -850, -1134, -1243, -1893, -2525, -2070, -2878, -1896, -2300, -3196, -3223, -3322, -4201, -6101, -4351, -4125, -6100, -5554, -5551, -5501, -6980, -7596, -6009, -5877, -7249, -8258, -6969, -7120, -7979, -8715, -7303, -7385, -7842, -7111, -6791, -6740, -7067, -8332, -7855, -5915, -6420, -6722, -6558, -6789, -6696, -7724, -6872, -4645, -4871, -5382, -4650, -4251, -4162, -3929, -3900, -3331, -3183, -2458, -2865, -1538, -1440, -2884, -878, -784, -400, -463, 172, 435, 2048, 1652, 1447, 4142, 3469, 1980, 3861, 4801, 4025, 3682, 5205, 6038, 4903, 4745, 5492, 7400, 5848, 5802, 5886, 6923, 7233, 5620, 6891, 6209, 8180, 6645, 7255, 7585, 7755, 6752, 6734, 8868, 7199, 7314, 7064, 8003, 6799, 6668, 6110, 5879, 5320, 5973, 5141, 6433, 5848, 5046, 5085, 5454, 4084, 2268, 3587, 3915, 3864, 2609]
1521B609N27p8K96k776n96P31r75P64j145o0m29o60o89N38q46o87p24J570m79
1540c109j723J452r55l07m64P31q90O95k632R61J010j433N68o95L01M51j403j34
1558g576J5l36O34K6P31K89j527J06J113O45r51O45L55m57M61n14J658k8rl93
1578e113k86J738o94K70M07M61l5J82n3J406Q98k91O99J9p52J279J416l51q16
1597C84M11J300L75r41L13P49M89L49k48J698j116j20J120r1J366r58o0J220o52
1616E588m06O55J023M81r53J56Q83k53k42j710K145q47M01q01J182j4k169K113
1634G232r47p77p29J188j75J81j620O83J3m12k57O5k95m82l94q66m36M44j489
1653I27J309k09j058L32j404l53Q77k360R62l43N62r81r42R45j075j392j26Q53
$$ y = [2609, 3136, 3058, 3354, 578, -18, 713, -262, 502, -643, -703, -1132, -1792, -2481, -1943, -2789, -3476, -4200, -2630, -3109, -4832, -3380, -4335, -4642, -5106, -4375, -5265, -4570, -7202, -6241, -5231, -6664, -6096, -6791, -6490, -6039, -7442, -7576, -7561, -7897, -7263, -7237, -6506, -6217, -7744, -7638, -6525, -5880, -6831, -6186, -5831, -6288, -5827, -6341, -4683, -4711, -4720, -5113, -5399, -3661, -4355, -4085, -3678, -3217, -3252, -3070, -3123, -1717, -819, -1110, -411, -392, -1144, 135, 1551, 1200, 384, 795, 2095, 2470, 1529, 1842, 2591, 3080, 3429, 3181, 4879, 3763, 3643, 4763, 4672, 6038, 5080, 5020, 6240, 5588, 5182, 5837, 6860, 7341, 6388, 6544, 7427, 7174, 6932, 5222, 7367, 6520, 6921, 6120, 7302, 7288, 5119, 7232, 6285, 5508, 4779, 5967, 5792, 5973, 4353, 5036, 5049, 4637, 4380, 4445, 4150, 3668, 3274, 2408, 1972, 2416, 927, 2236, 2027, 969, 1301, -103, -456, 421, -1939, -977, -1320, -758, -1739, -2681, -1736, -2811, -4203, -4329, -3476]
1671c476m95j68o80J156j347j007J058P4J74j341J47J350p41q58M65o01p67J792
1689e265m10j053J83l69L67K08P12L24j701J656l16l44N19P08P05l82o59R18l13
1708d512J67m29J543O55j801L71K798o70J25L78q05J620O9m56J336r67R89L94
1726H05r77K136n18O85m2j57p05J382O40N94o25j46J758r73J26M63J30N61l45
1745D792J44j6N58P06j04k70J83N81j085K006k085Q58K48r71L85q94Q03q21L24
1764E342R0m93M57o50m62l13J392j177o97j7J561j601j262J358p25k54j219L52
1782A682K146j774j761K4J151j861p64P42J47l66j038K67J55m77j256n45O11m65
1800c382K53j91l09p20j80O96k54k77l15l06M58p63k57O6K30o10o80P97M79L88
$$ y = [-3476, -3971, -4139, -4819, -3663, -5010, -6017, -4959, -4885, -4711, -6052, -5905, -4555, -5296, -6154, -5689, -6290, -7057, -5265, -5675, -6728, -6545, -6914, -6547, -6339, -5627, -5303, -7004, -5348, -5664, -6008, -5489, -4781, -4076, -4458, -5117, -4199, -4512, -4345, -4774, -3231, -2576, -4377, -4006, -1208, -1878, -1753, -1375, -2180, -560, -491, -947, 389, -578, 411, 805, -172, 1964, 1446, 2131, 2089, 1932, 1227, 2609, 3249, 3843, 3218, 3072, 4830, 3857, 3983, 4446, 4576, 5137, 4792, 4936, 4920, 5478, 6184, 6080, 5810, 5993, 6574, 5489, 7495, 5410, 6268, 6516, 5545, 5930, 5036, 5839, 5018, 5342, 5432, 4939, 5396, 4746, 4284, 3971, 5363, 4186, 3489, 3472, 5033, 3432, 2170, 3528, 2803, 2549, 1330, 1682, 3828, 2054, 293, 317, 1468, -393, -1157, -415, -268, -634, -1672, -1405, -1250, -1727, -2983, -3528, -2917, -3382, -3129, -3320, -3629, -4349, -4529, -3833, -4087, -4364, -4679, -4985, -4527, -5290, -5547, -5481, -5251, -5861, -6541, -5744, -5265, -4877]
1820d877j990L90J788j656j413K706J51L53j563QJ729L04r73O64J27K27q24M77
1838d372K581k003n38J149O35l35J077l52m70J423O74r13O72J30o84J976N75L04
1856A529j187l18J736o52J545n81M89K85M62Q32M4n59O08k90J272M44k362Q01
1874D098J886lk112R64J400k36j337K84J533j193L04o30P29J82r35K98j40J140
1892F232j960M00J51n94n62P01N83r64K75n72j78m78J091n57p0o92j063L49j15
1911A977Q95k605J148r4k96l66m55l50j695J381q91P69j8j480M81O4j82j160J56
1930b721L36j247j28L4P26j232p73k55N08m20j07l12J186j061J3j65P67q18K4
1949e645O82p7q74N66m3N25r39J52J427k20J93o04J88n75R18m15J311N27r22J732
$$ y = [-4877, -6867, -6477, -4689, -6345, -7758, -5052, -4901, -4548, -6111, -6103, -4374, -4070, -5043, -4379, -4252, -4025, -4849, -4372, -1791, -3794, -4332, -3183, -2548, -2883, -1806, -2158, -2628, -1205, -531, -1444, -772, -642, -1326, 650, 1225, 1529, 342, 24, 1760, 1108, 2653, 2072, 2561, 2846, 3308, 4140, 4184, 3625, 4233, 3943, 5215, 5659, 3297, 4098, 5984, 5981, 3869, 4833, 6233, 5997, 4660, 4944, 6477, 5284, 5588, 4958, 5687, 5869, 4934, 5232, 5092, 6232, 4272, 4672, 4823, 4229, 3667, 4368, 4951, 3987, 4262, 3690, 3512, 3034, 4125, 3568, 3498, 2806, 1743, 2092, 1977, 2872, 267, 1415, 1321, 1025, 659, 204, -146, -1841, -460, -1351, -582, -600, -2080, -1599, -1535, -1717, -2877, -2721, -2385, -3632, -3760, -3726, -3000, -4232, -5005, -5260, -4752, -5172, -5279, -5591, -4405, -5466, -5453, -5618, -4851, -5669, -5645, -4963, -5040, -5914, -5348, -5391, -4866, -5805, -5653, -4226, -4446, -4253, -4857, -4669, -5244, -4326, -4741, -3430, -2903, -3825, -2093]
1969b093j418K79P36J99j07N54L86Q89j50N05l38n76M23J031j45o1J024N1o89
1988E00J140k25J402m57J39m43J123q68L12J383M65j84p10O87P77j52j267J618
2006E240q27K37K86l26l4j38o8O60N14j143P98l7j07r52O89Q69k38o9j455O17
2026D516o90M68j466m08Q93k47N52m84M74j067l6l70J80m94R0m83k14k43r7j88
2046F86n78l4q42J6Q32o28m55o35L05o40n25J57o4l36j180l0O25j69o81L98J52
2067c626k56j041O93o08R46L28q5r28K28j246o9O46N99m96M8P64q93j33Q81n33
2087d781R29O63p93j45J76K66n53R40m49M85N81L46J55j084K24J058L2O87j42
2106a405m32J83J544j501O92M72O18k63O76M53n04p9Q14Q09r73J030n04J468J52
$$ y = [-2093, -3511, -3232, -2496, -2297, -2404, -1850, -1464, -575, -725, -220, -558, -1134, -711, 320, 175, 114, 1138, 1189, 500, 1640, 1415, 2817, 2360, 2499, 2056, 3179, 2311, 2623, 4006, 4471, 4287, 3577, 4264, 5041, 4889, 3622, 5240, 4413, 4650, 4936, 4610, 4576, 4438, 4370, 5030, 5544, 4401, 5199, 5162, 5055, 4103, 4792, 5661, 5423, 5354, 3899, 4516, 3826, 4294, 2828, 2420, 3313, 3066, 3618, 3134, 3608, 2541, 2505, 2135, 2315, 1821, 1911, 1428, 1214, 971, 874, 686, 108, 74, -768, -752, 80, -548, -1003, -1638, -1333, -1973, -2498, -2341, -2405, -2741, -3921, -3951, -3326, -3495, -4176, -3778, -3626, -3882, -4923, -4230, -4838, -3892, -3564, -3649, -4577, -4349, -5595, -5664, -5018, -4419, -4915, -4867, -4103, -4996, -5129, -4248, -4781, -3852, -3189, -3982, -4127, -3951, -3685, -4238, -3298, -3747, -3262, -2681, -2335, -2180, -3264, -3040, -1982, -1950, -1263, -1405, -1837, -1654, -110, -1611, -919, -447, 171, -92, 584, 1037, 533, 454, 1268, 2077, 1104, 2134, 1630, 3098, 3250]
2125C250m27J43J214o55j523J715R1o46l89J120k73l04R6J242l76r01O63J354
2143E394l19qM83m2o81r73J567r44j188L11K70N98o21j93n81K70L36m11o66o37
2163A965J348p54J98J16j668O00PL50j076k88j275R68N06j219m3l88m43O67j243
2182a672j74P15l79p36J0K50l00n73k38J189j160N78l7q6q06j675J792p00r45
2201d947J945j033o7j12j55J6L79J97o65J66k54j71J208q47l34M64K49N96j631
2220d996N26J568j028M26O80q50Q78q8l25K014o91k23M60n65J614l18k32j775
2238b925K911J60j76K26j85N04j290O56J131J28Q86j643K131j182O45M57Q38r73
2256B299J006p23Q74P11P85j343j060K382j161j99L40N17j132J305J93j630J000
$$ y = [3250, 2823, 2966, 4180, 3525, 2002, 3717, 3808, 3162, 2773, 3893, 3620, 3316, 3412, 4654, 4278, 3377, 4040, 5394, 5075, 5067, 5550, 5508, 4827, 3854, 5421, 4477, 3289, 3600, 3870, 4468, 3847, 3654, 3073, 3343, 3679, 3268, 2602, 1965, 3313, 2559, 2757, 2873, 1205, 1805, 1812, 2162, 1086, 798, -477, 491, 997, -222, -265, -653, -1096, -429, -1672, -1846, -1131, -1510, -2246, -2236, -1986, -2286, -2859, -3097, -1908, -3068, -2490, -2527, -2613, -3419, -5094, -3302, -4002, -4947, -3002, -4035, -4102, -4214, -4369, -4353, -3974, -3777, -4442, -4276, -4530, -4701, -3493, -4340, -4674, -4210, -3961, -3365, -4996, -4470, -2902, -3930, -3504, -2824, -3674, -2796, -2884, -3209, -1195, -1886, -2109, -1649, -2214, -600, -918, -1150, -2925, -14, 146, -30, 196, 11, 515, -775, -119, 1012, 1140, 2026, 383, 2514, 1332, 1977, 2434, 3272, 2299, 3305, 2582, 3456, 4167, 4952, 3609, 2549, 4931, 3770, 3571, 3911, 4428, 3296, 4601, 4794, 3164, 4164]
2273D164M44k36j37M19l48o42M05K32j77j97m43o16J030l57m77Q18q97k21r73
2292A791m3N00mm91M2l58n59J16k98j66o99P35o65K82l72j16K95l64r8q48k81
2313a601O3l22L4O04j289M10j49p31N93r24K8L50m42P97j521Q49m28Q87p34j224
2333d750J185j371J169J47r73Q10j19j17R54r56M25j42l62M46P21n40j99N2N45
2352c075l11R64j40M89j09k43j16R91N46j053J168j019k50L15J291n13O61k70
2370f74M07r03J401o04R99L07L4r3O37L7k85j11J552m08k14K56M80K74j0Q4j88
2391B978N43p4j14K51O6M97J92j051K06M80J68p17K25l01j09J427o73L53j091
2410C256O06j46L10q42k03Q26j870M61J449k31j003L90m89J05p39l47J200j328
$$ y = [4164, 4608, 4372, 4235, 4654, 4306, 3664, 4069, 4301, 4124, 3927, 3484, 2868, 3898, 3541, 3064, 3882, 2985, 2764, 1791, 1748, 2248, 2244, 1753, 1795, 1437, 878, 994, 696, 530, -169, 566, -99, 183, -189, -305, -10, -374, -472, -1320, -1601, -1538, -1860, -1826, -1222, -2511, -2101, -2250, -2981, -2388, -3312, -3284, -2934, -3376, -2579, -4100, -3251, -3679, -2792, -3526, -4750, -3565, -4936, -3767, -3620, -4593, -3783, -3902, -4019, -3065, -4021, -3596, -3738, -4100, -3654, -2933, -3473, -3672, -3620, -3075, -3386, -2422, -2562, -2073, -2182, -2425, -2541, -1550, -1004, -2057, -889, -1908, -2158, -1843, -552, -1065, -404, -674, -267, -1170, 231, -373, 626, 933, 967, 874, 1511, 1548, 1263, 1152, 2704, 2296, 2082, 2338, 2818, 3092, 3082, 3166, 2978, 3521, 3447, 3333, 3584, 3650, 4147, 4339, 3288, 3494, 3974, 4142, 3425, 3650, 3349, 3240, 4667, 3994, 4347, 3256, 3862, 3716, 4026, 3184, 2981, 3807, 1937, 2398, 3847, 3616, 2613, 3003, 2514, 2619, 1880, 1533, 2733, 1405]
2428A405J79k57j432Q01k64M74o92n14J114j298Q86j565L0o77L66L4j050R68j73
2447a665Or29J474j578k12k01Q71p14l44J109j216J356n70l63j079M03q14J337
2465c129j061m10J145n01O18k52M70o29L51P62j251J207n8k67L58j572J003M76
2483b740k63K96M65p26J331j164L43P23j26J68P02j17K79l89R54r47J302j099
2501a008Q76N02K79j303J307J026k098P74P05Q49R82N3r59q1j36J175p54K39n54
2520A874J313o57O02K08N77p69m47O73j279J578k05P09k61M71M05r81p12N85l26
2539C358r41Q36m83O28M84q16J341j244k57J58j031n88J182n81J16o46M04N66
2557B486j730J232j023k79j498K347o90n77L64o04j31q11o0J26J294j869M2L31
$$ y = [1405, 1584, 1327, -105, 696, 432, 906, 214, -300, 814, -484, 402, -1163, -1133, -1810, -1444, -1410, -2460, -1492, -1665, -1659, -2588, -1114, -2692, -2904, -3105, -2234, -2948, -3292, -2183, -3399, -2043, -2613, -2976, -4055, -3652, -4466, -3129, -4190, -4600, -3455, -3956, -3338, -3590, -3120, -3749, -3398, -2636, -3887, -2680, -2738, -3005, -2647, -4219, -3216, -2740, -3003, -2707, -2242, -2968, -1637, -2801, -2458, -1735, -1861, -1693, -991, -1108, -829, -1218, -264, -1211, 91, -1008, -132, 370, 649, -654, 653, 1679, -419, 355, 1060, 1909, 2891, 2944, 1985, 1904, 1768, 2943, 2189, 2428, 1874, 3187, 2530, 3132, 3340, 3917, 3148, 2701, 3374, 2095, 3673, 3468, 4177, 3916, 4387, 4792, 3811, 3099, 3684, 3358, 2417, 3253, 2770, 3398, 3882, 3066, 4407, 3163, 2906, 3064, 2033, 1445, 2627, 2046, 2162, 1516, 1920, 2486, 756, 1988, 965, 686, -812, 1535, 845, 268, 632, 28, -103, -914, -974, -848, 446, -1423, -1381, -1050]
2575a050m06r58J603j485J49o45q27J613m43k48j8r45J0P7Q48o91j02m97P19j473
2595d769J704o36L12O8J50L82j377P48L43o53J9J886q35j039r05Q6L62R74J00
2614c080M86k72O14m00J094o40O49R10m99Q29r06K65Q59N75m29J97q86R18Q04
2633A088o32k76O65m15J009n27K26K91O79j62n74k71J006K125j533j406J883k01
2651B975l00O80N69j507K96K20M20k76J212m16J95K35n31l22l27j00O32P8n64
2670C169k57l32M32p05J41m32J205r23q31O22l42j60K80m78J83K6R76k87k043
2689B44J245l96n2n74j36O3n33N74p65J113j752J27Q05m84j187l67m22J114p48
2708b131N7j73p40J417q54L20j0M6r37J059p30j1n37j211J159j10Q41K11k00l53
$$ y = [-1050, -1456, -2414, -811, -2296, -2147, -2792, -3619, -2006, -2449, -2697, -2715, -3660, -3650, -3573, -2725, -3416, -3518, -4015, -3296, -4769, -3065, -3701, -3389, -3321, -3171, -2789, -4166, -3418, -3075, -3728, -3709, -1823, -2658, -3697, -4602, -4516, -4154, -3180, -3080, -2594, -2866, -2252, -2652, -1558, -2198, -1549, -639, -1138, -309, -1215, -950, -91, 484, 55, 252, -634, 284, 1088, 456, 180, 845, 430, 1439, 912, 1138, 1429, 2108, 1946, 1372, 1101, 2107, 4232, 2699, 1293, 3176, 2975, 2675, 3355, 3924, 2417, 2713, 2933, 3353, 3077, 4289, 3873, 4068, 4303, 3772, 3450, 3123, 3023, 3655, 3733, 3169, 2912, 2580, 3012, 2307, 2448, 2016, 3221, 2298, 1467, 2089, 1747, 1587, 1867, 1389, 1572, 1598, 2574, 2287, 244, 1489, 1093, 1041, 467, 331, 394, -139, 435, -330, 783, -969, -842, -37, -521, -1708, -2075, -2497, -1383, -2131, -2074, -2247, -2987, -1570, -2424, -2104, -2114, -2068, -3005, -1946, -2676, -2687, -3224, -4435, -3276, -3386, -2545, -2334, -2534, -2887]
2728b887K25p13P15l55K9j29N84J0R4P91j774P22R00n62J97L81j29L58n82J394
2748g31j368L78M65l99K81Q08L93m06M66O1P4n5R70j394N74j3J61L87r31J020
2768G41O40p54R57M17o74J099k170K252J3L82P50p18J62j375O55P54m90N86l0
2787C197O27n30M42J12l58j088M69j034J182p2l56J182p04j555J424l28J53M6
2805B809o14R21r75p78J327n78N49q18r18J236j331j82J317n96o71j143Q35M48
2823H38r70J738j086k08K78j231L88l0o61P04o97n35n62L74m63Q11n93m82O96
2842a691n64m48m5N83J039k629J50J94J74J525k39p62n58P60o63N8L22m22K9J077
2862b110o25M46p51K49n60K59L23J094o52p9J009J16k20m8k70K49k78J487n16
$$ y = [-2887, -2662, -3375, -2660, -3015, -2986, -3115, -2531, -2521, -2427, -1636, -3410, -2688, -1788, -2350, -2153, -1772, -1901, -1543, -2125, -731, -2099, -1721, -1256, -1655, -1374, -566, -173, -579, -113, -52, 22, -33, 937, -457, 117, 104, 265, 652, -279, 741, 1381, 627, 1584, 2001, 1327, 2426, 256, 2508, 2521, 2903, 3653, 2935, 3097, 1722, 2377, 3131, 2641, 3227, 3197, 3824, 3294, 3736, 3848, 3490, 2402, 2871, 1837, 3019, 2947, 2591, 3773, 3069, 1514, 2938, 2610, 2763, 2809, 2195, 3116, 2141, 1363, 2690, 2112, 2661, 1843, 925, 2161, 830, 648, 1965, 1369, 698, -445, 390, 838, -132, 1606, 520, 312, 590, -641, -253, -283, -944, -240, -937, -1472, -2034, -1660, -2123, -1312, -1905, -2387, -1691, -2255, -2703, -2748, -2165, -1126, -3755, -3605, -3411, -3237, -1712, -1951, -2713, -3271, -2511, -3174, -3116, -2794, -3216, -3187, -2110, -2735, -2289, -3040, -2791, -3351, -3092, -2769, -1675, -2327, -2406, -1397, -1281, -1501, -1549, -1819, -1570, -1848, -361, -877]
2881h77j23r59J226Q26l62R74j714J366j61j419J251M50L95p58J094q45J533j39
2899A758l04N79m44J67N78m05L41q10R4j93L61J777j339l9K79j00Q48j585J365
2918B928j61M74N89j342N05L11j521R25n19O27J332j854J03O04r64j9M71k70O19
2937B838j53j72p45q2q33J30K97j096L79P39l50r21J189J27j408J095j162J0k84
2956d02M31j71K85l53m57K8q67O28J22j78K41j077J05l93O8O03q48m74K17m1o37
2977c170R06q81O32M99L97q96N28k2m18j623J347K54J87m65r39N84J477r86P42
2996a847p53k64J096q28N54l54N43m64P57n64R46m50N09N14l94k21L78K03j3J95
3016d57p5Q02p64k49J130R0K28L29l87Q56o93r86L67O75J316m04Q28o2p09j45
$$ y = [-877, -1000, -1959, -733, 93, -269, 705, -1009, 357, 196, -1223, 28, 478, 873, 115, 1209, 364, 1897, 1758, 1454, 2033, 1589, 1756, 2334, 1929, 2270, 1460, 1554, 1361, 1722, 3499, 2160, 2121, 2400, 2300, 3148, 1563, 2928, 2767, 3241, 3830, 2488, 2993, 3304, 1783, 2708, 2189, 2816, 4148, 2294, 2397, 3001, 2037, 2018, 2489, 2219, 2838, 2685, 2513, 1768, 1686, 853, 983, 1280, 184, 563, 1302, 952, 31, 1220, 1347, -61, 1034, -128, -118, -402, 29, -142, 143, -210, -667, -639, -1506, -878, -756, -934, -693, -1770, -1665, -2058, -1990, -1387, -2235, -2709, -2492, -2533, -3170, -2264, -3145, -2513, -2014, -1617, -2513, -1985, -2007, -2425, -4048, -2701, -2447, -2260, -2725, -3664, -3080, -1603, -2589, -1847, -2600, -2864, -1768, -2596, -2042, -2396, -1853, -2317, -1560, -2124, -1178, -1628, -1119, -605, -999, -1220, -842, -639, -652, -457, -532, 270, -494, -743, 387, 477, 705, 1034, 647, 1503, 810, -176, 191, 866, 2182, 1778, 2606, 2544, 1835, 1690]
3036A690L30n30P80L17o32q25J734j57k47J005j300P87O94m73q7n92J05N8R35
3055C592r65m1k11n65p2M55J90p72m01J138l94k14L23L92j137L57O76j238L48
3074A461K54p78J76k47O68o20k16j171m17J587k62j54p81Q69o20l94%j30R26j76
3094b5j553J09n55O92M10r81K74r18J61j4J268k066j90J319q97K32O87j299Q24
3113b522k76J043j336K15R66n66N16l44O8p66M58Q90j06l29J3r39J302j090Q84
3132a919J83p34L63J66M01M56p60J520p14n56J857o22p10K96J483m77l88m27O47
3151F5P47j849K108m18N65l49o69Q23K26Q07o96q54J281K36k92J695j162n94Q46
3170B516j085Q67J64o10L70l14Q30l6m7J43L78p80m05p3p6J397j300J56j82R08
$$ y = [1690, 2020, 1490, 2270, 2587, 1955, 1130, 2864, 2707, 2460, 3465, 2165, 2952, 3646, 3173, 3086, 2494, 2599, 2657, 3592, 2627, 2586, 2375, 1810, 1738, 2193, 2383, 1611, 1210, 2348, 1954, 1740, 2063, 2455, 1318, 1675, 2351, 1113, 1461, 1715, 937, 1113, 866, 1534, 914, 698, -473, -890, 697, 435, 281, -500, 369, -251, -645, -645, -775, 151, -25, -1578, -1469, -2024, -1332, -922, -1903, -1629, -2547, -2386, -2400, -1132, -3198, -3388, -2069, -2966, -2734, -2047, -3346, -2522, -2798, -1755, -3091, -2876, -1910, -2476, -1960, -2304, -2236, -3002, -2544, -1654, -1760, -2089, -2076, -3015, -1713, -2803, -1919, -1736, -2470, -2107, -1941, -1540, -1084, -1844, -324, -1038, -1594, 263, -359, -1069, -773, 710, 233, -155, -582, 65, 812, -1037, 1071, 653, 1218, 869, 200, 1023, 1249, 2056, 1360, 506, 1787, 2023, 1731, 3426, 2264, 1670, 2516, 1431, 2298, 2462, 1852, 2222, 1908, 2738, 2702, 2655, 2798, 3176, 2396, 1991, 1918, 1842, 3239, 1939, 2095, 1913, 2821]
3190B821r58r8N02j312J398j49l1K9p55K67l92J37K40j015R4k50j26M30J87r60
3210E9J726j903k8O12r00k3J66p0m2J177k083M90q89m57N83Q39j148r8J101j379
3230b267Q80k30m89m45R53j257J191m04l21o6J88l4p55k48J407j359J432n02N07
3249a819m3j60N35q99J55M7R13L09k282J574o27O04q93J149L50r69M91L25J7K26
3269i97J020j408M81R6m56K62R48p78P01n04J405Q9m19K42j70P47q51K05P91m06
3289I98O00j84R42k304K579j010m23P0O83q72MR01l91k98j09J905j253n44P93
3308B087L73p31r4J228p16R08l6j372R62j390Q77M57j17l81n78M96q09J059o63
3327A560O8m86P70r06O7j3o35O60m98M04R9j198J097o82N87r89J060j674P22K74
$$ y = [2821, 1863, 1765, 2267, 955, 2353, 2204, 2173, 2202, 1447, 1714, 1322, 1459, 1699, 684, 778, 528, 402, 832, 1019, 59, 1785, -118, -146, 466, -434, -457, -291, -361, -403, 774, -1309, -819, -1708, -2165, -1582, -743, -1891, -1989, -888, -2267, -1387, -1617, -2106, -2551, -1598, -2855, -1664, -2068, -2389, -2455, -2267, -2301, -3056, -3304, -1897, -3256, -1824, -2326, -1819, -1862, -2022, -1487, -2386, -2231, -2184, -1271, -962, -3244, -1670, -2297, -1693, -2586, -1437, -1087, -2056, -1565, -1240, -1223, -997, 23, -1385, -904, -808, -1264, -1002, -54, -832, -131, -635, 770, 859, 440, 682, 512, 1259, 408, 613, 1404, 998, 1598, 1414, 2356, 52, 2631, 1621, 1198, 1268, 1951, 1079, 1083, 1984, 1593, 1295, 1186, 3091, 1838, 1294, 2087, 2460, 1729, 1635, 2863, 2147, 3055, 3019, 1647, 2609, 1219, 2096, 2553, 2436, 2055, 1477, 1973, 1164, 2223, 1560, 1628, 1142, 1912, 1006, 1073, 1060, 425, 1085, 587, 991, 1090, -108, 989, 307, 894, -95, 965, -709, 13, 287]
3347B87j824Q19J70L48L89j656O23K6p31J64o5p69J717j391r39J416l65n0J29
3366a702k14l40O3r40R73P97n00j009O4J279o39q95P45r4n3L86k29L76n6M18O30
3387i40p56P8m80n76J275P27m64r58K320k801J967P81j799O54M83k91K89o3r5
3406f49J620r94J222n24j64K18m30K71J39k40M65K44m44O3J412j044m46J442r09
3425A252l75J422j10j114J576o37N23m88q68J643j726J051k08N60j73r51L35r5
3443A617L79P31m36j59K4p06m5O44l24l26L4k70Q05m9n80l76P59l63j674J432
3463A117p53j90O75p13J39M58J02m66J70K69r31K79n65l10J617r96o51J118r12
3482e43q42k87Mn32O79Q43j280J94J581k880J020J172p54j31N36l54l62P72k59
$$ y = [287, -1537, -718, -548, -200, 189, -1467, -844, -818, -1549, -1385, -1450, -2219, -502, -1893, -2832, -1416, -1781, -1831, -1702, -1916, -2256, -2193, -3133, -2160, -1363, -1863, -2872, -2808, -1529, -2168, -3063, -2318, -2412, -2465, -2079, -2308, -1932, -1988, -1570, -940, -1696, -1618, -2098, -2674, -1399, -672, -1136, -2094, 226, -2575, -608, 173, -1626, -972, -489, -780, -491, -554, -649, 971, -23, 1199, 675, 511, 729, 299, 570, 709, 469, 934, 1178, 734, 797, 2209, 1165, 719, 2161, 1252, 877, 2299, 2189, 1075, 2651, 2014, 2537, 2049, 1181, 2824, 1098, 2149, 1941, 2501, 2328, 1377, 1712, 1617, 1996, 2727, 2291, 2132, 2156, 1450, 1405, 2049, 1725, 1399, 1433, 1163, 1968, 1919, 1339, 963, 1722, 1359, -315, 1117, 364, 174, 849, 136, 275, 733, 835, 369, 539, 808, -123, 156, -409, -719, 898, -98, -749, 369, -543, -1385, -1672, -1668, -2200, -1521, -678, -1958, -1764, -183, -3063, -2043, -871, -1625, -1756, -1220, -1574, -1936, -1164, -1423]
3501a423R88k691K016j486j02m61J453K99m59j39L06k5o57J320j372J405q74p7
3519a979J340r15k64N21K16J47r5m9P30j67m16R56j523J636k69m57M18J95o52
3538f27P91O75k93R3l48K00Q38M37p34n89R55K70m09l49j220R76O90l61P46O46
3558B387o82J366q08k57m0m0p19J30N75j66m7l92K28n83J038k55M54m71J85J07
3578B010L13n02J43J95l69K9J59p11q99R74P83j204M55j006P99o72j77l9L02k5
3598E58j049p43J134R8r15Q99o22Q46j542M94N80o12P42n99l1K01n83j08L74M21
3618d57j191K28j0k40N08j21j033M98N00j169N19N90o84k51Q95m54k27QN25n33
3638b099o93R26n67N75K68N41J090j073j002R25k96L45m87K42L14o02M32L77l46
$$ y = [-1423, -435, -3126, -1110, -2596, -2698, -3159, -1706, -1407, -1866, -2005, -1699, -1724, -2381, -1061, -2433, -1028, -1902, -1979, -639, -1554, -1818, -1297, -1081, -934, -1029, -1078, -348, -515, -931, 25, -1498, 138, -131, -588, -170, 25, -627, 164, 839, 546, 639, 291, 491, 1329, 1766, 1032, 443, 1398, 1668, 1259, 910, -310, 666, 1356, 995, 1741, 2387, 1705, 3071, 2263, 2006, 1966, 1926, 1207, 1337, 1912, 1746, 1699, 1307, 1535, 952, 1990, 1735, 2189, 1718, 1903, 2010, 2323, 1821, 1964, 2159, 1790, 1819, 1978, 1267, 368, 1342, 2125, 921, 1376, 370, 1169, 497, 320, 281, 583, 558, -491, -1234, -100, -2, -917, -18, -640, 206, -1336, -842, -262, -874, -132, -731, -762, -561, -1144, -1252, -878, -457, -1648, -1420, -1430, -1670, -1162, -1283, -2316, -1818, -1318, -2487, -1968, -1378, -2062, -2313, -1418, -1872, -2099, -2091, -1566, -2099, -2792, -1866, -2433, -1858, -1590, -1049, 41, -1032, -2034, -1109, -1405, -1060, -1547, -1305, -991, -1593, -1161, -784, -1130]
3657a130j15K9j16P21K70M72n37k91O24M76J377j828M00p10K61m43O78j62O49
3676F25m97k8P22k13J593p47p81P74p29L29O04n38m33Q44q31J978o34r24J018
3695B132J87j83j551J051j012J077l31J48K20q1L72l57L51n63J460j528L09o00
3713A101Q23mq11m53L31L84L40o96n89O6J142k10j325O16q48J087j151N52r49
3732e94J61o4M42j58p67j114K540p90j05J99k22j081J429k88j072Q50k48n57j45
3751a584q53N80rM1r77R96L78k59J68j53P00j32j112R11q38k81O78O17j462Q26
3771a765K20L63K61l6n30K93l19J269j125j49L56L48J96O02j094N81l29n77J397
3790c8o69j68J284o21q02K60L36L19M05n25N52P07l40O89L20j188n7P84j060N
$$ y = [-1130, -1245, -1216, -1332, -611, -341, 131, -406, -697, -73, 403, 1780, -48, 352, -358, -97, -540, 138, -24, 625, 128, 100, 822, 609, 2202, 1455, 674, 1448, 719, 1048, 1652, 1114, 681, 1525, 694, 2672, 2038, 1114, 2132, 2319, 2136, 585, 1636, 624, 1701, 1370, 1518, 1738, 1657, 2029, 1672, 2023, 1460, 2920, 1392, 1701, 1101, 1924, 1920, 1109, 656, 987, 1371, 1711, 1015, 426, 492, 1634, 1424, 99, 715, -133, 954, -197, 355, -594, -433, -497, -55, -213, -980, -2094, 446, -344, -449, -250, -472, -1553, -124, -412, -1484, -634, -882, -1439, -1584, -2437, -1857, -1866, -1825, -2802, -1806, -1428, -1687, -1519, -1672, -972, -1104, -2216, -1305, -2143, -2424, -1746, -1129, -2591, -1765, -1545, -1182, -921, -957, -1487, -1194, -1513, -244, -1369, -1518, -1162, -814, -618, -16, -1110, -529, -858, -1435, -38, -707, -875, 409, -212, -1014, -754, -418, -99, 306, -219, 333, 1040, 700, 1389, 1709, 521, 464, 1248, 188, 193]
3810A93Q13p12M61N4p61J213J29k16O55Q04j325J90J51K80N56n79M46l13K68p49
3830A558N32j270J68L10J13q6L2N45j71j453M78J200N52j856L6R33J56p73K71
3849A275r58O07J76n91k32M67j002m46J275n86L51p26J598j390m20J646r40j000
3867h96K13L39j527J026N36n38j82J16j08K58n34l50Q0k83J667j589M59q71L67
3886a817L05j070Q91L75m75J128lj245k40J335j642l88J850l97J42N31k031P84
3904a967J081r09P20k35nJ24K48K07N78j334J051m20K7K3J271j005j56J725j540
3923e16P3J71P78k31O51j772J734n13J3p1R59k56j364J395o50Q36k64J52m73K19
3943H71J009p17J148r33p95P11L94L17Q5r35J132j516J207q96O3K99L79p47J06
$$ y = [193, 1006, 294, 755, 809, 48, 1261, 1390, 1174, 1829, 2633, 1308, 1498, 1649, 1929, 2485, 1906, 2352, 2039, 2307, 1558, 2090, 820, 988, 1298, 1411, 1325, 1357, 1902, 1731, 278, 756, 1956, 2508, 652, 688, 1621, 1777, 1004, 1275, 317, 924, 1100, 509, 277, 744, -258, -704, 571, -15, 336, -390, 1208, -182, -602, 1044, 104, -896, -683, -344, -1871, -845, -309, -847, -1029, -913, -1021, -763, -1297, -1647, -1567, -1850, -183, -1772, -1313, -2184, -1817, -1512, -2582, -1691, -1316, -1791, -663, -666, -1911, -2151, -816, -2458, -2846, -996, -1393, -1251, -720, -2751, -1967, -886, -1795, -1075, -1310, -1315, -1191, -943, -736, -158, -1492, -441, -861, -834, -811, 460, -545, -701, 1024, -516, -443, -272, 506, 275, 926, -846, 888, 375, 388, 317, 1276, 1020, -344, 1051, 401, 1237, 973, 1125, 652, 871, 1880, 1163, 2311, 1378, 583, 1294, 1688, 2005, 2090, 1155, 2287, 771, 1978, 1082, 1145, 1444, 1823, 1076, 1182]
3962A182J95J10J83k65m78j32Q72n81o82J522l56p22j53N53P10j433K2q33J042
3981G56l52r0m73K8P03K1l05L85r12p08R07O3J127j737L81j70o29Q29p7j766J044
4002i75m49q8J258j277j58J438l84j248J947k63j412R49r66L38lk52M12P15j720
4021b138J178J73k134J133P75o06j33Q8j33k49J725j163O83r26l11R63R21j268
4039a422J017j208p4J99P13K99M07n85o49Q90m24L28N22o76k39k34R03O40m90
4058h3K82M45r5o55P38j48N38N62n46j8M95j495q70J189L86N31J47j185N64N23
4078A305k0Q1j17Q40m49j32J29k74l48L71o65n52J429j0p00K08O78p59M02p90
4098F27j12m3J140j285O27m4Q82o66o40q5M51K53p13l28J235n58m56O45o94l3
$$ y = [1182, 1377, 1487, 1670, 1405, 927, 795, 1667, 1086, 404, 1926, 1570, 848, 695, 1248, 1958, 525, 547, -286, 756, 404, 314, -159, -131, 572, 593, 288, 673, -239, -947, -40, 23, 1150, -587, -206, -376, -1005, -176, -253, -2019, -975, -1424, -1512, -254, -1531, -1689, -251, -635, -1883, 64, -199, -1611, -662, -1628, -1290, -1293, -1545, -1133, -418, -2138, -960, -787, -2921, -1788, -1013, -1619, -1752, -1664, -1797, -2046, -321, -1484, -801, -1727, -2038, -1075, -154, -1422, -405, -1613, -1687, -1488, -775, -476, -69, -654, -1303, -413, -837, -509, 13, -663, -902, -1136, -233, 407, -83, 199, 644, 549, -106, 632, 484, 1022, 1584, 1038, 1020, 1515, 20, -850, 339, 725, 1256, 1403, 218, 782, 1305, 1285, 1366, 1249, 2089, 1640, 1508, 1637, 1363, 1015, 1386, 721, 169, 1598, 1588, 888, 1096, 1774, 1015, 1417, 627, 515, 472, 1612, 327, 954, 910, 1792, 1126, 486, 401, 852, 1105, 392, 64, 1299, 741, 285, 930, 236, 203]
4118B03L10j335K363j817K19n34q44J646r11K69j42O97p97J7M08l26j7J398j174
4137c67N48j007o18M65l18k04R75j354J282j305J614n13o43R3M51m52J344j339
4155a348n25j68J68o63J411l03l30M98P65j341J621j088P20j47J01L51n83m48
4173a309J316l16j155J296n79O63j36O40q65Q0l12R58l15N5R63j370Q49mo77J191
4193I73j241M65K80L79r00J325P4J97j41k32m17M35o28p2O94L6K53L93l21k45
4213A307M38q81Q10q86O15k18J07q07N88q97L98O88L32k8l37Q1k98kP1L65j142
4234C04J460o91r34N06Q8m34M86J016q63j757J398j120j6N5Q17J7k84q76J131
4253C03J22j479l5J006j074J300q52l03j43J355k258K36R76j94r5j39J41j45N83
$$ y = [203, 513, -822, 1541, -276, -57, -591, -1435, 211, -700, -431, -573, 124, -673, -656, -248, -574, -591, 807, -367, 181, -826, -1444, -979, -1297, -1501, -526, -1880, -598, -1903, -289, -802, -1445, -1352, -901, -1353, -9, -1348, -1873, -2041, -1873, -2536, -1125, -1428, -1758, -1260, -495, -1836, -215, -1303, -583, -730, -629, -278, -861, -1309, 7, -309, -1464, -168, -747, -84, -220, 420, -445, -365, -677, 281, -34, 21, 984, -386, 463, 459, -218, 973, -268, 197, 477, 856, -44, 1281, 1355, 1552, 1411, 1179, 762, 1197, 569, 497, 1191, 1227, 1480, 1873, 1552, 1307, 1745, 864, 1674, 788, 1403, 1185, 1292, 485, 1073, 176, 574, 1262, 1594, 1566, 1229, 1310, 1012, 1010, 1081, 1446, 304, 1764, 1073, 139, 645, 733, 299, 785, 1801, 938, -819, 579, -541, -557, -502, 315, 332, 48, -828, 303, 425, -1054, -1089, -83, -1157, 143, -709, -1012, -1155, 200, -2058, -1822, -846, -1040, -1135, -1274, -1133, -1278, -695]
4272f95j009R74j029J376q76L62P34j445N49k14L17R24n67q25k20L32Q4L63l20
4291a185n22J403j116l13K86j60Q55q36J111r70N69J4o17J082L9j060R35k86L47
4310d24K40L83j95L98j379R99P28m20n20P60K23k53p66k70O25n51R46P69j010
4329B83O88p09J144l64Q6P00j085j3P91q25J37N12m38O09p16k33J097P87q89j6
4349A546j105J227r72L34K61j14l45l0M01O5m98k0l37O59l43J266j522P7L2p96
4369b14J697j912J400K22j166K12q54R83K51j104J25P55k76j245J256k99N28n34
4387a75K02l78l0l98q6o43L08J52J75o50J078m12Q45j56j64o59j82j00j55j56
4407a584J237l03j933J761L07m12l55n28J309l76q36R23k93q84M22Q64P08p43
$$ y = [-695, -1704, -730, -1759, -383, -1259, -897, -163, -1608, -1059, -1273, -956, -32, -599, -1424, -1644, -1312, -1228, -865, -1185, -1707, -304, -1420, -1733, -1447, -1607, -752, -1588, -477, -1447, -878, -864, -1481, -399, -360, -1420, -485, -771, -424, -184, 199, 4, 402, -977, 22, 750, 330, -190, 570, 793, 540, -226, -496, 129, -422, 524, 1293, 283, 971, 262, 1406, 1042, 1128, 1828, 743, 730, 1521, 696, 833, 1345, 907, 1516, 800, 567, 1664, 2451, 1562, 1546, 441, 1668, 696, 1030, 1291, 1177, 832, 802, 1203, 1268, 770, 750, 413, 1072, 729, 1995, 473, 550, 582, -214, 1483, -429, 971, 1193, 27, 239, -615, 368, 619, -485, -360, 395, 119, -1126, 130, -169, 359, -175, 27, -351, -381, -779, -865, -1508, -1200, -1048, -873, -1523, -445, -857, -12, -168, -332, -991, -1173, -1273, -1428, -1584, -347, -650, -2583, -822, -515, -927, -1282, -1810, -501, -877, -1713, -790, -1083, -1967, -1545, -681, 27, -716]
4425g16j771K475q29o24R57j056J112l92o52P02P72k52P32j581P19k21J60J518
4443A053l57r11K11N80l27k42O68K32Q29k156L05M42N35j06N03j337K82J28J085
4462A417jj60J23o82n4J524q08o58J014j495O83M09j015R70J18p78N57l53J61
4481I72k82J91o40O67k54O63j003R19j079M01j98J37J288j104K45r07O97p35J621
4500A599l29o22m34O40p66K26K38o11m8o63J504r10O19p59K30l2n9o88O11n57
4520h11l3J92k45k49K33J36L6l10L67n61O83q1N4M35n85k72L68K20q99K19O4r27
4542a966O35R27k13P09j614l48J74L87J1j143J349M70o73P17j88N14J62p52J030
4561A88j276N56J49L83m59K13m22q40J428K64M35j09j504R67K01o17R2O01J019
$$ y = [-716, -2487, -12, -841, -1465, -508, -1564, -452, -844, -1496, -794, -22, -274, 458, -1123, -404, -625, -465, 1053, 696, -215, -4, 576, 249, 7, 675, 907, 1736, -420, -115, 327, 862, 756, 1259, -78, 204, 332, 1417, 1416, 1256, 1379, 697, 643, 2167, 1359, 701, 1715, 220, 903, 1312, 297, 1267, 1385, 607, 1164, 811, 972, 690, 881, 241, 908, 654, 1317, 314, 1233, 154, 555, 357, 494, 1782, 678, 923, 16, 713, -22, 1599, 1270, 648, 214, 854, 88, 314, 552, -59, -107, -770, 734, -176, 443, -316, -86, -118, -177, -865, -254, -811, -844, -652, -897, -1146, -913, -777, -741, -1051, -684, -1245, -562, -643, -589, -154, -739, -1011, -643, -423, -1322, -1103, -1039, -1966, -1331, -404, -617, 92, -1522, -1870, -1696, -1309, -1298, -2441, -1092, -622, -1295, -578, -766, -252, -90, -842, 188, -1088, -532, -383, 0, -459, -246, -668, -1508, -80, 184, 619, 510, -994, -27, 174, -443, -351, 250, 1269]
4580A269r07J94j250R67J28J10k24N10Q08p36p79k2N28r82K368r52M56j084L58
4599G60Q93r76j01J62m11P92n37P70J81j68n73m08J140P2k68M9n81m58P47j328
4619b43J092l49k67j17Q17L78J51p04l26M49r01M79J85o78k7N03m05J19K58R6
4639E10j73o92R1q54J129j26m86o23K063j828M70o82N42L25L36j116K41J192r28
4658f09l02R7o29M10J71k5l71j063J750R7P66j824K12j94J426r58J40p78J46O87
4678h51J199q23j050Q00L30j123K47J419p52m59NL26n99Q18M81m0o12Q55p50J3
4698e66K47Q73r47K52j02R27q23j667J190N67k62M16J219j13m97J62j068j43R93
4717F58k72M62j184O87R47j174P70j56l88O69j040J651n88m07p2M97P92p49K25
$$ y = [1269, 362, 556, -694, 273, 401, 511, 287, 797, 1605, 869, 90, 68, 596, -386, 1982, 1030, 1486, 402, 760, 1653, 677, 576, 738, 327, 1119, 582, 1352, 1533, 1365, 792, 384, 1524, 1596, 1328, 1377, 796, 338, 1085, -243, 849, 500, 233, 116, 933, 1311, 1462, 758, 432, 881, -20, 459, 644, -34, -61, 442, 37, 156, 414, 510, 337, -355, -264, -1118, 11, -115, -601, -1224, 839, -989, -519, -1201, -659, -334, 2, -1114, -873, 319, -609, -911, -814, -1443, -1033, -862, -887, -1258, -2321, -571, -474, 292, -1532, -1320, -1514, -88, -1046, -906, -1684, -1538, -851, 348, -475, -1525, -725, -395, -1518, -1271, 148, -604, -1063, -1058, -732, -1331, -513, -32, -72, -684, 171, -579, -566, -319, 554, -393, -141, -243, 684, -139, -1806, -616, -49, -311, 105, 1324, 1211, 714, 876, -192, -335, 658, 386, 848, -336, 351, 1298, 124, 894, 738, 350, 1019, -21, 1630, 1042, 635, 563, 1060, 1852, 1103, 1328]
4736A328l36n18O47k90j03Q76J51n23K55o14O14p08J85k04k25O33k27J029j360
4755F10L61j90k07j219J272R0n7M54p3p91n73J541r52j57n38R34j325J117k75
4774B2K1j101M93P71n30r84R81J045n55j31j039Q93r55N29O08r84M61l64p2p15
4794a606J720j197J20k18r67J159M9N01J1m61J054o97j038J009j95L65N94k251
4812b048J572l65M2q77R71k44P60j021J329n17n03J69J203j381L51J348m55j63
4830A71n87J421j116k78M3R15O48j320j9O92M08j653N40K44M46P22k65M58q18
4849F52n3k37K05Q91Q25k085R04l47O36l65o29K75p7J262n34l47J73k82M04j074
4869A97R42L12n01M28p96J693k012J91k89k62J69R37J826l000L7L01R30p55P1
$$ y = [1328, 992, 474, 1121, 831, 728, 1604, 1755, 1232, 1487, 873, 1487, 779, 964, 760, 535, 1168, 941, 1970, 610, 971, 781, 574, -645, 627, 717, 660, 1114, 1041, 250, -323, 1218, 266, 109, -429, 505, -820, 297, 22, 43, -1058, -565, 206, -324, -1308, -327, 718, 163, 32, -1007, -114, -1069, -540, 68, -916, -455, -819, -891, -1606, 114, -1083, -963, -1181, -2148, -989, -940, -439, -428, -889, 165, -532, -1570, -561, -756, -391, 203, -2048, -476, -841, -799, -1676, -705, -949, -189, -1210, 119, -398, -901, -732, 471, -910, -559, 789, 334, 171, -416, 1005, -111, -389, -346, 569, 1217, -103, -122, 570, 978, -675, -135, 109, 555, 1277, 1012, 1470, 652, 599, 362, 567, 1458, 2283, 198, 1102, 755, 1391, 1026, 397, 672, 595, 1857, 1323, 976, 1149, 867, 1271, 197, 1139, 1451, 950, 1378, 582, 2275, 263, 454, 165, -97, 72, 1009, 2835, -165, -128, 173, 1103, 348, 419]
4888D19N44m83m33o8J365r31j033L62M92j0Q38j230j51p47O28m2M2O67j166Q8
4908h49Q71M53p91l1m76P82j344L72O34M57r07l68M51l33K14L86m44K25R8l0P76
4929A46o41n09k01M18r32J245K70l31o31L90P5m73M54k14K66q61O11J172l77j375
4949a498J161m11P25o0pK79n78P80o92o53N69r69J330k69J77L45o17K23k44q4
4969d93J482j94N94j235p25J554j287J020k72O92o09q0k27N59k02L30Q22j307
4987D22N87L78q35J774j423J91j026M68J185m55j376l43K22P07J588k153J190
5004A101o89r95J857K15j632N49p73P55O70o71J95K46j197L19M8M6Q84j04j619
5023g95L4j09J794r93l24J7l44Q44N59m84J52M88k594K544p01Q16j302m34P43
$$ y = [419, 963, 480, 47, -21, 1344, 413, -620, -258, 234, 224, 1062, -168, -319, -1066, -438, -480, -438, 229, -937, -849, 22, 475, -316, -347, -823, -41, -1385, -1013, -379, 78, -829, -1197, -746, -1079, -865, -479, -923, -698, -600, -630, 146, -495, -1004, -1205, -787, -1719, -474, -204, -535, -1166, -776, -701, -1174, -720, -934, -668, -1529, -918, 254, -123, -1498, -337, -748, -23, -83, -90, 189, -389, 391, -301, -954, -385, -1354, -24, -293, -116, 229, -388, -165, -409, -493, 989, 795, 1389, 154, -571, 983, -304, 716, 444, 1136, 527, 447, 220, 779, 577, 907, 1729, 422, 1009, 1387, 552, 2326, 903, 1094, 68, 536, 1721, 1266, -110, -453, -231, 476, 2064, -89, 1101, 412, -583, 1274, 1489, -143, 406, -367, 388, 1058, 387, 582, 828, -369, -50, -2, 44, 928, 824, -795, -761, -870, 924, -69, -393, -376, -720, 124, 683, 199, 351, 839, -1755, 789, 88, 904, -398, -832, -89]
5042h9O01j9j111j73J01P00q87Q71j001J177j426R09r9j476J450j9J11K60l1J08
5062d3j186Q56j010P13J84o81J403j317N92r74N7J89j9N60J418j780J52J645r07
$$ y = [-89, 512, 493, -618, -791, -690, 10, -877, -6, -1007, 170, -1256, -347, -446, -1922, -472, -491, -380, -120, -151, -43, -1229, -373, -1383, -670, -486, -1167, 236, -1081, -489, -1463, -1406, -1217, -1236, -676, 742, -1038, -886, 759, -148]
$$ [...]
8191B79
##END NTUPLES=NMR FID
##END=
