##TITLE=1H_UK-8''
 CDCl3, 40 sc, 
 3.7.2020
##JCAMPDX= 6.0         $$ Bruker NMR JCAMP-DX V2.0
##DATA TYPE= NMR FID
##DATA CLASS= NTUPLES
##ORIGIN= UXNMR, Bruker Analytische Messtechnik GmbH
##OWNER= root
$$ XWIN-NMR		Version 3.5
$$ Mon Aug  3 10:20:29 2020 Russian Standard Time (UT+4h)  she@DPX200
##.OBSERVE FREQUENCY= 200.1314999998
##.OBSERVE NUCLEUS= ^1H
##.DELAY= (6, 6)
##.ACQUISITION MODE= SIMULTANEOUS
##.ACQUISITION SCHEME= undefined
##.AVERAGES= 40
##.DIGITISER RES= 18
##SPECTROMETER/DATA SYSTEM= spect
##.PULSE SEQUENCE= zg30
##.SOLVENT NAME= D2O
##.SHIFT REFERENCE= (INTERNAL, D2O, 0, 15.7039)
##AUDIT TRAIL= $$ (NUMBER, WHEN, WHO, WHERE, WHAT)
$$ ##TITLE= Audit trail, XWIN-NMR		Version 3.5
$$ ##JCAMPDX= 5.01
$$ ##ORIGIN= Bruker BioSpin GmbH
$$ ##OWNER= she
$$ F:/spectra/data/she/nmr/H-F/1/audita.txt
$$ ##AUDIT TRAIL=  $$ (NUMBER, WHEN, WHO, WHERE, WHAT)
(   1,<2020-08-03 10:19:32.90 +0400>,<she>,<DPX200>,
      <continue with go, POWCHK disabled, PULCHK disabled
       configuration hash MD5:
       00 E9 B6 7A A2 85 ED C7 34 08 36 98 17 FE 4E 26
       data hash MD5: 16K
       7C 88 46 76 83 93 A7 50 FA 78 21 F7 0F 7B 3B F7>)
$$ ##END=
$$ 
$$ hash MD5
$$ AD 3E 23 D6 62 0F C6 78 20 BE 67 CA 91 34 68 3E
##$RELAX= 
##$RELAX= 
##$RELAX= 
##$RELAX= 
##$RELAX= 
##$RELAX= 
$$ Bruker specific parameters
$$ --------------------------
##$DU= <F:/spectra>
##$EXPNO= 1
##$NAME= <H-F>
##$PROCNO= 1
##$TYPE= <nmr>
##$USER= <she>
##$AMP= (0..31)
100 100 100 100 100 100 100 100 100 100 100 100 100 100 100 100 100 100 
100 100 100 100 100 100 100 100 100 100 100 100 100 100 
##$AQSEQ= 0
##$AQ_mod= 1
##$AUNM= <au_zg>
##$AUTOPOS= <>
##$BF1= 200.13
##$BF2= 200.13
##$BF3= 200.13
##$BF4= 200.13
##$BF5= 200.13
##$BF6= 200.13
##$BF7= 200.13
##$BF8= 200.13
##$BYTORDA= 1
##$CFDGTYP= 0
##$CFRGTYP= 5
##$CHEMSTR= <none>
##$CNST= (0..31)
1 1 145 1 1 1 1 1 1 1 1 1 1 1 1 1 1 1 1 1 1 1 1 1 1 1 1 1 1 1 1 1 
##$CPDPRG= <>
##$CPDPRG1= <>
##$CPDPRG2= <>
##$CPDPRG3= <>
##$CPDPRG4= <mlev>
##$CPDPRG5= <mlev>
##$CPDPRG6= <mlev>
##$CPDPRG7= <mlev>
##$CPDPRG8= <mlev>
##$CPDPRGB= <>
##$CPDPRGT= <>
##$D= (0..31)
0 1.2 0 0 0 0 0 0 0 0.06 0 0.03 0 0 0 0 0.0002 0 0 0 0 0 0 0 0 0 0 0 0 
0 0 0 
##$DATE= 1596435430
##$DBL= (0..7)
120 120 120 120 120 120 120 120 
##$DBP= (0..7)
150 150 150 150 150 150 150 150 
##$DBP07= 0
##$DBPNAM0= <>
##$DBPNAM1= <>
##$DBPNAM2= <>
##$DBPNAM3= <>
##$DBPNAM4= <>
##$DBPNAM5= <>
##$DBPNAM6= <>
##$DBPNAM7= <>
##$DBPOAL= (0..7)
0.5 0.5 0.5 0.5 0.5 0.5 0.5 0.5 
##$DBPOFFS= (0..7)
0 0 0 0 0 0 0 0 
##$DE= 6
##$DECBNUC= <off>
##$DECIM= 24
##$DECNUC= <off>
##$DECSTAT= 4
##$DIGMOD= 1
##$DIGTYP= 9
##$DL= (0..7)
0 120 120 120 120 120 120 120 
##$DP= (0..7)
150 150 150 150 150 150 150 150 
##$DP07= 0
##$DPNAME0= <>
##$DPNAME1= <>
##$DPNAME2= <>
##$DPNAME3= <>
##$DPNAME4= <>
##$DPNAME5= <>
##$DPNAME6= <>
##$DPNAME7= <>
##$DPOAL= (0..7)
0.5 0.5 0.5 0.5 0.5 0.5 0.5 0.5 
##$DPOFFS= (0..7)
0 0 0 0 0 0 0 0 
##$DQDMODE= 0
##$DR= 18
##$DS= 0
##$DSLIST= <SSSSSSSSSSSSSSS>
$$ [...]
##$SUBNAM2= <"">
##$SUBNAM3= <"">
##$SUBNAM4= <"">
##$SUBNAM5= <"">
##$SUBNAM6= <"">
##$SUBNAM7= <"">
##$SUBNAM8= <"">
##$SUBNAM9= <"">
##$SW= 24.9337058888022
##$SWIBOX= (0..15)
0 0 2 0 0 0 0 0 0 0 0 0 0 0 0 0 
##$SW_h= 4990.01996007984
##$TD= 16384
##$TD0= 1
##$TE= 0
##$TE2= 300
##$TE3= 300
##$TEG= 300
##$TL= (0..7)
0 120 120 120 120 120 120 120 
##$TP= (0..7)
150 150 150 150 150 150 150 150 
##$TP07= 0
##$TPNAME0= <>
##$TPNAME1= <>
##$TPNAME2= <>
##$TPNAME3= <>
##$TPNAME4= <>
##$TPNAME5= <>
##$TPNAME6= <>
##$TPNAME7= <>
##$TPOAL= (0..7)
0.5 0.5 0.5 0.5 0.5 0.5 0.5 0.5 
##$TPOFFS= (0..7)
0 0 0 0 0 0 0 0 
##$TUNHIN= 0
##$TUNHOUT= 0
##$TUNXOUT= 0
##$USERA1= <user>
##$USERA2= <user>
##$USERA3= <user>
##$USERA4= <user>
##$USERA5= <user>
##$V9= 5
##$VALIST= <valist>
##$VCLIST= <CCCCCCCCCCCCCCC>
##$VD= 0
##$VDLIST= <DDDDDDDDDDDDDDD>
##$VPLIST= <PPPPPPPPPPPPPPP>
##$VTLIST= <TTTTTTTTTTTTTTT>
##$WBST= 1024
##$WBSW= 4
##$XGAIN= (0..3)
0 0 0 0 
##$XL= 0
##$YL= 0
##$YMAX_a= 417000
##$YMIN_a= -256789
##$ZGOPTNS= <>
##$ZL1= 120
##$ZL2= 120
##$ZL3= 120
##$ZL4= 120
##$ABSF1= 10
##$ABSF2= 0
##$ABSG= 5
##$ABSL= 3
##$ALPHA= 0
##$AQORDER= 0
##$ASSFAC= 0
##$ASSFACI= 0
##$ASSFACX= 0
##$ASSWID= 0
##$AUNMP= <proc_1d>
##$AZFE= 0.1
##$AZFW= 0.1
##$BCFW= 1
##$BC_mod= 2
##$BYTORDP= 1
##$COROFFS= 0
##$CY= 11.3945322036743
##$DATMOD= 1
##$DC= 2
##$DFILT= <>
##$DTYPP= 0
##$F1P= 16.9975609425685
##$F2P= -3.02152046262296
##$FCOR= 0.5
##$FTSIZE= 0
##$FT_mod= 4
##$GAMMA= 1
##$GB= 0.15
##$INTBC= 1
##$INTSCL= 1
##$ISEN= 128
##$LB= 0.24
##$LEV0= 0
##$LPBIN= 0
##$MAXI= 10000
##$MC2= 0
##$MEAN= 0
##$ME_mod= 0
##$MI= 1.114404
##$NCOEF= 0
##$NC_proc= 0
##$NLEV= 6
##$NOISF1= 3.799351
##$NOISF2= 2.8
##$NSP= 1
##$NTH_PI= 0
##$NZP= 0
##$OFFSET= 15.70392
##$PC= 1
##$PHC0= -9797.322
##$PHC1= 18.00092
##$PH_mod= 1
##$PKNL= yes
##$PPARMOD= 0
##$PSCAL= 0
##$PSIGN= 0
##$REVERSE= no
##$SF= 200.130013532006
##$SI= 16384
##$SIGF1= 3
##$SIGF2= 2
##$SINO= 400
##$SIOLD= 16384
##$SREGLST= <1H.CDCl3>
##$SSB= 0
##$STSI= 0
##$STSR= 0
##$SW_p= 3612.71676300578
##$SYMM= 0
##$S_DEV= 0
##$TDeff= 0
##$TDoff= 0
##$TI= <>
##$TILT= no
##$TM1= 0
##$TM2= 0
##$TOPLEV= 0
##$USERP1= <user>
##$USERP2= <user>
##$USERP3= <user>
##$USERP4= <user>
##$USERP5= <user>
##$WDW= 1
##$XDIM= 8192
##$YMAX_p= 0
##$YMIN_p= 0
$$ End of Bruker specific parameters
$$ ---------------------------------
##NTUPLES= NMR FID
##VAR_NAME=  TIME,          FID/REAL,        FID/IMAG
##SYMBOL=    X,             R,               I
##VAR_TYPE=  INDEPENDENT,   DEPENDENT,       DEPENDENT
##VAR_FORM=  AFFN,          ASDF,            ASDF
##VAR_DIM=   8192,          8192,            8192
##UNITS=     SECONDS,       ARBITRARY UNITS, ARBITRARY UNITS
##FACTOR=    0.0002004,     1,               1
##FIRST=     0,             0,               0
##LAST=      1.6414764,     0,               0
##MIN=       0,             -256789,         0
##MAX=       1.6414764,     417000,          0
$$ Real data points
##PAGE= N=1
##DATA TABLE= (X++(R..R)), XYDATA
0 0 0 0 0 0 0 0 0 0 0 0 0 0 -7 40 -40 40 -40 40 -56 80 -80 92 -118 122 -154 167 -196 222 -253 285 -321 361
32 361 -404 456 -507 565 -631 697 -777 862 -955 1058 -1171 1301 -1435 1594 -1767 1966
48 1966 -2195 2461 -2766 3128 -3568 4118 -4824 5760 -7084 9090 -12561 20200 -86701 212361
62 212361 310971 -68765 -180036 -67405 -65642 -149252 46495 262221 122987 -204354 -228320
73 -228320 -7430 129063 114097 97542 28358 -121406 -171331 -1433 174251 157966 14307
84 14307 -84144 -112646 -73660 40424 160627 137478 -26276 -149216 -99682 39930 118977
95 118977 107040 60695 -15386 -108943 -104375 60851 203343 125598 -64221 -116215 -33104 15734
107 15734 33167 105849 117105 -46923 -190107 -85139 113565 129772 18179 -22023 -28200
118 -28200 -90262 -80818 80427 179154 49092 -114020 -101821 -10132 25028 54311 94968 29982
130 29982 -116216 -140535 -5974 94396 62839 4 -37901 -86723 -100519 -4939 110092
141 110092 88234 -39385 -107052 -69052 -6248 35669 67820 55144 -31404 -115917 -85245 30029
153 30029 94822 47743 -37591 -75112 -68198 -39500 18050 76392 52616 -53989 -116503 -55262
165 -55262 40323 64446 37595 7238 -39957 -83031 -41026 64979 96461 16006 -54666 -53437
177 -53437 -32528 -12362 45648 81812 11691 -91075 -82317 9491 50773 32355 25012 7732
189 7732 -56780 -77446 12586 100424 63194 -24978 -45383 -22046 -13128 11485 64998 63033 -23460
202 -23460 -84720 -42364 32328 50123 29588 7399 -24843 -57499 -34989 38525 75709 32434
214 32434 -28637 -41512 -18752 9334 39778 60613 30719 -35920 -61571 -10151 48799 48523
226 48523 14980 -7322 -25342 -44234 -17272 53277 71970 4831 -52566 -30196 14277 22748
238 22748 30848 52002 27034 -43491 -51903 24903 75614 40016 -5921 -7905 -11645 -27392 3525
251 3525 64291 55573 -20911 -54441 -12295 24415 23373 29272 35643 -3125 -50042 -24090 45977
264 45977 61279 15873 -13409 -10696 -15539 -15464 22511 56699 20593 -43671 -50519 -1174 21787
277 21787 10559 8179 7426 -25212 -53384 -18962 41915 40230 -13423 -37807 -18379 -9185 -11789
290 -11789 11897 34640 -445 -58507 -51485 5288 23748 -5114 -17180 -13060 -34830 -53202
302 -53202 -15188 34420 16576 -38039 -47103 -16786 -6936 -11093 10742 21037 -19287 -59113 -29610
315 -29610 21024 19959 -12088 -16343 -12741 -32337 -36363 5614 35544 2240 -43095 -34675 -1424
328 -1424 3289 -13 15590 16943 -19140 -40265 -2876 38874 27687 -4673 -8197 -326 -9624
341 -9624 -7466 25093 39211 3282 -32728 -16626 15980 19760 12136 18192 13317 -14548 -20074
354 -20074 18313 47690 26900 -2318 -770 9568 3483 11515 37216 36233 -2981 -24392 1090
367 1090 27216 20063 9597 13366 4063 -18765 -11894 25351 38208 9601 -13488 -4030 7583
380 7583 3938 13194 29288 18512 -16609 -23028 6707 23891 11381 -688 -683 -9488 -22661 -7873
394 -7873 19356 17127 -11963 -25024 -10615 -1335 -3077 6124 15160 -3369 -28104 -18824 9523
407 9523 15178 -950 -7459 -6011 -15846 -22125 -3317 17040 3395 -24761 -25985 -7805 -4260 -8296
421 -8296 1189 6141 -14194 -30061 -11737 13584 10244 -6947 -7394 -3502 -12435 -13551 6673 19159
435 19159 -592 -22960 -14917 317 648 -2612 4562 3788 -15923 -23204 428 19113 7433 -6457
449 -6457 -2454 1697 -6709 -2489 19563 21429 -3226 -18267 -1914 13717 5712 837 10120 5398
463 5398 -15426 -15875 11572 23328 2092 -10836 -242 5820 -3364 1705 21605 17736 -7671
476 -7671 -13516 8388 19532 7588 2418 10449 4766 -11953 -6249 18696 19824 -4382 -12735 2050
490 2050 6640 -2722 3249 17603 9907 -12266 -9868 14920 19613 3184 452 10210 4731 -8516
504 -8516 -81 21463 16073 -9345 -12233 6823 8258 -3658 510 14757 4153 -17075 -8837
517 -8837 16317 15653 -3607 -4299 8407 3733 -8528 2299 20782 10305 -13713 -10326 9123
530 9123 7055 -6874 -1534 8173 -3694 -20237 -8228 12833 5957 -11643 -9343 2395 -3342
543 -3342 -12359 448 13184 -346 -18096 -10415 5753 1225 -10027 -4748 1997 -10772 -23016
556 -23016 -8467 7529 -1846 -19925 -15100 -3730 -8826 -15149 -2874 5244 -9041 -22277 -11570
569 -11570 5371 -507 -11629 -6695 -687 -11861 -18245 -3469 7846 -5520 -19356 -11529 -1494
582 -1494 -7518 -11473 -635 3451 -10944 -18136 -2596 8716 125 -7725 -170 3277 -5915 -5908 8267
597 8267 13089 -2038 -9352 2358 8057 681 -1137 8492 7449 -4756 -5118 8236 14050 5027
611 5027 863 8232 9787 3292 5849 16509 16455 4637 1655 10964 13938 7501 7917 13843 10432
626 10432 746 2294 13218 14626 4887 2595 9962 8956 2771 5926 16568 12224 97 2042
640 2042 11937 10983 3031 5614 11898 4867 -4686 1448 11601 6643 -4560 -2215 4950 -267 -7535
655 -7535 954 7728 -1564 -10886 -3495 5096 98 -6500 773 3283 -7857 -11063 34 5998 -4405
670 -4405 -11202 -5385 -2161 -9162 -10390 -2031 -583 -11620 -15782 -6099 -817 -7081 -9928 -3814 -2698
685 -2698 -11171 -10758 -230 3131 -6631 -12482 -4135 417 -6664 -8904 -960 609 -10767 -12849 -1369
700 -1369 3380 -6675 -9819 -487 1037 -7705 -7167 4600 6384 -6389 -8021 4006 6077 -4194
714 -4194 -3599 6973 5349 -6884 -6368 6908 7132 -5658 -5503 4879 4283 -5893 -2359 10019 6732
729 6732 -5108 -2987 8968 7464 -2491 2148 10683 6695 -3810 -321 10906 8053 -2310 -298
743 -298 8607 4917 -3948 850 9827 6342 -4510 -1526 8655 6069 -1762 2129 9962 4899 -3445
758 -3445 1159 12428 8576 -2556 -646 8260 5064 -3257 620 10198 3875 -7173 -2568 7870
772 7870 4817 -4470 -1251 6672 1273 -6069 758 10598 4419 -5340 -1763 7321 2067 -4833 1519
787 1519 7532 94 -8597 -2203 5639 262 -7368 -2627 2685 -3427 -8418 -40 4164 -2685 -8936
802 -8936 -1661 3251 -2340 -6328 -401 2869 -4742 -8407 -2049 2698 -3888 -9985 -4073 -801 -5393
817 -5393 -8955 -3658 238 -6977 -9814 -4730 -692 -5645 -8032 -2966 -226 -6010 -7636 -1959 1157
832 1157 -5014 -7308 -2554 -806 -6001 -7596 -1533 -264 -6366 -7705 -1676 -127 -5024 -5679 852
847 852 442 -5351 -4383 3293 3169 -3068 -2606 3600 2895 -3164 -465 4886 2678 -2877 -1275 5348 3496
864 3496 -734 1248 5706 2595 -1145 2863 8764 5340 485 4034 7826 4854 1992 6605 10632
879 10632 4939 1523 6220 9274 5697 2357 5516 8434 4089 1257 6745 8868 4858 1344 5120
894 5120 9152 4829 2569 7077 9843 4028 525 6538 9624 3860 30 4846 7041 1558 -1507
909 -1507 4518 5950 -1514 -4365 2781 4528 -1198 -4006 3013 4516 -3789 -5148 3436 4528 -3845
924 -3845 -5581 1880 2205 -6094 -5676 817 574 -7245 -8161 -562 -1139 -8538 -8220 -1214 -2326 -10232 -8649
941 -8649 -841 -1598 -8686 -8073 -1032 -1833 -9202 -7579 -359 -1743 -8439 -8474 -1542 -1929 -9731 -7943 -2071
958 -2071 -2368 -9655 -8318 -688 -768 -8104 -6858 802 -66 -7083 -5164 2918 1374 -6415 -4007 2763
974 2763 2219 -5055 -2981 3653 1106 -5892 -2668 4682 2253 -4914 -2237 5962 3076 -3493 318
989 318 7807 3413 -2603 834 8094 4533 -975 2283 7071 4196 -1350 3121 8106 3854 -1309
1004 -1309 2895 7989 3667 -475 2474 7157 4071 -516 3099 8200 4474 96 3169 8026 4679
1019 4679 294 3204 7902 3854 -878 2856 7708 3243 -1482 2010 5285 1658 -2235 1366 5299
1034 5299 1130 -2670 1646 6621 1309 -2277 1508 4632 562 -2699 2166 3546 -778 -3552 795
1049 795 2726 -2388 -4527 -258 1762 -3056 -4133 493 964 -2621 -4112 445 684 -3224 -3294 -593
1065 -593 -312 -3753 -3514 -574 -937 -4372 -4538 -1124 -1699 -4596 -5187 -2485 -2018 -4581 -4316 -1966 -2506
1082 -2506 -5013 -4502 -1105 -1403 -4507 -3488 -1565 -2544 -4846 -3715 624 -1648 -4981 -3599 -906 -2037
1098 -2037 -4415 -2807 -122 -2767 -5092 -2256 1331 -1545 -4327 -1627 1382 -983 -2592 -35 2049
1113 2049 -407 -2836 737 2817 181 -1714 1219 3050 -614 -1540 2604 3189 457 -736 3434
1128 3434 4613 1223 -560 4037 5418 1806 531 5522 6204 1943 1954 5471 6089 1466 1924 5779
1144 5779 5962 1796 1498 5209 6618 1576 358 6028 6414 1500 1830 6275 6345 1257 2142 6879 5929
1161 5929 1527 703 4855 5062 575 -367 4947 4080 -1892 -1342 4202 3405 -1813 -728 3314 2890 -2312
1178 -2312 -1937 3832 1840 -3892 -1724 2940 1563 -3608 -3166 1182 -498 -5646 -4526 1232 -1378
1193 -1378 -6779 -4433 265 -1502 -7011 -4719 -434 -2079 -6421 -5058 353 -2696 -7028 -5022 -285
1208 -285 -2357 -6797 -5141 -1043 -2517 -7553 -5070 -171 -2536 -7582 -5531 -619 -2525 -7478 -4229
1223 -4229 624 -2249 -6202 -3101 508 -841 -5243 -2761 2052 -1300 -4918 -2640 2253 -218 -4406
1238 -4406 -1011 3073 -254 -3820 -1348 3400 -47 -2724 -74 4231 637 -1461 1603 4837 2163
1253 2163 -895 2545 4824 2076 -10 2911 5226 1067 259 2796 6034 2624 109 3269 4886
1268 4886 3137 954 4187 5506 3076 1490 3910 6074 2826 1044 3414 5104 2083 1922 3989
1283 3989 5167 1511 812 3019 4020 1771 -73 2817 3109 1125 819 3530 3874 609 -51 2092
1299 2092 3017 946 -721 1801 1955 -967 -582 2182 1647 -1695 -1506 995 -443 -1516 -2229 204
1315 204 -467 -2841 -1866 525 -895 -3443 -1835 -763 -870 -3237 -1472 -436 -2311 -3996 -2218 -1459
1331 -1459 -2405 -3797 -2907 -1461 -2773 -4330 -3030 -1708 -3238 -4282 -2336 -1981 -2961 -3659 -1861 -1487
1347 -1487 -3538 -3436 -1465 -1114 -2570 -3914 -2088 -641 -2432 -3011 -1970 -1221 -3381 -3233 -602 -225
1363 -225 -2950 -3020 -461 -394 -1310 -2040 1149 695 -2138 -2022 1972 1848 -1375 -1313 960 2437 -1180 -736
1381 -736 2349 1874 -882 -618 3250 2976 -8 465 4646 3824 866 1121 4412 3358 942 1588 4376
1398 4376 4223 659 1950 4143 3662 501 1494 4915 3655 1131 1718 4895 3847 400 1739 5401
1414 5401 3833 811 2047 5246 3917 188 1399 4894 4007 1097 729 4642 2607 -288 1006
1429 1006 4213 1815 -1104 -179 2898 2187 -1510 300 2137 742 -1679 -688 3120 952 -2978 -1025
1445 -1025 1724 -42 -2921 -1460 378 -976 -3490 -1876 317 -2087 -4070 -2687 199 -2495 -5197
1460 -5197 -2229 -574 -2695 -4905 -2458 -349 -2477 -4819 -2644 -1306 -2919 -5230 -2741 -1847 -2541
1475 -2541 -5012 -2875 -1387 -2661 -3856 -2946 -1240 -2495 -4434 -2498 -897 -2299 -3528 -1742 -116
1490 -116 -1769 -3163 -1676 376 -1714 -3006 -1325 116 -1215 -2473 -240 999 -500 -2302 293
1505 293 1483 -912 -1383 1688 2770 35 -745 1324 3366 825 638 2008 2698 896 1507 2763
1521 2763 3186 1740 1031 2906 3168 1326 2249 3773 3629 1833 2334 3726 3363 2565 2051 3123 3639
1538 3639 2782 2888 3634 2735 1379 2452 3450 3571 1566 2364 2969 2962 1590 1854 2984 1878 1232 1259 2434
1557 2434 2224 912 1529 2194 1282 212 1441 2036 8 -1057 307 809 -450 -980 505 359 -1074
1574 -1074 -1813 -309 187 -1346 -2083 -718 -270 -2285 -2653 -106 -791 -2789 -2131 -512 -1082 -2744 -2980
1591 -2980 -1523 -2131 -4004 -3269 -2447 -1448 -3459 -2678 -1568 -1657 -3605 -3409 -1361 -2497 -3443 -2506 -1579 -1798
1609 -1798 -2455 -3044 -1269 -1399 -3074 -2566 -1161 -1622 -3513 -2229 -568 -1749 -2537 -2446 123 -382 -2925
1626 -2925 -1429 1008 -271 -2506 -891 948 1002 -1918 -1546 1817 864 -933 -392 1748 1644 -701
1642 -701 353 2158 1278 -442 503 2486 1729 -409 1459 2976 1597 463 1740 4281 2839 774
1658 774 1206 3372 2694 912 2743 4178 2372 1231 2498 3971 2538 1811 2728 3380 2916 1161 2706
1675 2706 3964 2202 577 1995 4037 2439 556 1563 4003 2058 459 1467 3357 1068 194
1690 194 532 2331 736 -313 932 1807 891 -233 657 1489 502 -1381 396 1422 -895 -1884 -698
1707 -698 -337 -1364 -2141 -1059 -185 -1486 -2245 -1609 -841 -1824 -3301 -1617 -1155 -2523 -2694 -1460 -1045 -2225
1725 -2225 -3035 -492 -1679 -2930 -3427 -1950 -1834 -2894 -3020 -1865 -1933 -2681 -2912 -2772 -1065 -2995 -2529
1742 -2529 -1597 -1584 -2175 -3621 -1868 -933 -1689 -2433 -1901 -876 -1576 -1339 -1048 -599 -1633 -1485 -780 -49 -1194
1761 -1194 -678 -36 49 -923 231 295 146 -100 677 645 1035 450 1361 1522 1675 1006 1293 1975 1183 649
1781 649 1854 2159 1768 1717 2394 2372 2650 1288 2333 2630 1690 2134 2450 3352 1934 2198 2647 2609 1720 2190
1801 2190 2182 2468 1462 1951 2250 2613 1410 1917 2668 2688 1359 1522 2277 2255 901 1050 2281 1900 567
1820 567 435 1726 1314 351 -226 1400 602 -327 -774 1145 208 -814 -630 741 286 -1600 -804 -30
1838 -30 -680 -1285 -1284 -460 -770 -2794 -1248 135 -1327 -2140 -1828 -814 -1234 -2389 -1858 -821 -2159 -2803
1856 -2803 -2665 -1504 -2278 -3572 -2792 -1550 -1850 -2747 -2104 -1864 -2704 -2980 -2620 -550 -2083 -2960 -2686 -876
1874 -876 -1887 -2857 -1990 -330 -1418 -3138 -1411 -240 -1487 -2427 -611 249 -990 -1728 -1214 349 -633
1891 -633 -1665 -910 1340 -278 -1031 273 1132 184 -962 396 1657 604 -722 833 2212 1251
1907 1251 258 1738 2386 1267 1028 1791 2533 1705 617 1272 2140 1857 1117 2164 3001 1544 1638 2252
1925 2252 2346 2496 1457 2464 3307 1703 2043 2070 2883 2067 644 2152 2760 1788 1099 1229 2790 1271
1943 1271 543 1370 1927 551 312 1257 1556 443 85 703 522 543 392 560 991 -50 -355 134 918
1962 918 -528 -235 164 -108 -796 -1042 -345 -213 -1230 -1681 -831 -742 -1327 -890 -1695 -1531 -1700 -1728 -1229 -1004
1982 -1004 -2107 -2096 -1327 -1270 -1499 -1393 -1598 -1870 -2571 -1958 -1500 -2392 -2019 -1678 -1482 -2518 -2480 -1100 -1438 -2597
2002 -2597 -2769 -1284 -1427 -1743 -1944 -1519 -999 -1639 -1603 -930 -804 -1902 -1274 -723 -813 -658 -597 31 207 -794
2022 -794 -888 333 516 -178 -674 -149 606 475 201 1182 710 144 807 1674 1321 938 372 1790 1221 128
2042 128 1239 2228 2374 337 1634 2764 2193 1086 1910 2684 1845 970 1652 2579 2257 1309 2273 3028
2060 3028 2121 1303 969 3032 2122 901 1646 2384 1554 97 1580 2177 1941 332 736 2118 1861 377
2078 377 1209 1516 905 638 505 1242 1011 -502 188 1114 -159 -563 -567 915 73 -1503 -907 767 80
2097 80 -1456 -1304 -29 -819 -2260 -896 -87 -894 -1713 -1360 -314 -1136 -2508 -927 -1186 -1565 -2400 -1784
2115 -1784 -810 -1679 -2409 -1791 -643 -1554 -2652 -1138 -1368 -1239 -2445 -1918 -1228 -1743 -2469 -2186 -735 -2055
2133 -2055 -2997 -1610 -482 -1898 -2068 -1732 -728 -1417 -2188 -1475 -289 -1033 -1645 -751 15 -887 -1255 -655
2151 -655 -31 -405 -853 215 -16 157 -22 396 438 410 411 153 1309 1158 206 497 1567 857 382 1509
2171 1509 2016 1874 454 1338 2350 1143 617 1770 2283 1446 1585 2038 2134 1524 1323 1101 1962 1632 1755
2190 1755 1948 1897 1909 1181 1910 2235 2363 1340 2213 1698 1610 1493 1235 1686 -7 1173 998 1271 1171 1227
2210 1227 1117 571 812 379 828 1368 866 -100 672 567 202 -117 -705 -193 -593 150 -36 -776 -1450 -612
2230 -612 -217 -972 -814 -640 -981 -1090 -1261 -1069 -550 -1553 -1700 -1205 -1521 -1595 -1188 -1351 -1443 -2488 -2474 -1129
2250 -1129 -1531 -1176 -1780 -1303 -2012 -2228 -1342 -1265 -1837 -2526 -1942 -943 -1481 -1731 -1543 -999 -1558 -1443 -1233 -1123
2270 -1123 -646 -1291 -810 -845 -667 -886 -810 -134 -216 -935 -618 97 -325 -778 113 317 222 -621 561 461 664
2291 664 -432 729 1701 856 577 829 1829 590 152 1825 1318 697 396 1033 2317 1682 759 938
2309 938 2260 2078 815 2026 2150 2060 1386 1270 2529 1520 906 1566 2323 1481 1666 1569 2239 1641 440
2328 440 1816 1800 1386 773 891 2354 1320 162 1186 1827 598 -58 767 1384 1020 441 873 1148
2346 1148 664 -443 59 1060 86 -739 -162 887 -367 -543 -601 774 -180 -932 -488 562 -518 -1453
2364 -1453 -972 -581 -575 -1205 -1403 -138 -1420 -1498 -1028 -793 -743 -1839 -2074 -614 -1156 -1663 -1356 -849 -1305 -2157
2384 -2157 -1610 -1040 -1621 -2894 -1407 -726 -1097 -1767 -776 -1111 -1339 -2000 -942 -1304 -1147 -1059 -862 -1023 -1168
2403 -1168 -670 -1115 -115 -750 -1081 -720 -168 -590 -105 -477 -193 -873 -522 425 403 -927 87 1150 801
2422 801 463 515 477 786 711 314 583 1378 675 -128 962 1418 937 1208 1723 898 1347 1105 1391 1442 1172
2443 1172 1208 1598 1852 1778 2023 1844 1161 1183 1697 1583 1538 1668 1462 1517 1016 822 1508 1861 1095 1267 630
2464 630 1052 1354 1156 722 801 575 741 478 1393 335 812 234 854 209 266 159 -283 -168 -203 71 340
2485 340 -654 281 212 83 196 -668 -322 -1313 -1387 -1089 56 -919 -1637 -1512 -1229 -893 -1383 -1758 -801 -1321
2505 -1321 -1797 -1800 -558 -1224 -2118 -1342 -1305 -1305 -1687 -876 -1463 -1604 -2277 -767 -1115 -946 -1527 -1654 -563 -1731
2525 -1731 -1997 -1293 -1214 -505 -1560 -1430 -648 -714 -1653 -1396 -223 -465 -601 -517 152 -326 -280 -560 259 -733
2545 -733 -373 121 -884 192 -419 783 761 368 -281 671 989 792 747 1082 1533 1268 -508 374 1996
2564 1996 611 774 1604 1630 575 494 1377 2068 1189 1086 1781 1769 1522 -200 1396 1332 1277 1458 1354 2088
2584 2088 780 1516 1307 2005 1701 1099 1147 1755 1143 -152 1190 1614 576 738 771 1206 289 242 805
2603 805 889 329 68 291 1039 349 -483 284 663 314 -652 148 474 -319 -583 -104 453 -865 -1011 -889
2623 -889 -611 -523 -1087 -626 -460 -1425 -1008 -1013 -571 -1022 -1180 -938 -567 -1517 -2010 -828 -971 -1236 -911 -575 -1275
2644 -1275 -789 -975 -1716 -1248 -881 -653 -1437 -965 -1113 -1173 -685 -1107 -1197 -1348 -1658 -1320 302 -693 -749 -626
2664 -626 -1119 -752 -344 491 -450 -772 -907 546 410 -488 -7 -90 -506 332 -42 639 -209 -325 409 369
2684 369 716 548 633 702 796 797 1012 339 831 1213 487 1001 719 1616 1117 676 1589 1072 1818 675 939
2705 939 1863 854 930 807 1008 1423 688 430 1344 1562 980 1148 748 1549 1103 1650 1255 1358 433 1217
2725 1217 638 879 700 623 953 833 762 438 739 763 69 235 896 329 359 -128 724 -76 39 -695 604
2746 604 -558 -586 -432 -651 -521 -1065 -298 -601 -745 -856 -875 -999 -724 -1388 -1282 -1710 -931 -1688 -769 -1128
2766 -1128 -1056 -1703 -1320 -732 -1002 -1510 -772 -360 -1713 -981 -1298 -287 -1438 -1853 -1376 -456 -1644 -721 -1145
2785 -1145 -496 -895 -987 -565 -984 -1465 -1108 -447 -246 -616 -1019 -534 -145 -671 -1216 -361 -57 27 -282 207
2805 207 -278 -461 -256 384 269 47 -9 339 411 58 177 215 931 506 1080 331 962 649 236 830 470
2826 470 1107 1015 518 951 1150 458 986 1480 1316 423 1340 1226 1297 251 1086 1068 318 892 1603 1047 983
2847 983 410 1048 1666 -35 445 1403 1679 701 175 894 916 445 345 964 721 -146 258 597 -82 525
2867 525 -106 455 84 -100 -132 100 424 571 -328 -311 -198 -355 -746 119 -788 -908 -455 -957 -1236 -1218 -986
2888 -986 -367 -644 -1094 -1292 -365 -1233 -435 -616 -264 -915 -1135 -671 -916 -1125 -1061 -820 -818 -1440 -1229 -1699 -611
2909 -611 -629 -274 -560 -470 -1051 -426 -804 -1691 -1228 -300 -1091 -805 -433 -917 -154 -818 -42 -371 -341 -773 -254
2930 -254 -747 -495 -430 -654 -466 68 -483 -450 111 162 -724 52 -236 653 532 93 604 637 802 382 476 752
2952 752 497 708 697 538 422 716 1423 846 708 708 977 933 548 593 1434 1493 1202 927 799 695 1429 1114
2974 1114 799 1253 606 -3 1037 1183 1271 1371 146 994 1423 941 1155 874 498 -21 94 1054 264
2993 264 378 252 -20 569 -115 -122 449 -341 -499 -69 -72 -124 139 -908 -473 -552 -165 -694 -694 -433 -625 -490
3015 -490 684 -246 -1032 -398 -364 -1013 -625 -787 -775 -1505 -1216 -369 -839 -692 -791 -1271 -732 -1206 -989 -490 -677
3036 -677 -1406 -1404 -681 -1004 -939 -1830 -1295 -764 -1841 -1396 -899 -222 -867 -1209 -623 -31 -930 -802 -468 -504 -43
3057 -43 -1116 -812 -407 -139 -405 -371 -96 258 223 61 174 220 3 -85 484 575 708 821 126 364 205 948
3079 948 534 600 53 733 1236 282 794 971 598 824 500 1104 873 1168 712 641 519 708 1304 1069 520
3100 520 949 1019 1178 1353 710 1026 944 730 687 863 1188 837 681 592 -23 235 321 537 593 586 -179 1190
3122 1190 -88 -61 575 170 624 75 222 273 314 85 -129 -7 381 -297 -505 -39 -624 -319 -355 76 -732
3143 -732 -563 -565 -244 -148 -556 -802 -414 -1047 -1188 -1119 -612 -977 -559 -256 -560 -864 -919 -349 -775 -1040 -1289 -956
3165 -956 -1404 -1104 -1006 -711 -404 -943 -1258 -839 -502 -778 -861 -196 -1057 -614 -692 -382 -110 -761 -451 -493 -275
3186 -275 -416 -323 476 -258 -313 -251 339 168 -394 -404 -454 537 -352 126 -677 846 842 330 926 254 263 274 791
3209 791 677 594 72 396 188 708 160 596 876 593 508 956 1168 833 1026 773 1368 642 840 683 766
3230 766 976 961 860 437 598 727 1491 742 1568 133 815 945 -55 -2 319 1313 -317 776 506
3249 506 510 -203 -58 137 599 796 147 392 176 933 109 360 301 646 -22 -15 372 -58 358 -315 -59 -432
3271 -432 -164 -542 159 -411 -661 -769 -14 12 -397 -400 -630 -749 -1083 -208 -622 -1150 -517 -948 -700 -1132 -280
3292 -280 -828 -740 -60 -793 -789 -899 -1044 -1349 -1010 -841 -502 -817 -939 -723 -985 -998 -905 -291 -395 -1138 33
3313 33 -354 -762 -356 146 -85 -435 -880 -77 -272 -387 -440 -252 91 -209 -199 285 341 49 97 -551 619
3334 619 499 338 275 382 624 198 258 348 -475 350 556 87 -204 640 -241 725 734 504 545 992 617 486
3356 486 1010 1365 504 658 382 885 1618 543 598 1348 847 975 656 700 589 1054 1315 738 841 408
3376 408 737 393 622 1242 247 -152 332 522 283 568 334 148 209 180 -195 -153 133 -470 -342 -307 -108
3397 -108 269 228 -107 -299 -151 -122 -141 22 -697 -951 -766 186 -734 -946 -540 -234 -1093 -220 -602 -399 -1235
3418 -1235 -359 -390 -1712 -496 -1058 -682 -1096 -782 -857 -281 -289 -1037 -544 -989 -672 -841 -707 -1023 -879 -304
3438 -304 -742 -241 -906 -577 -1201 -636 -478 -981 -710 -753 -566 -204 -183 -1040 52 -97 151 402 48 -11 264
3459 264 69 317 -488 13 474 115 -75 -340 279 152 10 231 704 557 465 319 312 -42 919 552 384
3480 384 385 40 990 956 -159 888 881 570 586 740 1270 726 524 440 1479 571 839 830 388 1041 247 232
3502 232 948 770 1088 584 675 109 743 693 -257 700 57 -175 696 -74 415 235 -213 98 -364 341 10
3523 10 249 281 457 -618 -249 -442 8 -753 719 -163 -569 -20 -220 331 -882 -327 -785 -16 -559 -623
3543 -623 -1009 -314 -804 -764 -235 -441 -610 -721 -905 -926 -735 -209 -1080 -473 -79 -775 -598 -926 -841 -1143 -773
3564 -773 -674 -306 -689 -180 -819 -281 -147 -142 -687 -123 -490 -140 -673 -664 -415 -698 788 -323 -437 -340 -71
3585 -71 -190 -197 419 384 -763 -419 -404 69 -538 -50 273 123 512 603 -327 -310 78 -69 203 923 329 457
3607 457 709 777 376 502 1274 -315 536 548 1077 988 711 581 -165 464 1056 588 694 1550 680 297 515
3628 515 783 557 581 270 352 121 64 1060 783 -206 527 561 1240 722 242 468 195 412 431 126 -45 146
3650 146 177 -276 323 522 -180 -319 -132 -535 -525 -439 -357 -86 -737 -604 -256 -577 -640 -368 -526 -732 -500 -859
3672 -859 -549 -171 -611 283 -813 -572 -66 -375 -518 -890 -1146 49 -742 -1136 -781 -671 -664 -786 -802 -295
3692 -295 -744 -402 -951 -907 -301 -651 -469 -833 -63 253 -460 -623 453 -939 -385 -426 557 916 329 -668
3712 -668 -384 -247 264 -425 -320 162 577 -376 200 629 123 306 361 698 363 222 768 1386 539 206
3732 206 350 449 274 589 545 -388 950 558 636 124 68 55 636 507 652 543 550 531 580 871 939 590 222
3755 222 782 677 758 1051 62 368 493 504 555 643 1315 357 137 679 521 324 534 290 356 571 679 -181
3777 -181 103 358 -287 68 -17 29 -241 -503 303 175 -418 642 543 140 -373 241 166 -526 -445 -294 -819
3798 -819 243 -401 -278 219 -777 -798 290 -9 123 -306 -555 -358 -395 -1050 -337 -940 -691 -388 -392 -877 -932
3819 -932 79 64 -191 -264 -505 -120 -448 -62 46 -459 -569 -335 47 -906 -37 -535 -334 -497 -823 -453
3839 -453 -290 -542 243 116 -652 -14 232 -255 -110 -251 157 119 406 443 -131 339 181 144 -157 65 260
3860 260 149 525 246 -58 556 388 183 682 -10 137 465 554 333 391 549 1063 407 651 624 319 693
3881 693 901 1256 1040 197 778 1516 651 486 -261 -253 554 171 1177 214 610 291 -90 457 1010 103
3901 103 432 204 -374 52 621 521 -444 36 237 -267 216 -302 350 354 707 -237 -215 -13 -567 485 -71
3922 -71 -245 -30 -535 -708 -245 -732 -745 -179 -100 3 -509 -912 -348 -1126 -300 -587 -929 -288 -925 22 -277
3943 -277 -910 -1021 -441 -648 -827 -772 -49 -299 -408 -398 -689 -218 -758 -661 -409 -656 -105 -357 -420 78 -355
3964 -355 -571 -510 -416 -343 87 -85 -125 -262 -410 287 -453 251 -111 -255 -223 344 105 -524 391 99 245 -323
3986 -323 40 385 292 134 -341 -14 -228 -16 680 484 402 -76 384 -283 684 1001 236 557 434 530 259
4007 259 207 433 413 219 731 -101 800 571 647 1009 544 535 115 1081 612 -98 133 53 609 118 238 707
4029 707 83 -172 280 -347 752 331 -288 315 -183 647 30 -637 -106 -707 -484 699 -277 442 -457
4048 -457 -56 490 -601 -316 -383 -136 -136 -797 528 -242 -122 -295 -189 -459 -712 91 -686 -289 -210 -474 -433
4069 -433 -445 -701 -414 -476 -423 -422 91 -174 -155 -179 -489 -849 -246 -628 -363 78 -505 -424 93 -447 -194 -599 -846
4092 -846 -257 -81 -185 45 -467 -481 -157 -405 -368 -288 -406 -869 40 -392 -23 -252 150 103 314 -490 368
4113 368 531 6 10 545 895 -21 41 41 127 352 792 558 595 600 137 -126 406 1131 263 672 1060 237 -60
4136 -60 962 672 422 891 734 718 1175 98 457 322 712 679 899 113 -263 394 529 741 322 -44
4156 -44 631 -31 304 133 582 6 62 -316 237 493 734 -251 -204 207 488 584 19 353 277 -295 17 197
4178 197 -607 -470 -470 -356 90 302 -298 -748 25 -661 -154 -656 -588 -520 18 418 -379 -971 -811 -809 -1347 -356
4200 -356 -143 27 -570 -218 -414 -197 -636 -619 -357 -157 1 -345 -616 -70 -533 114 -796 -49 -566 -695
4220 -695 -699 -324 -305 -25 91 -55 -180 -136 452 -222 -1 -329 -373 253 -227 -489 116 3 33 -200 -152 -112 151
4243 151 -345 -258 142 113 59 -99 208 -14 450 70 273 460 412 221 353 669 381 863 700 529 1068
4264 1068 542 311 830 182 414 559 126 631 254 -129 632 278 600 380 9 815 43 749 955 808
4284 808 125 -206 272 101 66 379 623 923 380 34 464 -65 -100 197 145 -95 -742 81 -228 185 -455
4305 -455 161 228 609 -698 -78 257 -371 732 559 -25 -653 -126 -629 -214 -36 -629 286 -71 -548 -583
4325 -583 -491 -499 213 -40 -632 226 -465 -734 411 -340 -379 -73 -519 224 -758 -576 -293 -189 -546 -487 -768
4346 -768 -568 77 -592 187 2 -198 -376 93 -754 306 -166 -390 -522 -485 -1007 193 -126 514 158 195
4366 195 133 -513 -16 -270 716 -134 -531 63 422 41 -120 193 -291 286 6 427 -167 482 818 -319
4386 -319 641 279 -64 358 130 -12 263 -42 415 680 260 355 654 68 425 -67 138 728 457 456 670
4407 670 628 271 607 609 57 -21 239 438 558 395 105 -88 636 -125 531 591 -182 -152 -193 -125 99 -299 196
4430 196 91 433 -642 -646 -505 -602 338 639 -404 -260 26 -281 -256 -250 832 -91 3 -653 -636 -447 -164 -286
4452 -286 -44 217 -77 -346 -190 -120 -280 -790 -223 -1081 -247 -371 -692 -669 -445 -179 -1004 14 -145 -499
4472 -499 -658 -1068 -138 229 -408 125 -263 -101 292 -167 97 -608 -389 -758 -534 -567 139 -168 -187 -73 142
4493 142 84 -296 -53 -409 435 137 141 -598 90 99 -317 246 140 -654 -149 459 -104 389 287 -104 20 248
4515 248 65 273 -177 228 694 602 -104 86 -462 797 611 100 103 619 466 567 360 815 562 347 894
4536 894 158 502 262 301 776 119 405 -604 573 449 128 1092 -334 418 559 346 -192 -11 145
4555 145 64 115 223 -139 289 158 827 -763 262 -606 586 280 8 -349 -456 -617 -232 -299 -172 -805
4575 -805 -136 -808 870 -231 -739 -189 -49 -797 -65 -279 -760 -374 -377 92 -127 -482 -1195 -58 12 -208
4595 -208 -400 40 -185 -666 -880 -234 -307 461 284 -261 14 -130 -1071 -454 -385 -120 -83 -123 -339 354 -60
4616 -60 185 -659 -25 556 441 -37 52 516 -818 -137 -660 -452 419 -177 -183 185 -545 623 26 -145 68
4637 68 -222 637 51 -369 240 -170 -245 -284 304 426 681 20 603 -239 303 298 513 356 366 379 798 498
4659 498 486 524 284 710 -222 215 1297 -155 633 543 234 110 705 142 11 623 838 186 285 283 634
4680 634 329 255 410 198 -155 -74 163 697 115 50 -371 127 -645 -343 469 583 -638 100 -225 -260 4
4701 4 66 324 -464 332 -493 298 -102 -67 639 -584 -561 -181 -74 -247 -625 250 198 43 -849 189 263 -186
4723 -186 -603 -297 138 65 -667 -351 -79 -573 -245 -42 -450 38 -394 -757 -140 -262 -95 -297 284 -234
4743 -234 -644 -879 -783 47 -88 -620 285 -435 -579 355 -446 -101 -655 32 -162 -280 -117 -276 424 280
4763 280 765 257 90 121 312 788 80 222 45 407 490 427 -150 345 155 386 -13 -70 -142 774 -67 161
4785 161 357 762 -18 538 364 100 461 212 348 721 -41 -71 141 383 438 245 -295 484 309 111 273
4806 273 445 548 -78 533 255 385 -471 1027 337 -309 -65 -45 -395 317 -553 60 -541 -55 62 -372
4826 -372 449 -229 -483 118 470 -466 -36 750 -476 401 -20 -196 -1643 20 52 25 -554 137 -22 -339
4846 -339 -390 -45 -213 -210 -65 -457 -95 -343 -190 -513 93 -615 -247 -802 -463 -643 -255 437 -710 -529 -288
4867 -288 -107 323 -335 -697 -432 -37 -169 59 -420 -120 -683 -99 -89 -303 -1186 167 -286 -699 -641 125
4887 125 392 -351 300 108 -277 -116 12 145 -165 300 711 137 -388 140 216 103 26 788 -419 -511 -122
4908 -122 292 832 712 342 330 18 -528 173 74 667 472 135 146 942 199 538 444 438 388 800 632 -40
4930 -40 194 129 322 -152 358 200 -46 -150 -506 74 297 123 -122 -94 376 83 -15 46 383 432 -442 350
4952 350 385 -112 -73 -297 318 316 151 236 -118 588 -182 456 69 -410 -627 38 -170 509 -226 -191 -117 -551
4974 -551 -98 326 391 -726 -193 -562 -170 163 -703 -630 -815 340 487 -102 -462 -43 -497 -412 -378 -833 -78
4995 -78 -502 -134 -227 -561 -346 -858 -325 -139 -214 -571 -242 -385 -317 -244 -419 -506 -72 -44 -222 394 -369 -293 111
5018 111 -157 -276 -183 10 -27 -322 221 539 175 -95 358 399 96 357 172 214 586 41 328 569 578 221
5040 221 574 590 -177 -1 -530 -183 340 507 117 -71 227 552 -565 230 -682 776 301 127 424 -353
5060 -353 555 809 286 201 342 494 607 396 538 -519 -18 85 -34 128 -297 -135 317 211 -7 297
5080 297 35 111 24 -565 -327 -111 12 -10 -186 210 250 -345 -208 643 -175 -337 140 -134 -442 -603 63
5101 63 -41 -62 -212 -1134 68 -71 55 -1051 0 36 310 -280 28 -586 -1253 -608 -459 248 492 26
5121 26 -294 -56 -479 -272 -581 -630 37 -210 -249 -258 290 -72 -93 -252 -762 352 319 72 35 86 164 -723 -489
5144 -489 -580 368 64 232 105 -529 -143 -177 -72 645 -328 -152 452 180 208 1 139 -255 261 -11 318
5165 318 -67 95 12 190 -142 491 404 147 -67 476 641 92 72 638 22 437 379 131 349 -467 543
5186 543 -260 -31 -142 -4 230 64 699 92 284 507 162 -4 -76 622 -207 75 384 -549 129 98 511
5207 511 417 -551 -167 -258 98 629 -708 233 174 -38 -95 -180 -88 -136 -157 -280 57 -489 -45 -303 -171 -361
5229 -361 318 -647 767 -667 -210 -245 -222 216 -286 -180 178 180 -94 -351 -837 -312 -545 -292 -134 -839 -62
5250 -62 -66 -67 -219 -196 -10 101 -467 -477 -14 -61 70 -548 343 -252 -834 -66 75 -766 -175 -278 -64 247 400
5273 400 -71 451 -17 193 -277 -490 61 82 169 -70 61 -267 -221 -72 -291 -110 198 115 286 -251 -70
5294 -70 -79 236 214 284 -121 146 448 -204 285 359 130 256 465 441 193 -72 403 -363 85 402 558 778
5316 778 565 226 516 303 6 -12 -169 305 722 -346 243 -205 -668 433 60 -230 443 726 382 -215
5336 -215 -28 350 -127 95 691 -224 -682 -449 -680 -79 -326 267 49 76 -435 -451 -186 -4 -232 -102 -213
5357 -213 -345 -236 -568 -1004 -352 -609 -280 364 -376 342 -156 60 386 -468 222 -54 91 -131 -334 -389
5377 -389 -453 -151 386 -207 -461 -323 -337 115 -4 -253 -1142 -629 -716 -450 -502 -204 -328 -207 -289 -332 319 99
5399 99 -480 85 -411 -300 -83 743 291 279 485 -45 -204 185 -121 332 433 459 -592 -71 147 -549 -12
5420 -12 125 361 112 -397 128 482 209 337 -208 -195 180 1174 -36 143 438 325 6 -311 -47 -680
5440 -680 -367 623 526 194 669 52 628 360 297 458 493 82 -25 157 -226 464 -403 477 -101 111 463
5461 463 -248 382 18 131 170 -99 771 -605 -357 -741 718 -319 -97 298 381 26 337 87 -318 -516
5481 -516 46 328 -402 -125 -383 144 188 210 -423 51 -1126 277 -30 -381 -808 63 -24 27 -252 132 206
5502 206 -417 -139 -672 -298 -734 -172 -516 -41 -457 -71 129 -57 -791 -13 -442 173 -378 -436 -682 -665 449
5523 449 45 -192 328 -235 -753 -447 -158 -253 89 430 -82 77 -158 -176 -64 485 -197 224 -188 -390 -448
5544 -448 885 948 375 -208 515 -236 56 -17 -324 12 -34 615 88 316 -3 351 -279 573 509 285 453
5565 453 -185 593 -193 -48 -306 374 676 153 514 386 398 639 677 148 272 610 213 728 306 60 -353
5586 -353 -92 19 25 147 361 374 -32 -106 96 289 501 236 -155 617 206 557 321 185 -564 -115 -588
5607 -588 -384 137 169 -118 -388 -771 -32 -371 -455 -579 -177 11 72 229 92 -305 -66 -329 -457 -326 -167
5628 -167 -638 -18 -495 16 -484 286 -100 -288 274 -210 157 -389 -356 -419 68 -541 -78 9 -386 34 -1087
5649 -1087 -364 -204 -72 374 10 -294 558 -163 -150 607 698 -139 676 237 49 79 -26 118 -448 201 -663
5670 -663 -148 124 -764 -238 -585 499 543 -21 229 158 -178 -673 114 -15 -2 -545 -68 -391 -101 202 23
5691 23 -352 586 -359 523 -44 -78 178 239 655 80 -109 88 179 265 688 281 4 -32 1004 -1 -54 248
5713 248 338 -155 512 -521 18 -254 657 -183 314 -26 240 130 -303 -97 887 499 420 262 -451 393
5733 393 294 -104 -147 101 -26 -6 -230 -143 -515 -78 -246 -354 -304 -147 -95 -350 -442 -117 -803 -215 -532 94
5755 94 -470 -514 -31 -699 92 -441 75 -331 -448 -499 -107 208 32 -205 -336 137 -231 -447 -329 -151 -716
5776 -716 912 -223 -44 333 -204 -294 -306 -288 56 -141 -416 -478 -389 376 -686 -192 295 83 -286 -79 302
5797 302 80 72 -673 -378 -461 -280 -393 439 53 115 -899 334 369 150 -511 -62 -251 490 357 -169 -24
5818 -24 -82 589 -118 290 360 335 -149 174 480 -6 520 368 172 740 14 233 291 925 -510 -195 61
5839 61 672 -404 -469 293 -514 -286 -91 -44 96 313 682 118 23 361 188 -6 -195 -170 -67 760 -50
5860 -50 233 187 -176 -24 -686 185 306 -789 394 -149 -511 -248 -386 -112 -491 -572 -254 -543 -585 228 -24
5881 -24 -406 -387 134 -23 62 224 -332 -149 -451 -453 40 -448 454 228 -838 -40 34 -58 -617 -195 414 555
5903 555 102 -26 33 -1020 -6 -727 440 -331 -159 63 99 47 -151 -150 192 -401 10 43 53 160 -472
5924 -472 108 -441 477 227 -353 163 -632 -84 -111 -180 394 -477 199 165 -267 25 -223 -45 66 179 229
5945 229 531 -191 -15 707 -273 335 237 -153 376 -307 248 -285 419 532 182 118 249 -152 26 450 830
5966 830 42 363 288 -89 164 457 395 -86 -485 448 589 154 420 168 -499 91 -95 571 238 202 463
5987 463 -402 -220 -496 242 333 161 -280 167 560 -910 -400 201 71 -308 -234 -272 268 303 14 11 130 -322
6009 -322 -307 -344 300 -401 -349 702 10 -537 -348 -505 190 81 323 -156 -244 14 -438 35 -897 -886 -482
6030 -482 9 243 -126 -731 4 -187 -519 -16 -135 -119 -416 -59 268 -293 301 -60 -9 -126 -221 -460 -200
6051 -200 162 193 63 344 150 -424 -480 -225 -193 119 -166 170 -190 98 -225 219 -14 76 444 554 -474
6072 -474 419 274 400 457 56 276 207 556 171 260 -909 -444 -9 -604 -288 201 131 600 634 335 -110
6093 -110 600 525 767 -75 244 248 -327 714 104 58 702 58 478 407 119 110 155 21 522 -488 -27 255
6115 255 37 262 43 226 -41 235 627 229 -32 63 -271 -546 -677 64 10 -15 264 -161 290 97 129
6136 129 -301 -46 -170 37 -80 -467 -162 -282 -359 93 -796 -681 -286 -120 -717 -96 -365 47 -584 -62
6156 -62 -417 289 -189 -278 -585 350 -368 61 57 -508 212 -251 457 -793 -98 -63 -159 90 -338 -629 -138 -265
6178 -265 73 -584 -255 -251 375 -94 -118 117 -48 -17 -77 -7 155 -280 338 -120 40 118 -4 641 503 -354
6200 -354 256 -241 -112 118 -422 464 -238 349 -227 -32 57 -225 306 271 991 338 57 35 -141 -171 263
6221 263 142 -59 -67 -268 277 -203 -121 54 -815 266 72 145 476 -124 456 -229 -468 -402 706 -14 217
6242 217 -557 727 47 43 402 -303 -428 69 84 -60 288 -100 352 372 -5 -400 -276 -130 627 -459 77
6263 77 -192 -171 -313 -399 -38 -505 -358 -656 105 59 -102 385 560 176 251 -416 -45 -89 -265 276 -847 -368
6285 -368 -365 -106 -114 -365 -428 415 -63 -31 -41 -618 169 -514 -446 153 -704 118 -224 -325 -208 -671 -262 -251 -353
6308 -353 518 -182 52 -374 -395 -104 -460 -105 29 -157 16 56 107 149 264 374 180 509 -150 -98 -183 -176 230
6331 230 -161 -83 67 -105 60 73 643 -349 -590 -43 -296 253 -112 268 282 520 507 334 -362 1024 -115
6352 -115 -251 -374 454 806 1600 323 365 -265 -207 -278 -49 -496 112 -279 217 -284 -194 704 -420 548 388
6373 388 -594 -227 -154 282 -107 -182 -183 104 -131 -179 90 208 -226 81 -7 -232 -41 -109 -407 -221 -454 -165
6395 -165 -145 -38 261 271 116 -236 -21 -292 -192 -424 43 -47 -337 292 33 353 -135 -571 491 -36 -430
6416 -430 0 229 -152 -393 -155 -434 88 -361 -181 -855 -58 -460 97 -97 -77 190 269 -256 -119 -238 -198
6437 -198 348 212 418 -424 332 414 -7 -703 -181 -155 115 -193 523 -404 403 -158 -224 6 334 105 -394
6458 -394 21 -323 -276 -378 117 -187 97 -15 162 218 317 416 -424 208 630 177 754 -85 -195 -41 -161
6479 -161 447 -161 212 349 403 123 -302 -50 970 -22 -61 -20 -183 488 157 355 453 316 -249 224 449
6500 449 -466 -157 39 76 184 172 50 -101 -686 658 -148 707 -127 573 -225 421 -325 -39 -110 149 1016
6521 1016 129 -121 -519 90 -330 271 -72 41 -484 134 -289 -372 -299 -468 -195 -360 150 -154 -143 -196 264
6542 264 -507 -78 4 -277 -317 60 -407 -339 -612 -137 -750 -235 304 -729 -194 -85 -394 -82 154 -280 238
6563 238 -195 218 30 -314 -319 707 394 -332 -376 289 -297 -277 -329 417 -197 -248 547 524 -338 288 670 216
6585 216 136 -735 -234 -597 116 281 -499 433 93 496 51 -467 -274 -469 378 491 327 504 -63 -235
6605 -235 -963 254 434 -215 297 195 -144 -156 278 126 -216 59 -127 205 9 -173 65 578 243 159
6625 159 -116 -28 623 -75 -280 92 -22 112 -614 -272 586 269 151 2 -300 -196 420 280 -566 -467 187
6646 187 -1 41 -383 -110 -74 -186 -434 65 -191 488 871 -534 42 -575 197 -28 81 86 66 103 127 68
6668 68 -434 -63 41 -168 -131 248 1 544 -61 -340 -731 -494 371 358 -294 -620 -188 -259 339 -36 231
6689 231 -64 116 370 80 -511 133 45 -81 378 -268 -293 53 -709 -18 51 -196 -85 49 -86 323 -230
6710 -230 941 -288 402 -61 112 154 356 -135 -278 677 -321 155 -552 478 327 -77 -55 -254 179 614
6730 614 34 712 -40 429 -244 166 -252 255 306 227 215 43 120 287 269 306 -243 -436 -113 -104 -48 150 -341
6753 -341 -264 374 285 571 -167 214 410 372 131 -41 104 -318 33 -858 367 301 -161 374 -163 -250 172
6774 172 121 276 357 260 598 483 -710 -217 194 578 -108 37 57 -278 259 -514 -704 -427 -490 279 46
6795 46 -471 146 -25 -305 -300 171 -260 26 255 -126 -409 -355 -184 686 355 -822 385 428 -339 -256 -483
6816 -483 -290 171 -6 121 -800 -401 144 -7 -689 -435 -248 32 -102 313 -236 -274 455 -87 201 123 -29
6837 -29 78 401 49 -562 -474 441 472 -191 -24 -843 27 35 159 -187 91 -104 -332 -142 -644 -49 -30 197
6859 197 211 -35 533 496 -220 157 314 -457 222 1098 329 -181 -33 -307 830 380 -14 469 -656 -450
6879 -450 -104 32 194 -136 236 -54 380 188 -234 789 528 169 -128 369 -119 -164 299 840 376 56
6899 56 242 3 92 733 123 434 376 71 235 385 -401 258 -155 -195 47 341 -190 352 35 208 -93
6920 -93 -298 -135 132 495 -447 199 -402 -556 214 -26 169 265 406 213 361 -94 106 188 -296 -268 -559
6941 -559 -312 -149 142 22 30 -252 -252 -575 -170 243 -251 227 575 -210 -75 326 -160 522 -524 295 213
6962 213 -191 -437 369 14 -292 448 -180 128 80 -946 36 266 105 5 118 -537 -388 28 60 131 -85
6983 -85 213 -170 -146 -184 -88 162 -29 516 17 -151 -246 -157 -172 -104 88 44 195 -100 406 494 144 6 74 -451
7007 -451 160 133 -163 849 -20 -74 -348 -182 215 -401 90 0 -9 428 -458 -258 250 112 246 242 94 417
7029 417 345 -77 131 67 -78 295 -201 103 -305 -53 205 125 -140 149 183 565 -50 80 580 131 586
7050 586 167 -207 519 499 -578 -335 -558 -188 -399 -376 188 -144 -502 -179 220 -231 -86 -398 194 521
7070 521 -252 172 -228 40 93 207 -401 0 164 -31 -36 144 -40 -94 -75 207 -54 -88 577 -244 -214 123
7092 123 73 -55 -376 -398 -435 -560 13 337 -258 91 75 498 -159 -156 -91 3 532 -409 104 449 571 -138 553
7115 553 -268 -246 -551 5 -227 -366 470 421 -771 -170 -397 370 596 -236 -31 120 -259 -127 382 267
7135 267 303 -186 -438 -743 -84 135 -546 408 237 -402 578 140 -167 52 -233 -57 -708 628 -74 -18
7155 -18 -396 -192 238 -417 -9 -425 879 -278 -85 -188 120 470 263 177 48 -290 198 -677 -639 539
7175 539 557 326 -390 -67 -3 296 -154 104 269 315 -144 -182 -214 687 -309 -74 -785 -225 175 -561 -445 -207
7197 -207 508 -293 -379 562 -766 49 102 -635 -369 -128 472 -461 325 234 -69 410 -119 -111 69 -199 74
7218 74 175 280 -206 192 -191 240 146 284 -357 45 166 -133 -236 -223 -39 432 -156 980 678 476 128
7239 128 123 275 -244 204 411 53 -62 7 -104 -29 -349 -301 -462 -444 87 539 -257 -281 -358 -160 486 665 -115
7262 -115 -436 615 176 416 397 1311 -291 -344 -14 -223 32 347 363 13 337 -485 129 692 -211 -398
7282 -398 280 462 470 755 16 -204 461 144 -327 -26 153 -338 1112 -578 -109 -60 -222 445 -431 174
7302 174 -280 429 -304 275 195 203 439 -1096 -248 -188 -157 -538 59 -224 144 222 -73 -206 -106 -739 -70 -563
7324 -563 -325 -747 -279 -44 -138 -206 -198 -21 2 -350 -383 -505 -25 -333 363 -589 -466 534 -111 413 2 -117
7346 -117 314 479 -191 75 523 -733 -59 -223 236 -109 331 30 -170 -283 9 -127 -1000 -23 -170 67
7366 67 53 -170 -85 -77 601 321 25 62 95 456 -215 180 179 93 -230 357 -383 647 127 256 -170 -99 -274
7389 -274 -75 -303 380 56 170 -257 -38 -852 -37 -373 4 293 -91 349 635 542 17 522 645 320
7409 320 171 -102 324 899 -443 58 -182 50 -189 190 361 2 -56 106 -156 -138 324 467 220 129 -534
7430 -534 76 333 -36 204 53 -222 -533 -154 -228 -465 23 28 143 -109 289 466 386 -181 -129 136 -561 291
7452 291 -380 -1 559 -423 112 -310 671 -69 478 -199 273 -95 -262 58 231 198 168 -513 -606 -191 -230
7473 -230 -336 -580 -190 -706 -486 151 183 254 -261 -69 -94 -394 299 155 704 -368 -21 -522 -32 175 -97
7494 -97 490 -288 24 269 112 138 18 -125 -227 520 -4 -573 -435 139 -211 -476 -448 566 346 476 -995
7515 -995 766 778 -901 102 -166 79 -15 176 -154 727 -349 -1063 -90 -172 420 628 -136 513 -128 -46
7535 -46 -233 -470 -304 312 379 73 815 -250 67 -8 75 171 -33 122 486 154 202 370 -452 466 -583
7556 -583 -595 338 -70 -13 164 -377 -80 -461 424 -457 -23 -222 -146 -422 -273 -112 -332 -31 429 -28 9
7577 9 28 -680 222 -384 72 776 185 -372 -311 232 31 137 -403 77 585 -244 -91 -294 -108 274 145
7598 145 -193 -265 -498 -289 122 -455 27 225 -91 -95 -180 -112 -119 -10 -446 484 -97 328 522 102 322 -39
7620 -39 -479 -292 -549 -443 82 -307 668 -279 385 -474 -336 229 -66 117 -382 -980 311 -139 644 -170
7640 -170 -35 -73 -41 22 86 74 258 -123 -427 107 207 627 4 186 -396 -330 481 -18 136 318 -6 -155
7662 -155 110 -307 404 931 332 -238 611 227 25 418 -337 712 205 327 -384 -431 2 -456 305 -336
7682 -336 655 77 -672 -180 -730 -264 -162 -109 569 156 -514 20 220 -242 -385 -548 356 445 -51 -21 -457
7703 -457 -85 309 183 -377 -134 -16 -19 437 -272 105 -143 40 93 7 294 -114 1342 -305 313 -486 -247
7724 -247 -106 -29 -228 -315 -12 -118 -10 -342 -64 290 -27 131 -150 -584 -91 -978 -586 -311 204 128 48
7745 48 157 -23 243 -51 -164 -179 -403 350 -349 -218 -492 -305 -608 395 37 533 -173 -14 180 -241
7765 -241 502 608 -207 -474 -411 161 249 -516 -225 371 475 -226 235 -77 -83 -319 14 263 615 -182 434
7786 434 -208 262 273 -77 433 160 -256 563 -230 12 106 -579 689 223 115 34 -20 350 -305 306 -132
7807 -132 -1 -310 242 151 578 -420 -431 603 263 -485 310 102 158 -298 97 295 39 15 42 631 -291
7828 -291 -245 -2 -265 -570 -346 915 -339 -793 249 -163 -171 99 296 -298 -134 -308 -154 -155 -386 115 -170
7849 -170 182 133 593 -218 -664 240 312 195 57 -304 -476 395 -243 101 -242 -129 185 -275 -442 220 -328
7870 -328 -23 333 236 -308 17 -254 360 -102 -247 483 71 496 -709 -366 31 495 461 203 -141 208
7890 208 655 621 171 -47 -45 354 266 147 183 -144 74 -193 410 230 416 -85 780 -153 32 -217 11 139
7912 139 -448 -245 -860 825 -318 544 309 389 356 -511 250 -210 339 -269 66 -120 547 632 382 28
7932 28 327 131 50 -291 364 -228 -414 -647 -310 -375 206 114 -40 -397 -457 194 117 -185 183 623 231 405
7954 405 384 -115 -204 -369 -249 -271 282 562 -377 -248 198 -187 -15 -2 214 156 295 -452 -706 423 -106
7975 -106 -329 -552 -224 -554 732 109 -331 118 257 381 -317 236 -359 281 515 -404 718 -397 38
7994 38 -122 -134 -59 -325 145 -310 -188 358 -261 -301 213 29 401 -376 -784 88 69 -168 77 -222 189 70
8016 70 -375 -471 -921 126 848 227 -259 -92 -436 997 693 135 -474 -69 844 -205 -125 35 -204 312
8036 312 -115 -106 -253 -201 -79 124 -29 -108 346 -134 -366 196 322 -290 123 -109 803 -261 -154 318 444
8057 444 563 96 -1 -242 -621 297 392 47 -278 -255 -244 63 432 -167 119 27 484 -221 537 -61 -5 452
8079 452 690 -597 -307 -429 299 -502 -261 -69 213 394 -512 165 17 -211 -464 404 376 122 -91 521
8099 521 19 -104 -594 78 173 -56 -58 -28 -42 -454 454 -59 25 230 -213 -275 2 29 486 -139 -189 671 527
8122 527 -156 17 485 185 -71 -496 88 292 132 -198 263 -121 -223 830 415 94 104 303 -141 336
8142 336 -169 -56 -44 -328 250 -993 295 -513 529 -371 -69 483 255 115 2 -167 398 -302 -63
8161 -63 27 -190 -25 68 -1 -222 -13 -216 906 -608 458 56 103 498 209 -179 105 322 229 39 -230
8182 -230 40 -67 9 -67 -103 -479 99 156 -250
8191b50
$$ Imaginary data points
##PAGE= N=2
##DATA TABLE= (X++(I..I)), XYDATA
0 0 0 0 0 0 0 0 0 0 0 -28 40 -40 40 -40 49 -80 80 -111 120 -149 160 -200 230 -267 307 -347 392 -444 507 -573
30 -573 641 -720 810 -908 1010 -1125 1252 -1393 1546 -1715 1894 -2102 2323 -2570 2853 -3160
46 -3160 3516 -3918 4377 -4910 5548 -6310 7247 -8438 9985 -12124 15257 -20334 29924
59 29924 -54599 260714 417000 -129509 -209955 -20402 82037 -15501 114018 230258 47326
70 47326 -256789 -182259 111110 224910 102339 12246 -46587 -114285 -91273 100902 222201
81 222201 120914 -67922 -124937 -67948 23437 110780 151414 58384 -106729 -167219 -46992
92 -46992 104048 130581 42614 -41526 -89863 -108225 -48370 100709 172026 35762 -150722
103 -150722 -143876 4217 75227 53161 56069 32490 -103757 -181775 -31723 154460 111008
114 111008 -60210 -108894 -65191 -66476 -40441 82363 122688 -39341 -182866 -109806 35917
125 35917 65332 39345 30643 -32223 -132055 -103405 54265 126275 36979 -61161 -78935 -72428
137 -72428 -47630 39447 106250 36447 -100920 -130668 -38672 44140 58508 41318 1585 -68613
149 -68613 -102094 -29482 86124 108845 16482 -72414 -74328 -22808 23944 57608 68124 13159
161 13159 -82269 -102392 -7417 83931 69300 375 -38730 -54457 -53763 6183 92011 84398 -18927
174 -18927 -79559 -37870 17303 39330 60578 60553 -16723 -94315 -50938 57108 80418 21277
186 21277 -15120 -23657 -52887 -44699 43624 101205 32545 -64268 -60433 1447 26796 36019 58011
199 58011 36107 -43270 -73865 -1970 73435 64181 8461 -22637 -34086 -37587 -1817 58760
211 58760 63256 -3304 -59898 -45004 3819 35276 43600 35167 -1769 -49189 -44000 23055 73076
224 73076 46231 -7536 -26968 -21930 -15568 14153 60096 50448 -27081 -71333 -25575 33094 32909
237 32909 14268 14579 -7727 -53948 -39681 41247 75873 16437 -38761 -26936 -4183 -5206 17522
250 17522 54713 27208 -49302 -64994 -1579 39140 18994 -893 -3683 -31391 -56961 -17939
262 -17939 46797 42451 -18492 -46534 -23078 -6567 -1615 23598 37341 -4888 -59392 -44540
274 -44540 16958 35951 5593 -13442 -15057 -32889 -43550 -4439 43701 22783 -40093 -54335
286 -54335 -15551 7514 2752 10323 21709 -11924 -53737 -28151 35174 44034 -705 -21806 -9767
299 -9767 -13750 -20682 12434 46143 14366 -42707 -39357 6097 21660 7745 14338 17264 -15222
312 -15222 -38071 2201 52002 39125 -4235 -9777 6243 1449 1301 34268 50122 6838 -34624
325 -34624 -13038 28734 28857 11775 14779 13609 -14220 -23421 18167 53121 29237 -10297 -9375
338 -9375 11133 11623 12946 35365 37320 -1922 -28985 -2591 33782 28402 6016 2377 -199 -18299
352 -18299 -15968 19510 37284 5441 -27918 -18170 3407 4638 5614 19806 12261 -23667 -33522
365 -33522 1349 26399 10747 -11737 -11035 -13275 -25399 -15729 15027 16747 -20627 -42056 -22886
378 -22886 -3425 -5965 -6484 1592 -10349 -36769 -32322 3997 17944 -4127 -20801 -16412 -16272 -20332
392 -20332 -6165 13746 4036 -28739 -35687 -13043 576 -5486 -5467 -2512 -17433 -33136 -17071
405 -17071 13205 14122 -9855 -15329 -7282 -7679 -8498 8312 21586 2810 -23011 -17166 6909 11384
419 11384 1000 2468 4293 -11760 -21093 338 23839 14388 -9120 -8924 2466 1180 2072 17508
433 17508 24036 2867 -14812 -775 20636 17665 7107 9347 7965 -7778 -10263 14359 26743
446 26743 8190 -10019 -3731 6263 2065 4390 19737 18610 -5548 -14884 7617 24379 14451
459 14451 2943 9099 8231 -7354 -4265 20012 24891 -1219 -15044 -793 8704 1160 1638 15175
473 15175 9534 -14439 -14617 11408 22321 5537 -3527 5231 5195 -6202 -54 21406 18090 -7559
487 -7559 -14719 4102 11343 -525 29 10205 1552 -18624 -11593 13600 15649 -4778 -9898 2781
501 2781 1878 -8311 1068 18953 9675 -15050 -13772 8643 10344 -4385 -3274 7001 -1842 -19975
515 -19975 -10163 12836 8580 -15180 -15322 -556 -882 -12601 -3269 11928 1393 -20827 -13337 8867
529 8867 7292 -9058 -6249 3475 -6199 -19130 -6620 11692 982 -19311 -15364 -1174 -5153
542 -5153 -13516 -3955 6257 -7640 -22544 -10315 8252 3680 -9600 -4889 3591 -5494 -14213 300
556 300 14259 852 -16187 -8735 5006 54 -7281 628 7122 -5821 -17220 -3650 13494
569 13494 6715 -7843 -1490 6381 -59 -4607 9640 19119 4533 -9344 1650 14806 7892
582 7892 710 7980 11443 -1850 -7304 8577 18595 6642 -4288 4597 10294 2200 1330 14706
596 14706 16833 1524 -4109 9755 16672 7441 3396 11196 10226 -1835 -2015 12046 13829 1310
610 1310 -4434 2985 5835 -491 324 8840 7070 -4660 -5396 4896 8821 820 -1023 3973 1326
625 1326 -6156 -4312 6637 4883 -6534 -8876 -1176 -1798 -9083 -6563 1055 -3048 -15270 -11826 -471
640 -471 -1492 -10361 -8288 -1541 -6414 -13608 -6921 4154 -2056 -13932 -10903 -2025 -6020 -12093 -6041
655 -6041 -388 -9931 -17703 -9695 32 -6306 -12752 -6171 -2819 -10212 -12529 -837 5617 -5098 -11765
670 -11765 -3739 2168 -3918 -5772 2369 2971 -7193 -9652 323 6520 -2326 -6924 -849 1915 -4211
685 -4211 -4229 7314 8726 -2312 -5552 3998 10321 3061 612 8232 9408 -298 -1955 10395 14075
700 14075 2981 -2306 7129 10311 977 355 10813 11442 -1968 -2335 10124 13129 3206 1006 12240
715 12240 11512 -204 1367 14588 14134 475 -945 10997 10558 -713 1360 11487 8167 -4789
729 -4789 -2673 9814 8228 -1975 -75 9285 5227 -4427 -157 12183 8230 -3706 -1284 7669
743 7669 5250 -3834 -203 8360 3281 -7806 -3834 6013 2676 -6681 -3859 2859 -1144 -8420 -3478
758 -3478 6194 2492 -8230 -5278 4289 2045 -6113 -3342 5927 187 -10587 -5912 4799 271
772 271 -9474 -7206 907 -3345 -11268 -5172 4251 -2302 -12573 -7154 3057 -1557 -9827 -3376 3465
787 3465 -3848 -10580 -3097 4398 -2345 -10505 -4648 1224 -4708 -9745 -3051 1572 -6207 -12265 -4618
802 -4618 1201 -3909 -9023 -3020 1711 -5609 -8386 -472 4188 -2698 -7544 -2099 2727 -3420 -5145
817 -5145 -679 2294 -4194 -7164 -608 2428 -2065 -4974 423 3021 -2340 -3642 2594 5631 -390
832 -390 -3361 3104 6667 780 -768 4887 6436 1073 -799 4613 6419 1090 -333 5905 5418 -225
848 -225 8 7401 7647 807 2255 7743 7741 2528 3817 9842 7794 983 3896 9854 7879 2158 3901
865 3901 8041 4630 -3 3286 8729 3910 -1424 2160 7244 3712 -202 3405 6766 1648 -1741
880 -1741 3093 6755 3275 -1178 1971 4096 360 -2314 1338 4699 -2021 -6661 -1706 1836 -2757
895 -2757 -5887 -1404 -616 -5128 -7322 -1406 1683 -4335 -7769 -2303 355 -5263 -7574 -1809 253
910 253 -7493 -9554 -3025 -122 -7518 -9909 -3885 -1752 -9117 -10702 -1854 -1299 -8833 -9587 -1884 -795
926 -795 -7854 -7983 468 432 -7192 -7633 786 691 -6908 -5714 652 -157 -6884 -5882 2181 1126 -6395
943 -6395 -4079 2539 2280 -4755 -2568 3996 3867 -2984 -1798 5703 5409 -751 535 6845 5338 -1363
959 -1363 141 6906 6272 -659 -618 6690 6742 -837 1497 8880 7125 -1074 1650 8831 8488 1221 2904
976 2904 10072 6890 140 2965 10682 7018 -1457 1968 9207 5705 -1021 2024 8790 4692 -2495
991 -2495 1678 8958 4525 -1955 1353 7597 3666 -1872 2287 8113 3045 -2916 1137 6656 2558
1006 2558 -3306 109 3999 288 -4077 -1036 3788 -413 -5095 -2195 3260 -168 -4889 -1306 2615
1021 2615 -456 -5418 -1502 2997 -1094 -5940 -2942 1305 -3158 -7027 -3630 353 -2980 -7105 -3609
1036 -3609 294 -3922 -7247 -3177 35 -4102 -7879 -2713 246 -4124 -6812 -1900 431 -4385 -6491
1051 -6491 -2703 -216 -4656 -6541 -2308 -1970 -5470 -5609 -2240 -822 -4821 -6227 -2064 -781 -4039
1066 -4039 -3663 -475 -612 -3686 -2714 -120 833 -2924 -2955 -28 321 -2064 -1560 963 991 -3381 -2024
1083 -2024 1749 1052 -1004 -1350 2255 1531 -40 701 3478 2978 -939 1152 4422 3114 1274 2252
1099 2252 4318 3292 495 2377 5957 3036 -76 2535 5785 3030 1266 3856 6205 2665 1110
1114 1110 5218 7328 3689 1781 4837 6354 3142 1773 5103 6116 2697 1164 4457 5336 1592
1129 1592 105 4524 4348 988 -74 4355 4959 441 351 3773 4338 745 -112 3721 3618 -502 -1793
1146 -1793 2841 2535 -1541 -2514 2013 1940 -3348 -3152 663 663 -4263 -4468 682 122 -4558 -4986 553 496
1164 496 -5074 -4098 -611 -715 -6099 -5474 -301 -1250 -7119 -6654 -1134 -1530 -7619 -6195 -1039 -2253 -8017
1181 -8017 -5770 -82 -2222 -7130 -5956 -330 -1908 -6682 -4968 -329 -1763 -6361 -4342 702 -2141
1196 -2141 -6649 -4327 657 -955 -6359 -4195 1104 -1514 -5395 -2360 2466 1370 -3622 -2061 3468
1211 3468 1833 -2849 -167 4497 2167 -2301 -12 4698 2674 -1282 199 4501 2071 -1441 1915
1226 1915 5476 3336 -339 1738 6317 4319 465 2737 6918 4719 986 4150 7556 4466 144
1241 144 2949 6916 4186 558 3652 6311 3363 156 3090 6408 2394 -643 3514 6243 3364
1256 3364 419 3126 5833 2327 97 2897 4940 2067 -926 1463 3095 1110 -1511 620 2103
1271 2103 -636 -1779 135 1771 -202 -2503 -261 848 -796 -2695 -775 640 -1905 -3860 -697
1286 -697 817 -1869 -3410 -1234 -1101 -3437 -4103 -1969 -1061 -4087 -5120 -2715 -1155 -3581 -4085 -1817
1302 -1817 -2321 -4247 -4125 -1284 -1630 -4062 -4471 -1604 -1390 -3896 -4143 -2108 -2812 -4618 -4290 -1663 -2940
1319 -2940 -4436 -3447 -1447 -1829 -4076 -1845 -662 -2012 -3110 -1943 35 -1482 -3143 -1126 351
1334 351 -886 -1520 -141 1299 -1025 -1725 -16 1407 -548 -1269 745 1819 373 -175 2019 2367
1350 2367 511 381 2831 2988 1395 1043 2538 3771 965 1006 3045 3394 1557 121 3982 3981 1521
1367 1521 1133 4106 4428 1776 1770 4827 5014 1336 1075 4883 5294 1682 1425 4630 4342 806 1148 4464
1385 4464 4627 744 665 3890 3938 42 1138 3891 2375 -1118 573 4216 2627 -405 554 2761
1401 2761 2551 -866 -138 2717 1216 -1809 -1379 2353 1212 -2445 -1475 953 -131 -3519 -2226 1034
1417 1034 -562 -3381 -2873 484 -856 -4241 -2755 -359 -1383 -4480 -3261 -160 -1824 -4880 -4181
1432 -4181 -140 -2393 -5690 -3914 -1135 -2584 -6030 -3709 -161 -2012 -5352 -3670 -377 -2340 -4949
1447 -4949 -3162 -10 -2081 -5038 -2131 105 -2029 -5156 -2414 64 -1961 -4042 -1980 591 -1500
1462 -1500 -3225 -1255 1345 -1080 -3138 -971 1490 119 -2070 -76 2146 179 -1345 117 2231
1477 2231 1085 -217 1221 3233 1071 297 1071 3782 2355 -128 2044 3399 2949 653 2359 4166
1493 4166 2739 1138 3160 4637 2989 1166 3148 4440 2657 1552 3442 3794 2494 1407 3721
1508 3721 3720 1858 1378 3158 4109 2214 1684 3366 3495 1666 1750 2440 3376 1386 934 2701 2800 1289
1526 1289 655 1518 1183 656 -344 1280 547 43 -677 624 23 -353 -687 -96 -449 -1037 -335 139 -556
1545 -556 -1820 -1004 -1393 -1425 -2304 -1581 -1317 -1596 -3316 -2479 -1249 -1748 -3291 -2834 -2030 -2264 -3368 -2734 -1696
1564 -1696 -2497 -3070 -2805 -1678 -2766 -3204 -1822 -2566 -2866 -3617 -2256 -1518 -3347 -3852 -2067 -2109 -4007 -2824
1582 -2824 -932 -1774 -3061 -2790 63 -865 -2388 -2346 -466 -532 -1929 -1327 444 625 -1873 -737 622
1599 622 6 -1621 -1003 1305 776 -946 -215 1817 926 -492 86 2118 2044 102 309 2016 2248 963
1617 963 1025 3283 3163 717 1126 3917 2713 912 1373 3578 3906 1229 2488 4497 3305 1271 1500
1634 1500 4172 2832 1167 1799 4719 2922 870 2359 4053 3226 354 766 4121 2623 659 2372
1650 2372 3033 1812 -156 1286 2597 1522 -508 627 2120 1136 -630 157 1410 1038 -1654 35
1666 35 1341 -61 -1233 -600 438 -454 -2358 -824 1445 -620 -2667 -1703 347 -1268 -2787 -1970
1682 -1970 -364 -1391 -3226 -2223 -801 -1692 -3519 -1938 -829 -1801 -3489 -3106 -1009 -1990 -3369 -1929
1698 -1929 -947 -2348 -4249 -2637 -927 -2276 -3578 -2620 -956 -2336 -3053 -1893 -230 -2761 -3095 -1928
1714 -1928 -547 -2189 -2704 -1679 -672 -1502 -1924 -981 -107 -685 -1824 -260 463 -452 -1164 -273 581 -472
1732 -472 -531 159 1393 368 155 525 1024 1140 53 1463 1923 566 677 1879 2054 1980 647 1564
1750 1564 1792 1928 1928 2151 2132 1599 1449 2481 2649 2225 1943 2678 2640 1885 2087 2612 2112 1585 1543 2712 2278
1771 2278 1802 2247 3151 1824 878 2513 2551 1985 1447 2313 1922 1791 1312 1440 1711 621 611 1433 1345 916
1791 916 429 987 779 -28 -314 504 363 -845 -235 1126 456 -892 -656 -69 -365 -822 -1152 -896 -683
1810 -683 -1975 -2048 -573 -1628 -2398 -1980 -1393 -1993 -3063 -2590 -1850 -1293 -2892 -2848 -660 -1389 -2626 -3351
1828 -3351 -1741 -1674 -2940 -2973 -1561 -2129 -3806 -2473 -886 -2038 -2944 -2854 -945 -1929 -2875 -1676 -315
1845 -315 -853 -2974 -2321 -885 -810 -1519 -1519 98 -487 -1552 -398 1270 87 -1070 -774 691 530 -1086
1863 -1086 -361 1604 112 -500 -117 1899 1523 325 97 1515 566 -72 931 2887 1233 324 900
1880 900 3219 1544 553 1658 3350 1537 563 1900 3033 1600 875 2087 3540 2175 1367 2050
1896 2050 3359 1892 587 1953 3326 2347 186 2166 3183 2090 664 2121 2800 1586 275
1911 275 1032 2171 1420 -206 1404 1988 1210 123 843 1931 605 -153 1139 1143 488 -63 -460 1012
1929 1012 -541 -629 17 315 -519 -1114 -410 -328 -806 -1619 -770 -448 -904 -1662 -1604 -497 -1257 -2341 -929
1948 -929 -1036 -2059 -2356 -1361 -1330 -2034 -2521 -2300 -1393 -2423 -2505 -1840 -706 -1384 -2618 -1461 -2266 -2260 -2435 -2179
1968 -2179 -1601 -2177 -2144 -1154 -1102 -1640 -1780 -1475 -1239 -1679 -1437 -506 -871 -1126 -1804 -780 -921 -1038 -797 -239
1988 -239 -744 -1090 61 225 -237 -385 -330 368 4 399 526 1041 472 208 624 1353 1130 971 986 1476
2008 1476 634 1260 2437 2087 1232 1395 1685 2815 1035 1004 2094 2400 1208 2272 2442 2356 1370 1607
2026 1607 1641 2376 1059 1387 1781 2424 910 1409 2436 1793 1156 1125 2056 1196 809 1965 2033 1359 735
2045 735 468 1662 683 39 348 1703 805 -696 4 1286 241 -753 -527 761 222 -1435 222
2062 222 756 -287 -1561 -805 1033 -472 -1651 -662 37 -646 -1869 -1058 -326 -1146 -2464 -1406 -648
2079 -648 -1303 -2576 -1719 -763 -1279 -2629 -1964 -1632 -1293 -2577 -1426 -1184 -2046 -3669 -2784 -649 -1887 -3066
2097 -3066 -1633 -867 -1335 -2522 -1859 -672 -1638 -2723 -1754 -853 -1384 -1857 -509 327 -1580 -2080 -1346 -14
2115 -14 -1077 -1471 -408 126 -297 -1042 -281 696 192 -1418 409 1496 452 -508 175 1005 810 -104
2133 -104 766 1246 648 481 578 2446 1390 223 1322 1864 1321 1222 2080 2545 1198 615 2092 2452 1275
2152 1275 1733 1441 2117 1727 1129 1992 2865 1897 687 1694 2366 2196 1182 1682 2011 1103 681 1340 1740
2171 1740 1614 1199 884 2054 458 724 748 916 66 63 833 1145 409 -178 310 -242 -49 -256 -819 543
2191 543 250 -596 -244 -377 -234 -568 -705 -1100 -647 -954 -1229 -754 -1233 -958 -1163 -1050 -1059 -1821 -1445 -754 -1815
2212 -1815 -2425 -1545 -1785 -2745 -1158 -2025 -1413 -1773 -1864 -2221 -1279 -1461 -1133 -1777 -1635 -2135 -1838 -910 -1179 -1766
2232 -1766 -1127 -1716 -2073 -1085 -1060 -788 -1322 -824 -1162 -1277 -1170 -1046 -142 -556 -887 -277 -185 -315 -369 -146 318
2253 318 561 -631 571 915 435 497 197 634 913 609 1225 920 850 596 1126 1770 1129 245 943 1211
2273 1211 1092 807 1064 1997 1449 1468 1393 2027 1298 834 1332 2913 1752 780 1363 2152 1865 735 1698
2292 1698 2463 1914 1131 840 1925 1684 1042 1247 1755 1205 25 1695 2216 1095 914 872 805 625 244
2311 244 551 1455 591 -385 227 813 598 -179 -753 495 45 -378 172 815 -543 -1794 -526 508
2329 508 -1095 -908 -1170 -56 -1363 -1446 -724 -426 -1881 -2210 -1062 -263 -1498 -2568 -1658 -603 -1562 -2180
2347 -2180 -1132 -939 -1600 -1851 -1929 -783 -1171 -2137 -2128 -1177 -1315 -1550 -1499 -926 -1696 -2230 -1548 -310 -1211 -1451
2367 -1451 -925 -1138 -1144 -1249 -466 -3 -612 -1608 -556 473 -105 -361 281 102 -862 -318 -150 1006 231
2386 231 -446 374 989 931 -736 321 834 -195 349 1078 1861 579 317 866 1420 514 988 1148 1324
2405 1324 744 737 1895 1227 1565 1011 1863 1824 1329 1238 1560 2044 643 1171 1608 1647 1062 970 2013 1315 1035
2426 1035 1000 1050 1745 1825 1074 1070 2358 639 1550 1193 734 542 304 229 989 306 238 415 371 264 462 -205
2448 -205 93 -264 76 41 -258 483 -301 -500 -427 -510 -276 -673 -869 -607 -656 -1004 -750 -951 -570 -1172 -1412
2469 -1412 -1541 -768 -1191 -1225 -701 -1623 -1235 -1490 -1053 -1511 -1626 -1499 -1930 -831 -1529 -1901 -1251 -1464 -1334 -1066
2489 -1066 -1077 -1256 -1274 -1387 -1363 -1541 -1807 -1627 -1486 -433 -756 -1147 -655 -566 -881 -866 -665 -194 -702 -764 -620
2510 -620 -125 160 -457 -78 814 459 -265 826 522 228 -418 -99 945 691 600 818 1048 1031 68 1258
2530 1258 1617 1446 657 1018 1643 1086 747 1036 1515 1241 694 858 2335 1557 900 1104 1818 980 1184
2549 1184 1525 2034 1073 638 1639 1424 1137 1128 1201 1624 814 245 903 1742 764 181 635 1284 630 815
2569 815 502 1458 246 39 687 720 -296 -87 199 208 258 -815 -80 962 -538 -888 502 -374 -1404
2588 -1404 -636 -280 -203 276 -717 -1209 -71 -203 -1525 -433 71 -1497 -2378 -763 -1070 -1377 -1718 -742
2606 -742 -871 -996 -1710 -771 -567 -1356 -1936 -1217 -1039 -1609 -1361 -1099 -573 -949 -1543 -822 -911 -1109 -1035 -469 -1167
2627 -1167 -536 -2039 -161 -961 -914 -928 -1460 -81 39 -362 160 -807 -486 257 -47 -52 -265 -539 -204 388
2647 388 160 45 -524 269 317 119 900 926 237 595 566 1764 1346 703 1275 624 1176 800 1252 1333 412
2668 412 1829 968 1163 823 1578 1097 1269 1101 1800 1453 1492 1565 1599 908 1169 1219 713 1671 1206 1029 1200
2689 1200 1597 889 777 1113 1178 479 1030 1688 821 714 405 473 705 219 646 729 543 246 635 9 52
2710 52 -1100 282 -140 -69 262 465 -107 -352 -48 -458 -320 -1191 -1075 -815 10 -946 -808 -1005 -771 -1012
2730 -1012 -1367 -224 -864 -1480 -1672 -676 -982 -783 -1393 -580 -603 -906 -1317 -992 -1048 -1027 -981 -1463 -1007 -1499 -1448
2751 -1448 -1488 -389 -649 -1887 -701 -1136 -545 -1367 -403 -1240 -1420 -1204 -392 -166 -1180 -509 -571 322 62
2770 62 -645 -241 271 -507 -660 -35 881 145 170 173 507 35 411 299 287 997 -328 805 746 671 236 659
2792 659 834 1055 882 1450 1494 638 1188 933 1817 1590 456 1250 1455 837 578 1779 1499 1105 1252 1191
2812 1191 1088 1402 1056 1391 1170 591 360 982 841 955 476 1425 1373 615 720 732 663 443 -6 360 1025
2833 1025 226 211 -19 -15 69 -120 -143 550 -487 -167 -263 73 -466 -569 -373 -282 -361 -794 -221 268 -939 -669
2855 -669 -1124 -961 -1578 -847 -975 -64 -704 -845 -1425 -783 -1102 -1142 -1109 -1108 -226 -1498 -1039 -1002 -1301 -394 -1366
2876 -1366 -666 -869 -1215 -1308 42 -752 -1640 -891 -1065 -733 -1170 -697 -1219 -763 -1423 -648 -467 -595 -854 -596
2896 -596 -1193 -204 -427 249 328 -80 -123 464 461 -36 221 -159 -247 329 105 551 -397 255 393 350 1131 524
2918 524 691 -605 821 657 724 1012 676 1020 668 1087 275 761 948 1044 1169 1061 950 1319 925 818
2938 818 1486 987 865 1434 807 981 1017 1140 896 896 452 829 958 905 899 964 576 755 51 603 1037 525
2960 525 56 653 513 244 16 592 599 99 -550 -110 -144 176 -386 -607 -308 -678 -546 -276 -306 -695 -477
2981 -477 -518 45 -72 -233 -684 -787 -676 -1314 -237 -699 -1280 -1189 -993 -514 -1068 -1230 -240 -699 -1284 -921
3001 -921 -746 -1689 -1209 -1664 -991 -533 -1223 -1778 -75 -718 -1577 -1150 -1218 -318 -685 -1383 -768 -399 -286 -610
3021 -610 -301 34 -728 -1178 -298 6 -777 -509 -169 -20 -459 -277 2 564 360 -683 -101 412 401 338
3041 338 1019 336 220 918 153 877 935 511 386 821 629 791 1465 769 992 456 849 843 617 407 699
3062 699 598 1073 956 1439 1090 877 588 841 742 830 639 467 1197 1384 918 238 1017 825 699 803 1294
3083 1294 318 862 447 630 806 525 1034 -88 663 -71 118 524 83 28 58 -320 42 -96 -113 140
3103 140 -611 140 439 -402 438 172 -9 -495 -187 -641 -476 328 151 -1122 -527 -415 -319 -523 -618 46
3123 46 -578 -472 -538 -1672 -944 -1198 -1004 -885 -1208 -655 -1010 -743 -839 -743 -723 -962 -924 -140 -51 -1040 -954 -604
3145 -604 -783 -1034 -779 -912 -131 -749 -944 -772 111 -1034 -25 -466 35 -138 -187 -296 455 -166 -582 95
3165 95 -201 -690 305 -238 425 -150 644 710 316 769 533 449 -205 622 224 770 753 388 874 785 761 613
3187 613 1279 647 16 996 1280 567 -130 263 442 926 1239 303 619 971 827 241 885 1362 467 1230
3207 1230 201 1035 746 555 1156 1192 735 -69 519 1294 652 202 -54 895 302 199 782 1371 -94
3226 -94 -242 351 451 630 -156 148 167 -13 389 -147 189 -264 20 -978 109 -478 -576 -610 -384 -1065 -586
3247 -586 -386 -99 -419 -816 -976 -750 -552 -646 -650 -721 -1210 -1096 -873 -576 -1009 -951 -1123 -836 -1351 -819 -413 -95
3269 -95 -1412 -1175 -564 -393 -693 -973 -508 -989 -332 -512 -173 -793 -546 -1262 -604 -892 -441 -664 -340 -99
3289 -99 -145 -457 202 -23 547 -611 236 -341 -501 19 419 318 38 363 329 422 444 517 665 660 -109 682
3311 682 496 356 -344 260 999 392 289 1019 676 1094 315 1312 506 773 493 89 1099 1280 933 -82
3331 -82 1074 1108 659 992 528 1105 994 777 748 788 445 511 412 568 771 584 585 411 -174 550 1193 -56
3353 -56 400 474 237 326 714 558 57 -262 -805 -155 56 -165 9 -637 228 -169 148 -905 -798 -212 -328
3374 -328 -432 -600 -453 -625 -191 -348 -198 383 19 -764 -862 -480 -148 -657 -1060 -769 -838 -645 -866 -633 -469
3395 -469 -666 -596 -562 -552 -1191 -1282 -1032 -547 -655 -522 28 -660 -828 -953 -854 -847 -416 -913 -489 -112 -319 -345 -128
3418 -128 -515 -301 -750 77 379 -225 13 253 -526 1133 20 -70 435 206 452 79 -65 -13 122 867
3438 867 392 777 250 995 1061 -64 166 152 843 54 659 1676 734 408 126 861 732 708 739 859 708
3459 708 1125 670 602 775 688 257 725 231 702 239 761 720 626 -145 -149 373 998 6 835 841 767 252 -549
3482 -549 308 582 -37 744 866 -59 373 468 303 -757 -269 131 657 222 -427 -88 81 -105 -315 83
3502 83 -374 -429 -923 -251 -303 -825 -145 -976 -663 -733 -559 -387 -969 -734 -564 -757 -271 -1123 -1148 -893 -1062 -1110
3524 -1110 -819 -871 -502 -795 -886 -77 -443 -598 -566 -658 -668 -309 -662 -910 -250 -549 -373 -223 -30 -644 -843
3545 -843 -175 -586 15 -533 -230 -655 -421 -166 -338 -408 363 -447 -38 52 -8 810 -80 -24 440 450 278 592
3567 592 991 314 -550 1045 727 747 -69 705 227 193 -332 803 259 518 734 639 1087 461 651 205
3587 205 652 341 346 889 1254 980 524 1756 700 736 466 657 881 339 542 18 162 162 764 338 171
3608 171 677 434 -425 494 -155 613 -303 -530 369 -42 -12 -376 330 121 -309 -24 14 -963 -411 -359 285
3629 285 137 -257 -102 -334 -413 -385 -555 4 -607 -113 -961 -1321 -1247 -633 -25 -723 -180 -500 -252 -993 -353
3650 -353 -1106 -586 -979 -876 -1143 -735 -791 -689 -411 -777 -266 -199 -303 -68 -796 -427 -1103 192 -645 -181
3670 -181 -523 -83 -280 -552 -23 -680 -452 -418 339 -161 -1047 -159 -206 97 -365 -798 -60 -125 435 106 -222
3691 -222 -254 235 192 -76 932 254 338 11 860 648 -140 -172 396 140 518 838 1334 718 501 775 1045
3712 1045 604 630 752 643 711 -132 516 536 1151 857 603 194 967 681 191 523 454 577 488 80 557
3733 557 1061 66 350 813 -45 15 561 899 5 133 230 -80 72 161 -6 -19 -178 200 507 -92 175
3754 175 51 -275 243 -376 -593 -199 275 -305 45 -422 -683 -796 -796 -49 -42 271 -875 -638 164 -319 -554
3775 -554 -602 -576 -12 -474 -417 -720 -228 -467 -941 -225 -980 -528 -772 -211 -886 -712 -473 -671 -447 -688 -708
3796 -708 -188 -404 -305 -476 -130 -381 -544 -467 -694 125 -441 86 113 54 -136 617 -421 55 238 -204 305
3817 305 331 247 488 863 -285 475 570 479 478 359 39 108 128 712 447 -252 855 699 -163 114 438 698
3839 698 523 430 40 617 291 -37 563 706 254 814 680 887 134 486 639 -160 464 493 959 763 270
3860 270 113 348 937 876 124 -67 249 355 136 130 879 -62 589 46 -184 -486 734 224 116 -300 -153
3881 -153 -140 216 60 -53 186 23 -471 -822 -330 -132 427 -243 -466 250 -152 -662 -165 -614 -320 -153
3901 -153 -590 102 -19 -255 -684 -631 -346 -555 -492 -95 -650 -573 -751 -547 -645 -795 -988 -291 -554 -246 -381
3922 -381 -500 -296 -618 -975 -371 -567 -1099 -124 -379 -186 -407 -265 -256 249 -745 502 6 -566 75 -8 237
3943 237 170 8 219 153 -115 -446 -199 382 542 198 -102 25 -389 -229 438 844 478 544 -361 475 -91
3964 -91 -27 425 468 895 27 230 449 618 769 151 885 996 496 -297 765 798 109 132 558 485 622 184
3986 184 902 -11 -342 319 -266 -73 -199 -50 -9 372 441 516 32 179 275 240 125 -6 601 563 151 250
4008 250 257 -125 -178 170 374 285 -183 139 -13 -274 -4 -312 -522 -10 408 -225 176 -526 -432 -137 234 -140
4030 -140 -543 -652 -21 -372 -463 -376 -1029 -326 -1083 -587 -663 -1030 -314 -293 -74 -158 -879 -691 -321 -447 -210 -239
4052 -239 0 -449 -761 305 -334 -467 -596 -194 -502 -423 56 377 -477 -427 249 356 196 20 11 -302 -19
4073 -19 71 647 -271 -405 -316 -29 323 238 -173 479 123 495 -330 103 -41 427 171 246 122 331 271 446
4095 446 202 1004 801 -157 392 92 317 750 343 217 170 -104 915 540 330 496 449 892 501 108
4115 108 219 65 257 -186 815 635 146 234 664 558 1091 235 94 718 -21 144 660 565 394 587
4135 587 170 -63 269 445 -89 -602 348 -124 -82 -4 -540 -340 627 -255 436 -479 99 -177 -679 458
4155 458 -300 -3 -525 -63 -307 -258 -394 64 -5 -28 -335 -778 -14 -719 -681 -309 -130 -665 -196 -755 -85
4176 -85 150 -363 -336 -1365 -368 -469 -112 -529 27 -631 -356 -716 -342 -49 -106 -450 -892 170 -239 -17
4196 -17 -50 17 -35 -438 -112 172 143 -871 -352 320 -422 -59 275 401 252 110 165 514 -11 9 560 602
4218 602 174 479 152 268 278 552 991 -85 151 -30 542 13 754 301 690 1108 431 232 288 262 735
4239 735 457 673 557 454 472 359 72 487 218 200 562 852 -55 195 340 -482 -611 826 470 -265
4259 -265 84 -130 283 224 -67 218 442 -213 356 168 -121 613 -774 116 112 182 -462 -12 -411 253 144
4280 144 -117 -297 223 273 -303 254 -56 92 -172 -383 -633 -196 -268 143 -726 -256 -561 -1278 -324 -770 94
4301 94 258 -689 -433 -857 -325 -415 -585 -510 -397 -776 -399 -640 -860 199 51 -464 -632 216 -695 -268 -331
4322 -331 -636 -493 -503 -106 405 -115 -84 -71 -109 170 436 -96 -231 -243 14 318 306 -203 193 -263 -677 518
4344 518 -505 638 396 -44 -305 467 577 280 417 64 238 130 673 798 586 701 549 733 -106
4363 -106 663 466 1038 334 607 233 657 720 243 660 610 926 515 366 488 177 92 225 309 616 859
4384 859 499 334 393 418 141 26 272 -171 -212 0 -61 375 274 -798 826 -88 -415 -126 -262 -8 -163
4405 -163 -87 -145 252 -136 361 46 289 -118 3 -187 -492 108 -561 -251 -150 -179 -1496 -754 50 -533 -761
4426 -761 -290 -578 194 84 -1130 -515 -234 -113 -694 -673 -125 -351 4 -345 -1 -457 -394 -50 -659 -414
4446 -414 -728 -640 -257 -464 -465 -64 20 -592 106 434 -415 18 -195 13 160 -119 -548 156 163 -559 -40 -135
4468 -135 363 -383 -230 162 341 -391 248 253 35 327 -537 348 109 366 598 121 168 311 299 543 324
4489 324 371 465 671 326 741 -9 824 -22 -197 402 541 -247 843 -158 85 903 249 1088 287 806
4509 806 -382 -141 879 -26 443 911 -197 750 -152 -163 -118 992 7 -26 -18 254 123 302 434 470 -355
4530 -355 -277 409 266 -178 -408 -268 354 302 -380 155 -702 -167 -774 -194 215 -123 -198 -1196 67 -682 -627
4551 -627 -174 -94 -716 -142 180 155 -250 -51 -668 -551 -81 177 -192 -717 -184 -370 -538 -357 -472 -132 -285
4572 -285 -575 -655 -325 132 -511 33 -445 -288 -149 -492 -52 -29 -93 -623 618 -522 -703 -708 -412 526 18
4593 18 94 359 -108 -129 -97 -579 199 364 7 -296 543 -281 132 2 122 447 206 -572 510 -91 -36
4614 -36 469 271 175 -172 793 279 1160 -166 -66 131 1043 528 852 411 342 657 999 689 274 635 362
4635 362 836 -224 203 -68 734 252 -76 20 238 -57 748 -83 157 175 847 -201 912 858 -18 198
4655 198 -98 -46 -451 22 -92 -369 61 743 -88 356 44 -280 -618 -82 333 60 -675 279 -78 -589
4675 -589 -171 -306 -255 -126 -755 -646 -650 -604 300 -921 -297 58 -457 -733 -567 -210 -341 -496 214 -610 -713
4696 -713 -7 -805 -391 -614 -1069 -329 -17 170 -227 -455 126 223 -176 -260 -632 -459 -236 -255 -470 67 177
4717 177 231 120 -5 119 320 185 -279 -253 42 -347 -191 -1013 298 413 -167 143 377 -6 106 119 -335
4738 -335 215 104 361 311 -259 62 313 87 226 382 268 528 727 489 106 276 -39 355 462 -140
4758 -140 -206 15 364 585 -22 146 87 339 1108 -41 118 925 42 520 752 293 516 667 -124 527
4778 527 232 162 226 -235 -665 44 170 -260 80 412 -417 29 253 -34 341 84 625 124 -169 81 -174
4799 -174 198 -650 -9 -31 653 -304 312 -353 -36 31 -265 -168 -614 195 -188 -443 -739 -182 -8 -486 -582
4820 -582 -536 -525 -250 -524 -353 -352 -313 -117 369 -559 384 12 179 118 127 -889 -381 -122 -196 343 -221 -387 33
4843 33 -106 -391 -180 -136 -143 -95 -228 27 -369 -461 -50 448 -147 -293 355 -450 -25 456 -319 -349 495 428 74
4866 74 -124 336 121 -579 575 65 822 288 474 300 607 196 623 370 624 138 266 581 -222 -555
4886 -555 576 -138 320 443 848 113 356 270 70 67 459 198 -246 779 79 -9 125 437 -411 106 270
4907 270 382 -232 594 -48 -113 162 361 9 106 794 192 -727 -322 188 97 -157 191 -108 -525 -425 -743
4928 -743 -246 -271 93 -4 99 -268 235 -351 -155 222 -147 -135 -154 45 -31 15 -123 -440 -82 -628 -472 -512
4950 -512 -125 -344 -930 -513 -509 -781 -399 -151 -282 183 -169 -676 -212 -160 -151 348 -423 -351 -518 -313 49 -432
4972 -432 -57 -359 249 -279 -119 346 -303 -832 -388 -380 -63 -67 387 154 36 -479 -262 647 -220 115 -456
4993 -456 -282 20 -300 -247 24 569 -617 654 -58 124 744 409 642 -223 353 181 90 141 324 271 -110
5014 -110 -187 530 820 60 980 495 -151 176 -199 751 193 370 212 164 575 141 323 -54 243 266 231
5035 231 -479 157 -523 374 466 894 -159 66 281 58 167 88 226 -306 62 -207 276 153 -111 704
5055 704 164 389 -55 -18 -324 -170 95 -661 -251 -230 -538 294 -248 -215 -311 -504 215 -388 -184 -449 335
5076 335 -472 -337 -901 88 -192 -196 -90 -8 -94 51 -165 -268 -419 -340 -55 312 -346 223 409 -255 288 -145
5098 -145 -774 -5 173 -631 75 -680 -28 -235 -247 -603 381 -342 102 -566 244 -746 220 -6 197 -189
5118 -189 68 316 502 -121 387 -295 -168 370 53 368 234 188 471 534 263 790 534 210 225 340 -277
5139 -277 178 -272 460 393 13 -345 822 -530 -536 409 564 401 633 628 657 567 36 -29 400 516 744 1115
5161 1115 25 282 627 163 40 351 108 779 972 338 -166 816 185 -321 -339 514 -63 324 399 581
5181 581 -60 -351 268 -354 -683 -36 547 -268 64 -413 417 -37 -188 -321 268 85 -199 -442 599 -478
5201 -478 106 182 -15 307 -146 -82 200 59 -816 4 -504 180 -710 -440 -431 -744 -97 -791 -645 -268 -490
5222 -490 138 -126 -509 607 -906 44 -890 -752 -405 -582 -150 86 128 -14 -303 -300 112 5 -534 -481 -380
5243 -380 -168 -306 54 -79 134 189 0 329 -193 -488 460 581 -161 108 -267 18 -444 805 568 85
5263 85 662 -133 729 265 61 -711 -18 423 309 632 463 302 -233 32 918 -288 614 -485 604
5282 604 553 318 385 129 -142 1123 26 658 939 -9 672 -45 561 270 -67 808 257 508 -50 168
5302 168 8 -88 -131 47 -182 85 66 63 643 -86 -101 110 11 -365 748 -142 -263 197 7 -557 45 -372
5324 -372 -76 138 -16 -168 -561 -435 322 -148 382 -82 -147 -112 -72 -683 -313 122 -717 238 -24 -455 -333
5345 -333 -159 -647 -177 543 -276 133 -218 -95 -1130 -475 212 -195 198 -165 -148 -93 -29 -109 -380 -509 -214
5366 -214 -7 45 -374 -470 100 -376 -208 -229 -132 -272 -402 -499 235 174 -292 274 -183 -436 89 491 -5 631
5388 631 107 277 -526 341 440 383 256 31 -15 103 543 -103 185 358 296 66 -315 1028 -156 94 -116
5409 -116 465 -438 28 796 205 -84 572 553 475 346 118 -403 204 360 479 99 -48 466 363 1063 -89
5430 -89 -357 265 418 60 -528 -513 -616 284 81 229 -10 -5 648 -367 464 -110 107 155 -56 141 544
5451 544 189 -9 -255 20 -641 -424 -50 -428 204 -381 -682 -667 -778 -316 -291 -781 429 257 -347 -672
5471 -672 -874 -744 -246 22 -152 -61 -304 -206 -401 284 -666 -398 -242 229 -389 -390 -473 -360 176 -403 161 -552
5493 -552 -360 -59 -441 -393 228 -108 337 -163 -10 -336 -123 46 149 -559 15 113 767 -147 179 -138 1
5514 1 388 216 960 260 128 -197 95 561 -62 -239 291 694 473 264 501 722 388 596 295 503 37
5535 37 -272 45 -366 476 -374 350 52 -36 131 666 424 275 977 3 112 194 414 180 -7 1051 289
5556 289 -8 -464 499 -706 357 586 628 -161 -32 -376 -682 113 339 -374 -714 363 -73 -281 94
5575 94 265 124 -206 209 68 197 -252 267 -468 -96 660 -376 377 -493 331 98 -974 -683 434
5594 434 -337 212 -10 -23 116 88 28 -85 -95 -44 -547 -638 -21 -10 -174 523 -480 -23 2 -132 -308 -368 54
5617 54 265 -576 580 185 45 -344 452 -646 -297 -175 -206 -708 88 -47 153 -194 -264 -199 -92 -356 136
5638 136 -392 -120 62 92 80 85 -190 574 109 311 128 367 -88 8 481 -31 -118 57 470 115 748 541
5660 541 136 500 131 -326 153 248 380 56 528 110 -115 856 103 -217 213 236 462 -267 -254 -297 462
5681 462 -336 119 -186 802 419 1 -343 -230 499 -184 171 993 -250 266 -533 -263 402 420 -433 99
5701 99 -19 18 402 -58 453 -385 463 519 135 -182 -241 -141 -382 163 403 52 37 -137 293 -413 236 168
5723 168 -400 -526 -618 -363 44 -608 -756 -289 -398 -394 -563 -460 -78 -502 -689 -447 230 -292 -127 -23 -158
5744 -158 -89 272 -481 -124 -209 -535 110 -28 -759 876 261 -528 474 -2 108 -71 -78 156 -4 -274 122
5765 122 62 -452 199 -245 24 645 -143 298 -535 256 232 -585 625 478 474 377 -317 -311 534 250 44 -10
5787 -10 1002 -163 -117 751 909 -108 555 -207 934 304 241 152 126 -402 -651 -290 523 -35 447 792
5807 792 30 420 657 816 56 197 -312 845 -460 -749 -180 66 -798 32 634 -428 314 281 -109
5826 -109 -104 222 -201 -191 376 -38 539 268 17 202 360 152 413 120 -268 -761 135 -293 -335 -467 -530 -61
5848 -61 156 -64 -132 -75 -218 -57 -133 -188 88 -675 -118 -591 16 -279 -543 434 -136 -500 1013 12 -344
5869 -344 120 -371 73 60 -240 -518 -395 256 -360 -651 8 -38 -483 -542 -261 -94 479 330 317 249 -204 -120
5891 -120 -638 -170 -143 -529 -288 -351 69 172 376 78 253 209 278 -234 343 -776 -984 -162 1026 155 -259
5912 -259 -167 378 -151 515 -132 -125 18 322 -114 -72 425 -18 299 276 238 192 713 3 -40 -3 626 255 -441
5935 -441 -441 625 169 306 -192 39 217 -45 -129 18 978 272 137 -99 -165 -61 -127 142 -202 -624 55
5956 55 582 71 566 134 -704 -180 -351 -3 204 -144 -659 -163 402 316 123 -185 -152 -119 -167 124 45 2
5978 2 -29 -290 -710 338 210 -170 -722 -257 84 145 -402 -32 704 -424 59 425 156 -462 -553 -842 119
5999 119 -471 96 -611 -339 -323 670 301 -446 32 -37 576 -468 -430 -74 -391 545 -573 -386 -401 -145 -246
6020 -246 -115 -298 -327 -258 159 -42 -292 -100 -665 129 -147 -127 -480 547 -221 -82 165 480 42 405 659
6041 659 -230 -135 339 565 -348 54 85 79 -73 156 44 41 105 -349 -126 -209 612 340 64 96 135 260 122
6064 122 789 493 299 -197 425 734 -280 447 442 14 800 617 244 -458 -66 -776 -107 449 291 -201
6084 -201 -499 801 487 -830 -260 61 52 -28 -980 287 -163 747 3 -24 -627 146 96 181 -167 149 -57
6105 -57 -152 162 -116 87 192 -788 -260 -347 117 210 -571 75 -529 50 -112 -29 484 278 -256 -752 38 58
6127 58 -174 490 21 166 -182 -189 235 -433 106 -63 -93 -211 95 20 27 -670 208 -414 -289 164 -59 285
6149 285 -359 -204 -102 70 -319 -335 -185 293 96 -360 88 183 254 -251 46 461 259 436 440 38 -21 827
6171 827 126 -76 33 689 -751 550 189 59 167 191 -276 422 191 -460 -63 120 389 19 529 633
6191 633 -196 612 364 -316 430 -95 -45 -394 -104 159 74 400 -440 391 750 -70 -50 -93 463 946 347
6212 347 149 -349 169 -666 395 -547 844 66 398 -132 -349 -98 168 141 -71 -5 -569 -290 -967 -121
6232 -121 182 70 142 -15 135 -242 -411 -64 -274 -72 145 535 79 -151 -450 68 -330 -150 -735 310
6252 310 314 -301 -777 27 -87 249 -199 -297 62 -318 -429 -351 -10 -69 -124 50 -77 -385 440 166 -48 -572
6274 -572 0 119 -794 -82 -455 -221 -769 -241 288 800 -514 -200 271 -337 161 -341 91 -244 -378 -600
6294 -600 554 68 -51 163 669 194 -609 6 -182 -442 86 46 -847 -31 418 153 -114 261 -129 227
6314 227 -111 211 377 251 74 178 138 -23 233 277 110 362 508 -94 -173 560 -28 64 209 642 102
6335 102 162 -189 523 359 721 -255 274 159 203 298 -26 -244 8 -248 200 -556 -618 -848 146 -627 374
6356 374 80 245 170 -190 -353 386 -373 -539 -167 346 79 -167 423 -235 -122 -45 -31 -920 -407 256 -211
6377 -211 -273 -244 -147 292 -119 318 -153 -188 -157 -708 -333 -319 -462 -417 -325 -202 -302 -365 29 -402 -234 -435 -266
6400 -266 211 -461 -154 -404 -727 -109 -570 -76 2 -45 66 384 280 98 179 -93 665 129 -774 152 274
6421 274 170 233 -355 -896 -275 810 61 -421 -448 -296 321 74 445 180 75 206 596 101 -180 -524
6441 -524 -113 839 217 -94 129 528 102 302 361 60 210 596 -236 446 -19 320 -44 -2 807 315 195
6462 195 -204 602 230 -148 599 -562 70 204 479 488 -134 140 827 234 217 -272 -384 310 47 344 111
6483 111 -113 -110 -348 -66 -370 -191 215 -386 -151 -115 646 -198 -12 -562 -50 804 600 -544 671 145
6503 145 136 -320 -320 -702 -411 62 36 85 -49 316 50 -332 16 -339 -925 2 24 -250 225 581 -368 -450 -560
6526 -560 -61 78 -511 223 185 -11 179 -230 251 386 -685 -267 -367 -272 -236 -48 368 -422 -154 227 486
6547 486 152 -102 189 -243 -185 177 -72 431 -379 -157 394 -239 470 300 -19 455 206 -296 750 -53
6567 -53 187 -442 111 618 -376 429 231 640 161 -289 -102 1 -47 -181 -45 138 134 -377 445 497 3 94
6589 94 -483 609 560 118 -140 578 -172 -160 328 64 26 -155 193 33 349 -448 391 692 483 13 -199
6610 -199 -195 55 -491 -700 179 -368 529 733 426 165 584 -585 138 -591 -5 724 37 53 -405 -213 -153
6631 -153 -170 22 -479 -571 352 -128 826 531 80 3 -521 -279 -384 -417 -10 -13 180 -555 -606 108 69 -201 -6
6654 -6 -353 625 -174 -434 199 -769 -498 81 -750 71 -356 -546 -11 41 -39 109 -270 707 -67 303 120
6675 120 -346 24 29 186 -568 -435 -287 8 -221 -88 287 -120 -87 192 116 350 263 329 -87 -142 297 420
6697 420 128 -44 -138 381 580 -449 95 66 463 -317 -78 1011 -396 -188 39 -84 27 61 12 -80 -895
6718 -895 -45 993 -33 987 390 -239 109 360 -236 94 503 181 599 -645 -121 -254 -401 225 69
6737 69 431 175 604 515 -422 -185 167 -386 -359 18 45 -49 42 249 -175 109 -147 269 -262 4 -253 109
6759 109 139 -339 384 -241 -176 552 42 228 -516 28 272 -181 547 6 -11 -549 -175 -376 66 -104 -240
6780 -240 -483 -379 -586 -22 640 -165 -639 446 -168 -214 -404 -340 -541 -527 -112 53 -10 161 279 322 -110
6801 -110 -274 261 -154 352 -81 20 505 -385 177 610 136 269 -102 87 231 98 -246 -284 54 363
6821 363 482 -278 120 311 260 450 256 299 360 91 744 -161 247 190 -392 -175 465 131 -69 323 -32
6842 -32 -238 574 472 -228 316 77 420 135 381 -532 -196 71 153 -157 -139 58 230 386 528 -233 413
6863 413 -162 197 78 -207 -371 -124 111 -35 239 408 -204 -321 461 295 348 232 -124 -765 -393 599
6883 599 323 -134 -383 63 -56 -547 -130 170 18 -103 477 7 -35 -78 321 -140 -350 435 -612 -420
6903 -420 -82 84 -363 109 216 -368 -871 -309 198 557 -760 -414 77 -602 566 101 -526 235 -623
6922 -623 -558 -172 -719 -136 -132 -422 321 -336 113 -1017 -181 -375 -500 517 561 795 171 320 -338 -78 -166
6943 -166 -603 358 -62 -345 509 -124 -257 336 492 665 38 -418 82 -351 -444 -679 145 -375 -149 110
6963 110 -116 -91 67 -190 -68 373 -433 83 203 -237 173 -134 46 72 592 -100 14 -500 -139 484 -279
6984 -279 150 63 142 437 -28 34 48 663 275 -76 -568 55 308 134 -49 735 -36 -31 352 171 -421 57
7006 57 812 -432 -240 44 -695 -1030 440 -608 -192 -420 -47 232 49 97 9 136 147 467 -135 449
7026 449 -26 380 -217 -14 -405 -170 443 238 13 351 -187 122 155 80 168 -384 -257 -294 -165 829 -369
7047 -369 141 -654 -152 330 405 -881 -318 -29 -162 -599 -60 -551 80 -200 -811 480 -743 439 163
7066 163 -81 -258 120 25 495 264 65 -268 408 -17 -233 169 -348 84 -243 -359 45 279 -84 74
7086 74 -442 731 73 -662 580 173 594 -103 -360 -705 741 -9 297 123 925 33 36 231 -120 -233
7106 -233 288 1049 498 34 468 -231 -1051 490 301 447 428 -93 -37 310 173 -9 58 -436 153 399 135
7127 135 215 -179 574 -208 131 289 394 383 396 342 -223 239 503 -230 -201 756 523 -383 -1042 -12 179
7148 179 -120 -293 205 -199 -387 222 252 -430 -189 558 -107 256 -4 -80 284 -200 -584 -835 19 -458 -433
7169 -433 -70 460 -271 261 -250 -256 -20 -588 61 374 37 -273 -9 -17 285 -218 -514 -403 458 55 326
7190 326 -359 323 -43 118 -203 245 -12 193 -217 -169 -388 219 -506 -140 127 -337 -383 -34 -162 173 140
7211 140 -200 66 -533 -704 -115 395 78 27 153 406 -329 -202 370 -1 251 -4 598 364 -1 -62 157
7232 157 -773 291 -235 164 -62 201 -189 294 -363 100 -530 167 -549 97 773 -73 653 -194 234 157
7252 157 122 101 -862 163 435 333 -369 64 115 -27 633 -11 291 -678 335 200 -372 153 -79 -601
7272 -601 -9 -76 -575 547 -122 133 -65 -183 -349 -267 55 88 439 639 519 219 -675 -152 118 248 -517
7293 -517 -518 176 -642 -312 -80 -43 -244 10 -3 -29 -329 193 108 -309 74 97 -215 -56 -232 558 -526 -20
7315 -20 -435 -126 360 -141 91 169 -205 229 189 447 -288 435 -438 145 268 316 59 145 324 -800 131
7336 131 115 203 121 385 -38 904 857 644 455 -228 106 409 -662 180 116 -32 -191 -154 25 172 451 109
7358 109 657 -61 263 600 513 71 88 385 143 300 -23 -116 -109 521 334 311 -248 -572 311 257 166 8 -273
7381 -273 168 167 53 -66 49 -84 167 -583 -207 130 -422 -225 188 32 319 -52 426 22 -7 -568 -312
7402 -312 340 -171 220 -34 354 -12 335 -257 -253 679 -258 -252 -349 -1043 -143 82 -279 123 -457 -49 -310 28
7424 28 -86 -387 243 224 -304 72 227 -22 -180 -210 442 514 -20 198 -564 389 109 -130 -422 -443 -136 -21
7446 -21 155 -498 518 594 -401 -187 275 154 57 -343 344 -439 130 368 -634 -122 -437 -587 127 545
7466 545 -1 -610 26 299 1 365 -245 263 754 -208 625 720 -457 -91 58 256 368 191 461 34
7486 34 110 -515 44 -387 58 -338 246 308 -23 770 -366 -136 105 296 566 114 -482 -96 307 137 -326
7507 -326 -5 219 -69 458 255 75 282 -141 1 420 107 107 449 -122 239 275 -498 -590 113 -390 -9
7528 -9 869 120 -132 -140 -81 547 269 59 330 -58 214 -598 -580 -172 -278 99 -119 30 423 -318 131 150
7550 150 597 -79 111 -540 -40 209 290 -138 -622 220 -223 309 -665 58 -231 -263 325 756 -41 -135 -478
7571 -478 376 -174 69 -179 -61 301 -176 120 51 -550 -10 -114 317 819 269 -257 -214 -178 -654 268 154
7592 154 -505 -164 -317 -183 173 57 368 -626 -130 715 -264 375 -60 223 93 -88 619 186 -579 57
7612 57 -134 -905 711 103 -5 -51 -218 383 573 219 66 222 -570 459 -396 491 74 29 -23 311 53
7633 53 -90 86 70 166 -310 428 -755 -356 -640 297 -731 -196 599 107 74 672 -79 -151 -284 71 -248
7654 -248 254 27 280 92 327 462 -242 179 67 -248 -443 586 207 271 -4 -357 145 112 -673 -718 -68
7675 -68 -127 -8 10 -48 366 -456 172 51 363 286 -348 346 389 -149 -313 -306 137 -294 -308 134 -19 -152 71
7698 71 -227 292 288 -328 514 -244 47 -223 198 -295 15 -16 -155 -354 -21 -12 -565 -220 216 25 -240 -418
7720 -418 -464 -580 -222 32 -282 534 26 92 200 -113 -377 75 357 113 -301 154 -22 -619 -263 703 212
7741 212 -425 -315 -296 -62 -688 5 393 350 1069 285 133 -188 109 113 -169 -375 370 349 -156 434 222 246
7763 246 83 -26 -112 176 159 -57 391 -719 57 463 169 727 351 184 10 -761 -129 -465 89 -91
7783 -91 -46 372 336 -180 -116 64 -293 111 -31 -173 244 -56 -263 -247 -14 -229 -372 437 -838 373 -283
7804 -283 -17 -243 -320 250 -96 305 354 -190 -566 -153 -90 -226 133 -47 -223 77 -470 335 -733 129 36
7825 36 591 321 -561 -204 80 136 189 -487 -20 -10 208 285 -52 215 -517 -509 -257 -18 -480 574 586 -9
7847 -9 220 -285 99 107 192 214 108 -315 -388 -651 176 46 -304 92 -95 527 337 175 -487 42 -51 769 -887
7870 -887 -170 -462 334 150 -306 148 -53 -92 -253 464 -231 354 161 75 -274 338 128 170 136 414 -470
7891 -470 -196 285 236 -10 196 -5 377 -91 149 -14 67 77 366 122 242 -7 322 -98 871 1093 619
7912 619 -110 510 139 72 223 -16 764 -112 7 1171 254 125 30 -4 -21 -198 436 -346 231 -655 66
7933 66 171 -18 -591 674 -24 -248 -315 411 41 -286 169 31 -273 -389 162 408 9 -325 34 559
7953 559 -290 160 -355 154 -207 118 358 -154 -346 191 -419 806 159 53 105 -485 146 -55 64 343
7973 343 471 -195 9 -33 -241 254 -277 108 -101 -419 -370 -98 -313 -181 -81 209 223 -319 -215 -55 -371
7994 -371 155 -308 200 96 -578 388 -272 305 123 57 -190 3 -87 -596 6 -116 351 -269 133 -173 442
8015 442 425 -38 239 268 298 -199 1 7 187 379 3 175 350 -627 304 183 604 598 53 561 -263 -83
8037 -83 -122 -89 195 -512 245 152 -217 -480 269 -310 268 56 -319 378 -42 136 -27 -61 -224 173 -611 -559
8059 -559 -131 -207 146 560 757 -417 -118 -510 -283 -525 -425 -204 321 -275 -191 746 -695 395 -279 -454
8079 -454 -326 -195 -373 -395 -76 -454 -766 -177 468 -92 -723 -268 -199 570 95 212 2 -151 -157 -21 -60 -68
8101 -68 231 159 -361 362 72 248 305 -96 -242 -234 866 355 278 -245 104 -161 282 173 -331 11 -8 149
8123 149 -11 404 -85 399 -105 197 -27 -294 -13 106 435 250 -198 117 -249 -401 219 579 630 -24
8143 -24 -62 -612 -111 53 -36 -203 -2 -101 48 84 174 -128 -862 26 41 333 430 99 110 57 -4 -127 -565 140
8167 140 -392 -148 -241 -228 -625 218 -448 -435 311 -114 411 -203 -50 247 -185 -109 264 -475 511 230 311 186
8189 186 -712 -297
8191b97
##END NTUPLES=NMR FID
##END=
