##TITLE=1H_UK-8''-15ppm
 CDCl3, 32 sc, 
 6.8.2020
##JCAMPDX= 6.0         $$ Bruker NMR JCAMP-DX V2.0
##DATA TYPE= NMR FID
##DATA CLASS= NTUPLES
##ORIGIN= UXNMR, Bruker Analytische Messtechnik GmbH
##OWNER= root
$$ XWIN-NMR		Version 3.5
$$ Thu Aug  6 09:50:55 2020 Russian Standard Time (UT+4h)  she@DPX200
##.OBSERVE FREQUENCY= 200.1314999998
##.OBSERVE NUCLEUS= ^1H
##.DELAY= (6, 6)
##.ACQUISITION MODE= SIMULTANEOUS
##.ACQUISITION SCHEME= undefined
##.AVERAGES= 32
##.DIGITISER RES= 18
##SPECTROMETER/DATA SYSTEM= spect
##.PULSE SEQUENCE= zg30
##.SOLVENT NAME= D2O
##.SHIFT REFERENCE= (INTERNAL, D2O, 0, 15.7039)
##AUDIT TRAIL= $$ (NUMBER, WHEN, WHO, WHERE, WHAT)
$$ ##TITLE= Audit trail, XWIN-NMR		Version 3.5
$$ ##JCAMPDX= 5.01
$$ ##ORIGIN= Bruker BioSpin GmbH
$$ ##OWNER= she
$$ F:/spectra/data/she/nmr/H-F/1/audita.txt
$$ ##AUDIT TRAIL=  $$ (NUMBER, WHEN, WHO, WHERE, WHAT)
(   1,<2020-08-06 09:49:48.54 +0400>,<she>,<DPX200>,
      <continue with go, POWCHK disabled, PULCHK disabled
       configuration hash MD5:
       00 E9 B6 7A A2 85 ED C7 34 08 36 98 17 FE 4E 26
       data hash MD5: 16K
       23 E5 0B B2 19 F9 9E C3 CD 93 0F 16 02 9B 59 94>)
$$ ##END=
$$ 
$$ hash MD5
$$ 41 F0 6B 04 30 DB E5 E0 5F DA D9 78 84 1A EF C4
##$RELAX= 
##$RELAX= 
##$RELAX= 
##$RELAX= 
##$RELAX= 
##$RELAX= 
$$ Bruker specific parameters
$$ --------------------------
##$DU= <F:/spectra>
##$EXPNO= 1
##$NAME= <H-F>
##$PROCNO= 1
##$TYPE= <nmr>
##$USER= <she>
##$AMP= (0..31)
100 100 100 100 100 100 100 100 100 100 100 100 100 100 100 100 100 100 
100 100 100 100 100 100 100 100 100 100 100 100 100 100 
##$AQSEQ= 0
##$AQ_mod= 1
##$AUNM= <au_zg>
##$AUTOPOS= <>
##$BF1= 200.13
##$BF2= 200.13
##$BF3= 200.13
##$BF4= 200.13
##$BF5= 200.13
##$BF6= 200.13
##$BF7= 200.13
##$BF8= 200.13
##$BYTORDA= 1
##$CFDGTYP= 0
##$CFRGTYP= 5
##$CHEMSTR= <none>
##$CNST= (0..31)
1 1 145 1 1 1 1 1 1 1 1 1 1 1 1 1 1 1 1 1 1 1 1 1 1 1 1 1 1 1 1 1 
##$CPDPRG= <>
##$CPDPRG1= <>
##$CPDPRG2= <>
##$CPDPRG3= <>
##$CPDPRG4= <mlev>
##$CPDPRG5= <mlev>
##$CPDPRG6= <mlev>
##$CPDPRG7= <mlev>
##$CPDPRG8= <mlev>
##$CPDPRGB= <>
##$CPDPRGT= <>
##$D= (0..31)
0 1.2 0 0 0 0 0 0 0 0.06 0 0.03 0 0 0 0 0.0002 0 0 0 0 0 0 0 0 0 0 0 0 
0 0 0 
##$DATE= 1596692860
##$DBL= (0..7)
120 120 120 120 120 120 120 120 
##$DBP= (0..7)
150 150 150 150 150 150 150 150 
##$DBP07= 0
##$DBPNAM0= <>
##$DBPNAM1= <>
##$DBPNAM2= <>
##$DBPNAM3= <>
##$DBPNAM4= <>
##$DBPNAM5= <>
##$DBPNAM6= <>
##$DBPNAM7= <>
##$DBPOAL= (0..7)
0.5 0.5 0.5 0.5 0.5 0.5 0.5 0.5 
##$DBPOFFS= (0..7)
0 0 0 0 0 0 0 0 
##$DE= 6
##$DECBNUC= <off>
##$DECIM= 24
##$DECNUC= <off>
##$DECSTAT= 4
##$DIGMOD= 1
##$DIGTYP= 9
##$DL= (0..7)
0 120 120 120 120 120 120 120 
##$DP= (0..7)
150 150 150 150 150 150 150 150 
##$DP07= 0
##$DPNAME0= <>
##$DPNAME1= <>
##$DPNAME2= <>
##$DPNAME3= <>
##$DPNAME4= <>
##$DPNAME5= <>
##$DPNAME6= <>
##$DPNAME7= <>
##$DPOAL= (0..7)
0.5 0.5 0.5 0.5 0.5 0.5 0.5 0.5 
##$DPOFFS= (0..7)
0 0 0 0 0 0 0 0 
##$DQDMODE= 0
##$DR= 18
##$DS= 0
##$DSLIST= <SSSSSSSSSSSSSSS>
$$ [...]
##$SUBNAM2= <"">
##$SUBNAM3= <"">
##$SUBNAM4= <"">
##$SUBNAM5= <"">
##$SUBNAM6= <"">
##$SUBNAM7= <"">
##$SUBNAM8= <"">
##$SUBNAM9= <"">
##$SW= 24.9337058888022
##$SWIBOX= (0..15)
0 0 2 0 0 0 0 0 0 0 0 0 0 0 0 0 
##$SW_h= 4990.01996007984
##$TD= 16384
##$TD0= 1
##$TE= 0
##$TE2= 300
##$TE3= 300
##$TEG= 300
##$TL= (0..7)
0 120 120 120 120 120 120 120 
##$TP= (0..7)
150 150 150 150 150 150 150 150 
##$TP07= 0
##$TPNAME0= <>
##$TPNAME1= <>
##$TPNAME2= <>
##$TPNAME3= <>
##$TPNAME4= <>
##$TPNAME5= <>
##$TPNAME6= <>
##$TPNAME7= <>
##$TPOAL= (0..7)
0.5 0.5 0.5 0.5 0.5 0.5 0.5 0.5 
##$TPOFFS= (0..7)
0 0 0 0 0 0 0 0 
##$TUNHIN= 0
##$TUNHOUT= 0
##$TUNXOUT= 0
##$USERA1= <user>
##$USERA2= <user>
##$USERA3= <user>
##$USERA4= <user>
##$USERA5= <user>
##$V9= 5
##$VALIST= <valist>
##$VCLIST= <CCCCCCCCCCCCCCC>
##$VD= 0
##$VDLIST= <DDDDDDDDDDDDDDD>
##$VPLIST= <PPPPPPPPPPPPPPP>
##$VTLIST= <TTTTTTTTTTTTTTT>
##$WBST= 1024
##$WBSW= 4
##$XGAIN= (0..3)
0 0 0 0 
##$XL= 0
##$YL= 0
##$YMAX_a= 369821
##$YMIN_a= -213029
##$ZGOPTNS= <>
##$ZL1= 120
##$ZL2= 120
##$ZL3= 120
##$ZL4= 120
##$ABSF1= 10
##$ABSF2= 0
##$ABSG= 5
##$ABSL= 3
##$ALPHA= 0
##$AQORDER= 0
##$ASSFAC= 0
##$ASSFACI= 0
##$ASSFACX= 0
##$ASSWID= 0
##$AUNMP= <proc_1d>
##$AZFE= 0.1
##$AZFW= 0.1
##$BCFW= 1
##$BC_mod= 2
##$BYTORDP= 1
##$COROFFS= 0
##$CY= 11.3945322036743
##$DATMOD= 1
##$DC= 2
##$DFILT= <>
##$DTYPP= 0
##$F1P= 16.9975609425685
##$F2P= -3.02152046262296
##$FCOR= 0.5
##$FTSIZE= 0
##$FT_mod= 4
##$GAMMA= 1
##$GB= 0.15
##$INTBC= 1
##$INTSCL= 1
##$ISEN= 128
##$LB= 0.24
##$LEV0= 0
##$LPBIN= 0
##$MAXI= 10000
##$MC2= 0
##$MEAN= 0
##$ME_mod= 0
##$MI= 1.114404
##$NCOEF= 0
##$NC_proc= 0
##$NLEV= 6
##$NOISF1= 3.799351
##$NOISF2= 2.8
##$NSP= 1
##$NTH_PI= 0
##$NZP= 0
##$OFFSET= 15.70392
##$PC= 1
##$PHC0= -9787.026
##$PHC1= 2.400929
##$PH_mod= 1
##$PKNL= yes
##$PPARMOD= 0
##$PSCAL= 0
##$PSIGN= 0
##$REVERSE= no
##$SF= 200.130013532006
##$SI= 16384
##$SIGF1= 3
##$SIGF2= 2
##$SINO= 400
##$SIOLD= 16384
##$SREGLST= <1H.CDCl3>
##$SSB= 0
##$STSI= 0
##$STSR= 0
##$SW_p= 3612.71676300578
##$SYMM= 0
##$S_DEV= 0
##$TDeff= 0
##$TDoff= 0
##$TI= <>
##$TILT= no
##$TM1= 0
##$TM2= 0
##$TOPLEV= 0
##$USERP1= <user>
##$USERP2= <user>
##$USERP3= <user>
##$USERP4= <user>
##$USERP5= <user>
##$WDW= 1
##$XDIM= 8192
##$YMAX_p= 0
##$YMIN_p= 0
$$ End of Bruker specific parameters
$$ ---------------------------------
##NTUPLES= NMR FID
##VAR_NAME=  TIME,          FID/REAL,        FID/IMAG
##SYMBOL=    X,             R,               I
##VAR_TYPE=  INDEPENDENT,   DEPENDENT,       DEPENDENT
##VAR_FORM=  AFFN,          ASDF,            ASDF
##VAR_DIM=   8192,          8192,            8192
##UNITS=     SECONDS,       ARBITRARY UNITS, ARBITRARY UNITS
##FACTOR=    0.0002004,     1,               1
##FIRST=     0,             0,               0
##LAST=      1.6414764,     0,               0
##MIN=       0,             -213029,         0
##MAX=       1.6414764,     369821,          0
$$ Real data points
##PAGE= N=1
##DATA TABLE= (X++(R..R)), XYDATA
0 0 0 0 0 0 0 0 0 0 0 0 0 0 -24 32 -32 32 -32 33 -60 64 -64 91 -96 111 -129 153 -170 197 -220 250 -285 321
32 321 -357 397 -449 497 -558 619 -685 757 -842 932 -1032 1141 -1263 1402 -1554 1733 -1929
49 -1929 2159 -2430 2750 -3136 3621 -4237 5060 -6218 7978 -11014 17710 -78136 186243 273480
63 273480 -51123 -139282 -48201 -76252 -166188 21089 241395 142246 -143452 -189376 -38968
74 -38968 56953 71604 116590 88918 -61913 -158228 -55971 91975 124075 64511 2136 -65098
86 -65098 -103159 -40949 88271 131802 44849 -62049 -78870 -31470 17123 63180 103865 67403
98 67403 -56511 -122109 -23021 111340 105321 15524 -12453 -13018 -62273 -63041 65727 146485 31128
111 31128 -113640 -86947 10633 18843 9153 66250 59553 -74668 -135679 -12238 104501 65047
123 65047 -7350 -10454 -27732 -76506 -34171 82863 95026 -15074 -80177 -49925 -20861 -9474
135 -9474 37970 66744 -6603 -98558 -80417 9149 46912 27955 11941 -8774 -55191 -68041
147 -68041 817 75393 58952 -17554 -57301 -38937 -11122 7854 32333 42125 -4059 -72757
159 -72757 -71411 3442 52441 28425 -11964 -23640 -34894 -45860 -4769 60114 53444 -18618
171 -18618 -52377 -22808 1928 8229 36820 47923 -11420 -71506 -41494 26860 34284 5793
183 5793 3952 -5498 -51045 -55347 19302 66351 18310 -37668 -27365 -7466 -15326 3608 52995
196 52995 43706 -29372 -60588 -12607 30827 22727 11351 11865 -13768 -48809 -31971 26357 46172
209 46172 9039 -25419 -26017 -18315 -8493 20485 44188 22033 -25153 -37293 -2156 28758 29860
222 29860 20799 13898 -10675 -34257 -11597 38945 46907 5148 -22067 -10024 -3936 -7397 18785
235 18785 51449 24949 -32557 -31856 19662 39967 19831 18911 29590 57 -31905 -564 55816
248 55816 48598 -1914 -12955 4767 -1165 -7844 26071 49356 9595 -35635 -20568 19297 21270
261 21270 11036 21693 19003 -17493 -31740 9485 45188 26407 -7510 -7379 -2523 -14227 -9168
274 -9168 25723 34070 -10047 -43976 -22022 8086 4422 -4179 6356 2168 -32696 -42077 460
287 460 33059 9354 -23265 -17629 -6556 -18654 -16158 17024 25753 -18182 -49152 -22770 7316
300 7316 -2111 -13207 1013 -3999 -39220 -42080 3000 25460 -2928 -25763 -13167 -6537 -21130
313 -21130 -9496 25110 22173 -21113 -34258 -3467 13323 -1009 -1234 14096 -931 -32875 -24051
326 -24051 16953 25370 -3078 -15479 -1117 -2250 -13641 1571 31785 22673 -13935 -19538 8719
339 8719 20596 8115 10383 21369 5727 -19634 -9789 24015 28018 2635 -7212 2586 -448
352 -448 -10091 6677 30642 16910 -14273 -14076 10338 15923 6498 12996 20026 578 -19422 -1958
366 -1958 26022 20949 -2482 -4049 2182 -6039 -11811 7785 23836 3553 -21914 -15335 5175
379 5175 5329 -1656 7980 10941 -10096 -22102 -549 20722 11194 -5728 -4655 -877 -10112 -9516
393 -9516 9437 15869 -5626 -22042 -11746 1054 -1948 -3850 5450 2446 -17809 -20000 2670
406 2670 14208 2426 -6807 -1160 -2318 -11643 -5054 13835 13047 -8200 -16963 -4765 1640 -5338
420 -5338 -2355 6606 -926 -20793 -17418 3608 9302 -3878 -6860 -563 -5524 -13892 -2636 14226
434 14226 8602 -10330 -13114 -1596 242 -5257 1713 7506 -5538 -20483 -12200 4832 3458 -7157
448 -7157 -6118 -1591 -10748 -15100 1564 13741 2792 -12900 -7543 3222 -95 -3534 7918 11488
462 11488 -6330 -17545 -2508 11884 4111 -5666 576 2980 -9400 -11596 6985 15971 884
475 884 -10551 -571 8278 1531 893 13579 15402 -1945 -7750 8130 17774 6897 1234 9689
489 9689 9864 -3712 -3243 14954 18265 1627 -4522 6946 10049 1857 3999 18357 15766 -2210
503 -2210 -3744 12885 18496 6365 4223 14198 10741 -4836 -720 17465 17432 -1978 -5789 7088
517 7088 6784 -3911 807 14642 8618 -9703 -8635 9524 10920 -2110 -1239 8397 2117 -10943
531 -10943 -3698 12653 8106 -9643 -9042 1922 -2113 -10658 -4354 6638 -3769 -18111 -13006 2624
545 2624 -299 -10740 -7289 963 -7202 -16412 -6170 7340 -578 -14462 -9854 504 -5054 -12793
559 -12793 -4089 4741 -6316 -19391 -10894 2188 -2843 -12467 -6592 398 -7088 -15068 -4295 7323
573 7323 -384 -11605 -5033 3954 -2775 -7641 2421 8899 -2812 -11941 -2336 7735 -343 -6367
587 -6367 1067 4668 -4882 -9567 3833 9795 -95 -6154 2469 6172 -1042 -1243 9612 11912 -425
602 -425 -4432 6069 10210 2797 957 6757 5835 -2967 -3051 7841 10053 1007 -3161 3437 5210 239
618 239 1425 9191 8375 -1192 -1807 7060 8552 3384 2032 7104 4586 -2605 -794 7850 7784 -2151
634 -2151 -3454 3260 2837 -3402 579 6804 2691 -6033 -2744 5967 4133 -2607 963 6050 1134
649 1134 -5394 488 8002 2872 -4516 -1556 2693 -1778 -5871 238 5201 -2675 -8516 -1990 2537
664 2537 -2783 -4293 1193 2351 -4630 -6931 791 3931 -1672 -4322 -603 341 -5636 -5149 1609 2240
680 2240 -5041 -8143 -2536 -827 -5726 -5387 -380 -1401 -8384 -7619 21 1896 -4719 -6676 -843 -625
696 -625 -6304 -4560 2315 1791 -7040 -7897 -449 -90 -6534 -5575 524 -1569 -10045 -7619 1779 1212 -6736
713 -6736 -5471 1945 -101 -7201 -2515 5745 2187 -6722 -3052 5118 2649 -4673 -364 6618 607
728 607 -6756 -947 6550 1951 -3864 997 5988 1215 -3709 2802 9812 3908 -1701 2513 8867
743 8867 4118 131 5768 10189 3298 -2211 4341 10609 5654 575 5229 7925 2805 -618 6181
758 6181 10532 4452 -1972 4338 9853 5007 1130 7319 10960 3325 -1880 5959 11002 4467 -595
773 -595 4412 7402 162 -2533 5447 8414 -409 -4722 1993 5595 -1082 -3167 3596 5871 -3301
788 -3301 -5664 3180 5552 -1779 -4299 1713 2041 -5031 -4907 1901 1680 -5785 -7000 -1050 88 -6877
804 -6877 -6757 -903 -1400 -8440 -7592 -895 -877 -6411 -5939 -1199 -1756 -7337 -6290 -327 -1435 -7148 -7040
821 -7040 -1985 -2912 -7609 -5867 -1254 -2413 -8371 -7135 -1199 -1220 -6394 -5102 -174 -1500 -6601 -3783
837 -3783 1824 986 -4744 -3317 1196 -180 -2957 -941 2883 -544 -4688 -1759 3336 729 -3349
852 -3349 -790 3366 -198 -3099 1617 4875 1608 -845 2121 5154 1930 451 3728 5767 1443
867 1443 -204 3901 5991 1925 -245 3165 4129 412 478 3950 4979 681 -26 4151 4776 1439
883 1439 1995 4769 4507 840 1397 4664 5206 1821 555 4452 3858 -233 191 4273 3552 -867 -307
900 -307 3379 2014 -1759 177 3793 2543 -1550 -366 3561 2558 -1512 231 3601 1698 -3102
915 -3102 -264 4278 969 -3008 -973 2080 -1024 -4942 -817 2749 -1832 -5436 -1641 2232 -1663
930 -1663 -4463 -302 2265 -2412 -5160 -143 2184 -2066 -5061 -1241 262 -3516 -5315 -876 20
945 20 -4927 -6475 -1931 -54 -4250 -5502 -1478 -260 -4345 -5684 -905 980 -3958 -5563 -924 566
961 566 -3735 -5488 -1015 675 -4438 -5563 -321 1038 -4360 -5732 -786 714 -3959 -4942 894 1394
977 1394 -3566 -3704 1735 2433 -2814 -3094 2993 3154 -2396 -2297 3626 3169 -2584 -1357 3728 3459 -2411
994 -2411 -939 4198 3483 -1139 -108 5115 3661 -809 1345 6231 4991 123 1784 6423 5511 573
1010 573 2648 6496 3876 474 2083 6215 5296 809 1589 5680 4167 843 3106 6867 4499 57
1026 57 2205 7166 4564 477 1933 5946 3806 -393 1782 5110 2741 -1155 1357 4393 2029
1041 2029 -2409 681 3036 240 -2347 -539 2703 -238 -2666 -97 2542 -1085 -3229 -562 1028
1056 1028 -1380 -3768 -1246 585 -2399 -4476 -2249 -687 -3455 -4985 -2803 -1743 -4325 -5363 -2424
1071 -2424 -1080 -3353 -4900 -2343 -1779 -3520 -4602 -2324 -1269 -3087 -3912 -1387 -765 -3363 -4453 -2641
1087 -2641 -2110 -4201 -3697 -2235 -1917 -3896 -4513 -1427 -1196 -2837 -2662 -586 -536 -2654 -1711 681 399
1104 399 -2376 -1034 1412 425 -2087 -930 624 -267 -2283 -678 1810 13 -901 562 1937 971
1120 971 -676 1094 3033 2263 -229 1998 3059 1350 273 2407 3349 1487 148 2060 3080 1283
1136 1283 409 3688 3164 949 740 3252 3947 1567 1349 3556 2898 1024 1150 3715 4454 1427 842
1153 842 3489 3073 971 920 2939 2673 -143 218 3140 2989 -323 -222 2844 2580 -759 46 3052
1170 3052 2412 -1102 32 3086 2337 -648 -517 2267 1039 -2603 -779 2040 356 -2381 -1717 1294
1186 1294 -57 -3425 -1657 1317 -346 -3262 -1843 810 -715 -4360 -1863 322 -778 -3597 -2018
1201 -2018 545 -1853 -4317 -2274 132 -1980 -5225 -3321 -30 -1280 -5088 -2270 389 -2128 -4236
1216 -4236 -2731 251 -2097 -4593 -1904 394 -2070 -4685 -2388 327 -2180 -4586 -1899 698 -1512
1231 -1512 -3933 -1509 770 -1435 -4002 -1264 803 -1508 -3488 -758 1839 -4 -2636 575 2399
1246 2399 -579 -1613 671 2462 -303 -1097 1378 2860 670 -765 1874 2711 483 -404 2316 3513
1262 3513 682 -400 2840 3690 1755 984 3316 3476 1932 1337 3109 4026 1555 1209 3181 4498
1278 4498 1712 1049 3038 3660 2241 1102 3033 3733 1287 646 3253 3561 1479 1144 2568 2712 307
1295 307 1020 2649 2111 397 482 2396 1370 -666 -575 1871 897 -1215 -1111 1515 592 -1303 -1196 231
1313 231 387 -1442 -870 -41 -811 -2424 -934 -173 -1204 -2407 -1768 -762 -1697 -2450 -1744 -1292 -1919 -3094
1331 -3094 -2066 -1059 -2545 -3005 -2025 -1029 -3092 -2760 -1936 -1726 -1978 -2842 -1903 -992 -2275 -2566 -2095 -1841
1349 -1841 -3064 -2639 -1458 -1341 -2117 -2478 -1492 -976 -2429 -1401 -541 -783 -1668 -1114 -210 81 -1295 -1667
1367 -1667 684 5 -1666 -190 1032 -95 -1588 -271 1146 1045 -154 1 2075 657 -205 748
1383 748 1450 774 -293 1288 2253 1535 361 2054 3038 1141 624 1518 3045 1414 13 2075 2888
1400 2888 1607 679 2158 2624 1358 908 2555 2874 1322 421 2824 3414 1784 557 2422 2827 1228
1417 1228 751 1313 3042 688 -79 1847 2760 387 157 1215 1925 482 -695 1502 2379 463 -620
1434 -620 1808 1551 -392 -1032 1582 1388 -1125 -1304 900 1037 -1133 -2425 215 290 -1957 -2145 -49
1451 -49 -147 -2736 -2160 -136 -435 -2898 -2213 -132 -717 -2444 -2556 491 -984 -3288 -3247 -782 -823 -3216
1469 -3216 -3189 -1054 -676 -3299 -2857 -968 -1173 -3128 -2931 -892 -641 -3263 -2793 -878 -1172 -3145 -2968
1486 -2968 -150 -993 -2522 -3092 -88 -604 -1331 -1457 104 181 -1898 -1279 487 93 -1326 -1017 882
1503 882 529 -1426 -478 1840 914 -216 -234 1438 457 -363 -60 2035 1175 532 968 2058 1629 361
1521 361 1595 2392 1574 553 1572 2522 1561 708 1556 2839 2197 812 1934 2992 2079 1572 1859 1720
1539 1720 1934 945 1947 2239 1942 1315 1599 2232 1790 996 1825 1739 886 804 1189 1731 1049 353 1544 1885
1559 1885 942 116 392 1103 254 -207 1143 1067 -448 -271 353 275 -594 -550 156 -293 -1092 -867 -591 -667
1579 -667 -1035 -1134 -735 -1117 -1567 -1425 -827 -1459 -2071 -1305 -1227 -1381 -1817 -1717 -1583 -1314 -1823 -980 -1350 -1938 -2048
1600 -2048 -1452 -894 -1352 -1539 -1052 -1618 -2434 -1925 -1089 -451 -1697 -1698 -970 -926 -1809 -2356 -1005 -1092 -1503 -1514 -1019
1621 -1019 -62 -1283 -1077 -291 -46 -1077 -1008 267 -6 -1283 -422 1049 396 -720 -402 803 279 -576
1639 -576 -241 1236 839 -184 486 1851 1347 37 1199 1986 1398 137 1015 1854 928 363 1513 1996
1657 1996 1862 719 1097 2103 2174 560 1283 2280 1386 588 750 2753 1846 1210 1602 1939 1582 -33
1675 -33 1615 2278 1759 12 1052 1768 1345 404 1353 1751 714 -100 758 1824 1314 -34 306 2038
1693 2038 607 -360 465 1304 56 -1001 -145 1225 -384 -1167 -416 1085 -895 -1331 -552 452 -500
1710 -500 -1209 -512 -17 -908 -2534 -1338 -330 -1609 -1982 -1121 -381 -1567 -2053 -1558 -980 -1778 -1390 -1324 -651
1729 -651 -1514 -2571 -1566 -652 -1309 -2323 -1131 -688 -1396 -2057 -1327 -452 -1329 -2052 -1297 -108 -1492 -1581
1747 -1581 -778 -224 -1199 -1203 -841 -78 -1354 -1342 -85 174 -868 -859 33 766 18 -468 310 590 -186 -16
1767 -16 609 406 808 47 387 1255 42 384 1284 1234 364 806 1174 925 767 356 1282 1727 886 1227
1787 1227 1399 1077 572 1153 2501 1234 1663 1378 1241 1041 1341 1458 1146 732 1062 1094 1702 1381 1535
1806 1535 860 1531 1192 823 846 1327 983 803 1172 483 304 631 1577 1106 -47 498 838 476 -204 241
1826 241 -201 254 95 268 316 15 -707 39 3 310 -465 -783 -193 -552 -979 -398 -386 -986 -1518 -632 -5
1847 -5 -1235 -1973 -1093 -1070 -1419 -1100 -1030 -893 -1586 -1819 -1066 -1342 -1088 -1868 -642 -880 -1922 -1939 -1051 -642 -1609
1868 -1609 -1427 -701 -1089 -2065 -1490 -1131 -769 -1001 -1734 -960 -660 -984 -1174 -649 125 -1185 -1273 -621 157 -613
1888 -613 -1085 -214 431 -642 -151 120 337 -13 -1246 620 982 -357 -191 588 729 402 193 809 1253
1907 1253 857 557 1483 1554 619 496 2054 1864 438 762 1174 1392 556 836 2008 1808 1053 1167 1736
1926 1736 1795 1270 1322 944 1793 697 1268 1511 1161 390 265 1066 1727 932 749 1491 1100 487 548 1441
1946 1441 1020 537 238 954 1021 -490 127 327 591 -431 -184 553 217 -531 -875 -146 321 -413 -547
1965 -547 123 -128 -800 -1059 -35 -920 -1006 -712 -60 -801 -1367 -893 -422 -1225 -1478 -1362 -285 -1051 -1532 -988
1985 -988 -677 -828 -787 -915 -1023 -915 -1438 -1492 -753 -943 -1584 -1483 -1232 -1328 -1318 -851 -519 -965 -1198 -1243 -567 -1120
2007 -1120 -985 -780 -648 -288 -451 -743 -931 -684 -442 -1331 286 335 -63 -97 -71 -473 -179 413 189 281 404
2028 404 51 34 846 800 922 631 318 768 419 658 951 1038 866 977 757 337 1166 746 491 1175 1464
2049 1464 817 1202 1394 745 1385 855 1242 1125 609 822 2114 853 1094 846 1212 785 648 974 833
2068 833 1163 582 622 1358 627 301 618 1432 733 144 727 366 523 442 -913 136 46 -177 322 890
2088 890 747 -1 -499 300 113 -685 244 238 132 -1438 -621 -35 -738 -670 -304 -172 -389 -1312 -1261 -191 -1151
2109 -1151 -1110 -1110 -776 -1439 -1119 -952 -568 -1314 -1789 -1469 -1000 -688 -1750 -801 -180 -458 -1078 -1158 -154 -771
2129 -771 -588 -1247 -417 -586 -982 -575 -824 -453 -1077 -1320 -788 -634 -631 -626 -174 26 -929 -339 402 143 -935
2150 -935 -92 121 -224 -521 -29 591 570 -531 -155 558 439 158 305 660 744 71 375 859 536 235
2170 235 493 1269 791 1052 518 661 912 714 577 988 873 465 1068 1754 1066 754 1267 1296 904 668
2190 668 697 1350 942 488 819 1096 547 705 739 949 915 681 189 618 362 665 713 1128 946 207 249 362
2212 362 -73 176 159 202 187 146 526 265 -427 -465 -5 -205 68 -341 -118 -371 -636 -27 -364 307 -48 -421
2234 -421 -518 -308 -902 -234 -287 -637 -1075 -1168 -504 -823 -1037 -889 -630 -669 -841 -1092 -421 -935 -795 -508 -1114
2255 -1114 -1107 -577 -361 -712 -592 -839 -1013 -740 -652 -1048 -836 -532 -875 -1319 -472 -391 -400 -528 -749 -746 -408 -613
2277 -613 -133 -429 -35 154 -284 -161 -550 23 112 254 82 108 378 333 10 649 753 339 -21 689 451
2298 451 583 397 404 494 891 483 536 1168 1299 769 711 665 925 590 846 1233 944 385 402 1009 1114 582
2320 582 757 981 504 -27 700 643 906 405 778 1316 289 35 672 821 -31 113 292 886 280 148
2340 148 420 875 668 -693 271 693 -110 31 71 471 146 -769 -266 -65 -93 -1111 -73 484 -594
2359 -594 -813 -204 102 -327 -988 -4 46 -648 -549 -900 -613 -1437 -899 -595 -298 -497 -842 -830 -815 -635 -1325
2380 -1325 -745 -477 -742 -1215 -581 -536 -631 -1047 -155 -691 -1059 -317 -675 -105 -890 -810 -901 -647 -924 -699 285
2401 285 -458 -865 -238 -522 -126 -133 -744 -416 540 56 -642 57 296 186 19 -90 576 -479 337 764
2421 764 114 -417 219 496 210 45 359 528 343 351 448 1006 881 908 -47 752 684 286 391 942 852 791
2443 791 67 928 1203 386 693 606 927 548 877 752 666 724 492 578 575 773 421 640 356 389 116 698
2465 698 1329 312 794 977 394 -229 509 85 -146 -20 262 171 170 205 -444 408 138 -222 -372 379 35
2486 35 -234 -125 61 -195 -780 -519 -229 94 91 -549 -646 -700 -494 -723 -982 -578 -369 -477 -879 -623 -500 -932
2508 -932 -766 -770 -473 -813 -628 -208 -487 -138 -400 -606 -649 -357 -959 -401 -553 -1029 -874 -294 -257 -216 -408 -160
2530 -160 26 -229 -226 -589 33 -931 298 -425 66 -290 -750 -503 -567 228 -381 -97 -811 -46 139 -256 562
2551 562 672 163 -192 97 451 -40 124 22 1167 276 215 1062 715 183 180 1620 568 -228 943 1361
2571 1361 778 249 722 516 853 758 476 1015 1114 826 936 524 801 194 623 511 721 209 469 214
2591 214 327 679 -247 878 519 383 383 976 668 347 680 158 488 66 211 705 659 -370 -218 -108
2611 -108 86 -53 -575 -335 -150 -532 75 344 -494 -151 -251 -236 -206 -821 -652 -204 -521 -727 -324 -449 -510
2632 -510 -549 -849 -469 -115 -322 -882 -1025 -683 -876 -1010 -95 -40 -1019 -911 -721 -710 -898 -594 -513 -932 -669
2653 -669 -635 -968 -319 -499 -437 -308 -911 -1134 -725 -103 -234 -279 -199 -325 -775 -535 -618 473 -40 19 -460 184
2675 184 428 -335 -149 -67 -120 366 262 -54 -113 -24 -238 453 619 639 353 719 325 621 70 1200 -151
2696 -151 1072 546 861 931 866 265 1110 1012 570 259 502 561 229 619 865 577 467 632 710 877 539
2717 539 674 477 560 539 683 1127 820 225 619 888 495 -310 217 672 438 -670 137 423 331 -133 26
2738 26 161 666 -140 545 457 -214 -250 -97 190 -303 -247 -316 -74 -551 -401 -22 -624 272 -528 167 -682 -331
2760 -331 -533 -640 -695 -740 -702 -75 -127 -226 -129 -613 -96 -1258 -723 -124 -868 -741 -353 -419 -405 -680 -1001 -612
2782 -612 -884 -958 151 -474 -359 -630 -120 -741 -175 -400 -348 -300 -302 -498 -155 466 7 8 215 -457 -740 -48
2804 -48 36 228 -131 223 270 58 -53 328 162 -61 211 429 307 -263 200 225 765 368 85 -228 23
2825 23 575 202 982 827 486 420 769 1491 373 451 797 707 302 151 398 1014 297 687 -132 9 809
2846 809 51 -38 430 685 156 -95 745 670 606 348 86 324 243 -152 850 511 131 333 346 -120 205
2867 205 -486 425 148 236 92 210 392 -4 98 -17 246 19 259 1 272 -741 454 -286 -518 -974
2887 -974 241 -180 -353 -578 -282 -334 -771 -795 -690 41 -454 -908 -210 -154 -445 -659 -350 -690 -337 -1032 -751
2908 -751 -1054 -419 -62 -548 -611 -451 -767 -1176 -228 -234 -761 -379 -597 -464 -890 -277 159 -86 -790 202 -121
2929 -121 -584 203 69 -204 18 394 177 172 -333 -145 219 199 267 -17 -182 222 159 71 658 91 130 239
2951 239 190 351 -102 645 137 530 -78 957 178 139 308 766 311 101 596 606 484 -115 252 697 420
2972 420 388 378 789 673 845 638 159 581 189 472 819 -136 375 196 351 261 729 404 169 499 560
2993 560 273 334 344 470 -112 364 48 266 517 39 219 -13 -342 274 -113 34 -53 287 -604 -435 37
3014 37 -123 48 -2 -580 -568 -730 -228 -147 -633 -906 -494 -561 -436 -853 -77 -230 -270 -764 -424 -318 -1046 -834
3036 -834 429 -346 -849 -805 -162 -817 -604 -1012 -227 -427 -976 -542 -49 -42 -272 428 -353 -662 -533 -640 -338
3057 -338 -209 109 -225 161 46 -447 -433 53 -83 115 82 161 20 222 479 223 -85 318 536 188 -66
3078 -66 348 195 -266 838 466 -133 -35 186 635 227 293 68 -41 553 426 1195 672 498 94 372 609
3099 609 -44 631 220 983 346 554 524 -167 435 465 230 564 241 82 254 720 138 336 65 922 361
3120 361 229 215 270 450 -381 295 266 301 887 762 23 -45 203 73 108 214 -92 -147 -635 -19 -195 -417
3142 -417 -180 -367 -400 -66 -186 -592 -556 -276 -99 -354 -520 -309 -391 -329 -124 -355 -437 -443 -257 -476 -429 -83 -189
3165 -189 -388 -101 -767 -352 -646 -602 -336 -352 -106 -140 -520 -316 125 96 -15 -156 -521 -906 125 413 -268
3186 -268 -440 -332 -589 -42 161 -230 201 -228 83 -271 -120 315 447 460 -406 595 243 319 -165 325
3206 325 630 -238 655 -20 153 415 212 -245 185 494 710 880 -234 238 70 244 -159 45 627 395
3226 395 181 43 418 517 108 767 283 142 529 771 -87 463 940 219 312 243 95 189 -75 645 148
3247 148 33 262 289 524 -65 -56 259 -47 127 -19 -430 246 353 516 -29 295 -166 779 47 166 -370
3268 -370 -549 -151 -424 261 -177 -366 102 60 -835 -445 -49 -654 -233 -67 -120 193 -560 123 -472 -428 -852
3289 -852 -144 -719 -320 -360 428 165 -127 -229 -4 -476 -185 -706 -231 -207 -243 -650 -310 -867 -119 -578 -612
3310 -612 -74 -217 -404 171 -389 -184 -481 -322 -133 -243 187 -380 -464 -219 -208 56 -124 -126 -8 -493 -285
3331 -285 113 -260 -943 430 24 396 468 539 -244 -94 308 -210 514 -33 284 284 612 378 80 51 836
3352 836 488 302 433 79 798 325 673 277 519 364 526 499 78 384 596 -6 485 -70 797 328
3372 328 54 413 700 142 54 293 -375 178 -210 394 180 449 175 27 664 -86 -410 132 257 -76
3392 -76 -333 -129 97 -170 268 -558 -339 -230 -167 128 165 40 -286 8 341 228 -382 -179 361 -576 -151
3413 -151 -189 -509 -440 -219 32 412 -903 -589 -457 -284 -285 -170 166 352 -246 -458 -768 -900 -238 -576 -248
3434 -248 -281 60 -520 -263 -196 -554 -242 173 -847 -441 -179 99 -146 134 -236 -60 -201 141 71 96 -182
3455 -182 -276 -870 144 -65 -65 -65 324 -265 -303 -236 110 -11 691 558 315 244 -165 -187 389 60 -323 233 25
3478 25 313 208 33 365 -243 493 -73 343 630 491 493 688 230 -75 527 -64 761 913 148 194 415
3499 415 225 213 538 314 77 447 -147 488 -45 475 542 -529 61 412 236 356 356 142 714 426 322
3520 322 -201 337 -25 -208 564 -257 -153 -160 -238 555 366 -315 193 252 80 -14 137 -193 -162 -479 139 87
3542 87 -835 -40 -395 -276 132 -361 -249 -441 -299 -349 -294 -376 -176 -591 -382 -459 -519 -530 -130 138 -391 -206
3564 -206 -357 -649 -706 -374 -177 -406 7 324 -535 -458 -52 14 -561 155 -642 67 453 132 -267 -221 374
3585 374 394 -247 -621 633 -515 -96 -17 34 -138 -530 166 -27 419 283 232 155 25 118 270 -139 -251
3606 -251 501 705 261 574 -116 -79 244 -171 260 50 74 89 287 238 291 -192 426 66 450 -192 -84 277
3628 277 261 659 260 262 333 -19 365 -167 -165 533 -421 174 -41 322 51 -259 -196 485 -54 365 163 286
3650 286 416 492 -80 140 -144 344 -205 236 161 204 -154 -159 -274 -167 -14 -286 30 -77 137 -539 -229 403
3672 403 -139 222 -55 49 -76 -525 -116 -481 -89 -747 781 -102 -1017 108 -394 -705 -875 -849 -296 -699
3692 -699 -296 -66 -125 -18 -421 -376 -92 -581 43 -209 -265 -214 -280 -352 -662 -516 -61 -186 302 89 -91 -167
3714 -167 65 418 -487 -227 139 433 -261 -26 338 607 176 -71 132 -3 -212 145 -108 67 171 603
3734 603 599 653 140 -442 596 816 135 -133 105 224 86 -136 -301 978 327 -110 142 -386 1132 -307
3754 -307 143 -90 622 -107 -172 79 -485 705 295 -398 487 263 340 -15 329 386 178 -86 366 -186 -76
3775 -76 272 -225 29 363 -66 45 411 -474 310 399 267 -120 -674 82 -333 -218 419 -743 93 88 334
3796 334 -72 144 -411 -187 562 15 -334 74 216 -252 213 -102 -123 -335 -361 -526 15 249 -84 -773 78
3817 78 -89 -328 -880 -212 -277 -132 -143 157 -413 84 -32 -48 -72 -620 -285 8 126 -96 -83 -99 164 379
3839 379 256 8 122 -134 -325 -304 -285 245 145 338 303 -98 -175 599 98 -168 443 225 70 264 300 -138
3861 -138 -168 520 -259 136 274 530 319 77 640 123 703 169 265 115 667 21 123 103 65 1048 819
3882 819 -405 480 84 454 576 757 117 514 631 476 225 -74 1009 157 660 263 174 -823 247
3901 247 -424 58 -16 432 55 -324 363 -221 75 -5 -222 -711 621 265 -302 29 -658 88 -484 216
3921 216 304 -401 337 -231 238 -361 -600 71 -37 -68 -586 -271 370 -271 -426 -146 -131 -493 562 37 -257
3942 -257 -236 -160 -1052 -926 219 -340 -163 -95 53 210 -164 -647 -387 46 -386 -253 -221 -1018 -38 461 -366
3963 -366 -29 -503 -738 -496 -670 -544 -333 -286 174 213 157 -441 -96 20 13 -183 -562 436 -105 -486 -30 249
3985 249 -180 70 494 57 409 100 145 310 -611 -434 84 193 -150 243 -76 -80 -164 -509 412 149 7
4006 7 59 255 480 67 562 314 220 169 261 298 422 88 -361 443 275 -138 49 162 351 93 93 107 132 617
4030 617 -149 1 251 -468 -269 274 417 143 277 101 121 100 -136 -140 -338 -268 -139 297 -293 -37 141 -253
4052 -253 269 -97 377 95 -75 317 273 -249 35 -422 294 -26 -87 -180 -301 -238 -187 -357 -326 -44 -267 -2
4074 -2 468 -383 -177 -7 -314 142 -582 129 412 -324 -221 120 -370 -579 -7 321 -546 409 60 -435 -64
4095 -64 293 -51 -385 556 -555 70 -303 -634 166 230 77 -45 345 -2 302 437 402 -49 -598 854
4115 854 -509 -169 199 -55 179 71 280 -105 612 -25 89 -56 268 643 179 -24 565 -189 -47 499
4135 499 -458 -275 116 454 93 -7 446 584 567 246 850 241 -15 -469 188 221 -98 345 -362 172 128
4156 128 402 -124 -54 80 269 438 316 171 201 -537 381 -717 24 140 73 -61 -52 221 233 -474 -144 -19
4178 -19 128 96 80 338 -41 -235 -399 -387 188 97 -161 89 394 -312 -103 -122 261 -180 -722 -17 -67 -517
4200 -517 -173 105 -683 -220 -133 -196 28 39 -927 96 130 -97 -320 -300 -447 -699 -757 -30 39 -665 335 -326
4222 -326 355 -108 -184 -240 457 -529 319 -292 -164 -540 340 -147 675 -96 231 -151 -227 319 166 408 351
4243 351 -33 -259 549 660 -233 -16 323 19 197 -526 584 75 138 -214 284 625 -544 557 296
4262 296 156 328 343 435 -256 207 -12 246 638 552 -42 -6 864 74 269 -101 518 429 -306 34 -110 273
4284 273 651 485 228 -535 53 493 -69 445 -212 -89 236 193 45 366 229 -277 533 -98 914 -113
4304 -113 337 182 -1 809 -500 -380 -522 166 366 500 -417 183 118 489 140 -339 -250 313 302 150 -443
4325 -443 -284 82 -35 -637 290 -116 -303 -446 -466 -391 -399 -518 283 -30 -75 -26 -382 -617 -63 -499 -256 65
4347 65 -57 -24 -87 -135 64 -170 36 336 -76 135 -77 -107 -12 -121 391 380 25 -159 24 -696 186 -5
4369 -5 -475 316 -104 283 -478 22 -78 667 266 148 82 64 -21 -7 363 191 153 327 -76 103 28 350 55
4392 55 -429 170 130 458 386 193 255 268 166 173 78 -60 -25 218 280 197 362 -794 380 285 472 -303 -5
4415 -5 617 281 -1 585 301 185 88 178 222 139 324 -186 224 -92 -454 -235 458 237 232 -236 -150 552 -201
4438 -201 -426 -303 -293 376 -41 -155 -419 -319 547 292 445 152 270 -327 -87 -474 -511 10 -204 161 -469
4459 -469 312 -370 -224 -271 163 38 -201 -74 -272 -137 177 70 -218 77 -198 -183 149 -281 18 -73 -100
4480 -100 -634 -390 -203 189 198 269 111 -264 234 15 -183 -56 92 -581 -368 -164 850 -195 -426 -124
4500 -124 114 110 245 -440 -457 143 51 344 -67 573 52 -5 -27 446 47 141 -213 12 -16 306 236 66 172
4523 172 -44 17 267 27 -117 -205 -93 -195 174 349 269 214 483 226 149 249 21 140 234 419 32 -637
4545 -637 288 -59 223 362 74 439 -156 449 521 226 -366 80 14 316 428 -196 -64 -176 326 504 -55
4566 -55 -46 -158 -12 -318 -458 -32 239 176 -321 -21 -96 225 47 -289 -43 -411 -341 106 -456 142 -171 -196
4588 -196 201 -93 -285 -92 -361 5 -124 -316 -224 -407 -273 372 -104 -66 -81 -1 -503 -397 -112 52 -345
4609 -345 46 -115 -216 -79 -335 258 301 323 -218 -29 59 -88 93 -375 61 246 184 -83 423 -253 -216 -153
4631 -153 -10 -16 -200 30 219 495 -159 -334 320 -282 -89 -477 -191 75 335 215 274 268 -222 -281 111 -332
4653 -332 284 -43 -191 486 383 -316 162 63 -90 78 -55 410 210 -44 443 136 25 949 -64 -446
4673 -446 520 404 -97 600 44 -755 188 320 261 410 105 71 -44 549 23 42 544 26 484 416 55
4694 55 -335 69 450 204 -115 -213 -37 291 -70 -259 42 -413 -425 -795 -20 -449 -504 -147 -216 189 -109 -215
4716 -215 58 -26 -102 347 288 -152 567 -285 460 88 -689 -313 -490 182 -261 -389 278 -416 -223 -34 -417
4737 -417 -577 -155 37 -298 301 -336 -44 -199 58 -44 -601 -126 -499 23 -419 -612 -674 -483 3 -431
4757 -431 -458 432 -173 -31 145 -377 -136 277 -249 -605 443 321 189 191 -414 53 132 250 383 -374 -166
4778 -166 -156 159 -99 136 129 367 -299 -126 -438 -518 209 -326 -574 492 455 185 420 -202 134 7 278
4799 278 -106 8 -356 471 393 -355 13 -233 -41 149 210 206 -132 31 387 -86 59 458 130 106 205 317
4821 317 -220 -314 494 123 -110 28 114 14 597 12 -58 -482 215 -435 -215 -395 -375 92 -680 669 -305
4842 -305 624 80 -112 -165 -315 -348 -68 -142 -246 -36 146 -146 31 296 57 74 239 -104 83 -82 -254
4863 -254 -14 186 -86 -11 118 -384 -54 -268 -129 -26 -596 241 142 -447 104 -665 -8 -130 -160 210 -46
4884 -46 -154 -415 -31 247 -948 -411 127 -309 101 -610 -402 250 -125 55 -43 -159 185 237 27 432 390
4905 390 -59 178 -813 142 -145 150 -216 247 321 78 251 -46 -5 330 -45 -3 581 318 205 387 466
4926 466 91 84 112 68 57 113 -54 -363 155 246 75 95 233 -814 503 -104 202 5 -679 318 211 -146
4948 -146 -579 136 -497 -386 -524 -578 -229 167 -60 73 120 220 72 27 -570 -158 296 -238 -107 -294 -604
4969 -604 15 177 547 84 -537 187 -95 -281 -218 -284 -493 199 -329 -299 -611 -35 -153 -92 -365 -293 189 -554
4991 -554 190 -316 64 -391 -58 -227 -120 -307 77 -342 -422 -622 -526 438 -139 -208 -254 -180 -249 -146 -246 -356
5013 -356 37 -209 450 -261 333 292 -477 -319 -110 146 616 145 -135 187 66 -189 -325 -79 265 327 -187
5034 -187 35 449 -70 -59 134 441 340 322 367 200 278 -312 69 440 16 -438 146 29 -159 303 565
5055 565 380 486 -388 339 486 -532 93 33 122 225 148 -307 -191 -258 307 -376 -191 514 -38 -183 466
5076 466 208 554 -298 -309 -287 676 243 378 -4 -5 43 111 -216 130 -337 -189 244 106 -459 -717 393 -736
5098 -736 95 73 -7 -134 204 163 -205 -520 40 -566 107 -338 -72 -282 -160 -75 261 -445 -613 97 349
5119 349 68 57 307 16 71 41 -342 135 -323 -58 -311 -358 -222 23 -425 -247 -270 -423 185 -342 255 -432
5141 -432 -116 58 -21 -39 -377 537 30 -145 -523 63 -65 -310 -379 409 61 292 80 168 -127 220 -112
5162 -112 -140 -8 -296 -283 240 424 65 54 -510 191 203 -128 2 31 106 -153 59 205 372 -160 186 282
5184 282 -545 62 -437 -133 195 -253 306 241 252 -459 395 -62 -24 438 -63 185 219 242 644 -267 49 249
5206 249 253 177 650 -129 -395 187 -379 160 -408 212 563 371 -120 -427 -187 -48 -193 -40 -198 36 240
5227 240 50 -14 -316 43 202 424 -891 89 252 -282 -384 -425 -26 111 200 -750 -264 -494 351 -626 272
5248 272 89 -615 -29 -57 -379 -152 -201 -598 -98 189 251 -373 227 -12 -104 -443 692 -114 -387 -506 287
5269 287 417 -30 37 -75 -354 -190 100 372 217 -272 -152 -455 356 -143 202 -212 -190 -355 -149 -409 -371
5290 -371 -272 201 -100 442 -84 -326 90 466 519 227 -22 257 -145 -44 -325 327 210 55 52 -73 153
5311 153 -204 -369 -88 178 143 -118 417 522 -57 -266 105 -11 220 506 -189 313 -243 -229 756 -101 -194
5332 -194 -412 101 73 384 42 -604 434 -92 144 8 255 51 -139 -170 512 309 116 614 646 59 377
5353 377 -62 1 -18 23 117 393 31 333 25 -603 -174 -148 28 -247 -102 25 114 -202 -260 36 109 -320 167
5376 167 -181 -259 -108 -54 -10 46 243 182 83 631 356 -177 -249 165 -469 -65 -171 -262 404 -166 -189 58 330
5399 330 -133 -371 -93 -276 -666 -251 -78 204 -225 -114 -279 -17 407 -290 -549 39 -69 0 592 293
5419 293 72 -10 3 -114 -528 11 27 -267 -282 270 -215 -26 -193 -196 397 269 134 515 274 50 -76 -307
5441 -307 194 545 279 231 -210 460 -388 -132 226 196 164 -407 105 -131 -513 225 317 109 166 148 73 172 -408
5464 -408 -183 144 -162 -296 194 102 -130 -20 69 343 46 41 -319 13 118 335 -455 195 48 -457 23
5485 23 -582 139 -478 -505 -348 585 -96 -81 -131 -576 29 479 140 -284 54 -407 -591 7 233 203 -208 97
5507 97 -85 67 -272 -88 -193 -66 -58 295 474 -456 -102 -33 70 118 -19 -28 -183 -37 239 -63 98 -293
5529 -293 -70 -434 -436 -581 -107 678 -429 12 81 -136 27 -8 -67 -160 333 -218 264 -650 110 97 18 48 -34
5552 -34 107 430 -79 200 581 486 166 -391 48 195 478 -190 107 559 -260 81 -9 -140 597 -285 143
5573 143 -157 77 681 -220 -118 -320 -152 353 -394 146 265 92 292 -92 356 -110 197 406 -29 -51
5593 -51 5 458 249 317 -40 -198 -317 -122 -185 -24 261 -315 315 -461 803 194 322 -250 -792 530 -161
5614 -161 40 295 -305 -73 173 481 219 -1 303 730 38 -72 412 -540 -170 82 -123 47 -584 -79
5634 -79 -236 22 -247 -97 30 -327 358 -706 11 -367 -643 -136 -396 470 -15 316 -258 32 -233 -124
5654 -124 -184 256 -45 -264 405 -210 -160 -120 200 358 432 -195 363 -184 22 -62 -50 150 -350 -11 32 -387
5676 -387 369 -630 374 104 309 -245 92 500 98 249 99 -312 -409 237 363 242 -200 331 53 80
5696 80 77 631 183 366 26 231 362 164 36 395 -91 250 260 -587 -50 689 30 226 -36 -153 609
5717 609 133 -495 394 -147 -38 182 455 -99 261 -170 -64 186 74 -53 -197 547 -404 -291 232 84
5737 84 -364 -365 -35 613 227 354 -49 99 -370 67 -108 -399 240 503 35 -320 -573 50 188 16 175
5758 175 -360 -420 38 88 -211 407 186 405 196 -273 -286 -256 173 91 -752 -609 -82 93 106 -233 -835 -322
5780 -322 -595 -36 550 268 -642 63 -263 297 -359 -479 -323 359 253 -509 27 339 -25 628 -60 -202
5800 -202 -193 -684 -259 -315 56 -82 455 -736 510 -634 -487 111 -321 -274 -582 -323 159 313 -65 -306
5820 -306 156 462 85 295 282 269 -402 -381 33 -162 -26 552 -141 156 209 112 329 -81 261 -126 -536 559
5842 559 -611 32 356 -1 -142 284 -87 791 -263 -120 700 85 305 -330 -268 86 -49 375 279 127
5862 127 -217 -336 611 69 -178 -365 138 -161 44 -113 347 88 -452 90 162 126 -102 -657 -526 145 0
5883 0 -64 127 -565 235 -196 81 -580 -399 49 72 -277 182 117 -205 369 -436 -5 -172 150 67 -533 404
5905 404 534 172 259 -152 -839 -85 240 -81 -354 -85 281 -174 -152 444 6 -6 -488 242 133 -469 457
5926 457 -688 708 95 188 93 911 192 -364 -213 -106 20 420 652 -107 -121 -219 -282 -330 52 -192 -600
5947 -600 -380 -501 275 262 96 291 106 791 447 -68 -39 57 605 -229 -117 230 707 570 -94 -320 371
5968 371 -116 -230 -392 308 -407 113 -50 326 395 -6 -27 -214 -42 -394 241 571 40 -66 301 -184 36
5989 36 125 -115 -308 256 422 45 330 743 -485 939 161 -34 -111 310 79 21 -305 -243 199 -426 -462
6010 -462 -53 -260 -636 -421 -163 -438 -337 467 -18 -167 -185 -89 102 106 -282 -286 -243 -182 -414 275 182 398 88
6033 88 -120 -9 -237 -190 -122 14 -532 -213 -665 -165 65 -312 -72 165 214 181 -250 230 437 246 412 216
6055 216 568 178 420 -111 -511 13 -254 301 -54 -366 -356 -258 111 -365 -396 -478 -431 -316 -268 325 241 345
6077 345 273 256 -271 508 -75 561 581 -43 161 24 -108 111 287 -138 422 -134 249 180 170 -637 356 309
6099 309 -308 204 -112 -284 -391 226 15 -386 189 -330 -235 204 -127 473 432 -273 500 214 -159 -82 22
6120 22 467 -60 349 -170 -396 -329 -353 454 92 -394 -558 54 -422 -765 552 -14 -327 87 -163 79 -279
6141 -279 3 122 -441 126 247 205 730 135 267 147 -364 23 -36 -792 504 -124 225 -38 -84 -233 597
6162 597 -767 82 -136 -233 -325 -284 -64 308 -187 102 345 477 96 108 -405 59 157 -717 540 465 -402
6183 -402 -465 -727 45 -691 199 461 -587 -32 -45 19 452 94 154 -151 -452 -85 -649 -360 -142 -320 -287
6204 -287 392 925 -39 255 -522 -252 194 348 677 -177 239 576 -52 471 -276 13 599 -39 -12 346
6224 346 245 154 9 76 627 -536 221 80 22 121 -331 -50 323 568 367 306 -410 -141 522 152 97 273
6246 273 306 -176 176 579 -185 79 253 -530 204 -46 -70 -369 -657 -8 209 -272 -378 -152 -418 123 -336
6267 -336 156 -360 68 240 42 -210 -160 -294 693 -602 314 -19 129 240 255 60 -479 28 -452 -470 -120
6288 -120 206 168 61 274 -58 247 189 368 -43 -262 123 178 334 -563 -286 499 -532 -81 267 370 275
6309 275 -266 -410 -441 55 -582 279 121 100 -164 -69 444 -472 -53 319 -42 -58 81 -261 401 -382 -66
6330 -66 232 77 135 381 -339 37 -143 398 66 155 -89 907 217 301 514 334 31 -570 -130 614 406
6351 406 -108 -295 647 -386 186 224 -267 -216 421 300 596 475 -152 32 333 249 906 -200 -535 16
6371 16 460 269 -168 -159 -43 -202 -270 331 309 128 -348 -226 -251 310 -141 -161 130 102 -155 -63 63 -144 694
6394 694 151 -168 286 -355 156 565 -439 180 145 500 198 -188 -303 -26 233 104 90 9 -323 -266 -243
6415 -243 -309 -56 -786 157 -82 286 -153 -159 -378 -353 353 460 -81 -581 390 104 214 116 163 -109 -355 -152
6437 -152 -695 -185 -90 -352 -239 -316 -430 71 -86 195 -433 -22 72 -107 32 88 5 -139 -717 -109 275 82
6459 82 -52 318 601 -471 63 174 486 -192 35 313 -69 72 -302 468 456 291 97 88 341 26 377
6480 377 123 194 -435 -198 -77 -63 21 -254 121 449 -359 260 296 102 257 406 287 -186 -674 210 309 384
6502 384 71 -141 -177 -254 254 -197 -407 -449 -213 -72 -125 -12 305 77 -24 -269 176 71 -400 -73 -234
6523 -234 -33 -90 -358 13 -180 -13 58 270 135 -161 212 -89 -11 305 609 483 -429 -367 -241 199 -61
6544 -61 236 -14 -475 -218 254 68 65 183 40 398 -520 -609 -149 -251 96 77 -104 -633 -124 -228 -133 134
6566 134 17 -9 149 -40 -55 490 -104 -147 127 -20 652 211 -107 405 206 -40 213 148 518 -24 205
6587 205 270 22 277 -660 -25 -631 -77 -113 533 -45 68 90 -297 -128 -385 223 -263 -322 -2 173 -143
6608 -143 -82 -231 98 -190 266 -248 1 -672 -14 95 -198 26 549 678 -371 368 -115 14 35 -26 308
6629 308 -70 159 -82 87 -19 -220 -6 323 -647 612 -249 481 -156 139 -182 538 245 179 -270 -119
6649 -119 9 36 376 -285 42 374 13 157 61 -114 -385 -22 606 -237 751 -351 540 -9 -421 -182
6669 -182 -233 -607 -423 -5 623 -649 430 26 -410 73 -28 -10 -397 381 -555 676 -54 120 -98 576
6689 576 206 195 4 -374 444 -762 -496 316 395 658 -46 -287 37 -264 516 472 320 81 707 302 -223
6710 -223 345 -145 530 -83 350 529 47 20 -41 54 383 401 546 -153 -622 138 -357 -40 -93 308 -485 446
6732 446 87 -450 818 -110 205 196 246 -183 -556 370 -89 -550 144 365 540 419 150 -38 204 266 400
6753 400 -351 256 411 227 60 -489 5 275 366 -716 50 57 -88 492 105 -179 102 -34 -28 266 120
6774 120 -294 23 -20 237 -16 -96 120 140 -369 -782 -71 -137 -2 94 -140 -50 -111 -19 302 25 165 74 71 -586
6798 -586 49 -32 -604 59 -76 -566 -51 315 -132 290 48 -155 -283 -328 409 4 189 -230 165 -446 -62
6819 -62 -524 -35 -137 -111 116 381 81 -314 -409 17 -242 582 154 289 -370 -431 103 11 105 188 -564 74
6841 74 -321 166 -289 -392 -44 -136 -76 228 -262 -424 -280 217 -74 -315 -476 -112 -50 -787 -185 -565 95
6862 95 -5 554 -352 -349 556 -323 16 389 604 -7 552 326 325 218 395 -81 -120 585 503 -154 -297 132
6884 132 31 95 738 106 -75 63 54 563 226 -119 256 -629 255 333 -415 -471 -14 -342 405 312 -271 291
6906 291 104 -231 -237 405 164 236 622 -141 159 46 -63 512 134 604 42 -270 185 125 342 38 41 -121
6928 -121 -288 -860 144 313 -191 -553 -456 150 -227 486 357 213 -80 -162 30 -93 -205 70 372 127
6948 127 292 -300 -247 15 -228 -220 334 224 -163 36 -92 513 -183 -186 509 -75 -404 -512 -51 -392 -133 -149
6970 -149 -681 -106 50 -46 -362 -331 148 39 14 206 -518 70 6 -145 483 331 -15 -139 -360 0 -363
6991 -363 -450 222 41 -143 -170 89 171 446 10 260 126 138 221 65 487 -130 -107 285 -364 -35 -508 -216
7013 -216 -84 97 199 187 -248 47 29 257 584 208 -42 627 -295 306 343 -453 196 -547 -222 -754 -371
7034 -371 -176 208 92 -220 135 -235 478 -209 -28 240 -3 -82 574 280 370 -414 46 -117 -92 -380 -401
7055 -401 291 -142 -172 182 -385 -105 -349 -239 -174 135 -731 346 -19 202 -197 -526 552 -129 115 39
7075 39 249 43 12 41 -116 -295 -36 -321 -610 0 -321 56 -272 -88 -333 47 474 -104 -368 -548 6
7096 6 275 533 -130 -603 -332 127 240 -168 325 152 -519 60 -16 43 -134 65 39 -48 -35 -283 -64 -297
7118 -297 -195 -37 -186 368 -444 -12 354 230 69 -317 -246 -148 124 -20 -92 234 -353 387 -13 -244 348
7139 348 304 -517 238 -396 341 -374 -110 481 -25 176 396 -150 -14 132 253 -521 374 -3 -31 -392 -182
7160 -182 -398 -171 106 -273 352 -84 -21 17 -200 -208 -235 351 -18 -118 107 104 527 245 139 -168 -92 86 -393
7183 -393 -215 -127 -66 -244 183 -73 -123 -157 -320 -362 -488 220 -345 568 -154 -537 168 -229 -443 -202 -446 238
7205 238 -97 395 -258 -415 -457 -326 -174 -405 -87 -136 -235 -157 -460 440 -558 -427 -825 -346 9 139 -77
7226 -77 -303 332 -115 -179 -156 -21 -315 -163 346 412 -375 -34 458 -339 330 -110 -187 119 613 -578 16
7247 16 99 -477 -184 536 182 -199 -259 -302 315 -195 200 -172 -189 307 298 -161 -168 -308 -397 -483 -321 86 -57 276
7271 276 -317 -750 -393 -477 397 -49 191 227 -423 445 454 394 501 -59 490 71 85 405 -232 -211 351 -125
7293 -125 -625 45 -191 481 -156 703 -19 -546 409 -156 -17 179 60 40 -67 31 -632 57 194 264 103
7314 103 -478 -490 626 133 -255 621 -116 60 -4 653 48 145 -171 -43 421 735 298 -32 330 -179 -393
7335 -393 -72 33 -327 300 135 278 211 54 -361 -139 716 -136 -40 -212 52 340 -232 134 -278 -12 95
7356 95 -566 -69 -348 51 -989 586 154 270 107 216 228 -151 79 43 260 343 413 -79 -16 -253 134
7377 134 308 -670 -61 654 -28 -155 134 -32 199 240 8 69 -185 470 810 33 -138 61 -29 -224 -554
7398 -554 623 -109 -370 243 30 598 239 -164 -223 327 -356 77 284 270 363 -21 90 291 -245 319 -74
7419 -74 -123 -261 -9 442 661 12 -536 423 -127 -278 -43 68 -185 626 -416 220 -53 -215 -200 172 188
7440 188 -28 -157 394 490 137 -62 183 -179 48 -351 293 -191 287 350 -155 -687 -120 -368 -263 -429 -232
7461 -232 368 319 36 2 -19 -258 218 -484 -59 -217 185 -479 -401 150 -289 -494 535 -124 279 -280 277
7482 277 -241 117 -534 508 -335 60 -74 256 -46 495 255 -526 -97 112 -276 -448 125 -550 -170 1
7502 1 303 75 134 -656 -161 383 365 157 377 -498 224 -351 -369 311 -102 43 153 -209 329 -449 642
7523 642 -248 -263 192 -20 -289 208 294 -395 -42 3 -40 -160 -1 275 270 -181 185 -372 785 302 95 -485
7545 -485 342 36 570 -313 180 -4 -170 390 118 237 85 -538 722 250 260 159 277 -233 -140 -357
7565 -357 116 -193 296 -416 -160 -232 221 -73 460 51 99 10 -124 -86 -328 84 -222 53 -170 -93 97 -500
7587 -500 313 283 -13 -133 113 -602 53 292 -47 -172 -117 83 182 232 -274 499 223 -311 -543 165 -211
7608 -211 13 -139 435 -154 269 44 90 -172 131 -143 -55 259 -392 -238 149 -49 322 539 -187 502 394
7629 394 -460 220 291 -196 -171 -513 -629 -291 -368 177 48 -20 -271 402 164 -561 -196 588 -137 -107 -260 -41
7651 -41 -221 -248 212 80 268 -137 406 67 -25 -488 228 -219 168 6 -359 171 25 115 -152 -64 -27 455
7673 455 433 -109 -306 272 -169 -592 -124 -256 -432 73 57 824 485 -500 149 157 -83 -212 271 20 -134
7694 -134 48 22 -170 81 -39 -280 8 324 340 222 -203 143 140 216 631 -104 508 482 68 -38 -65 457
7716 457 68 -5 -137 224 244 -501 542 88 -161 -101 195 26 227 -492 -478 161 -51 153 -100 -133 -326
7737 -326 75 240 -198 -557 -310 242 153 -210 -222 -424 447 312 189 211 622 72 -733 688 -196 398 -176
7758 -176 -227 360 318 -233 264 -492 49 469 287 365 198 -123 -598 98 95 -36 -84 450 455 55 -120 462 52
7781 52 -82 -108 -434 25 -24 -213 113 298 -62 60 44 153 -38 118 53 111 256 34 179 206 382 32
7803 32 105 -55 514 -588 -103 -890 199 -445 -182 315 724 -440 140 -295 -723 93 469 25 145 361
7823 361 16 -73 -97 -406 -10 -539 137 -115 -648 -75 105 -455 -23 -221 -184 86 -905 185 -271 -229 328
7844 328 82 26 -183 287 384 407 84 -393 -316 165 -412 171 -63 514 13 -17 278 -205 -177 -23 -88 619
7866 619 422 -144 108 -246 430 -70 -303 -147 754 -250 -288 -395 111 311 195 167 138 -73 -157 -81 307
7887 307 -151 278 -302 -87 713 -236 135 -341 173 283 116 -418 231 -240 178 52 63 -170 -620 35
7907 35 -839 403 146 -333 -276 -260 187 305 123 -40 14 -129 95 552 80 -77 -72 -158 -231 168 -169 167
7929 167 103 -119 -525 28 498 -500 -408 -107 -86 136 159 58 -123 -18 183 -24 -184 -474 -285 105 375
7950 375 -33 138 34 94 -293 335 139 -46 192 -140 304 -424 130 125 465 319 -198 29 -333 -819 434
7971 434 -35 511 82 248 218 -151 -361 -297 4 -110 -546 -227 343 -263 -355 -820 233 -8 468 -80 -271
7992 -271 100 231 -444 30 410 -327 -214 430 -204 -23 148 -99 -139 -338 -147 -86 254 482 48 174 -355
8013 -355 164 -208 -161 -382 -182 242 -35 -66 228 157 482 -214 147 292 156 31 -338 323 74 283 118
8034 118 -145 -413 175 -348 145 645 -53 -577 354 182 -311 37 122 396 -188 576 -99 66 476 205
8054 205 -252 653 814 -227 99 -67 -429 -102 -155 -214 573 74 -498 -325 473 -126 86 471 37 -245
8074 -245 79 166 -66 -744 482 270 -185 180 279 78 178 271 -200 162 -53 107 -202 22 -137 -461 -181
8095 -181 -189 -110 -328 196 5 -354 -643 60 -284 225 308 -56 102 229 -118 202 122 297 -75 -6 -232 -203
8117 -203 -57 -8 217 -522 -46 73 -700 -460 168 135 318 -4 265 254 300 -52 10 572 36 120 -172 165
8139 165 460 -319 -278 -59 104 400 -212 18 -187 -457 59 -352 23 139 -489 49 42 -88 -410 -38 398
8160 398 -279 79 -235 129 147 -114 -88 566 -288 -75 61 -566 -181 340 149 217 329 254 -144 359 50
8181 50 90 -74 27 115 61 332 -215 -291 135 -52
8191e2
$$ Imaginary data points
##PAGE= N=2
##DATA TABLE= (X++(I..I)), XYDATA
0 0 0 0 0 0 0 0 0 0 0 -32 32 -32 32 -32 64 -64 65 -96 97 -128 154 -163 193 -225 258 -292 344 -387 440 -497
30 -497 558 -628 702 -786 877 -980 1084 -1207 1340 -1484 1646 -1821 2014 -2235 2470 -2746
46 -2746 3049 -3393 3796 -4264 4812 -5477 6290 -7319 8668 -10524 13252 -17663 26008
59 26008 -47477 224879 369821 -104975 -175690 -20211 48464 -38209 100568 231127 74433
70 74433 -213029 -178168 51689 155485 93575 62780 13753 -93504 -125422 25124 162653
81 162653 133099 10550 -54591 -70640 -48665 29738 123907 107281 -18325 -112315 -79244 7257
93 7257 54924 58290 45241 -12965 -103565 -113688 14083 126850 75225 -47878 -72217 -30800
105 -30800 -31118 -17352 79598 114142 -23452 -149936 -78928 53311 54237 2182 15030 2059
117 2059 -101913 -124445 18238 118022 35487 -71241 -62038 -34020 -46234 -1913 88459 67653
129 67653 -57516 -102771 -29653 28485 28103 38540 36946 -36124 -101558 -50562 48616 65183
141 65183 7298 -29568 -38743 -54310 -40284 29313 77110 29438 -53971 -70182 -16453 27538
153 27538 35672 33753 21396 -22776 -64693 -35655 43759 70682 16079 -38566 -39359 -24427 -17334
166 -17334 15874 55366 26556 -49499 -66171 -10010 28168 24276 25685 21430 -27578 -63569 -13298
179 -13298 58671 50171 -3292 -16650 -12645 -33647 -24990 39976 65178 -2552 -60800 -34459 7792
192 7792 6570 10711 39071 20171 -45097 -55658 12232 56568 31979 1132 -1118 -11477 -27031
205 -27031 -581 50304 50338 -3838 -37329 -21675 3150 14661 27268 31196 991 -39039 -32264
218 -32264 14637 42724 27301 4013 -4789 -13734 -18015 11395 52341 42539 -9922 -32065 -6315
231 -6315 12227 8375 19352 32498 -452 -48782 -34286 23635 37888 1549 -12653 -1289
243 -1289 -15794 -33780 1355 48791 27964 -28678 -34745 -1446 4553 -4374 15465 26232 -15758
256 -15758 -54257 -25956 19908 15271 -10711 -11099 -11221 -35076 -38487 5480 33246 2125 -35715
269 -35715 -28027 -7273 -8946 -4811 19677 18056 -24807 -47745 -13514 21634 11481 -9853 -6861
282 -6861 -8571 -31898 -31609 11083 33843 -532 -35896 -23067 1888 -1761 -2270 21604 23448 -17405
296 -17405 -36665 1081 34883 19101 -2465 6146 6554 -18039 -14564 27207 40814 1972 -23990
309 -23990 -4544 11863 2003 7965 32821 23836 -16471 -21297 19190 36973 17126 7162 19262
322 19262 10556 -12749 1336 39011 38446 1181 -14056 6322 12571 1732 10988 30653 15338
335 15338 -19954 -18506 16560 28764 8920 3749 13110 2477 -14421 1067 32237 28597 -3919
348 -3919 -14078 1690 5214 -3194 7333 20753 3203 -26946 -21140 9032 13352 -3561 -4483
361 -4483 2232 -11028 -23737 -2894 23319 12521 -15684 -15937 -1100 -3234 -7872 6807 15956
374 15956 -7545 -29686 -16440 7825 4893 -9146 -6839 -3815 -18686 -24373 -1412 16957 1455
387 1455 -18981 -14336 -3100 -6236 -6264 9147 11337 -11009 -23930 -7663 8866 2024 -5522 -1361
401 -1361 -4012 -19059 -17847 4271 12282 -4667 -16609 -8413 -3697 -8926 -2992 12108 8321 -13175
415 -13175 -17675 295 9796 1179 -786 5404 -1948 -17517 -10607 10499 11790 -6171 -11994 -3799
429 -3799 -4451 -9364 -776 12447 4119 -14523 -12757 3980 8117 1403 4230 8172 -2822 -12886
443 -12886 -1484 15911 11145 -4176 -4519 1305 -3397 -6124 7056 15558 700 -14359 -5526 9386
457 9386 6809 719 8259 10924 -2850 -9678 7796 21650 10214 -3191 3299 8409 -905 -1938
471 -1938 14003 18062 45 -11230 995 12250 4476 -768 9331 10063 -5893 -8456 10142
484 10142 18754 5203 -3134 5787 8621 -2144 -1448 14256 14087 -3505 -10939 2284 6740 -2370
498 -2370 -3208 6489 2917 -13994 -12897 5699 9612 -4592 -9303 1245 480 -11306 -6945 10152
512 10152 7289 -12348 -14673 40 2750 -9990 -7227 3351 -3121 -19780 -15841 2573 2979 -12617
526 -12617 -13504 -2908 -6273 -16180 -8653 7758 1694 -16395 -13524 971 461 -9701 -3792 4490
540 4490 -4449 -17338 -8842 6253 2462 -10665 -8039 498 -4847 -12411 -2336 9883 1647 -11795
554 -11795 -5567 7892 4701 -3956 3999 11613 1829 -8238 1236 14186 8703 -3066 1588 9132
568 9132 2132 -4429 5789 15608 5786 -5974 1629 12605 6682 790 9087 15153 3667 -3538
582 -3538 8028 16965 9402 1191 7907 11784 3041 -431 10712 15111 3565 -4249 4386 9206
596 9206 1858 -91 9398 9896 -2196 -4993 7292 12609 3316 -692 5785 5739 -2224 -1157 8389
611 8389 9221 -1771 -6017 770 3873 -2163 -2168 2935 849 -7782 -7962 1546 4320 -3061 -5193 -460
627 -460 -168 -5844 -3799 4821 3286 -5957 -7581 -292 394 -6037 -4404 2041 -2913 -11347 -7954 1379
643 1379 -865 -8921 -6401 -728 -4516 -9591 -3686 3768 -1152 -8979 -5201 1430 -2618 -6742 -977
658 -977 2486 -4674 -10182 -2913 1835 -4218 -7348 -1904 -1739 -7539 -8767 -577 2651 -4335 -6893 -2659
674 -2659 113 -4236 -3899 2743 2698 -4461 -6376 -20 2453 -1883 -4136 1182 -599 -6741 -6045 1890
690 1890 3745 -3622 -6176 -290 1368 -3680 -2193 4863 4293 -3847 -3614 5100 6152 -388 -522 5338
706 5338 3769 -3565 -926 8253 5686 -3414 -1858 5204 3821 -2604 1057 9096 5357 -3591 455
721 455 9607 6802 384 3703 10935 5023 -1936 4494 11439 6497 -916 2978 8552 3318 -1917
736 -1917 4380 9716 3205 -3636 1859 8248 4208 -756 3557 7616 1635 -2541 3544 8840 3380
751 3380 -2493 2141 5666 476 -3394 2449 6097 -975 -7162 -2012 3465 -1537 -6341 -1259 2856
766 2856 -4479 -8708 -945 4624 -2317 -8235 -2208 1117 -4371 -8000 -420 1805 -6677 -10439 -2849
781 -2849 1026 -5892 -9965 -3073 -1384 -8120 -10918 -2443 1185 -7437 -9597 -2642 -250 -6613 -6705 755
797 755 828 -6600 -7221 -101 751 -5302 -5314 290 467 -6498 -5866 1450 1439 -4293 -4151 1249 1109 -3190
815 -3190 -2174 3819 3288 -2314 -1452 4195 4557 -282 339 5607 4148 -992 -759 6709 4234 -403
831 -403 16 5253 4068 -637 1926 7407 5201 -610 1614 6873 5981 1598 3479 7549 5172 400
847 400 3350 8792 5128 975 3615 6359 3662 -288 3651 7218 2626 -779 2508 5912 2391
862 2391 514 3103 5743 1336 -38 3778 5685 1298 -796 2981 3337 400 -658 3252 2566 -1182
878 -1182 -2248 954 1810 -1797 -2161 504 1076 -3043 -2606 1207 933 -1946 -2744 769 962 -2993 -2719
895 -2719 735 588 -3927 -3619 -412 -1131 -4909 -3615 -556 -1830 -5955 -4780 -684 -974 -5650 -3986
911 -3986 72 -1940 -5766 -2913 1460 -1606 -6451 -3140 -110 -1849 -6144 -2186 1028 -2858 -6367
926 -6367 -3653 -66 -3445 -6031 -3160 -217 -4016 -6774 -1081 1411 -2660 -5479 -1077 1505 -2896
941 -2896 -3308 71 1076 -2915 -3989 -82 1835 -2275 -3816 -503 2032 -1537 -3141 583 3032
956 3032 -1101 -2956 1909 4047 -523 -2178 2552 4689 -388 -1463 4112 5009 120 -934 4240
971 4240 5314 -41 -921 4429 5697 436 -789 5037 5855 15 201 5923 6153 414 1147 6105
987 6105 6548 542 2073 7008 5999 364 1251 6520 4847 321 469 4941 4142 -409 700 5270
1003 5270 3603 -1470 -399 4134 2894 -1012 -314 4121 2230 -1929 188 3526 2151 -2463 -1434
1018 -1434 2295 1048 -3404 -2320 919 -661 -5176 -3397 1439 -348 -4340 -3031 411 -913 -4838
1033 -4838 -3005 1245 -1652 -5676 -3034 343 -1733 -6018 -3692 -311 -3058 -6039 -3589 -732 -3952
1048 -3952 -6000 -3466 -430 -4045 -5846 -2900 -624 -3214 -5030 -2102 -173 -2991 -4032 -1636 730
1063 730 -1894 -3472 -1387 40 -2545 -3399 -1161 61 -2270 -2599 -39 884 -1264 -2028 318 1619
1079 1619 -700 -1091 2202 2773 350 -1068 1895 2904 1222 782 3205 2737 415 213 3193 3412
1095 3412 1084 818 2467 2723 1362 2308 4407 3375 1529 1745 4588 3995 1494 2545 4792 3325
1111 3325 479 2740 4723 2793 1292 2480 3645 2340 587 2383 3647 2076 635 2150 3328
1126 3328 1539 670 2620 3827 994 401 1853 3714 1107 -542 2048 2003 -749 -1434 811 1989
1142 1989 -1212 -965 627 653 -1740 -1408 732 402 -1615 -1647 424 843 -1739 -2532 181 23 -2400
1159 -2400 -2979 500 -219 -3358 -3661 -711 -953 -3890 -3965 -854 -1311 -4660 -3309 54 -329 -4126 -3446
1176 -3446 -1065 -1581 -3508 -3825 -347 -1127 -4099 -2935 -126 -782 -4710 -3147 318 -1660 -4093 -2810
1192 -2810 165 -1249 -3985 -2164 765 -649 -3494 -1332 961 -372 -3500 -905 1771 -701 -2736
1207 -2736 -824 1583 -82 -2008 -1180 2364 -353 -2623 -440 2461 214 -2091 701 2973 1181
1222 1181 -785 1813 3775 897 -381 924 4296 1879 224 1921 4204 1890 -143 1559 4203
1237 4203 1922 -492 2897 4957 1951 -301 3435 5104 1847 19 3277 4287 2032 372 3432
1252 3432 4819 2272 363 2942 4526 984 -264 2567 3769 829 -690 1765 2775 320 -1027
1267 -1027 2090 2530 333 -601 1613 1797 -486 -890 1214 1275 -834 -1518 611 1391 -1309 -2305 -66
1284 -66 686 -2345 -2706 -118 -87 -2578 -3050 -781 -449 -2725 -2757 -650 -754 -3242 -3503 -574 -918 -3710
1302 -3710 -3125 -727 -2098 -3415 -2819 -730 -1744 -3335 -2936 -1748 -1652 -3367 -2461 -1190 -2044 -2485 -2066
1319 -2066 -1028 -854 -2647 -1528 -885 -1090 -1925 -1306 -598 -529 -2180 -457 -272 -976 -2020 -56 -188 -819
1337 -819 -1090 77 635 -185 -798 454 1089 153 -547 1029 1148 982 -94 1860 1670 1056 676 1665
1355 1665 2028 628 468 2595 1811 1302 1044 2403 2217 1746 1897 2906 2919 1271 1918 3690 2770 765
1373 765 1837 3087 2127 393 1336 3023 1758 692 1371 2967 1947 533 1403 3062 1341 -30
1389 -30 1226 2299 1004 206 1502 2429 1062 -756 1109 1959 605 -735 -100 451 -451 -1046 298
1406 298 1309 -823 -1972 321 182 -1201 -1513 117 779 -1299 -1839 -476 348 -1298 -2257 -659 -130
1423 -130 -2050 -2716 -1360 -16 -2823 -2840 -829 -405 -2677 -3337 -1294 -690 -2621 -3398 -1013 -371 -2275
1440 -2275 -2731 -1387 -316 -2934 -3333 -928 -608 -2740 -2951 146 -867 -3223 -2231 16 40 -2014 -2510
1457 -2510 -558 152 -1888 -1664 232 -344 -2112 -1986 224 845 -1059 -1009 502 418 -1225 -1194 1264 332
1475 332 -1129 -255 1812 1743 -376 -988 2021 1746 311 -19 1582 2456 119 60 2431 1756 640 867
1493 867 2483 2269 576 1047 2639 2409 295 1053 3302 2744 611 1671 2996 2191 798 1279 3194
1510 3194 2497 559 2105 2994 2054 -79 1282 2428 1602 -131 1071 2256 1002 237 685 1248 1225
1527 1225 -473 670 829 465 -969 472 304 482 -482 -693 787 -535 -623 -525 -90 -1111 -1516 -318
1545 -318 -62 -826 -1322 -876 -604 -1455 -1544 -39 -747 -1764 -2240 -998 -776 -1177 -2288 -1837 -1095 -1207 -1812
1564 -1812 -1140 -794 -3015 -2529 -839 -2017 -2249 -1198 -1385 -1008 -2196 -1787 -940 -1197 -2169 -1221 -1518 -1404
1582 -1404 -1438 -1452 -380 -953 -1624 -527 -648 -852 -803 -666 -608 -773 -1027 -115 -345 -423 -930 272 526 308
1602 308 -443 -309 918 230 516 171 730 408 -98 1401 1661 554 1028 1446 910 572 927 1942 1645
1621 1645 527 1096 2034 2200 894 1163 1968 1949 1209 1368 2314 2185 1574 1364 2443 2069 734 1339 2413
1640 2413 1738 469 671 2356 1128 690 620 1977 1359 280 1097 2223 957 68 477 2132 1216
1657 1216 11 145 1275 607 -701 -440 795 63 -1066 77 365 665 -1093 -452 498 -174 -1201
1674 -1201 -262 9 -1120 -1882 -1445 -311 -1120 -2167 -1072 -344 -879 -2592 -940 -456 -1828 -2472 -1106
1691 -1106 -319 -1424 -2360 -1374 -482 -1754 -1724 -1063 -991 -1417 -2087 -1986 -360 -1462 -2207 -1191 -447 -1313 -2079
1710 -2079 -1266 -563 -1132 -2396 -1255 -482 -1020 -1837 -521 165 -1365 -1628 -97 331 -756 -737 -615 666
1728 666 90 -375 280 701 -381 -278 256 962 -175 -817 621 828 481 38 973 1945 524 279 1017
1747 1017 1970 1468 588 1695 1510 951 527 2155 1353 776 681 2023 1643 1059 1094 1569 2036 539 1291
1766 1291 2048 1600 798 800 1528 1031 715 1122 1597 1181 455 1106 1233 902 539 1020 655 364 401 497 812
1787 812 281 458 652 787 602 155 -99 222 83 157 -320 345 -447 -433 -728 -64 -60 -82 -680 -380 -245 -836
1809 -836 -857 -857 -694 -1193 -799 -828 -1503 -1435 -1567 -838 -1366 -1566 -1357 -744 -1712 -1364 -723 -1153 -1395 -1462 -1083 -1122
1831 -1122 -1274 -1558 -454 -1435 -1706 -1175 -1175 -1226 -1092 -1322 -839 -959 -1410 -1416 -327 -662 -1496 -551 -430 -456 -364
1852 -364 -737 -99 -934 -1206 -83 595 -645 -1055 -175 336 207 -358 326 294 -847 -242 453 1316 1092
1871 1092 323 1128 1296 987 132 622 1082 818 940 1342 731 1249 164 1031 1078 757 1055 1500 2022 306
1891 306 1293 1445 2037 1497 1034 1672 1370 1326 610 1853 1923 320 472 1363 1769 989 616 1021 1337 182
1911 182 634 1847 1175 514 17 809 625 -10 34 802 750 -421 60 491 483 -552 -188 897 124 -127
1931 -127 384 -206 190 -933 -644 349 -40 -692 -1195 207 -239 -1271 -1227 -373 -301 -1153 -1329 -704 -545 -1274
1951 -1274 -1123 -449 -1407 -1906 -1034 -837 -913 -1751 -1324 -731 -928 -933 -1496 -422 -693 -1426 -775 -340 -608 -739
1971 -739 -1184 -344 -429 -1153 -941 -354 -794 -1059 -804 -362 -531 -954 -796 -292 -270 -793 -168 -583 200 -528 -406
1992 -406 306 252 -343 602 86 364 278 -533 387 397 464 564 917 1221 151 122 1107 377 962 579 729
2013 729 791 431 164 1338 1203 823 860 1072 1058 738 1833 1173 1525 631 1119 1138 918 730 816 1050 861
2034 861 809 1514 470 788 1204 910 1157 184 1221 386 563 289 266 122 523 174 472 998 659 -183
2054 -183 -186 582 453 85 227 139 -61 -46 -45 80 -559 120 130 -372 -1121 -826 -204 -291 -150 -1009 -426 -266 -928
2077 -928 -1450 -514 -1168 -1148 -1444 -864 -481 -1590 -699 -607 -632 -1319 -874 -471 -370 -1541 -1013 -1061 -288 -1087 -1166
2098 -1166 -573 -309 -1019 -1147 -643 -636 -1148 -1452 -475 -568 -618 -732 428 -36 -846 -377 164 -60 -806 -433 -394
2119 -394 -489 -393 357 563 98 138 11 914 58 -213 397 1052 679 -659 111 1057 237 857 1027 1086 1048
2140 1048 264 924 655 414 650 1517 1206 663 776 353 821 1641 591 796 1464 1468 188 931 1179 969
2160 969 575 674 1293 841 629 500 1765 675 313 646 798 447 692 503 1362 623 -132 437 890 692
2180 692 -774 519 1428 328 -131 103 574 177 -185 543 103 -454 -99 -140 -313 -516 -613 -562 -726 -892
2200 -892 -894 -599 259 -1129 -875 -624 -487 -661 -1320 -492 -603 -1362 -642 -785 -866 -770 -990 -975 -391 -598 -1235
2221 -1235 -956 -255 -882 -649 -1014 -1193 -1310 -1083 -1252 -637 -648 -932 -660 -601 -877 -782 -866 -119 -678 -1031 -261
2242 -261 -223 -661 -442 -569 -212 -162 -406 461 -271 -80 -54 646 35 -117 -47 -750 661 262 34 519 483
2263 483 -123 143 778 712 931 1114 1245 646 1148 1350 619 595 1238 597 443 842 869 945 1199 763 582
2284 582 855 418 908 515 998 1321 439 -114 1440 823 974 62 1159 787 768 767 490 565 -2 -45 419
2305 419 1324 130 167 487 355 -86 581 84 257 213 -466 186 -72 -168 -95 51 -441 -170 613 -70 -91
2326 -91 -750 -99 262 -115 -1254 -1048 -125 -1102 -722 -25 153 -458 -1277 -802 -710 -697 -862 -227 -230 -199 -581 -785
2348 -785 -408 -898 -1094 -623 -45 -617 -854 -406 -540 -535 -1319 -581 -260 -438 -698 -542 -74 -814 -685 -393 43
2369 43 -892 -1149 -16 -22 -420 -1209 434 364 -479 -744 785 319 -230 -466 -57 343 -290 -738 554 766
2389 766 229 156 550 656 136 184 387 827 695 474 230 1275 322 512 757 777 390 764 473 617 868
2410 868 438 1134 469 153 540 1612 492 331 674 1088 778 642 190 189 924 860 932 516 793 392 256
2431 256 286 368 -4 -122 641 233 570 19 576 520 146 -111 215 -235 -635 -439 336 246 -44 14 208 -143
2453 -143 -21 -170 -44 84 -809 -641 -424 -294 -460 -387 -212 -414 -322 -1261 -788 -434 -900 -829 -48 -888 -554
2474 -554 -623 -1044 -673 -537 -1048 -393 -577 -124 -387 -479 -510 -275 -616 -369 -949 -998 -554 -454 -450 -968 -219 -385
2496 -385 -458 -757 -153 -527 20 -307 -410 -238 -5 -611 -380 -80 111 -467 263 -505 -273 -271 165 411 154
2517 154 348 228 490 56 47 156 665 533 768 121 586 641 281 1041 479 294 263 513 838 -239 738
2538 738 367 127 366 736 800 1001 856 941 900 -75 453 925 639 494 868 633 615 588 428 705 442 -122
2560 -122 522 1113 859 367 8 551 1060 287 -82 392 579 -50 328 167 -175 -148 -434 -388 361 181 -274
2581 -274 -225 -215 -354 -435 -414 -380 -326 -866 -163 -358 -344 -949 -49 -272 -602 -803 -617 31 -1070 -1295 275 -483
2603 -483 -997 -423 -585 -551 -925 -1231 -132 -656 -1535 -1105 -220 -444 -151 -750 -20 -600 -554 -1017 -190 -79
2623 -79 -733 -608 -579 -364 -140 -652 -129 -482 -380 -768 -285 141 -513 -144 155 364 -492 -99 -133 -274 -62
2644 -62 -301 280 168 -1082 -275 621 6 -187 -13 582 653 -1 -57 475 335 -82 195 439 557 518 307
2665 307 709 201 663 744 400 461 232 511 1444 721 350 733 707 719 -29 759 680 617 -454 530 520 433
2687 433 -202 423 317 112 413 1127 728 776 443 43 379 -144 -272 164 949 306 -123 146 -115 -175 -183
2708 -183 -279 202 -306 450 230 -178 314 -130 284 -199 -442 60 57 -524 -555 -89 -295 -368 293 -293 -1161 -1213
2730 -1213 -359 -305 -482 -453 -240 -969 -829 -401 -1080 -582 -918 -278 -426 -800 -222 -976 -775 170 -322 -485
2750 -485 -693 -413 -654 -764 -242 -517 30 -435 -880 -733 -714 -322 -749 -412 -718 -339 -217 195 62 334
2770 334 -75 201 -168 -608 615 139 -149 222 313 368 408 343 573 64 212 127 921 784 196 977 142
2791 142 910 527 603 114 513 743 550 598 693 596 769 889 997 66 459 284 776 660 135 828 1128
2812 1128 842 982 437 397 39 58 30 454 526 128 961 398 418 212 255 317 510 -154 210 227 -38 471
2834 471 164 356 404 -228 280 869 180 -394 1029 56 -127 -375 -35 34 -196 44 85 -358 -777 -348 -122
2855 -122 86 -482 -634 -241 -419 -588 -375 155 -257 -465 -910 -278 -7 -688 -900 -480 -776 -288 -888 -463
2875 -463 225 -508 -494 -493 -646 -526 -128 63 -493 -785 36 -56 -379 -1048 -469 97 -673 -606 -321 -158 -551 254
2897 254 -149 -555 75 -192 -663 416 -56 -353 22 -243 562 277 51 263 225 63 386 298 133 349
2917 349 630 679 566 487 293 430 608 116 20 -223 189 52 -35 897 345 933 476 208 1041 45 3 273
2939 273 467 513 763 190 707 383 238 312 241 665 124 572 781 251 220 -82 379 384 272 -143 805 34
2961 34 -245 271 159 354 709 -48 -320 179 357 424 135 -393 -536 -353 85 -384 -12 -114 -210 -326 446
2982 446 19 247 -409 -92 9 -477 -166 -325 -249 -499 -112 -456 -517 -305 -473 -405 -250 -986 -745 -386 -280
3003 -280 -816 -559 -487 -368 -157 -190 -542 -688 -663 -708 -298 -527 104 -245 -150 -557 -775 69 -647 -558 -8 35
3025 35 184 -606 -480 -300 -172 215 81 157 -44 -318 -164 138 441 228 113 132 264 -181 -133 -54 465 147
3047 147 312 570 966 142 -34 502 119 545 214 811 655 1014 411 345 303 906 595 -116 749 11 822
3068 822 204 615 412 348 209 479 121 262 795 290 349 -179 272 122 200 229 763 432 594 32 516
3089 516 422 522 283 226 640 -189 95 206 278 133 301 -59 490 139 -507 60 149 -664 68 160 -167 -30
3111 -30 46 -13 -282 -436 -601 -359 -9 -97 -691 -68 -139 -37 -694 -786 -306 -564 -509 -564 -697 -355 -337 152 -1062
3134 -1062 -965 -733 -591 -445 -946 -783 -161 -510 -274 -166 -232 -219 -563 -875 42 -9 -287 -440 -425 -241 -666
3155 -666 -517 197 -557 -309 473 -251 -251 -12 -338 396 494 -47 134 -286 157 6 -80 409 -104 271 -42
3176 -42 277 624 372 127 821 192 103 376 532 332 52 704 283 367 1 483 611 231 252 615 150
3197 150 -222 450 -4 185 111 147 416 185 -298 590 772 389 923 737 612 309 339 467 554 412 61
3218 61 364 -33 272 -131 147 -17 273 -270 562 -272 222 -650 -136 274 -145 437 -102 -104 -205 -167 71
3239 71 236 -605 -275 163 -277 173 -68 198 -127 -642 242 -246 311 -404 -1071 -601 -356 -118 -302 -444
3259 -444 -72 -440 -418 -469 -378 -613 -574 -227 -201 -611 -277 -339 -317 -983 -604 -126 -316 -288 -415 -422 196 -425 13
3282 13 -13 -611 58 -184 -211 -102 -603 222 26 664 -103 -267 107 -210 209 -30 537 191 700 471 889
3303 889 -190 187 -907 261 35 -208 -520 180 -38 578 183 173 92 185 -102 916 354 -36 -153 190
3323 190 -247 261 -567 674 418 1064 244 238 45 801 -14 357 629 325 324 457 774 320 382 285 267 27
3345 27 782 -68 679 440 -76 448 537 -58 -95 482 94 -184 357 206 -24 124 -264 156 181 82 112 -285
3367 -285 274 -5 284 -135 -440 -267 -165 118 368 -388 -273 -247 78 -102 0 -578 -225 -439 -245 -923
3387 -923 -247 -73 -565 -252 -501 12 -219 -380 -305 -485 -404 -194 89 135 -315 -705 -974 -403 -589 -197 -114
3408 -114 251 -13 -15 -1138 -150 67 -164 -720 -401 -612 -374 565 291 579 -32 -266 490 712 411 59
3428 59 -122 193 213 -233 -552 -123 -379 337 227 -300 350 -253 535 388 103 280 250 308 340 461 295 185
3450 185 488 132 589 499 -179 -14 179 132 398 530 425 573 778 489 589 341 189 377 598 -121 16
3471 16 762 195 290 90 523 237 179 579 178 335 667 -4 374 223 -99 -141 -583 52 -207 281 735
3492 735 -134 -504 489 121 -562 56 -254 189 371 504 -650 -271 66 -259 385 356 151 31 -918 -223
3512 -223 42 255 -390 358 -601 -227 -259 -204 -293 -335 -159 -512 -467 -1004 -182 30 5 114 -637 -221 38 -7
3534 -7 -610 -701 139 -781 -638 -719 -100 -329 -579 -25 -34 17 -395 -39 -347 130 -284 -15 71 -680 -77 -184 -599
3557 -599 -412 462 646 -186 242 -163 -449 560 376 -222 -51 265 -3 -197 -30 459 283 379 184 310
3577 310 750 -282 718 354 126 -144 418 -229 90 -245 184 -288 683 -321 484 -78 -59 1462 478
3596 478 549 -79 170 437 498 232 767 473 556 77 498 224 800 227 -51 91 494 81 -145 686 189
3617 189 514 -197 -17 -32 353 250 83 85 -103 -53 -63 -9 517 356 203 -563 -529 328 -451 -663 -281 -396
3639 -396 -770 -397 474 -62 -357 -500 101 -306 275 129 -344 -364 -519 123 -21 -703 -833 -616 -192 -526
3659 -526 -152 -161 -438 -572 -420 94 -802 -575 230 -539 -203 -304 -504 325 -476 284 90 353 -543 -55 46
3680 46 -569 -235 16 -279 -264 -98 0 -256 -203 -578 -344 -409 343 -153 29 -292 -29 -74 274 549 -65 589
3702 589 -87 478 551 -64 387 -166 373 53 310 112 719 -64 -342 604 -143 529 295 182 442 482 531
3723 531 -189 502 342 300 -17 56 717 231 103 233 160 804 424 -331 550 392 632 586 838 82 -74
3744 -74 -15 177 408 -178 -16 -85 40 53 -544 410 73 145 -135 -7 -231 -326 257 -385 -293 -470 482 -133
3766 -133 -12 556 -628 -697 -341 -62 370 46 -77 -34 -234 -610 199 36 -297 78 -180 -920 -178 392
3786 392 -18 -524 -256 237 -452 -227 -338 -380 -349 -316 -138 -471 -249 -159 -67 -438 -796 265 -71 302 -89
3807 -89 138 -156 -150 39 -57 -102 467 252 -317 -107 373 363 138 -323 -182 74 -143 798 23 187 463 87
3829 87 44 226 577 648 458 529 -140 -51 8 547 -170 84 179 134 464 183 949 518 239 83 23 200 481
3852 481 1008 598 682 -33 -195 712 571 -234 -333 -306 520 739 -298 2 57 206 -3 450 -23 69 736
3873 736 47 -264 457 877 669 881 110 2 657 161 -294 -327 109 -536 -335 -759 39 421 -315 50
3893 50 736 458 -553 120 -110 109 40 -543 -177 -9 -16 -423 69 -732 -78 -433 -880 -503 -106 -265 -258 -422
3915 -422 33 -453 -283 24 -291 -139 -612 -109 36 -196 -282 -38 117 -461 -312 227 180 -482 23 -336 -116
3936 -116 -131 86 -240 -279 243 46 8 -150 127 231 299 536 4 -461 210 180 492 -212 39 210 186 305
3958 305 465 201 747 -176 712 308 445 -160 -412 154 -37 -259 85 349 737 310 51 166 512 554
3978 554 81 37 235 200 604 370 -115 323 175 207 36 -173 -208 400 281 401 184 542 175 131 -228 252
4000 252 -80 345 109 425 276 397 29 723 41 -53 -33 97 418 -503 -268 -195 824 691 112 -890
4020 -890 488 135 352 -258 698 -700 -372 -265 -482 -246 -504 -456 158 272 -338 -81 -27 124 -364 -207
4040 -207 477 -670 -372 -483 213 -27 -233 96 17 138 -129 -704 -535 -282 -190 -920 -274 9 -250 -822
4060 -822 141 -195 178 -146 -270 834 -105 -306 -168 305 171 101 318 -158 240 -13 42 186 -463 427
4080 427 227 -77 101 -60 116 213 166 201 -481 223 -369 393 243 452 174 -65 250 272 250 -96 -420 499
4102 499 -57 -12 -189 873 117 -47 73 376 -219 -525 480 219 -44 243 272 227 676 287 657 533
4122 533 165 -5 -248 291 -131 146 318 -303 234 142 192 202 510 373 -289 54 207 -411 -183 -598 -432
4143 -432 -18 305 -323 226 -252 -368 -551 -318 -163 25 84 -16 -462 -159 111 -795 -225 -314 251 -500 -45
4164 -45 -275 -775 -495 243 -747 -432 176 -370 -322 160 -608 -581 -53 -293 -186 -46 -531 -78 -248 -597 133
4185 133 -3 -245 -404 -80 158 -177 29 -51 -452 -150 -577 -679 -29 -104 -382 -59 -4 -493 100 -103 -716
4206 -716 456 -799 31 492 -20 -110 38 114 236 -192 578 216 188 -402 258 -267 -39 -6 -7 591 16
4227 16 -268 366 409 542 381 -360 -2 510 237 196 19 764 449 327 491 38 402 285 462 38 847
4248 847 406 443 484 72 241 445 -39 28 207 1016 -168 -182 529 -87 -86 443 -558 68 297 -485 490
4269 490 256 -540 -12 18 70 -800 -91 513 61 372 572 -695 460 -382 -169 70 -321 -159 279 -13
4289 -13 -55 90 -449 -473 286 -584 -425 151 -160 265 44 124 -278 155 203 -531 -59 -200 -92 -145 -115 51
4311 51 143 -42 18 -392 -479 -282 -65 -578 -419 26 -359 -42 -395 -372 121 -7 -183 -374 -39 72 277 197
4333 197 558 -179 32 -740 -300 -44 -61 -150 292 26 -53 -151 7 138 -319 -828 -393 -287 183 130 168 131
4355 131 -15 18 336 378 332 -236 26 271 -1 240 329 53 10 -68 206 437 255 59 -51 449 -19 923
4377 923 380 20 93 65 121 -161 404 101 -105 -313 -74 177 -52 126 94 141 310 95 -69 -126 -483 -104
4399 -104 55 120 -254 357 -815 -226 57 -270 125 349 370 194 280 -423 -450 182 256 -637 -114 35 -416
4420 -416 -320 -542 -46 -262 -223 -148 -93 358 -126 -115 -387 -385 -731 -667 -339 -165 -341 -763 517 -175 -258 -196 -490
4443 -490 204 -149 147 -312 -70 -558 -748 132 -417 -250 -297 -198 -356 -154 -36 200 156 -113 232 60 408
4464 408 -345 152 -250 -252 399 -154 373 71 -294 463 -258 207 271 72 117 -283 -113 -136 422 553 335 33
4486 33 19 -82 855 -90 99 85 531 51 87 910 -421 -203 322 440 72 197 131 200 -387 -14 -48 -59
4508 -59 816 233 737 -164 493 184 -169 -12 477 138 88 287 -274 -138 47 -4 -53 681 591 -182 -249 49
4530 49 -345 -206 -388 528 208 311 -207 -237 -141 273 -589 141 199 312 123 151 -372 508 -16 279 50 -216
4552 -216 -68 -540 -528 31 196 -638 362 313 -477 -319 -1096 199 -159 -280 58 319 202 -688 -289 -37
4572 -37 -205 7 -362 -296 -480 78 -439 -146 -620 -288 -740 -100 252 -134 119 24 405 557 644 235 94
4593 94 328 -414 276 -119 265 -658 130 188 259 -314 365 42 201 448 -27 119 275 488 325 4 -195
4614 -195 117 375 372 -81 73 -57 -206 37 -393 -20 -468 -33 -99 -490 -346 252 163 -246 612 378 351 -433
4636 -433 -130 -117 76 -549 -542 -262 186 403 -37 -63 -180 -34 -52 211 299 430 109 189 129 387 -276 273 -290
4659 -290 265 361 310 27 563 -53 -399 695 136 -455 149 389 -93 -453 74 -79 70 -304 103 -349
4679 -349 -476 -618 -1 -587 -363 -19 -451 352 -248 174 -414 83 -119 -36 -51 314 -683 -101 -220 -293 118
4700 118 314 33 -346 -48 -98 259 73 -281 -200 -495 -337 426 503 -607 -260 415 -164 -493 -157 -715 81
4721 81 -594 189 203 -242 188 276 84 347 -389 -143 361 55 -124 448 -35 -52 -99 -520 63 -231 -52 35
4743 35 662 381 213 160 415 160 -210 -235 640 -93 -369 391 99 698 304 46 465 -118 417 222 760
4764 760 51 561 -282 -26 241 391 -73 0 413 787 273 63 290 -135 228 18 204 -125 -589 223
4784 223 560 -295 -63 367 -30 667 811 -5 -381 -42 65 -233 7 -146 -113 -140 327 301 271 -47 -208
4805 -208 -593 141 72 -2 280 85 48 -55 -203 -219 125 -225 -388 -411 -156 -195 77 -334 150 -62 -136 -728
4827 -728 233 3 -497 36 185 155 -277 -306 54 -405 -104 -201 -251 -591 -292 347 221 -321 -7 298 -79
4848 -79 -9 -353 -420 -288 -15 85 -60 38 -312 531 475 483 333 -2 -52 -250 -177 212 -68 58 -281 62 171
4871 171 436 -90 -74 -277 -83 -91 -84 -361 -336 390 -13 138 476 93 -334 -445 207 717 642 1023 235 250 274
4894 274 411 -161 249 26 103 87 207 657 -27 -408 -52 296 341 -9 461 486 -347 238 168 199 437 -140
4916 -140 211 378 247 -2 -158 -37 -3 -151 399 -11 11 -487 -68 -148 62 -98 -524 -108 119 -154 194
4937 194 -75 -65 -223 307 601 -146 371 625 -115 57 -25 152 328 136 -41 -122 -16 318 16 -174 28
4958 28 -281 434 171 353 180 -146 -267 76 -183 522 -85 -415 -167 -283 -417 -290 249 114 266 -20
4978 -20 -501 248 -44 -6 -379 127 -100 -113 611 -196 72 -334 -71 -239 314 237 257 18 245 40 -86 -71
5000 -71 -320 135 -186 -195 -293 750 -413 21 -460 109 14 -43 54 -351 -187 -108 106 458 222 489 283 -152
5022 -152 352 -530 335 -103 186 -54 350 -135 45 138 147 134 363 -331 498 155 327 12 161 296 -398
5043 -398 335 178 739 -109 206 -315 551 -247 316 151 237 -654 126 -141 -308 211 289 163 -506 -8 -291
5064 -291 240 -203 -252 567 -36 192 -117 -410 117 282 231 598 149 227 -101 -579 -208 -76 -166 461 -192
5085 -192 -215 197 -119 50 337 -141 -20 -269 -36 83 -532 83 -225 146 -68 -866 224 -9 389 342
5105 342 296 271 -63 -216 174 441 -338 -182 -188 -200 -132 322 -467 -38 344 -611 -307 4 146 -38 -175 418
5127 418 -265 -66 -105 207 -387 -9 176 247 -316 426 80 56 123 391 189 -10 -176 259 84 -122 393
5148 393 -135 -375 -148 -276 184 50 -277 13 -21 -551 203 295 430 -343 47 267 317 -480 -217 -1 -323
5169 -323 -101 -30 511 191 -30 243 106 613 -46 48 82 -178 -482 -527 134 -309 394 207 372 175 399
5190 399 0 849 543 -940 -445 -159 -291 -125 298 -247 -367 -277 66 -101 350 -282 -457 -44 218 -311
5210 -311 -517 -67 -91 100 -176 -459 -850 -153 56 -41 -113 301 198 -516 -592 256 349 -236 352 50 0 -192
5232 -192 506 -203 -717 64 -378 149 180 -825 -300 526 -864 -67 460 -24 67 -212 -101 -344 -589 13
5252 13 -246 -252 104 356 -26 -302 140 -89 -270 620 -357 223 -193 141 55 -94 -811 429 -191 120 -40
5273 -40 -130 67 -488 550 897 495 216 -37 -242 282 -446 83 574 -322 737 401 412 137 211 45 -117
5294 -117 529 402 73 -179 -123 156 -226 -18 187 68 -417 61 -196 -620 472 -569 339 327 -179 -468
5314 -468 -471 128 234 338 27 291 -317 -420 -168 -225 -347 224 -225 -504 -320 55 -329 189 432 -166 -546
5335 -546 298 -228 0 410 -549 -166 38 -118 -444 -38 -296 -180 625 165 -259 -631 20 -698 -6 422
5355 422 -694 -572 413 345 -780 200 611 358 23 -373 -364 1 206 131 -143 47 -188 138 -414 -104 178
5376 178 -74 -498 676 -1 -251 -283 -234 -132 -86 -346 -398 80 56 -275 144 -130 132 156 -147 125 104 -82
5398 -82 -97 -449 289 379 -104 794 -346 815 180 -386 -124 224 204 403 336 480 197 401 -127 86 -535
5419 -535 176 433 -408 -211 356 52 89 -232 91 201 -40 206 1018 360 -131 241 24 -105 174 -2
5439 -2 41 488 61 -56 -269 -383 -319 -195 -125 24 489 426 210 -735 -367 383 -791 -327 -378 -376 -30 120 -295
5462 -295 -523 74 312 33 133 -289 281 117 -257 -388 -262 -431 -330 207 25 -49 -33 405 199 -85 116
5483 116 130 -247 -14 89 -56 197 6 -444 -223 -315 -249 -728 268 -812 386 -181 -55 103 104 221 -142
5504 -142 -126 -1048 146 -395 393 3 -385 -572 283 -75 212 370 -234 -62 -498 25 236 515 167 -160
5524 -160 -274 -50 -430 -19 339 -48 358 -76 672 629 -394 -73 333 51 -241 -243 -5 -278 -202 185 308
5545 308 748 115 240 -229 97 -287 -376 -134 153 272 -18 182 204 126 288 580 279 -2 99 984 250
5566 250 30 91 -374 292 153 -21 -298 -103 -214 -582 424 -564 -396 -86 -159 479 207 -283 114 -363
5586 -363 319 -413 -602 -518 58 -349 -1 -353 166 -291 -695 -260 -162 -452 -31 188 -154 -78 32 247 -379
5607 -379 -198 -182 -168 7 232 -161 -597 -386 38 -301 -22 162 -525 175 -376 333 4 -266 -233 44 350
5628 350 -145 -633 -80 -200 -47 586 -104 -20 133 -327 538 566 -1 173 -453 544 51 397 -232 -197 14
5649 14 311 -267 236 3 -109 237 -370 422 -105 -157 262 612 -165 -234 -523 142 81 402 -44 268 -261
5670 -261 -646 -259 -410 738 435 168 21 -423 -126 276 -46 88 -288 -489 99 -9 446 -135 31 100
5690 100 -322 385 28 43 445 -43 164 -64 -256 -198 121 -199 -455 584 -346 119 143 -167 155 -57 480
5711 480 211 91 423 -985 -332 -140 160 -444 59 548 -276 -20 -38 467 -522 330 -355 222 -630 -284
5731 -284 -198 -242 352 -561 200 -342 126 -358 -165 -118 110 85 -157 -260 105 147 -176 -147 143 100 -286 -52
5753 -52 379 -346 -290 -145 -549 36 -201 -13 -10 119 -496 -622 136 413 120 -248 345 346 388 75 62 242 207
5776 207 -290 -44 -187 38 347 -322 290 454 -165 424 151 1 550 -266 303 429 -493 253 123 -225
5796 -225 303 103 -532 101 -513 -97 152 271 234 -186 -94 588 197 95 113 -32 -429 -318 480 151 84
5817 84 -216 -457 575 140 222 -305 337 501 -490 27 -76 329 -59 323 -38 -177 -106 -196 -90 -406 -116
5838 -116 -1 30 983 229 -138 -880 -26 81 -283 -382 7 -114 -25 198 -284 21 31 597 -12 -193 296
5859 296 150 220 326 34 -221 -136 -362 -324 -211 -142 89 -213 -223 -58 160 -362 -5 630 133 93 -437 9
5881 9 109 156 -517 522 -269 475 148 -110 40 56 333 266 110 -517 565 94 -131 -610 -684 -357 -63
5902 -63 -357 -230 106 169 -21 392 689 536 -196 -144 348 -92 397 47 179 -52 -387 -26 -150 95 473
5923 473 489 -275 -29 112 152 -449 335 312 -13 29 -55 433 -65 61 207 356 124 -272 470 -158 -96 223
5945 223 -130 -127 112 106 104 76 -154 588 -320 97 -324 -1 336 -29 573 -346 -110 -521 -433 232 129 -150 -284
5968 -284 -202 155 458 192 330 30 -187 -399 657 109 -249 310 -50 -319 694 23 -735 -160 -139 36
5988 36 512 -89 -397 32 -356 248 149 -176 329 -32 -282 -311 -431 -557 -6 -175 -331 -204 174 -362 38
6009 38 -185 392 -196 -247 -349 -384 28 -98 -325 -473 97 -355 80 437 189 -24 358 -46 -58 109 218
6030 218 325 118 249 -88 50 86 48 -169 -107 879 486 168 -83 218 131 -158 168 332 207 485 -126
6051 -126 -282 -121 -162 492 -88 74 542 315 -248 -112 182 -15 35 495 115 -32 1167 -40 164 -102
6071 -102 -87 75 332 -88 100 -284 358 10 236 121 -465 -349 -22 -365 401 31 -178 -141 -45 479 347
6092 347 -577 19 -319 -14 150 309 878 122 103 332 64 -5 0 -138 -99 -251 -309 92 110 208 -380 -175 460
6115 460 111 190 -298 -485 -513 -424 -656 -241 -275 -712 -639 22 -302 -298 150 -37 -119 616 38 788 346 109 -577
6138 -577 -348 89 229 -160 623 70 23 -429 234 -600 148 92 -22 -307 190 270 -40 186 218 522 380
6159 380 -17 -509 -786 -233 -28 -86 -155 -336 13 109 -101 -206 107 87 165 -13 117 -270 742 -201 206
6180 206 389 72 31 914 91 205 -198 -108 3 284 20 -229 298 299 404 -732 -267 411 117 541 291
6201 291 -389 97 -329 166 133 -61 -262 299 8 706 529 185 -209 540 112 24 -38 106 215 454 277
6222 277 -253 -157 351 -189 456 -314 -17 113 -32 142 -304 90 -70 14 -265 -273 176 34 -68 15 466 -227
6244 -227 -789 -213 158 -344 -10 161 228 -292 -421 438 139 8 -240 19 352 -193 6 -223 -183 -439 466
6265 466 -733 68 -308 2 -53 -404 -59 349 -51 -68 -228 235 453 126 43 72 263 74 18 -155 -249 61
6287 61 -566 -179 12 23 -73 167 -153 -339 -433 13 16 -116 498 -78 -128 343 346 -60 -7 49 264 317 490 -368
6311 -368 169 240 225 -126 435 -2 -281 662 -579 -249 -144 433 -135 482 -238 -54 467 295 130 -182
6331 -182 28 66 -105 309 312 277 110 -204 -282 163 -17 -215 316 -211 320 -212 -211 153 86 119 -133 -146 -470
6354 -470 183 163 32 -35 508 219 420 -496 -417 -729 -583 -111 167 -316 171 -56 -236 -118 192 -205 203
6375 203 -218 117 -389 -349 -275 457 335 106 -42 -156 291 -32 536 -467 -124 -182 -4 252 737 69 -88
6396 -88 -292 -304 17 323 3 -90 -301 -67 11 504 -203 -63 -82 538 529 -188 -615 -18 -74 -232 -83 -436 204
6419 204 27 50 19 412 -76 152 648 -329 -92 -58 -464 140 -88 476 97 -368 -210 -106 579 -79 319
6440 319 56 -156 293 238 1 368 276 10 121 254 127 -229 381 445 213 183 257 -98 243 329 132 -27
6462 -27 -56 -346 508 44 197 -683 402 -142 40 -195 -166 180 370 81 306 434 -156 437 76 100 -84
6483 -84 -46 -121 -421 390 -215 81 -263 361 -263 -58 474 97 -74 450 419 251 -18 450 -45 -212 363
6504 363 21 35 -290 267 308 52 136 212 392 272 -369 -242 198 109 676 300 208 -368 -15 -99 -150 143 174
6527 174 79 -124 -315 -71 -730 -503 -351 540 -401 -252 -308 139 466 205 -84 70 122 -165 11 466 157
6548 157 -344 -309 234 40 -77 -8 -381 151 325 -189 -239 211 271 -152 -278 -437 -516 287 228 -441 6 666
6570 666 843 151 85 -153 497 -135 95 151 164 24 890 149 -54 357 383 -181 145 85 359 -61 -201 -373
6592 -373 -46 419 -120 140 179 294 -475 233 142 -546 -31 -182 1 320 656 -674 135 -441 -133 194
6612 194 -370 210 -556 34 84 59 -447 550 267 -483 83 -447 441 267 -465 61 -118 348 -251 -262 -188
6633 -188 622 -591 -617 112 167 -121 46 92 -215 -502 319 485 -467 -65 -132 -195 22 -305 -265 152 -372 -103
6655 -103 -139 -226 442 55 -93 160 327 -711 -359 -183 -714 628 -499 -89 -19 135 -648 361 -24 115
6675 115 -271 -321 -94 145 -217 -81 -594 202 414 113 523 -435 656 -152 -257 76 -178 -203 215 -545
6695 -545 405 -20 14 28 37 -423 381 -39 -285 -469 -3 292 -321 228 310 -20 468 323 -756 -422 43
6716 43 356 475 -58 57 142 98 254 182 -106 -193 -219 -234 71 -107 -380 2 484 -456 276 -37 423 -18
6738 -18 191 285 -98 28 628 -328 305 -109 -353 -217 -627 319 -50 28 387 81 34 357 -454 -409 -25 -117
6760 -117 67 -77 226 115 406 486 77 -593 253 -403 -16 137 -476 403 3 183 292 -83 631 -112
6780 -112 178 -249 -305 -2 273 555 225 281 304 -52 -280 185 -180 -191 -15 -28 259 229 785 -103 -6 -409
6802 -409 24 198 424 520 -234 -107 -191 -137 -219 305 -263 86 170 184 -27 254 -38 64 298 -320 245 109
6824 109 -253 -226 652 8 -29 222 44 -180 -123 -251 -607 325 247 86 -266 452 41 235 -591 -64 161
6845 161 -457 -308 -151 218 10 295 139 175 127 -292 -40 7 -284 412 122 170 -206 350 -114 100 201
6866 201 259 301 -219 -509 -479 -66 -205 54 -22 247 -153 99 -78 -338 -265 -545 356 165 -630 -654 -337 49
6888 49 -227 125 -153 -310 -449 -444 85 320 -175 -72 -85 75 -504 -380 -77 -375 -309 -130 14 -34 -5 -68 -191
6911 -191 -510 -97 -158 -157 -221 6 -228 203 -147 -601 -397 -287 149 85 117 -351 -405 -354 -434 -377 214 229 452 489
6935 489 318 196 121 -322 -696 437 275 -601 -82 -8 -52 134 -88 299 244 -488 -138 -170 259 263 282 -78
6957 -78 137 595 364 48 -351 -261 118 -528 -258 -444 -112 -483 184 -69 28 -82 162 147 -155 -133 -191 -44
6979 -44 -84 13 226 766 71 -139 -203 95 292 -701 497 -381 -505 700 -42 106 -711 421 -499 212
6999 212 146 285 338 -128 7 -343 -564 279 66 -43 267 -3 -515 -43 280 182 -150 345 -75 332 442
7020 442 -58 -396 225 60 -341 28 53 -292 -144 427 -202 -160 179 -220 -227 -391 -40 109 -436 189 -275
7041 -275 -791 140 -374 37 338 172 -31 132 292 -107 -363 -82 224 -412 112 164 -236 -249 8 -214 170
7062 170 -212 -715 166 76 39 111 161 348 342 286 -321 315 166 280 -63 581 -105 79 -119 556 40 -410
7084 -410 270 -22 -255 -371 -181 76 -104 -252 212 106 -190 -326 -302 -407 -494 349 -6 -328 -76 359 -7
7105 -7 334 -161 320 283 762 -397 363 282 460 63 -608 -144 -164 28 -122 79 -3 -149 90 62 -365 384
7127 384 -141 -183 100 229 77 -67 298 -353 103 202 307 366 -71 430 -88 -88 155 -553 -200 -77 -180 301
7149 301 -588 -382 24 343 526 191 660 -656 -496 -334 222 -473 -13 -75 -568 -7 275 -427 -86 159
7169 159 -332 -57 -248 244 119 82 -82 -170 -99 495 -112 -12 -675 -70 425 316 -2 354 142 63 -122
7190 -122 -477 103 81 373 73 139 356 -418 51 -565 60 -2 -36 -97 -204 229 -63 83 170 46 30 -50 -166
7213 -166 -299 230 -11 -176 -103 312 -166 250 -423 404 -200 -518 180 135 -175 381 -405 -389 449 690 242
7234 242 144 282 -233 -147 -182 -401 115 -75 -383 -89 153 -59 425 249 -125 -136 77 -344 188 -92 -130 37
7256 37 -25 -112 -279 678 -281 533 114 -541 256 215 28 -228 -184 218 -43 -330 659 26 241 -286 368 -129
7278 -129 -191 -435 -215 -111 685 75 -286 -579 -270 -337 -472 -89 52 269 -93 311 511 -520 13 421
7298 421 37 -230 -571 -292 261 32 -94 62 -207 -291 -174 -124 -533 -681 -681 268 372 -317 414 -259 -241 349
7320 349 -72 -451 441 -269 14 -200 -721 13 -352 215 102 -6 -352 452 -82 -218 -87 -70 362 293 83
7341 83 328 -378 459 -60 -47 188 -173 -117 433 290 176 -173 -333 -43 214 -68 357 294 -457 20 -334
7362 -334 186 -481 -265 -231 404 69 538 256 315 -114 -58 236 63 -199 500 251 -218 257 487 -16 -151
7383 -151 -365 -257 496 379 -139 365 406 123 446 -416 -99 158 -266 364 -137 296 87 28 261 -73 476
7404 476 38 71 541 114 -309 -239 48 -61 -290 130 259 -125 147 256 -94 235 433 -319 188 -537 -198
7425 -198 567 569 -134 293 451 337 467 -250 -200 -205 -32 -147 -741 122 96 478 284 -692 573 338 -185 -458
7447 -458 -317 -174 -273 147 119 -170 30 -24 257 -148 415 -208 6 -80 -312 -352 -162 -250 607 59 341 -83
7469 -83 -114 576 82 237 -116 -424 140 255 353 321 321 242 -437 -326 -8 -256 -267 741 -420 166 -91 62
7491 62 386 -359 -433 63 88 102 -337 -333 22 226 392 -492 -23 -271 456 80 -50 -198 407 -378 225 217 248
7514 248 -388 566 156 501 -7 168 276 -47 709 -238 200 -239 -194 244 -55 -401 267 -454 137 374
7534 374 380 152 -653 424 142 -43 285 153 -155 -216 -149 -130 562 -185 -114 -186 -99 614 48 -93 263 47
7556 47 -68 111 247 14 -262 624 315 353 314 -255 155 -279 294 36 155 218 238 385 524 165 -676 -594
7578 -594 79 -253 124 175 -444 68 -335 -147 14 -75 162 148 -98 -248 -301 -538 478 -137 18 49 106 53
7600 53 -133 196 188 -50 287 527 -456 482 115 459 246 -411 -349 -328 144 157 -254 -345 -438 295 -314 364 735
7623 735 -20 654 750 410 726 -134 269 -128 367 252 -333 -143 -99 419 79 -74 366 297 -31 142 195
7644 195 -60 17 251 -370 -119 379 328 -15 -308 452 52 109 -602 122 -488 637 -367 -415 323 20 52
7665 52 140 548 97 -29 343 113 249 -195 161 -28 16 -96 -308 13 111 55 46 523 157 93 -59 576 47
7688 47 -44 -71 501 295 -119 68 -440 321 207 -617 -128 578 -162 -17 84 -290 -298 -346 553 -137 -119 94
7710 94 -16 -204 -9 195 113 -144 -253 139 -62 -437 -55 41 269 -230 -16 -861 -561 -166 164 467 595
7731 595 -551 -387 -693 -355 -108 -241 -5 -387 90 -326 434 170 -163 -746 134 -141 198 -49 -815 81
7751 81 -55 264 -278 -305 275 175 491 212 96 331 -223 77 -494 -204 351 -91 -1 -153 320 -437 139
7772 139 10 -6 245 -286 -6 -365 -195 -749 -188 24 -158 429 -144 -516 422 322 406 248 42 158 -308
7793 -308 -335 -234 112 216 63 291 235 -620 61 -13 -34 62 -49 136 70 -164 162 177 552 45 -365 209
7815 209 1 183 -476 -58 195 188 -544 312 102 -12 -225 48 6 121 -378 122 -359 -616 38 263 -232
7836 -232 -12 203 -89 -489 -149 -120 -531 146 -720 98 390 -4 132 547 120 148 -727 -333 57 14 192
7857 192 -490 -863 192 381 -195 364 280 -238 -142 216 221 -66 644 -152 262 223 -7 -83 496 -102 -213 -69
7879 -69 -444 374 -125 102 -257 -71 -137 -480 -43 194 146 594 -460 520 63 124 202 -169 318 17 -122
7900 -122 -37 73 -81 338 320 106 -165 362 -12 634 -482 -355 -187 231 298 288 -535 13 -143 623 22
7921 22 755 278 -95 -83 -397 -56 -385 -127 -36 252 -110 166 -142 116 215 -604 -254 -19 -220 -320 125
7942 125 246 349 -136 -260 -184 -57 405 -466 20 -78 -265 -254 220 373 114 -129 81 -317 79 -362 -120
7963 -120 -312 -127 384 -411 296 -367 -198 582 215 337 -154 -479 -612 -12 -476 246 -265 239 -349 35
7983 35 -148 -311 142 -465 222 214 -475 56 -248 111 303 -99 339 -433 -385 90 343 324 -42 166 473 -361
8005 -361 450 -143 18 -662 -423 655 53 116 121 -144 17 -208 -102 -32 357 -789 -567 509 174 -191
8025 -191 201 -254 -66 122 -208 -294 55 401 -191 188 -447 64 540 619 -165 554 398 -22 177 -338 -845
8046 -845 -177 26 288 -316 27 159 -491 -218 225 -118 704 500 478 405 -213 153 31 -349 240 89 -334
8067 -334 3 -279 306 -23 273 -357 452 185 -407 -152 -437 186 188 99 -38 -415 -553 -234 524 -62 208
8088 208 -242 -422 32 151 135 -87 -40 -394 456 -84 -328 -224 74 -154 12 -195 42 129 6 -347 -325
8109 -325 -591 400 -53 -209 474 264 -270 -73 -96 -170 251 108 235 -138 -26 54 -71 435 -433 117 -112
8130 -112 67 302 544 -198 -92 -134 654 47 -261 -75 -304 359 -646 -269 -157 137 90 -119 -162 391 -303
8151 -303 -203 -25 -288 520 102 -12 568 -313 -222 -28 188 -479 -309 237 398 74 189 476 160 -128
8171 -128 265 49 257 -32 300 453 164 333 -81 -354 -97 -277 368 368 46 34 219 277 198 -21
8191b1
##END NTUPLES=NMR FID
##END=
