##TITLE=1H_UK-7
 THF-d8, 108 sc, 
 28.7.2020
##JCAMPDX= 6.0         $$ Bruker NMR JCAMP-DX V2.0
##DATA TYPE= NMR FID
##DATA CLASS= NTUPLES
##ORIGIN= UXNMR, Bruker Analytische Messtechnik GmbH
##OWNER= root
$$ XWIN-NMR		Version 3.5
$$ Tue Jul 28 11:10:10 2020 Russian Standard Time (UT+4h)  she@DPX200
##.OBSERVE FREQUENCY= 200.1315
##.OBSERVE NUCLEUS= ^1H
##.DELAY= (6, 6)
##.ACQUISITION MODE= SIMULTANEOUS
##.ACQUISITION SCHEME= undefined
##.AVERAGES= 108
##.DIGITISER RES= 18
##SPECTROMETER/DATA SYSTEM= spect
##.PULSE SEQUENCE= zg30
##.SOLVENT NAME= DMSO
##.SHIFT REFERENCE= (INTERNAL, DMSO, 0, 15.7039)
##AUDIT TRAIL= $$ (NUMBER, WHEN, WHO, WHERE, WHAT)
$$ ##TITLE= Audit trail, XWIN-NMR		Version 3.5
$$ ##JCAMPDX= 5.01
$$ ##ORIGIN= Bruker BioSpin GmbH
$$ ##OWNER= she
$$ F:/spectra/data/she/nmr/H-F/1/audita.txt
$$ ##AUDIT TRAIL=  $$ (NUMBER, WHEN, WHO, WHERE, WHAT)
(   1,<2020-07-28 11:08:19.92 +0400>,<she>,<DPX200>,
      <continue with go, POWCHK disabled, PULCHK disabled
       configuration hash MD5:
       00 E9 B6 7A A2 85 ED C7 34 08 36 98 17 FE 4E 26
       data hash MD5: 16K
       52 EA F2 F4 A1 FE 69 A7 33 B7 51 42 3B 60 AB 7F>)
$$ ##END=
$$ 
$$ hash MD5
$$ 24 09 F7 86 E3 0D CF 78 70 B5 FE A9 11 EA 8F 81
##$RELAX= 
##$RELAX= 
##$RELAX= 
##$RELAX= 
##$RELAX= 
##$RELAX= 
$$ Bruker specific parameters
$$ --------------------------
##$DU= <F:/spectra>
##$EXPNO= 1
##$NAME= <H-F>
##$PROCNO= 1
##$TYPE= <nmr>
##$USER= <she>
##$AMP= (0..31)
100 100 100 100 100 100 100 100 100 100 100 100 100 100 100 100 100 100 
100 100 100 100 100 100 100 100 100 100 100 100 100 100 
##$AQSEQ= 0
##$AQ_mod= 1
##$AUNM= <au_zg>
##$AUTOPOS= <>
##$BF1= 200.13
##$BF2= 200.13
##$BF3= 200.13
##$BF4= 200.13
##$BF5= 200.13
##$BF6= 200.13
##$BF7= 200.13
##$BF8= 200.13
##$BYTORDA= 1
##$CFDGTYP= 0
##$CFRGTYP= 5
##$CHEMSTR= <none>
##$CNST= (0..31)
1 1 145 1 1 1 1 1 1 1 1 1 1 1 1 1 1 1 1 1 1 1 1 1 1 1 1 1 1 1 1 1 
##$CPDPRG= <>
##$CPDPRG1= <>
##$CPDPRG2= <>
##$CPDPRG3= <>
##$CPDPRG4= <mlev>
##$CPDPRG5= <mlev>
##$CPDPRG6= <mlev>
##$CPDPRG7= <mlev>
##$CPDPRG8= <mlev>
##$CPDPRGB= <>
##$CPDPRGT= <>
##$D= (0..31)
0 1.2 0 0 0 0 0 0 0 0.06 0 0.03 0 0 0 0 0.0002 0 0 0 0 0 0 0 0 0 0 0 0 
0 0 0 
##$DATE= 1595919731
##$DBL= (0..7)
120 120 120 120 120 120 120 120 
##$DBP= (0..7)
150 150 150 150 150 150 150 150 
##$DBP07= 0
##$DBPNAM0= <>
##$DBPNAM1= <>
##$DBPNAM2= <>
##$DBPNAM3= <>
##$DBPNAM4= <>
##$DBPNAM5= <>
##$DBPNAM6= <>
##$DBPNAM7= <>
##$DBPOAL= (0..7)
0.5 0.5 0.5 0.5 0.5 0.5 0.5 0.5 
##$DBPOFFS= (0..7)
0 0 0 0 0 0 0 0 
##$DE= 6
##$DECBNUC= <off>
##$DECIM= 24
##$DECNUC= <off>
##$DECSTAT= 4
##$DIGMOD= 1
##$DIGTYP= 9
##$DL= (0..7)
0 120 120 120 120 120 120 120 
##$DP= (0..7)
150 150 150 150 150 150 150 150 
##$DP07= 0
##$DPNAME0= <>
##$DPNAME1= <>
##$DPNAME2= <>
##$DPNAME3= <>
##$DPNAME4= <>
##$DPNAME5= <>
##$DPNAME6= <>
##$DPNAME7= <>
##$DPOAL= (0..7)
0.5 0.5 0.5 0.5 0.5 0.5 0.5 0.5 
##$DPOFFS= (0..7)
0 0 0 0 0 0 0 0 
##$DQDMODE= 0
##$DR= 18
##$DS= 0
##$DSLIST= <SSSSSSSSSSSSSSS>
$$ [...]
##$SUBNAM2= <"">
##$SUBNAM3= <"">
##$SUBNAM4= <"">
##$SUBNAM5= <"">
##$SUBNAM6= <"">
##$SUBNAM7= <"">
##$SUBNAM8= <"">
##$SUBNAM9= <"">
##$SW= 24.9337058887773
##$SWIBOX= (0..15)
0 0 2 0 0 0 0 0 0 0 0 0 0 0 0 0 
##$SW_h= 4990.01996007984
##$TD= 16384
##$TD0= 1
##$TE= 0
##$TE2= 300
##$TE3= 300
##$TEG= 300
##$TL= (0..7)
0 120 120 120 120 120 120 120 
##$TP= (0..7)
150 150 150 150 150 150 150 150 
##$TP07= 0
##$TPNAME0= <>
##$TPNAME1= <>
##$TPNAME2= <>
##$TPNAME3= <>
##$TPNAME4= <>
##$TPNAME5= <>
##$TPNAME6= <>
##$TPNAME7= <>
##$TPOAL= (0..7)
0.5 0.5 0.5 0.5 0.5 0.5 0.5 0.5 
##$TPOFFS= (0..7)
0 0 0 0 0 0 0 0 
##$TUNHIN= 0
##$TUNHOUT= 0
##$TUNXOUT= 0
##$USERA1= <user>
##$USERA2= <user>
##$USERA3= <user>
##$USERA4= <user>
##$USERA5= <user>
##$V9= 5
##$VALIST= <valist>
##$VCLIST= <CCCCCCCCCCCCCCC>
##$VD= 0
##$VDLIST= <DDDDDDDDDDDDDDD>
##$VPLIST= <PPPPPPPPPPPPPPP>
##$VTLIST= <TTTTTTTTTTTTTTT>
##$WBST= 1024
##$WBSW= 4
##$XGAIN= (0..3)
0 0 0 0 
##$XL= 0
##$YL= 0
##$YMAX_a= 2186980
##$YMIN_a= -2441430
##$ZGOPTNS= <>
##$ZL1= 120
##$ZL2= 120
##$ZL3= 120
##$ZL4= 120
##$ABSF1= 10
##$ABSF2= 0
##$ABSG= 5
##$ABSL= 3
##$ALPHA= 0
##$AQORDER= 0
##$ASSFAC= 0
##$ASSFACI= 0
##$ASSFACX= 0
##$ASSWID= 0
##$AUNMP= <proc_1d>
##$AZFE= 0.1
##$AZFW= 0.1
##$BCFW= 1
##$BC_mod= 2
##$BYTORDP= 1
##$COROFFS= 0
##$CY= 11.3945322036743
##$DATMOD= 1
##$DC= 2
##$DFILT= <>
##$DTYPP= 0
##$F1P= 16.9975609425685
##$F2P= -3.02152046262296
##$FCOR= 0.5
##$FTSIZE= 0
##$FT_mod= 4
##$GAMMA= 1
##$GB= 0.15
##$INTBC= 1
##$INTSCL= 1
##$ISEN= 128
##$LB= 0.24
##$LEV0= 0
##$LPBIN= 0
##$MAXI= 10000
##$MC2= 0
##$MEAN= 0
##$ME_mod= 0
##$MI= 1.114404
##$NCOEF= 0
##$NC_proc= 0
##$NLEV= 6
##$NOISF1= 3.799351
##$NOISF2= 2.8
##$NSP= 1
##$NTH_PI= 0
##$NZP= 0
##$OFFSET= 15.70392
##$PC= 1
##$PHC0= -9817.638
##$PHC1= 40.20091
##$PH_mod= 1
##$PKNL= yes
##$PPARMOD= 0
##$PSCAL= 0
##$PSIGN= 0
##$REVERSE= no
##$SF= 200.130013532006
##$SI= 16384
##$SIGF1= 3
##$SIGF2= 2
##$SINO= 400
##$SIOLD= 16384
##$SREGLST= <1H.CDCl3>
##$SSB= 0
##$STSI= 0
##$STSR= 0
##$SW_p= 3612.71676300578
##$SYMM= 0
##$S_DEV= 0
##$TDeff= 0
##$TDoff= 0
##$TI= <>
##$TILT= no
##$TM1= 0
##$TM2= 0
##$TOPLEV= 0
##$USERP1= <user>
##$USERP2= <user>
##$USERP3= <user>
##$USERP4= <user>
##$USERP5= <user>
##$WDW= 1
##$XDIM= 8192
##$YMAX_p= 0
##$YMIN_p= 0
$$ End of Bruker specific parameters
$$ ---------------------------------
##NTUPLES= NMR FID
##VAR_NAME=  TIME,          FID/REAL,        FID/IMAG
##SYMBOL=    X,             R,               I
##VAR_TYPE=  INDEPENDENT,   DEPENDENT,       DEPENDENT
##VAR_FORM=  AFFN,          ASDF,            ASDF
##VAR_DIM=   8192,          8192,            8192
##UNITS=     SECONDS,       ARBITRARY UNITS, ARBITRARY UNITS
##FACTOR=    0.0002004,     1,               1
##FIRST=     0,             0,               0
##LAST=      1.6414764,     0,               0
##MIN=       0,             -2441430,        0
##MAX=       1.6414764,     2186980,         0
$$ Real data points
##PAGE= N=1
##DATA TABLE= (X++(R..R)), XYDATA
$$ plain form
0 0 0 0 0 0 0 0 0 0 0 108 -108 108 -108 108 -215 216 -235 324 -353 432 -538 623 -720 825 -946 1089
26 1089 -1250 1420 -1606 1825 -2060 2333 -2607 2924 -3278 3655 -4065 4524 -5030 5582 -6185
41 -6185 6851 -7579 8391 -9288 10293 -11415 12674 -14112 15763 -17674 19929 -22617
53 -22617 25895 -30000 35316 -42458 52548 -67866 93461 -245473 2186980 513991 -2290636
64 -2290636 470357 1294136 -536830 -365030 405380 -63119 275343 90274 -489866 201692
74 201692 413776 -578781 -77498 549645 -453418 -463267 800822 123206 -962096 233729
84 233729 1040661 -445611 -868275 629505 733307 -640498 -561162 514478 399453 -410952
94 -410952 -356967 231618 297292 -116645 -254775 23459 268626 76010 -265724 -34269
$$ packed form
0@%%%%%%%%%J08k16K16k16K16l23M31m51N59o77P85r70J161j343J545j771K035
26A089k339K670l026L431l885M393m940N531o202O933p720Q589r554J0612j1767
41f185J3036j4430J5970j7679J9581k1708K4089k6786K9875l3437L7603m2546
53b2617M8512n5895O5316p7774R5006j20414J61327l38934K432453j672989k804627
64b290636K760993Q23779j830966J71800P70410m68499L38462j85069n80140O91558
74B01692K12084r92557N01283O27143j003063r849J264089o77616j085302J195825
84B33729Q06932j486272m22664J497780J03802j373805P9336J075640j15025q10405
94d10952N3985N88585O5674m13937j38130K78234K45167j92616l41734K31455
$$ plain form
104 -34269 300222 -121348 -231912 345035 -41757 -544756 423964 497287 -820800 -225421
114 -225421 1002128 -144518 -842509 427172 476805 -384303 -79774 78081 -97809 306691
124 306691 -28412 -570411 293314 536405 -532299 -284039 578922 -40599 -393345 316981
134 316981 95794 -416251 234122 370625 -470752 -230847 549039 61419 -494974 27951
144 27951 328407 -19504 -139627 -85416 5756 256614 45059 -403764 1368 474079
154 474079 -94443 -444445 172701 324183 -208342 -155263 186177 -36810 -98465 218555
164 218555 -51696 -333888 244484 334105 -400171 -216430 430216 50680 -297166 49856
174 49856 45654 -10924 201137 -169075 -328707 394473 281031 -538431 -108085 518720 -69577
$$ packed form
104c4269L34491m21570j10564N76947l86792n02999R68720P3323j318087N95379
114b25421J227549j146646o97991J269681M9633q61108L04529J57855j75890M04500
124C06691l35103n41999Q63725K43091j068704K48260Q62961o19521l52746P10326
134C16981k21187n12045O50373J36503q41377K39905P79886m87620n56393N22925
144B7951L00456l47911j20123N4211R1172K50858k11555m48823M05132M72711
154D74079n68522l50002O17146J51482n32525N3079L41440k22987o1655L17020
164B18555k70251k82192N78372Q9621p34276J83741O46646l79536l47846L47022
174D9856m202n6578K12061l70212j59632P23180j13442q19462M30346O26805n88297
$$ plain form
185 -69577 -334225 160802 83780 -121611 143799 -2611 -281297 150272 305346 -274694
195 -274694 -251409 311397 133233 -260397 -24960 107203 -29721 100014 558 -273169
205 -273169 123514 380332 -263830 -353864 371185 230899 -378976 -74230 251412 -64149
215 -64149 -56261 93005 -168293 -34303 327809 -86303 -364576 222661 296034 -275681 -127540
226 -127540 217451 -41847 -40838 128045 -201086 -96050 383813 -51031 -444249 205250
236 205250 358267 -279511 -183523 235975 22040 -80917 71303 -103425 -67116 247767
246 247767 -4151 -312738 77545 289655 -121272 -213261 116093 111931 -58501 -2862 -38475
257 -38475 -77501 169668 108298 -294934 -74000 361591 -10790 -346546 91705 235163
$$ packed form
185f9577k64648M95027p7022k05391K65410j46410k78686M31569J55074n80040
195b74694K3285N62806j78164l93630K35437J32163j36924J29735r9456k73727
205b73169L96683K56818o44162r0034P25049j40286o09875L04746L25642l15561
215f4149P888J49266k61298J33990L62112m14112k78273N87237P3373n71715J48141
226a27540L44991k59298J009J68883l29131J05036M79863m34844l93218O49499
236B05250J53017o37778R5988M19498k13935j02957J52220j74728L6309L14883
246B47767k51918l08587L90283K12110m10927r1989L29354m162j70432N5639l5613
257c8475l9026K47169o1370m03232K20934M35591l72381l35756M38251J43458
$$ plain form
267 235163 -121230 -69798 66905 -89006 73835 181916 -240063 -162550 364843 53166
277 53166 -378014 75286 260312 -150843 -64780 107272 -131261 39587 241457 -229237
287 -229237 -220377 372870 99502 -385793 44395 263356 -116376 -70113 71736 -104847
297 -104847 59616 189036 -203618 -172665 291121 99167 -288533 -19767 207638 -18931
307 -18931 -88376 6121 -27081 40540 107815 -99026 -158908 151434 177424 -187536 -158914
318 -158914 202163 110688 -167612 -41883 84762 -5211 41728 1985 -171078 55325 248961
329 248961 -150499 -250683 224159 163027 -230503 -34678 137598 -64050 33415 80459
339 80459 -203331 2383 306791 -127593 -292040 225562 178214 -230296 -32859 122973
$$ packed form
267B35163l56393N1432J36703j55911J62841J08081m21979P7513N27393l11677
277E3166m31180M53300J85026m11155Q6063J72052k38533J70848K01870m70694
287b29237Q860N93247k73368m85295M30188K18961l79732M6263J41849j76583
297a04847J64463J29420l92654L0953M63786j91954l87700K68766K27405k26569
307a8931o9445R4497l3202O7621O7275k06841n9882L10342K5990l64960K8622
318a58914L61077r1475k78300J25729J26645q9973M6939l9743j73063K26403J93636
329B48961l99460j00184M74842o1132l93530J95825J72276k01648R7465M7044
339H0459k83790K05714L04408m34384j64447N17602m7348m08510J97437J55832
$$ plain form
349 122973 -73671 44750 78565 -210485 735 288860 -113944 -261445 183054 164333
359 164333 -167426 -50205 84363 -19531 38843 35394 -146171 -5319 208553 -43779
369 -43779 -218667 71565 181453 -80252 -127914 52396 66383 -4853 -4680 -56531 -33741
380 -33741 137822 51018 -202070 -24039 234672 -23068 -205207 59969 119096 -62195
390 -62195 -12527 2368 -81704 99304 118321 -204883 -81360 264890 5958 -233977 67040
401 67040 131862 -77729 -1059 14689 -103272 91171 134739 -199260 -99080 249336 24537
412 24537 -218375 40072 127639 -48020 -8421 2927 -78647 77594 113169 -153978 -104955
423 -104955 187986 63356 -181339 -24074 127344 457 -46032 -4522 -30963 40511 94971
$$ packed form
349A22973j96644J18421L3815k89050K11220K88125m02804j47501M44499j8721
359A64333l31759J17221J34568j03894N8374l449j81565J40852K13872k52332
369d3779j74888K90232J09888k61705m7662J80310J3987p1236J73n1851K2790
380c3741J71563q6804k53088J78031K58711k57740j82139K65176N9127j81291
390f2195M9668J4895q4072J81008J9017l23204J23523L46250k58932k39935L01017
401F7040O4822k09591P6670J5748j17961J94443M3568l33999J00180L48416k24799
412B4537k42912K58447Q7567j75659L9599J1348q1574J56241L5575k67147M9023
423a04955K92941j24630k44695J57265J51418j26887m6489M1510k6441P1474N4460
$$ plain form
434 94971 -87001 -125686 129862 119526 -157436 -88188 143956 34968 -92885 1925 2940
445 2940 -2955 91669 -30894 -149422 97094 162482 -142837 -119286 150149 52220 -105649
456 -105649 1010 10120 -19412 85936 -14164 -152780 73241 168195 -115564 -128985 126026
467 126026 73712 -84872 -23531 15003 -2981 60763 -9632 -124067 35743 149085 -66805
478 -66805 -138193 82427 108193 -63240 -59206 28904 21240 25252 3494 -88867 -12849 135293
490 135293 -12774 -163317 38607 144431 -58581 -89856 55475 28270 -3401 34120 -64059
501 -64059 -50906 137757 27550 -182152 17270 157621 -64550 -98239 56612 15061 -8117
512 -8117 44798 -64430 -54606 138949 33325 -160425 12743 142372 -39887 -85728 28068
$$ packed form
434I4971j81972l8685K55548j0336k76962O9248K32144j08988j27853R4810J015
445B940n895R4624j22563j18528K46516O5388l05319K3551K69435r7929j57869
456a05649J06659R110k9532J05348j00100j38616K26021R4954k83759j3421K55011
467A26026n2314j58584O1341L8534j7984O3744p0395j14435J59810J13342k15890
478f6805p1388K20620K5766j71433M034Q8110p664M012k1758r2361P6018J48142
490A35293j48067j50543K01924J05824k03012l1275J45331k7205l1671L7521r8179
501f4059J3153J88663j10207k09702J99422J40351k22171l3689J54851m1551k3178
512h117N2915j09228R824J93555j05624j93750J73168J29629j82259m5841J13796
$$ plain form
523 28068 16869 11068 20465 -68577 -35780 107964 28198 -120794 -14132 113269 11684
534 11684 -83051 -13878 50324 25699 -16727 -44266 -15695 55915 41760 -72522 -61579 90187
546 90187 66811 -98660 -50193 90774 23724 -49638 -5018 -12927 11544 70856 -48265 -103834
558 -103834 92063 94048 -121100 -51360 106307 2751 -45678 20846 -34145 411 98764
569 98764 -53615 -116055 104052 85867 -119138 -37006 84371 -3414 -19625 9297 -48948
580 -48948 18381 91756 -58234 -93231 85116 69734 -79637 -38493 45418 24571 -1866
591 -1866 -26859 -32251 37059 51612 -44422 -60017 40010 62735 -29637 -65392 16503 66648
603 66648 -7256 -60297 -289 41129 15423 -12389 -42792 -8139 77263 6998 -101485 10486
$$ packed form
523B8068j1199n801R397q9042L2797J43744p9766j48992J06662J27401j01585
534A1684r4735O9173O4202k4625m2426k7539K8571P1610j4155j14282J0943J51766
546I0187k3376j65471M8467J40967o7050p3362M4620p909K4471N9312j19121n5569
558a03834J95897J985k15148O9740J57667j03556m8429O6524n4991L4556R8353
569I8764j52379o2440K20107j8185k05005Q2132J21377q7785j6211K8922n8245
580d8948O7329P3375j49990l4997J78347j5382j49371M1144Q3911k0847k6437
591a866k4993n392O9310J4553r6034j5595J00027K2725r2372l5755Q1895N0145
603F6648p3904n3041O0008M1418k5706k7812l0403L4653Q5402p0265j08483J11971
$$ plain form
615 10486 97428 -29850 -63097 26992 15084 3407 24052 -54011 -32490 99260 9653 -117461
627 -117461 24829 91296 -42781 -40748 25707 -6260 19935 31155 -68444 -20548 99386
638 99386 -1126 -96823 21139 67940 -26172 -32223 147 -1791 32956 11922 -62163 -8085
650 -8085 75905 3597 -66910 -1530 55246 11194 -37733 -23281 19708 32782 -9447 -42659
662 -42659 -6616 41212 18008 -44649 -29415 48984 38830 -46937 -30737 42975 23323 -19468
674 -19468 -17908 -13405 22103 37868 -43113 -50683 57666 40883 -60306 -22724 43265 9558
686 9558 -5873 -7723 -28973 26252 50094 -48639 -52268 56000 35630 -49747 -22804 26987
698 26987 16966 1768 -17813 -21559 25685 39248 -29090 -43269 32830 39888 -28760 -36816 15969
$$ packed form
615A0486Q6942j27278l3247R0089j1908j1677K0645p8063K1521J31750q9607j27114
627a17461J42290O6467j34077K033O6455l1967K6195J1220r9599M7896J19934
638I9386j00512r5697J17962M6801r4112o051L2370j938L4747k1034p4085N4078
650h085Q3990p2308p0507O5380N6776m4052m8927J4452M2989J3074m2229l3212
662d2659L6043M7828k3204o2657J5234P8399j0154q5767J6200P3712j9652m2791
674a9468J560M503L5508J5765q0981p570J08349j6783j01189L7582O5989l3707
686I558j5431j850k1250N5225K3842r8733l629J08268k0370q5377K6943M9791
698B6987j0021j5198j9581l746M7244J3563o8338j4179P6099P058o8648q056N2785
$$ plain form
711 15969 28450 -5477 -23869 -11379 19568 27338 -16237 -38212 18390 46298 -18673 -43051
723 -43051 14335 32036 -6364 -23580 -11125 12041 26410 -7263 -43952 9224 55304 -13166
735 -13166 -46840 17130 32941 -6927 -14213 -11636 1932 33546 -3994 -47416 8846 47903
747 47903 -12937 -36411 8806 23995 6809 -13364 -23035 13658 33293 -15974 -34609 9936
759 9936 27481 291 -27407 -14796 30623 21659 -29270 -20060 25341 18380 -9513 -19040 -7492
772 -7492 24863 21227 -35063 -26471 39752 19447 -36231 -9302 18913 5445 4029 -11498 -21924
785 -21924 26350 28434 -39908 -22500 43181 11027 -29208 -1938 8173 5558 15384 -19752 -28161
798 -28161 38353 21562 -47519 -10333 34567 -1510 -12806 -3274 -10695 21412 22464 -35405 -17459
$$ packed form
711A5969J2481l3927j8392J2490L0947P770m3575k1975N6602K7908o4971k4378
723d3051N7386J7701l8400j7216J2455K3166J4369l3673l6689N3176M6080o8470
735a3166l3674O3970J5811l9868p286K577J3568L1614l7540m3422N6262L9057
747D7903o0840k3474M5217J5189j7186k0173r671L6693J9635m9267j8635M4545
759I936J7545k7190k7698J2611M5419q964n0929R210M5401o961k7893r527J1548
772g492L2355l636n6290Q592O6223k0305n5678K6929K8215j3468j416j5527j0426
785b1924M8274K084o8342J7408O5681l2154m0235K7270J0111k615R826l5136q409
798b8161O6514j6791o9081L7186M4900l6077j1296R532p421L2107J052n7869J7946
$$ plain form
811 -17459 43808 8893 -31341 -3355 12274 9156 4742 -27528 -11814 36375 3042 -35005
823 -35005 3842 22128 852 -2843 -12504 -4837 31158 4505 -40004 4828 35838 -12384 -22912
836 -22912 7089 3568 7582 5522 -29133 -984 42101 -8709 -37133 17074 21998 -11490 -3425
849 -3425 -7215 -6958 27400 2620 -42066 10198 39142 -22303 -24409 18489 1708 1088 8521 -23134
863 -23134 -1438 37699 -12249 -34240 21401 18784 -16611 -5851 -1029 -377 19571 -5493 -29299
876 -29299 17648 27758 -21835 -13030 15924 2836 2755 -2939 -21147 10738 26235 -21437 -20703
889 -20703 22285 9344 -13300 -2298 -1612 4883 15094 -11780 -22004 22327 16901 -24633 -6862
902 -6862 14319 -52 2186 -2959 -15981 13802 18436 -24276 -13271 25909 3539 -16827 870
$$ packed form
811a7459O1267l4915m0234K7986J5629l118m414l2270J5714M8189l3333l8047
823c5005L8847J8286k1276l695r661P667L5995k6653m4509M4832L1010m8222j0528
836b2912L0001l521M014k060l4655K8149M3085n0810k8424N4207M924l3488Q065
849c425l790K57L4358k4780m4686N2264K8944o1445k106M2898j6781o20P433l1655
863b3134K1696L9137m9948k1991N5641k617l5395J0760M822O52J9948k5064k3806
876b9299M6947J0110m9593Q805K8954j3088q1n694j8208L1885J5497m7672P34
889b0703M2988j2941k2644J1002O86O495J0211k6874j0224M4331n426m1534J7771
902f862K1181j4371K238n145j3022K9783M634m2712J1005L9180k2370k0366J7697
$$ plain form
915 870 1477 1304 13195 -11747 -17494 23131 11382 -24615 -2729 15073 -49 -729 -5289 -8466
929 -8466 15055 9896 -20755 -5573 20290 54 -12292 -397 3335 5942 3856 -15524 -5216
942 -5216 18151 1514 -16349 1277 8889 2976 -3170 -7749 517 14418 -230 -17294 998
955 998 14180 -1260 -9754 -2764 4766 7324 -957 -12489 1082 15281 -1943 -11824 2072 8179
969 8179 2670 -5204 -7451 3748 9101 -5421 -11051 2395 8854 -1069 -7598 -2360 7191 6566 -6273
984 -6273 -8323 6995 8511 -5415 -6104 391 6158 4331 -10461 -7879 11489 5271 -10805 -3637
998 -3637 4648 3864 2436 -5360 -4136 10890 7144 -13066 -4871 11382 -512 -4675 -1305 -3254
1012 -3254 6378 7183 -12406 -3674 14853 950 -9780 2361 2991 261 2505 -7348 -5367 13272
$$ packed form
915H70O07j73J1891k4942n747M0625j1749l5997K1886J7802j5122o80m560l177
929h466K3521n159l0651J5182K5863k0236j2346J1895L732K607k086j9380J0308
942e216K3367j6637j7863J7626P612n913o146m579Q266J3901j4648j7064J8292
955I98J3182j5440q494O990P530K558q281j1532J3571J4199j7224r881J3896O107
969H179n509p874k247J1199N353j4522n630J3446O459r923o529N238R551o25j2839
984f273k050J5318J516j3926o89O495N767j827j4792K582J9368o218j6076P168
998c637Q285p84j428p796J224J5026l746k0210Q195J6253j1894m163L370j949
1012c254R632Q05j9589Q732J8527j3903j0730J2141O30k730K244r853J981J8639
$$ plain form
1026 13272 2701 -14714 2422 10283 -4309 -2466 1125 -3638 8838 5301 -14298 972 15906
1039 15906 -6178 -9534 5820 443 -2664 4823 -7649 -5759 14576 -485 -17653 8430 11147
1052 11147 -10817 725 3354 -8575 7317 5434 -17034 3413 15703 -11029 -8192 11884
1064 11884 -1024 -3611 8697 -7761 -4314 16126 -4942 -15965 11702 6571 -12896 3825
1076 3825 3051 -7183 9187 3017 -14949 7987 14096 -13346 -3768 13082 -3947 -3051 7647
1089 7647 -8143 -1924 13784 -9680 -14038 14117 3371 -12751 6887 2883 -6284 10130 781
1102 781 -14444 10287 10739 -15991 -2129 12452 -7914 -3080 7541 -10980 -588 15260 -10010
1115 -10010 -9518 16734 -201 -11409 9198 305 -8406 9333 -1792 -13121 9328 6908 -16300
$$ packed form
1026A3272j0571j7415J7136P861j4592J843L591m763J2476l537j9599J5270J4934
1039A5906k2084l356J5354n377l107P487j2472J890K0335j5061j7168K6083K717
1052A1147k1964J1542K629j1929J5892j883k2468K0447J2290k6732K837K0076
1064A1884j2908k587J2308j6458L447K0440k1068j1023K7667n131j9467J6721
1076C825p74j0234J6370o170j7966K2936O109k7442R578J6850j7029Q96J0698
1089G647j5790O219J5708k3464m358K8155j0746j6122J9638m004r167J6414r349
1102G81j5225K4731M52k6730J3862J4581k0366M834J0621j8521J0392J5848k5270
1115a0010M92K6252j6935j1208K0607q893q711J7739j1125j1329K2449k420k3208
$$ plain form
1128 -16300 2315 10689 -9261 127 8022 -8301 2784 10969 -10481 -5695 14440 -4540 -8999
1141 -8999 7651 -319 -5112 7051 -2116 -9291 10848 3880 -12192 4606 9099 -8692 1014
1154 1014 6210 -8052 2832 7335 -10767 -1726 11295 -4834 -5992 8226 -1797 -2953 8448
1167 8448 -2790 -6787 10300 398 -11089 7405 5245 -8804 3572 2644 -6294 5041 4534 -9730
1181 -9730 2371 9464 -6356 -4324 6266 -2069 -3488 3962 -3221 -3619 9393 -1184 -7923 4523
1195 4523 3049 -5568 2044 1639 -3237 3393 922 -5518 2145 3446 -3653 -1262 3439 -819 -1281
1210 -1281 1986 -2236 -614 3118 -1076 -3448 3577 1141 -2661 -242 -263 -1166 2168 -1985 -1713 3396
1226 3396 571 -1980 315 652 -855 127 -1995 -2275 2128 1242 -3486 -1168 2720 932 437 906
$$ packed form
1128a6300J8615Q374j9950R388P895j6323J1085Q185k1450M786K0135j8980m459
1141h999J6650p970m793J2163r167p175K0139o968j6072J6798M493j7791R706
1154A014N196j4262J0884M503j8102R041J3021j6129j158J4218j0023j156J1401
1167H448j1238l997J7087r902j1487J8494k160j4049J2376r28q938J1335n07j4264
1181i730J2101P093j5820K032J0590q335j419P450p183l98J3012j0577o739J2446
1195D523j474q617P612m05m876O630k471o440P663J301p099K391M701m258m62
1210a281L267m222J622L732m194k372P025k436l802K419k1r03L334m153K72N109
1226C396k825k551K295L37j507R82k122k80M403q86m728K318L888j788m95M69
$$ plain form
1242 906 -432 3092 243 -3047 1053 690 -1216 1787 -1124 -2495 1345 686 -3089 1595 3757 -1436
1258 -1436 482 2406 -1774 1014 4433 -4653 -207 4107 -4217 -2358 4524 -2192 -3105 4518 -1731
1273 -1731 -2014 5363 -597 -5013 3989 1999 -5679 575 2713 -4792 1991 2497 -5105 1442 5606
1288 5606 -4896 -617 7429 -3976 -1204 5675 -2221 -3976 5915 -2289 -5896 4829 2101 -7538
1302 -7538 3259 3980 -7269 4272 4785 -7326 2700 5938 -8598 -318 7193 -7059 -1163 6552
1316 6552 -5060 -2507 8206 -3872 -6121 10352 -10 -7676 6742 1294 -8334 6335 1166
1329 1166 -10058 5193 4739 -8344 3085 6437 -7496 1187 8346 -6256 -2114 8479 -7022
1342 -7022 -4766 9248 -2665 -7627 9260 -141 -9665 6597 1969 -9742 6674 4550 -8863
$$ packed form
1242I06j338L524k849l290M100l63j906L003k911j371L840o59l775M684K162n193
1258a436J918J924m180K788L419r086M446M314q324J859O882o716r13P623o249
1273a731k83P377n960m416R002j990p678O254K138p505O783N06p602O547M164
1288E606j0502M279Q046j1405K772O879p896j755R891q204l607J0725k728r639
1302g538J0797P21j1249J1541N13j2111J0026L238j4536Q280P511j4252N896P715
1316F552j1612K553J0713j2078k249J6473j0362p666J4418n448r628J4669n169
1329A166j1224J5251m54j3083J1429L352j3933Q683P159j4602M142J0593j5501
1342g022K256J4014j1913m962J6887r401r524J6262m628j1711J6416k124j3413
$$ plain form
1355 -8863 2088 6197 -7141 -335 7265 -8086 -1045 8262 -6605 -3563 9907 -4252 -5142 9756
1369 9756 -3242 -6453 9930 -1372 -7850 7695 2036 -9145 5910 4753 -9671 2540 7476
1382 7476 -8726 585 7283 -7192 -1377 9223 -6896 -3375 8365 -4401 -3873 6519 -1994
1395 -1994 -5682 7822 -854 -7091 6273 2914 -6642 2686 3854 -7863 1247 5925 -6742 -780
1409 -780 6775 -5813 -2438 6944 -3072 -2788 7195 -1514 -5720 6084 478 -6460 4869 913
1423 913 -6865 2595 3625 -6227 2842 3565 -6851 2298 4892 -5082 -1492 5672 -4418 -1327 4720
1438 4720 -3409 -3996 6034 -1552 -4155 4234 -6 -4488 4464 505 -4493 3102 2533 -4339 1267
1453 1267 2144 -4365 1683 2028 -4004 -1264 3474 -252 -2180 3091 -215 -2287 3844 -61 -3233
$$ packed form
1355h863J0951M109j3338O806P600j5351P041R307j4867L042J3470j4159q90J4898
1369I756j2998l211J6383j1302o478J5545n659j1181J5055j157j4424J2211M936
1382G476j6202R311O698j4475N815J0600j6119L521J1740j2766N28J0392q513
1395a994l688J3504q676o237J3364l359r556R328J168j1717R110M678j2667N962
1409g80P555j2588L375R382j0016K84R983q709m206J1804n606o938J1329l956
1423I13p778R460J030r852R069P23j0416R149K594r974L590P164j0090L091O047
1438D720q129n87J0030p586k603Q389m240m482Q952l959m998P595n69o872N606
1453A267Q77o509O048L45o032K740M738l726j928N271l306k072O131l905l172
$$ plain form
1468 -3233 1453 651 -4102 1197 778 -3873 107 2191 -1821 -1152 1665 -56 -453 1054 -666 -1265
1484 -1265 1163 -584 -760 -406 -374 93 1244 -508 -1129 1565 -674 -265 -169 369 935 -530 -822 377
1502 377 -817 -863 2151 -530 -2535 1065 878 -879 1404 1176 -1739 1267 2882 -969 -957 1590 -692
1519 -692 -426 1464 -3022 -318 2332 -1356 -786 2409 -408 -356 2207 282 -2013 2389 2110 -3138
1535 -3138 1261 2219 -2995 151 3889 -4213 -1761 3965 -2174 -2527 3388 -2567 -1631 5203 -537 -3194
1551 -3194 3155 589 -4011 3713 2044 -4444 4136 3791 -7385 1166 4163 -5028 1067 3967 -5669
1566 -5669 -700 6023 -3082 -2546 5075 -1955 -3259 6569 -1420 -4806 5948 396 -5304 3957 1152
1581 1152 -6050 3600 3050 -5969 1606 4842 -5461 592 4985 -4995 -633 6562 -3875 -4550 5837
$$ packed form
1468c233M686q02m753N299m19m651L980K084m012O69K817j721l97J507j720n99
1484a265K428j747j76L54L2M67J151j752o21K694k239M09R6N38N66j465k92J199
1502C77j194m6L014k681k005L600j87j757K283k28k915L006J615l851J2K547k282
1519f92K66J890m486K704K650l688N70L195k817N2K563j925k295M402k79n248
1535c138M399R58n214L146L738q102K452N726o139l53N915n955R36O834n740k657
1551c194O349k566m600P724j669o488Q580l45j1176Q551K997r191O095K900r636
1566e669M969O723r105N36P621p030j304R828p989l386J0754n552n700R261k805
1581A152p202R650n50r019P575L236j0303O053M393r980M362P195j0437o75J0387
$$ plain form
1596 5837 -1007 -5590 5684 -1232 -6934 6073 2406 -7291 2966 1816 -5091 678 5222 -6739
1610 -6739 696 5886 -4679 -2264 5623 -4293 -2862 7086 -3522 -3943 6485 -1155 -3959 6595
1624 6595 -907 -6570 6303 770 -7382 3055 2384 -6758 2042 4300 -6785 232 6140 -4739
1638 -4739 -1151 5724 -3005 -2279 6749 -2078 -4103 5670 -557 -4107 4460 331 -4324 3741 2527
1653 2527 -5441 2183 4283 -6055 294 4728 -5083 183 6269 -3989 -3496 4979 -1737 -3424 3879
1668 3879 -964 -4471 4263 -357 -3602 3468 1253 -4960 2471 2318 -5556 992 3338 -5183 1080
1683 1080 3474 -4901 393 4970 -3022 -2207 3781 -937 -1564 2448 -770 -3743 4001 -38 -4960
1698 -4960 1014 1398 -3043 -392 2304 -3502 1821 2710 -2007 -409 2205 -1959 -706 2100 -518
$$ packed form
1596E837o844m583J1274o916n702J3007l667r697J0257j150o907N769M544j1961
1610f739P435N190j0565K415P887r916J431R948j0608m21J0428p640k804J0554
1624F595p502n663J2873n533q152J0437o71r142Q800K258j1085P017N908j0879
1638d739L588O875q729P26R028q827k025R773o227l550Q567m129m655Q065j214
1653B527p968P624K100j0338O349M434r811N266O086j0258M93Q475o716j687P303
1668C879m843l507Q734m620l245P070k215o213P431j53p874O548K346q521O263
1683A080K394q375N294M577p992Q15N988m718o27M012l218k973P744m039m922
1698d960N974L84m441K651K696n806N323Q89m717J598K614m164J253K806k618
$$ plain form
1713 -518 -1684 2349 -470 -2539 2283 266 -2439 1863 746 -2322 893 1488 -2010 528 1110 -841
1729 -841 -79 1465 -637 -1296 1023 -1336 -1371 522 529 -1065 179 642 -1009 412 191 -623 613 -138
1747 -138 -47 -256 718 -383 -792 470 69 -1372 -696 1972 -702 -135 176 -1471 -463 598 -157 -1512
1765 -1512 1259 548 -859 1327 1474 -839 3 1918 -342 -377 1429 -1311 11 1331 -1980 -1073
1781 -1073 2312 -174 -1870 1650 343 -990 1441 1065 -3121 825 1496 -3642 179 2217 -2064
1796 -2064 -1626 3625 -2405 -1602 3407 -757 -1079 3106 150 -3008 3055 159 -3755 1895 621 -3454
1812 -3454 975 2339 -3392 1170 3836 -4184 -557 3327 -3242 -539 3878 -2121 -2485 3649 -1307
1827 -1307 -3550 2694 -453 -4267 2288 537 -3205 2583 1394 -4268 1708 3862 -4971 730 3056
$$ packed form
1713e18j166M033k819k069M822k017k705M302j117l068L215N95l498K538N82j951
1729h41P62J544k102o59K319k359l5J893Pj594J244M63j651J421k21q14J236p51
1747a38R1k09R74j101m09J262m01j441O76K668k674N67L11j647J008J061p55j355
1765a512K771p11j407K186J47k313Q42J915k260l5J806k740J322J320l311R07
1781a073L385k486j696L520j307j333K431l76m186L946O71n138L821K038m281
1796b064M38N251o030Q03N009m164l22M185k956l158O063k896l914N650j274m075
1812c454M429J364n731M562K666q020L627L884o569K703M417n999l64O134m956
1827a307k243O244l147l814O555j751l742N788j189n662N976K154q833N701K326
$$ plain form
1842 3056 -3729 -1403 4287 -2315 -2544 4810 -718 -3645 3910 -97 -3613 4036 2097 -4631 2461
1857 2461 1474 -4009 2102 2550 -4106 832 3675 -3166 -1600 4795 -3286 -1407 4693 -2612 -3745
1872 -3745 5706 -586 -4792 5574 392 -3890 4650 389 -4965 2377 2771 -4615 909 2910 -4971
1887 -4971 686 4643 -4052 -1898 5629 -1923 -1568 4949 -1636 -2341 4887 -1525 -3525 3457 511
1902 511 -4752 3484 2591 -4250 1398 2608 -3589 390 4076 -3489 -392 3466 -1891 -1484 3028 -1464
1918 -1464 -1366 4071 -584 -3882 2896 805 -3639 3266 1440 -3911 2138 1385 -4348 191 2209 -3604
1934 -3604 -53 3971 -1474 -986 3269 -1375 -1276 3013 -954 -2558 2937 -700 -2229 1731 1696 -2556
1950 -2556 1615 1889 -2248 1313 2049 -1506 -512 2614 -2279 224 3212 -1854 -1311 1399 -117 -2169
$$ packed form
1842C056o785K326N690o602k29P354n528k927P555m007l516P649j939o728P092
1857B461r87n483O111M48o656M938K843o841J566O395q081J879O100p305j133
1872c745R451o292m206J0366n182m282Q540m261n354P342L94p386N524K001p881
1887d971N657L957q695K154P527p552L55O517o585p05P228o412k000O982k946
1902E11n263Q236q93o841N648J210o197L979L686p565L097L858n357M07M512m492
1918a464R8N437m655l298O778k091m444O905j826n351O049p53n733M539K018n813
1934c604L551M024n445M88M255m644R9M289l967j604N495l637j529L960l5m252
1950b556M171K74m137L561P36l555R94L126m893K503K988n066N43K710j516k052
$$ plain form
1966 -2169 2058 83 -2859 1912 512 -2068 626 1828 -1073 -73 2036 -1454 -593 1541 -1446
1981 -1446 -91 1708 -1254 -2006 1608 531 -1511 1545 1470 -1334 732 599 -1762 -71 33 -1171
1997 -1171 -211 1047 -454 -284 913 512 -566 135 -442 -497 1497 622 -587 118 950 -959 -491 -654
2015 -654 -1058 -224 182 -627 324 216 714 -1820 978 1339 -1085 411 1267 -1588 -112 1874 -778
2032 -778 -760 1387 -724 -1053 2143 359 -1085 549 -706 -1131 963 -593 -1779 112 1493 -1741
2048 -1741 471 1549 -1946 -345 1550 -1782 -747 2361 -296 -1727 2243 -790 -1488 1764 1545
2063 1545 -3268 1291 1899 -2630 584 2567 -2897 391 2746 -2183 -1034 3026 -2757 -737 2759
2078 2759 -1540 -2318 2791 141 -2678 2930 623 -2434 2337 2366 -3006 640 2909 -2709 427 3264
$$ packed form
1966b169M227j975k942M771j400k580K694J202k901J000K109l490Q61K134k987
1981a446J355J799k962p52L614j077k042L056p5k804K066j33k361J691J04j204
1997a171R60J258j501J70J197m01j078P01n77n5J994q75j209P05Q32j909M68j63
2015f54m04Q34M06q09R51j08M98k534K798L61k424J496Q56k855J476J986k652
2032g78J8K147k111l29L196j784j444J634j255m25K094j556j186J891J381l234
2048a741K212J078l495J601J895l332J035L108k657j431L970l033o98L252k19
2063A545m813M559O08m529L214J983n464L288K355m929J149M060n783K020L496
2078B759m299p78N109k650k819N608k307l057M771K9n372L646K269n618L136K837
$$ plain form
2094 3264 -2919 287 3538 -1979 -1722 3980 -1000 -2595 3032 -332 -2655 3101 471 -2890 3136
2109 3136 890 -4830 2422 2161 -3173 1307 2408 -4242 855 2700 -2005 -1130 4541 -1139 -2679
2124 -2679 3160 -897 -1992 3830 -582 -3233 3477 1110 -3930 2212 906 -3501 1620 1831 -3170
2139 -3170 -332 3233 -2634 -544 3570 -2267 -2610 4095 -758 -3410 4294 65 -3661 3501 732
2154 732 -3561 3257 1551 -3322 750 1706 -2893 1097 1871 -3886 -1022 3917 -1974 -1215 2399 -1320
2170 -1320 -1643 3626 -2503 -3093 3207 -406 -2843 2293 1504 -2124 1227 1216 -2056 37 2790 -2990
2186 -2990 -364 1829 -2324 -647 3154 -2407 -2248 2970 -608 -2028 2427 -254 -2196 1858 903
2201 903 -2815 75 1142 -2360 1763 1597 -3010 321 2462 -1949 -1082 1386 -681 -381 2623 -1122
$$ packed form
2094C264o183L206L251n517K57N702m980j595N627l364k323N756k630l361O026
2109C136k246n720P252k61n334M480J101o650N097J845m705Q75N671n680j540
2124b679N839m057j095N822m412k651O710k367n040O142j306m407N121K11n001
2139c170K838L565n867K090M114n837l43O705m853k652P704m229l726P162k769
2154G32m293O818j706m873M072R56m599L990P74n757K864M939n891P59L614l719
2170a320l23N269o129n90O300l613k437N136p89l628L351j1l272K093K753n780
2186b990K626K193m153J677L801n561J59N218l578j420M455k681j942M054r55
2201I03l718K890J067l502M123j66m607L331K141m411Q67K468k067L00L004l745
$$ plain form
2217 -1122 -2194 2843 388 -2195 1469 274 -2627 1283 1885 -1917 757 1597 -675 209 1842 -2752
2233 -2752 218 1635 467 -1941 342 -1082 -492 1514 192 -1392 637 2195 -2223 1254 2262
2248 2262 -1032 -548 131 -1092 -239 540 -838 -876 936 543 -616 73 458 -1495 159 231 -454 185
2266 185 1322 -1836 -44 1563 -495 -869 953 365 14 330 593 -823 1442 559 -2365 -199 1489
2283 1489 -1897 275 1781 -1321 -887 923 -240 285 1644 -86 -904 599 -566 -1342 846 214
2299 214 -2010 -825 1263 -1936 404 1266 -796 580 2047 -1355 -1224 743 -934 -949 2514 1308
2315 1308 -2383 1790 2428 -2336 914 -594 -1951 935 1687 -1695 -1071 3316 -1459 -986 1985 -836
2331 -836 -1266 2248 -628 -778 2297 -354 -1839 1843 966 -2523 1042 1811 -1776 968 1351 -1465
$$ packed form
2217a122j072N037k455k583L664j195k901L910O02l802K674Q40k272Q84J633m594
2233b752K970J417j168k408K283j424N90K006j322j584K029J558m418L477J008
2248B262l294M84O79j223Q53P79j378l8J812l93j159O89L85j953J654P2o85O39
2266A85J137l158J792J607k058l74J822n88l51L16K63j416K265q83k924K166J688
2283A489l386K172J506l102M34J810j163N25J359j730q18J503j165p76K188o32
2299B14k224J185K088l199K340Q62k062J376J467l402J31J967j677j5L463j206
2315A308l691M173O38m764L250j508j357K886P52l382O24M387m775M73K971k821
2331h36m30L514k876j50L075k651j485L682q77l489L565P69l587K744L83k816
$$ plain form
2347 -1465 1117 3253 -1419 -1107 2797 -1457 -465 1092 -1584 -1487 3017 -929 -4122 2741 1026 -3446
2363 -3446 2072 1384 -2318 587 2494 -2604 226 2492 -2907 779 1983 -779 -778 1790 -763 -2296
2379 -2296 2354 -1429 -3444 2681 1756 -1731 1082 1013 -2651 1521 1018 -2203 -238 3261 -2599 -1245
2395 -1245 3641 -1370 -951 3431 -1208 -2209 2756 -375 -2049 2725 1585 -2631 1708 937 -1957
2410 -1957 1030 1404 -2200 45 3424 -2371 -265 2938 -1499 -2087 3182 -993 -1821 2780 -1831 -3057
2426 -3057 2644 107 -3275 2286 893 -3234 933 1097 -1793 675 2418 -1823 -440 1776 -1795
2441 -1795 -807 3590 -1463 -752 1548 -809 -2026 1568 610 -2459 2294 656 -2161 907 1741 -1962
2457 -1962 262 1555 -1841 -626 750 -1678 -952 1717 -1118 -1064 2135 -1340 -1380 2465 17 -1866
$$ packed form
2347a465K582K136m672L12L904m254R92J557k676R7M504l946l193O863j715m472
2363c446N518o88l702K905J907n098K830K266n399L686J204k762JK568k553j533
2379b296M650l783k015O125r25l487K813o9l664M172n03l221J965L499n860J354
2395a245M886n011M19M382m639j001M965l131j674M774j140m216M339p71k894
2410a957K987L74l604K245L379n795K106L203m437n88N269m175q28M601m611j226
2426c057N701k537l382N561j393m127M167J64k890K468J743m241J383K216l571
2441a795R88M397n053P11K300k357j217L594r58l069M753j638k817L068Q34l703
2457a962K224J293l396J215J376k428P26K669k835N4L199l475m0L845k448j883
$$ plain form
2473 -1866 427 473 -2366 1191 1506 -2136 204 864 -1428 -573 3004 -929 -579 1735 -239 -838 1653
2490 1653 -177 -835 1329 331 -1009 1245 11 -740 742 437 -1180 685 532 -868 -691 237 -246
2507 -246 -832 989 258 -688 -324 -412 -1346 96 1337 -1694 -556 1538 -1315 -1064 234 -653 -523 824
2525 824 -286 -223 1037 -532 -381 188 -277 -527 422 -210 -806 213 453 -1562 634 1259 -1013 -509
2543 -509 870 1040 -1060 391 -83 -1076 738 525 -2509 -234 946 -1253 336 1184 -654 1265
2559 1265 1149 -777 -451 1705 -939 -432 974 797 -879 928 -122 -448 419 -130 -2248 600 1267
2576 1267 -2887 -752 1616 -1685 -550 3143 -1026 -1926 2149 -348 -805 960 599 -1507 1452 481
2592 481 -2114 -190 209 -1535 -240 1592 -1548 -184 1782 -590 -798 1533 -709 -358 1946 -681
$$ packed form
2473a866K293M6k839L557L15l642K340O60k292Q55L577l933L50K314j974n99K491
2490A653j830o58K164r98j340K254j234p51J482l05j617J865j53j400J77R28m83
2507b46n86J821p31r46L64q8r34J442J241l031J138K094k853K51J298q87J30J347
2525H24j110O3J260j569J51N69m65k50R49o32n96J019K40k015K196O25k272N04
2543e09J379J70k100J451m74r93J814k13l034K275J180k199J589Q48j838J919
2559A265j16j926L26K156k644N07J406j77j676J807j050l26Q67n49k118K848O67
2576A267m154K135K368l301J135L693m169r00M075k497m57J765l61k106K959r71
2592D81k595J924L99j744J295J832l140J364J966k372k08K331k242L51K304k627
$$ plain form
2608 -681 -1577 1922 853 -616 2037 -287 -1393 1903 1530 -2263 778 1843 -3012 459 1617 -1661
2624 -1661 -61 2501 -240 -329 1678 -57 -1117 2113 -402 -2265 1605 479 -3070 1341 -221
2639 -221 -2154 1123 799 -2029 646 1649 -1096 -174 1417 -1492 -891 1548 -566 -1972 2339 -1069
2655 -1069 -2155 1012 936 -2088 703 587 -2336 679 978 -2540 215 1553 -2574 -15 435 -1415
2671 -1415 -891 2182 -567 -1292 3056 -1265 -1262 1736 182 -812 1783 356 -2274 1093 1525 -1435 111
2688 111 1385 -1389 -637 1301 -949 -346 1801 -814 -537 1937 -537 -1101 2359 1171 -1956 1527
2704 1527 723 -1050 422 2284 -1102 375 1384 -1943 1272 1299 -1933 -815 1208 -30 -378 1068
2720 1068 -1452 -482 1427 692 -1251 676 1252 -1030 1168 1430 -1854 -290 640 -1914 -796 1710
$$ packed form
2608f81q96L499j069j469K653k324j106L296l73l793L041J065m855L471J158l278
2624a661J600K562k741q9K007j735j060L230k515j863L870j126l549M411j562
2639b21j933L277l24k828K675J003k745R22J591k909O01K439k114j406M311l408
2655a069j086L167p6l024K791j16k923L015K99l518K755J338m127K559M50j850
2671a415N24L073k749p25M348m321LK998j554r94K595j427k630L367M32k960J546
2688A11J274k774P52J938k250O03K147k615K77K474k474n64L460j188l127L483
2704A527q04j773J472J862l386J477J009l327L215K7l232J118K023j238l48J446
2720A068k520R70J909p35j943J927N76k282K198K62l284J564R30k554J118K506
$$ plain form
2736 1710 -621 -489 1763 -573 -203 1369 -262 -123 1115 343 -753 1119 1310 -1382 743 1202
2752 1202 -1656 1820 1616 -1103 -62 1204 -405 -1238 1106 -180 -856 1429 -656 -1507 947 880
2768 880 -697 445 462 -1431 773 1737 -508 290 1225 -1222 -97 925 75 -1192 -34 -804 -554
2785 -554 1123 106 -1015 825 890 -537 868 1097 -49 -29 -74 -7 -492 1372 -204 579 1163 -231
2803 -231 -472 652 406 -1517 576 1035 -1142 30 -120 -305 298 1665 -718 -634 243 -1436 -941 1332
2821 1332 -154 -770 1296 -430 -388 1536 981 -1791 1710 330 -648 357 1091 -713 -246 786 -694
2838 -694 -293 1693 -1017 -140 559 48 -1547 619 515 -1432 1017 362 -1389 527 1745 -1099 -1001
2855 -1001 1568 -189 -511 1795 -946 -2 1300 736 -1638 1203 224 -1991 1351 220 -1350 347
$$ packed form
2736A710k331J32K252k336L70J572j631J39J238p72j096J872J91k692K125M59
2752A202k858L476k04k719J041J266j609q33K344j286o76K285k085q51K454o7
2768H80j577J142J7j893K204R64k245P98R35k447J125J022q50j267J158p70K50
2785e54J677j017j121J840O5j427J405K29j146K0m5O7m85J864j576P83N84j394
2803b31k41J124k46j923K093M59k177J172j50j85O03J367k383Q4Q77j679M95K273
2821A332j486o16K066j726M2J924n55k772L501j380r78J005P34j804M67J032j480
2838f94M01J986k710Q77O99n11j595K166j04j947K449o55j751J916J218k844R8
2855a001K569j757l22K306k741R44J302n64k374K841r79k215L342j131j570J697
$$ plain form
2871 347 1619 -1684 309 702 -596 -976 1807 -1067 -488 2575 -92 287 1857 -565 -2075 992
2887 992 912 -788 1949 -1178 -2365 595 738 -1119 26 1104 -1027 1030 1005 -932 -1129 976 -835
2904 -835 -1173 2311 -357 -823 2435 -75 -1338 1524 671 -2207 602 666 -1242 569 620 -350 -294 1718
2922 1718 -1241 -1310 1040 -694 -825 2117 -1340 -2665 2822 24 -1989 1034 149 -1791 465 -104
2938 -104 -1364 -270 1566 -1444 804 174 -1517 -841 1336 -772 -1509 1327 634 -555 1669 -4
2954 -4 -1274 1861 -396 -1188 186 664 -1601 1147 1444 -1301 401 1831 -699 -680 1391 -735 -1261
2971 -1261 319 -1258 -1205 704 387 -261 1181 929 -632 -245 693 -1324 746 747 -952 -345 624 -287
2989 -287 -254 802 -1231 -682 1584 270 -1214 1154 90 -1159 440 107 -168 373 30 -785 -34
$$ packed form
2871C47J272l303J993L93j298l80K783k874N79L063k667L79J570k422j510L067
2887I92q0j700K737l127j187K960J43j857J145J078k131K057k5j937j97K105j811
2904h35l38L484k668m66L258k510j263K862q53k878K809O4j908J811N1r70N6K012
2922A718k959o9K350j734j31K942l457j325N487k798k013L023q85j940K256n69
2938a04j260J094J836l010K248o30j691O76K177k108p37K836o93j189K224j673
2954dj270L135k257p92J374M78k265K748K97k745J702J430k530J9K071k126n26
2971a261J580j577N3J909l17o48J442k52j561L87R38k017K070Jj699O07R69r11
2989b87L3J056k033N49K266j314j484K368j064j249J599l33k75N41l43q15P51
$$ plain form
3006 -34 725 -320 -1529 766 -891 -50 -141 -857 -81 1133 -638 -578 -155 292 -778 201 -1181 -1247 81
3025 81 924 -1033 277 731 -725 419 965 -1552 -262 909 -101 -786 1434 849 -982 642 208
3042 208 -402 50 269 -1263 453 948 -1407 807 -305 -200 -529 351 -66 -281 1600 -765 -41 486
3060 486 194 208 747 988 -583 -184 624 -348 579 561 372 -1305 314 424 -213 188 139 -1227 -1287 1215
3080 1215 -122 -63 -1780 -1256 238 484 -976 205 1094 -497 505 1215 -446 -1082 1176 -1425 -485
3097 -485 1631 -502 -1056 -216 981 -989 505 646 -921 260 1026 -623 678 160 -1079 -956 1435
3114 1435 753 -1042 661 -512 -1505 1024 832 -1420 841 417 -508 1762 215 -1156 337 134
3130 134 -734 106 1207 -545 -1437 1509 -765 -959 1464 -601 -1122 697 41 -1048 298 409 -952
$$ packed form
3006c4P59j045j209K295j657Q41r1p16P76J214j771O0M23M47j070R79j382o6J328
3025H1Q43j957J310M54j456J144N46k517J290J171j010o85K220n85j831J624m34
3042B08o10M52K19j532J716M95k355K214j112J05l29Q80m17k15J881k365P24N27
3060D86k92J4N39K41j571L99Q08r72R27j8j89j677J619J10o37M01m9j366o0K502
3080A215j337N9j717N24J494K46j460J181Q89j591J002P10j661o36K258k601R40
3097d85K116k133n54Q40J197j970J494J41j567J181P66j649J301n18j239J23K391
3114A435o82j795J703j173r93K529j92k252K261m24r25K270j547j371J493k03
3130A34q68Q40J101j752q92K946k274j94K423k065n21J819o56j089J346J11j361
$$ plain form
3147 -952 296 343 -832 923 1400 -964 405 682 -1117 -854 -44 -274 -583 2006 -1222 -858 769
3164 769 -370 -644 1310 21 -1459 634 640 -1050 1012 640 -2174 -92 529 -774 -850 1544 -479
3181 -479 -945 529 -327 -487 479 -70 221 -94 -43 -1545 278 1485 -1282 261 1437 -1213 683
3198 683 341 -128 -320 933 -1300 -366 -95 -825 198 720 9 -1279 477 158 -1834 688 706 -1292
3216 -1292 1282 194 -602 -163 675 -1103 -260 613 -95 288 1400 83 -1134 1172 -490 -1455 363
3233 363 1070 -1520 1528 -641 -855 268 1333 -533 -119 343 79 -85 2057 -1423 -521 986 1174
3250 1174 -1829 843 1030 -2094 323 10 -159 -436 392 -1214 68 694 -669 -1105 846 -595 2
3267 2 1176 365 134 816 802 -790 300 407 -614 -133 229 -890 -36 924 -1158 1047 526 610 -30
$$ packed form
3147i52J248M7j175J755M77k364J369K77j799K63Q10k30l09K589l228L64J627
3164G69j139k74J954j289j480K093Oj690K062l72k814K082O21j303p6K394k023
3181d79m66J474q56j60R66n49K91l15N1j502J823J207k767J543J176k650J896
3198F83l42m69j92J253k233R34K71p30J023N22p11j288J756l19j992K522J8j998
3216a292K574j088p96M39Q38j778Q43Q73p08L83J112j317j217K306j662r65J818
3233C63P07k590L048k169k14J123J065j866M14M62k64j64K142l480R02J507J88
3250A174l003K672J87l124K417l13j69k77Q28j606J282O26j363m36J951j441N97
3267BJ174q11k31O82j4j592J090J07j021M81L62j119Q54R60k082K205n21Q4o40
$$ plain form
3286 -30 428 562 -497 647 -823 -266 293 -1309 -1001 -342 147 -1115 130 420 -1172 823 444 -384
3304 -384 120 -286 298 -28 953 55 -623 1211 311 -1083 836 448 -336 1163 -22 -853 671 1201
3322 1201 -150 283 767 -145 -552 779 127 263 -243 404 -1166 1010 542 -1301 240 -160 809 296
3340 296 -5 -184 207 1232 -802 -1249 72 667 -1476 251 13 -813 117 -767 -677 421 52 -687
3358 -687 267 1260 256 -216 639 -1354 -998 -545 -448 -1001 -64 -255 -690 951 388 -846 516 -229 -1295
3377 -1295 674 54 -510 752 848 99 168 557 -1446 -397 751 -1426 -684 1395 -557 -758 891
3394 891 -134 540 397 -209 -382 176 823 -514 533 2126 -1555 287 697 -575 -61 -104 844 -939
3412 -939 1566 -671 -1221 857 671 -1205 947 -12 -1065 41 628 -1336 293 948 -1262 -712 2106
$$ packed form
3286c0M58J34j059J144j470N57N59j602L08O59M89j262J245K90j592J995l79q28
3304c84N04m06N84l26R81q98o78J834r00j394J919l88p84J499j185q31J524N30
3322A201j351M33M84r12m07J331o52J36n06O47j570K176m68j843J541m00R69n13
3340B96l01j79L91J025k034m47J321N95k143J727k38q26R30q84R0J098l69p39
3358f87R54R93j004m72Q55j993L56M53R7n53R37j91m35J641n63j234J362p45j066
3377a295J969o20n64J262R6p49O9L89k003J049J148k177P42K079j952k01J649
3394H91j025O74j43o06j73N58O47j337J047J593l681J842M10j272N14m3R48j783
3412i39K505k237n50K078j86j876K152r59j053J106N87j964J629O55k210N50K818
$$ plain form
3429 2106 -1440 5 589 -619 -760 1046 -405 -316 1244 57 -489 -664 522 -1095 636 1255 -658
3446 -658 281 548 -681 397 1010 -570 -895 247 -1469 -138 1002 422 -451 1003 -190 -452 -1212
3463 -1212 1118 -227 785 460 950 881 1445 -896 -567 1205 31 -620 187 345 -356 162 -772 -7
3481 -7 1099 1106 -997 -363 43 -888 523 554 -838 -84 716 -556 164 708 -432 83 1365 -514 -635
3500 -635 396 -219 -943 -130 -50 -569 -547 67 434 -212 233 -529 684 779 -334 733 892 135 542 486
3520 486 910 -1264 184 -144 -1444 1511 559 -1126 1152 639 -99 913 1048 -356 -218 -58 -291
3537 -291 78 -58 -1016 -1464 -534 -307 -164 704 233 -754 236 -97 359 240 1229 -307 359 196 -325 285
3557 285 150 -824 -758 826 -558 -233 268 1 -496 752 333 -36 184 233 -872 143 243 -489 -620
$$ packed form
3429B106l546J445N84j208j41J806j451Q9J560j187n46j75J186j617J731O19j913
3446f58R39K67j229J078O13j580l25J142j716J331J140n80q73J454j193k62p60
3463a212K330j345J012l25M90o9N64k341L29J772j174o51Q07J58p01N18r34P65
3481gJ106Pk103O34M06r31J411L1j392P54Q00j272P20N44j140N15J282j879j21
3500f35J031o15p24Q13Q0n19K2O14L67o46M45p62J213R5j113J067J59p57M07n6
3520D86M24k174J448l28j300K955r52j685K278n13p38J012J35j404J38J60k33
3537b91L69j36r58m48R30K27J43Q68m71r87R90l33M56j19R89j536O66j63n21O10
3557B85j35r74O6J584j384L25N01k67m97J248m19l69K20M9j105J015J00p32j31
$$ plain form
3576 -620 1428 210 666 -929 -334 -670 924 600 -229 936 -229 -605 -210 357 -1049 670 167
3593 167 -68 -470 750 -346 -453 1411 -572 -645 329 -951 -174 -341 231 -1480 358 541 -1157 -918
3611 -918 44 534 -1249 451 720 843 1775 -1252 246 742 -219 -1044 1087 701 -782 557 183 -737
3629 -737 662 115 -1188 332 283 -1199 343 1171 -25 -6 1225 -716 -376 -166 75 -328 1084 518
3647 518 -839 813 -508 110 878 -565 -1803 560 -101 -493 -194 168 -128 399 1635 -885 374
3664 374 945 -313 -810 80 436 -643 1104 818 -457 515 381 -903 -107 792 292 -190 657 -370
3682 -370 277 87 -270 349 923 -95 243 1715 75 -836 971 -57 -535 -37 -282 -436 1075 820
3700 820 -355 -577 720 -1239 -73 -297 683 627 163 190 -587 440 -778 -1032 858 304 -568 274
$$ packed form
3576f20K048j218M56j595N95l36J594l24q29J165j165l76L95N67j406J719n03
3593A67k35m02J220j096j07J864j983p3R74j280P77j67N72j711J838J83j698K39
3611i18R62M90j783J700K69J23R32l027J498M96r61q25K131l86j483J339l74r20
3629g37J399n47j303J520m9j482J542Q28j196J9J231j941L40K10K41m03J412n66
3647E18j357J652j321O18P68j443j238K363o61l92K99L62k96N27J236k520J259
3664C74N71j258m97Q90L56j079J747k86j275R72j34j284P96Q99n00m82Q47j027
3682c70O47j90l57O19N74j018L38J472j640r11J807j028m78M98k45j54J511k55
3700H20j175k22J297j959J166k24R80n6m64K7p77J027j218k54J890n54q72Q42
$$ plain form
3718 274 -599 -936 553 1143 -1452 -246 1024 -482 637 957 -830 -742 1188 748 -1114 838 377
3735 377 -734 -235 159 -1523 209 181 -45 -460 -436 -414 813 218 -457 -880 352 -657 268 280 -993
3754 -993 945 499 1573 -485 120 275 -629 -77 -163 913 -117 181 55 487 630 -256 -554 943
3772 943 610 -356 303 974 -172 908 192 617 1160 -491 -940 1006 -306 353 -437 -433 277 -7 210
3791 210 559 -158 -386 95 -926 -624 -70 48 227 -395 -639 424 6 -740 523 1574 -397 -530
3809 -530 772 -65 -922 -147 -1232 -87 178 443 -154 -56 -957 -833 843 728 -370 270 -81 -508 -185
3828 -185 789 -594 1495 666 -735 -237 874 482 375 1033 -489 -1017 -392 13 -285 -12 -51 -244 -506
3847 -506 1248 -45 342 380 -90 100 -114 93 -8 1072 214 -1420 431 -962 -442 56 -401 -132
$$ packed form
3718B74q73l37J489N90k595J206J270j506J119L20j787Q8J930m40j862J952m61
3735C77j111M99L94j682J732k8k26m15K4K2J227n95o75m23J232j009R25J2j273
3754i93J938m46J074k058O05J55r04N52q6J076j030K98j26M32J43q86k98J497
3772I43l33r66O59O71j146J080p16M25N43j651m49J946j312O59p90MP10k84K17
3791B10L49p17k28M81j021L02N54J18J79o22k44J063m18p46J263J051j971j33
3809e30J302q37q57P75j085J145K65K65n97R8r01J24J676j15j098O40l51m27L23
3828a85R74j383K089q29j401M98J111l92j07O58j522n28O25M05k98K73l9j93k62
3847e06J754j293L87L8m70J90k14K07j01J080q58j634J851j393N20M98m57K69
$$ plain form
3865 -132 -420 -76 19 -10 586 525 -594 1577 -392 1014 1381 736 0 -458 -441 -368 -55 -633 -979 -380
3885 -380 -217 -726 21 122 -348 -225 -94 -144 1039 -375 -527 -452 61 -23 -575 265 1121 54 862 600
3905 600 460 260 1082 -760 222 136 -79 -884 100 -52 -723 923 -34 -478 1800 480 -947 1089
3923 1089 43 411 359 303 -521 -193 894 -1345 742 941 -13 140 651 -3 250 1266 -375 -2679
3941 -2679 69 -1715 -560 1104 -342 336 226 119 -1061 1726 579 -631 -479 1088 -835 491
3957 491 831 254 -522 1107 267 -41 1314 -813 -433 -311 -102 368 -210 -704 -164 328 555 -412 497
3976 497 68 -404 -324 420 -861 -122 -101 391 -431 1020 -158 -886 597 788 100 353 331 -334 1470
3995 1470 1176 -65 665 334 -874 -300 854 190 -325 -344 -683 285 191 -851 79 -355 -187 -656 -227
$$ packed form
3865a32k88L44R5k9N96o1j119K171j969J406L67o45p36m58J7P3L13n78l46N99
3885c80J63n09P47J01m70J23J31n0J183j414j52P5N13q4n52Q40Q56j067Q08k62
3905F00j40k00Q22j842R82q6k15q05R84j52o71J646r57m44K278j320j427K036
3923A089j046L68n2n6q24L28J087k239K087J99r54J53N11o54K53J016j641k304
3941b679K748j784J155J664j446O78j10j07j180K787j147j210J52J567j923J326
3957D91L40n77p76J629q40l08J355k127L80J22K09M70n78m94N40M92K27r67R09
3976D97m29m72Q0P44j281P39K1M92q22J451j178p28J483J91o88K53k2o65J804
3995A470k94j241P30l31j208N74J154o64n15j9l39R68r4j042R30m34J68m69M29
$$ plain form
4014 -227 396 -1162 -510 351 -350 914 47 140 -897 324 699 -1188 -858 197 -329 142 -2 -600
4032 -600 948 417 459 -572 982 512 394 795 573 155 305 -852 535 25 -300 -713 20 -643 44
4051 44 -704 -1159 -830 545 635 -552 -117 603 -1261 947 217 -204 184 63 -276 561 408 13 58 201
4071 201 199 -803 1386 752 -820 309 -137 0 153 -470 342 -280 71 667 -265 1016 -304 -389 188
4090 188 -184 -296 49 1299 222 -87 -213 -455 -65 1102 -436 -1312 513 384 -419 559 256 136
4108 136 560 -91 -870 820 16 -246 719 979 -901 -434 612 -180 564 155 -365 -90 -597 -19 -1066
4127 -1066 597 486 -196 471 -494 -1338 821 452 184 1152 492 -1023 658 768 -761 668 -289 542
4145 542 576 613 -32 -602 763 -31 -650 1056 222 -605 388 56 -1284 -356 574 -81 -102 1449 540 -737
$$ packed form
4014b27O23j558O52Q61p01J264q67R3j037J221L75j887L30J055n26M71j44n98
4032f00J548n31M2j031J554m70j18M01k22m18J50j157J387n10l25m13P33o63O87
4051D4p48m55L29J375R0j187M35P20j864K208p30m21L88j21l39Q37j53l95M5J43
4071B01kj002K189o34j572J129m46J37J53o23Q12o22L51N96r32J281j320q5N77
4090A88l72j12L45J250j077l09j26k42L90J167j538q76J825j29q03R78l03j20
4108A36M24o51p79J690q04k62R65K60j880M67J046p92P44m09n20K75n07N78j047
4127a066J663j11o82O67r65q44K159l69k68R68o60j515J681J10j529J429r57Q31
4145E42L4L7o45n70J365p94o19J706q34q27R93l32j340R28R30o55k1J551r09j277
$$ plain form
4165 -737 1464 363 -127 548 -262 66 504 -502 -299 -175 -629 1040 1395 -381 -638 19 370 -762
4183 -762 -398 698 -297 163 91 -71 75 531 -459 -155 1029 539 -989 604 -228 156 670 223 -861
4202 -861 1137 558 -983 -188 233 259 66 -270 -415 594 924 -703 -944 839 -8 -160 192 21 622
4221 622 810 519 -1276 121 1969 -582 -343 470 1 -442 1154 337 -495 278 176 -308 -500 -428 -465
4240 -465 -133 1181 1493 -139 661 491 -53 202 -725 494 1500 911 1028 -382 321 -693 891 -182
4258 -182 204 -538 -301 -71 -754 281 -16 913 93 663 163 -798 -864 -516 -754 -220 796 828 -59 -376
4278 -376 -867 -226 -569 1468 -402 -666 -163 609 -479 188 -466 166 967 440 -1512 273 1026 -1054
4296 -1054 -73 1268 501 2 545 269 283 1096 1045 -1373 130 9 304 -227 -384 -171 573 -284 -181
$$ packed form
4165g37K201j101m90O75q10L28M38j006K03J24m54J669L55j776k57O57L51j132
4183g62L64J096r95M60p2j62J46M56r90L04J184m90j528J593q32L84N14m47j084
4202h61J998n79j541P95M21K6j93l36j45J009L30j627k41J783q47j52L52j71O01
4221F22J88k91j795J397J848k551K39Q13m69m43J596q17q32P73j02m84j92P2l7
4240d65L32J314L12j632Q00j70n44K55r27J219J006n89J17j410P03j014J584j073
4258a82L86p42K37K30o83J035k97R29q20N70n00r61o6L48k38N34J016L2q87l17
4278c76m91O41l43K037j870k64N03P72j088O67o54O32Q01n27j952J785P53k080
4296a054R81J341p67m99N43k76J4Q13n1k418J503j21K95n31j57K13P44q57J03
$$ plain form
4315 -181 336 1108 72 669 -95 -469 -908 -312 980 537 393 -458 -197 842 764 250 679 1140 487
4334 487 800 715 -142 119 578 -48 -90 1144 -140 -711 39 428 -381 628 -625 -403 -59 373 -1069
4353 -1069 -1055 -300 -91 825 1309 -291 -444 676 -592 -1425 152 239 -1406 249 390 -182 -721 149
4371 149 -333 246 718 224 -981 -78 177 -846 -172 1021 707 71 78 -767 599 747 637 -133 -415
4390 -415 830 -393 180 -599 499 381 -537 -697 597 218 92 733 540 183 1091 313 -838 1179
4408 1179 840 -603 -27 1049 -407 864 -511 -875 -1093 -77 -696 -662 1429 -1036 442 302 -397
4425 -397 784 -15 891 44 310 101 -900 360 465 -434 -219 293 -1166 340 552 -527 -1195 321
4443 321 -611 -479 426 -686 212 819 -160 348 -208 296 -1163 86 730 -350 263 -899 -485 1276
$$ packed form
4315a81N17P72j036N97p64l74m39N96J292m43j44q51K61J039p8n14M29M61o53
4334D87L13q5q57K61M59o26m2J234j284n71P50L89q09J009j253K22L44M32j442
4353a069J4P55K09R16M84j600j53J120j268q33J577Q7j645J655J41n72n39Q70
4371A49m82N79M72m94j205R03K55j023O74J193l14o36Pq45J366J48j10p70k82
4390d15J245j223N73p79J098j18r18j60J294l79j26O41j93l57R08p78j151K017
4408A179l39j443N76J076j456J271j375l64k18J016o19L4K091k465J478j40o99
4425c97J181p99R06q47K66k09j001J260J05q99K15N12j459J506K12j079o68J516
4443C21r32J32R05j112Q98O07r79N08n56N04j459J249O44j080O13j162M14J761
$$ plain form
4461 1276 299 113 -786 1308 296 -1052 -112 -110 397 -185 571 109 1342 583 -804 322 1056 642
4479 642 117 -469 -1232 320 1225 -726 -1139 737 -209 -351 11 142 47 -1120 -241 399 489 -29 -210
4498 -210 879 404 -62 477 119 -418 -672 279 -136 -381 814 -10 -508 -74 286 -172 -934 243 172
4517 172 767 251 -244 387 149 162 -397 357 -703 -282 -531 -232 312 775 12 317 988 420 820 -747
4537 -747 525 286 417 -1053 563 1796 1143 -649 -161 192 821 -1193 150 -442 -53 1261 -96
4554 -96 -326 -124 962 -978 -286 292 521 -1121 -332 -1145 526 74 -1394 -380 764 21 147 2
4572 2 166 820 907 -49 -241 -593 644 -912 -1252 -808 -74 664 -503 335 -67 372 -581 -318 401 -516
4592 -516 747 -222 1052 736 474 -368 66 841 268 -567 623 1195 817 -678 373 -42 431 580
$$ packed form
4461A276r77j86q99K094j012j348R40KN07n82P56m62J233p59j387J126P34m14
4479F42n25n86p63J552R05j951m13J876r46j42L62J31r5j167Q79O40R0n18j81
4498b10J089m75m66N39l58n37k54R51m15k45J195q24m98M34L60m58p62J177p1
4517A72N95n16m95O31k38J3n59P54j060M21k49K99N44M63p63L05O71n68M00j567
4537g47J272k39J31j470J616J233o53j792M88L53O29k014J343n92L89J314j357
4554i6k30K02J086j940O92N78K29j642P89q13J671m52j468J014J144p43J26j45
4572BJ64O54Q7r56j92l52J237j556l40M44P34P38j167Q38m02M39r53K63P19r17
4592e16J263r69J274l16k62q42M34P75n73q35J190N72l78j495J051m15M73J49
$$ plain form
4610 580 -715 295 572 243 115 -363 -432 -739 284 944 150 279 558 -589 136 1268 271 -490 1377
4629 1377 -686 438 488 119 259 -327 838 -870 -137 1035 1097 -9 273 -105 591 109 67 -394 867
4648 867 -12 -1223 247 288 802 213 -234 -390 823 161 401 50 -510 741 -606 331 -79 781 -915
4667 -915 -863 182 334 -666 -23 708 -1163 -446 -97 -164 384 680 -973 -680 5 196 -210 -743 17
4686 17 -98 639 -438 -339 234 821 193 754 843 142 502 784 -576 -449 170 696 -821 -416 -111 286
4706 286 -1058 173 565 441 -31 835 831 -447 -848 -1024 -57 -131 1247 27 -980 392 805 -4 -569
4725 -569 -852 -169 76 -859 541 617 265 -251 -117 178 819 -684 103 224 -432 -72 362 -176 -114 373
4745 373 -1251 111 1334 -33 -569 787 1277 -294 592 11 -846 863 1459 -232 -40 1183 108
$$ packed form
4610E80j295J010K77l29j28m78o9l07J023O60p94J29K79j147P25J132r97p61J867
4629A377k063J124N0l69J40n86J165j708P33J172O2j106K82l78O96m82m2m61J261
4648H67q79j211J470M1N14n89m47j56J213o62K40l51n60J251j347R37m10Q60j696
4667i15N2J045J52j000O43P31j871P17L49o7N48K96j653K93O85J91m06n33P60
4686A7j15P37j077R9N73N87o28N61Q9p01L60K82j360J27O19N26j517M05L05L97
4706B86j344J231L92j24m72Q66mj278m01j76R67p4J378j220j007J372M13q09n65
4725e69k83O83K45r35J400P6l52n16J34K95O41j503P87J21o56L60M34n38O2M87
4745C73j624J362J223j367n36J356M90j571Q86n81q57J709N96j691J92J223j075
$$ plain form
4762 108 -1331 1498 423 -27 -194 -195 -1314 -564 374 -833 -522 293 -845 878 -509 249 532 946
4780 946 488 -915 368 324 -703 492 -330 40 -202 408 -93 -878 111 -788 174 -187 -536 -912 -60
4799 -60 257 645 238 238 -268 747 518 654 -390 333 -72 -1414 -919 184 -229 -220 -483 1130 -685 -366
4819 -366 146 -65 -454 34 -498 -1260 837 736 -268 -304 81 119 -325 1245 -59 -3 175 426 -342 380
4839 380 816 -189 -824 248 -369 -265 580 123 464 553 107 -1604 170 158 -61 293 608 -155 562
4858 562 -917 1255 -401 883 295 -261 -645 -164 -282 -249 -105 -469 -1096 1001 574 892 1026 -640
4876 -640 -164 190 -83 432 -569 -268 530 471 -289 -180 -36 54 362 -148 -242 -699 517 -342 -1482 1088
4896 1088 248 74 -670 177 104 -154 -947 -235 -818 591 -958 -328 1212 188 -612 536 783 -584
$$ packed form
4762A08j439K829j075m50j67jj119P50R38j207L11Q15j138J723j387P58K83M14
4780I46m58j403J283m4j027J195q22L70k42O10n01p85R89q99R62l61l49l76Q52
4799f0L17L88m07%n06J015k29J36j044P23m05j342M95J103m13Rk63J613j815L19
4819c66N12k11l89M88n32p62K097j01j004l6L85L8m44J570j304N6J78K51p68P22
4839C80M36j005o35J072o17J04Q45m57L41Q9m46j711J774j2k19L54L15p63P17
4858E62j479K172j656J284n88n56l84M81j18L3J44l64o27K097m27L18J34j666
4876f40M76L54k73N15j001L01P98n9p60J09J44R0L08n10r4m57J216q59j140K570
4896A088q40j74p44Q47p3k58p93P12n83J409j549O30J540j024q00J148K47j367
$$ plain form
4914 -584 532 259 -173 755 752 -1090 -509 262 243 -2178 -661 428 70 338 549 -768 309 -132 983
4933 983 -126 82 648 -137 -460 -406 260 900 877 504 115 974 674 375 381 9 -477 -132 -298 483 -324
4954 -324 138 8 -372 -327 614 246 -464 1059 -381 -742 -157 181 429 -132 -80 656 854 398 -100 -215
4974 -215 676 -1052 -1168 440 -324 -137 -729 -516 -1014 961 -98 -307 394 -189 -131 -1540 680 -474
4992 -474 -1448 -63 723 -520 232 -55 -337 379 46 500 484 856 412 60 -526 -498 493 94 174 -334
5012 -334 -228 552 -127 -867 -460 -656 -574 -501 -641 652 729 -18 18 501 -1223 994 -234 -483 126 -89
5032 -89 -174 26 1267 -381 -639 829 145 -691 408 457 -496 -99 1058 -311 868 -305 582 438
5050 438 52 -471 180 2 -448 87 -80 610 162 23 -178 -221 324 -262 -872 -868 745 1114 -719 359
$$ packed form
4914e84J116k73m32R28lj842N81P71j9k421J517J089l58K68K11j317J077m41J115
4933I83j109K08N66p85l23N4O66O40k3l73l89Q59l00k99Ol72m86L45j66P81q07
4954c24M62j30l80M5R41l68p10J523j440l61N85L38K48n61N2P36J98m56m98j15
4974b15Q91j728j16J608p64J87n92K13m98J975j059k09P01n83N8j409K220j154
4992d74r74J385P86j243P52k87k82P16l33M54j6L72m44l52n86K8R91l99Q0n08
5012c34J06P80o79p40M07j96Q2P3j40J293P7p47L6M83j724K217j228k49O09k15
5032h9q5K00J241j648k58J468o84q36J099M9r53L97J157j369J179j173Q87j44
5050D38l86n23O51j78m50N35j67O90m48j39k01m3N45n86o10MJ613L69j833J078
$$ plain form
5070 359 -836 599 -376 107 -296 -213 -185 215 518 945 -777 -408 579 -1394 509 -122 -158 84 299
5089 299 -188 -561 -575 -554 1514 1466 -1485 -101 -243 -493 515 519 -227 -793 -404 -828 -79 -234 -33 -788
5109 -788 -326 1486 -244 -5 -557 186 -20 -359 1016 300 -80 -430 646 202 -809 1274 586 849
5127 849 -160 -54 669 -558 -729 1158 -158 -161 312 -856 938 661 980 378 902 273 151 301 -263
5146 -263 735 -291 -22 -126 -600 -793 -789 -378 1015 -386 233 763 75 -1620 1360 -34 109 -949
5164 -949 -285 -388 -129 1265 -1172 -3 71 184 101 -430 1106 906 1296 -861 926 102 -967 -656
5182 -656 195 -723 -305 657 379 -1166 -11 488 -129 -271 -1131 -725 -405 62 181 151 -1071 802 709
5201 709 55 -1076 444 -592 -167 -367 -167 -102 -252 600 245 424 -1347 464 17 633 1489 908 179
$$ packed form
5070C59j195J435r75M83m03Q3K8M00L03M27j722L69R87j973J903o31l6K42K15
5089B99m87l73j4K1K068m8k951J384j42k50J008Mp46n66L89m24P49j55K01p55
5109g88M62J812j730K39n52P43k06l39J375p16l80l50J076m44j011K083o88K63
5127H49j009J06P23j227j71J887j316lM73j168J794k77L19o02N24o29j22J50n64
5146b63R98j026K69j04m74j93MM11J393j401O19N30o88j695K980j394J43j058
5164i49O64j03K59J394k437J169P4J13q3n31J536k00L90k157J787q24j069L11
5182f56Q51r18M18R62k78j545J155M99o17j42q60M06L20M67J19l0j222J873r3
5201G09o54j131J520j036M25k00K00O5j50Q52l55J79j771J811m47O16Q56n81p29
$$ plain form
5220 179 -760 -750 -767 -254 -53 -157 461 491 3 -687 -17 -923 566 85 -675 286 469 -1732 -999 745
5240 745 -372 545 420 -629 -706 -247 -73 -1496 750 -215 -389 586 161 -646 -61 185 -520 -591 202
5259 202 -88 541 -627 -208 340 432 277 -529 -172 -562 -56 1363 -20 29 1065 -691 -609 84 1126
5278 1126 -707 -256 600 546 675 1799 -410 213 -62 -611 159 -3 51 312 590 275 -1040 925 -120
5297 -120 -541 896 22 -136 395 603 634 249 723 117 615 311 -1378 349 154 -267 -658 259 -676
5316 -676 -236 231 -264 54 -1210 30 114 330 139 -210 -926 -1035 683 928 394 -417 -933 819 135
5335 135 228 615 120 299 -860 893 827 147 327 287 628 -975 524 -1399 -187 1259 -257 -121
5353 -121 254 877 592 605 -387 -462 -941 293 46 -638 753 448 -476 -1098 -245 -120 -650 151 -89 167
$$ packed form
5220A79r39J0j7N13K01j04O18L0m88o90O70r06J489m81p60R61J83k201P33J744
5240G45j117R17j25j049p7M59J74j423K246r65j74R75m25q07N85K46p05p1P93
5259B02k90O29j168M19N48R2j55q06L57l90N06J419j383M9J036j756Q2O93J042
5278A126j833M51Q56n4J29J124k209O23k75n49P70j62N4K61K78l15j315J965j045
5297a20m21J437q74j58N31K08L1l85M74o06M98l04j689J727j95m21l91R17r35
5316f76M40M67m95L18j264J240Q4K16j91l49p16j09J718K45n34q11n16J752o84
5335A35R3L87m95J79j159J753o6o80J80m0L41j603J499j923J212J446j516J36
5353a21L75O23k85J3r92p5m79J234k47o84J391l05r24o22Q53J25n30Q01k40K56
$$ plain form
5373 167 324 168 -123 486 250 -77 629 -635 -566 740 66 601 -522 54 838 -584 -175 1233 -697
5392 -697 585 -194 182 28 291 484 393 526 1044 404 302 -157 12 949 1281 424 -394 -247 -189 -691
5412 -691 -80 319 171 -45 -106 508 -858 -561 892 193 -483 -1144 283 -43 -999 -460 674 407 1268
5431 1268 351 159 702 -88 -20 815 345 386 71 372 1197 -1075 -568 -358 -1043 -628 263 -642 912 657
5451 657 776 -134 112 -124 1322 274 -153 -256 -231 189 -264 227 -669 -1026 57 883 901 -1281 413
5470 413 -330 -120 22 35 1191 -790 -203 -631 -693 -292 -231 -761 -539 316 91 -610 -118 -62 87 562 277
5491 277 422 -543 -281 -248 100 -426 11 -790 552 -147 -702 119 64 485 241 -296 -1248 -273 63 -349
5511 -349 -776 634 -68 -1202 -847 -579 -1076 185 -86 388 -89 -787 878 -320 -189 360 -798 3
$$ packed form
5373A67J57j56k91O09k36l27P06j264O9J306o74N35j123N76P84j422M09J408j930
5392f97J282p79L76j54K63J93r1J33N18o40j02m59J69R37L32q57q18J47N8n02
5412f91O11L99j48k16o1O14j366K97J453o99o76o61J427l26r56N39J134k67Q61
5431A268r17j92N43p90O8Q35m70M1l15L01Q25k272N07K10o85M15Q91r05J554k55
5451F57J19r10K46k36J446j048m27j03K5M20m53M91q96l57J083Q26J8k182J694
5470D13p43K10J42J3J156j981N87m28o2M01O1n30K22Q55k25p01M92N6J49M75k85
5491B77J45r65K62L3L48n26M37q01J342o99n55Q21n5M21k44n37r52R75L36m12
5511c49m27J410p02j134L55K68m97J261k71M74m77o98J665j198J31N49j158Q01
$$ plain form
5529 3 70 -47 -324 -336 261 471 -71 555 476 -610 -65 1397 -720 84 564 1047 511 -448 -116 421 -19
5550 -19 -643 398 -650 129 359 629 -578 722 -855 -728 -206 -562 -2 42 -724 -169 66 -289 -227
5569 -227 16 600 539 333 353 -128 -418 -789 -501 492 849 488 -143 -357 -557 -672 403 -391 -1279 -116
5589 -116 73 -330 391 -145 128 -512 -556 1147 453 -279 -534 -517 -99 -255 -287 -133 -884 -1430 439 -566
5609 -566 -142 62 198 -98 134 232 312 -459 538 -18 -170 554 730 -704 -267 -61 -494 -814 574 -367
5629 -367 215 -490 219 462 -709 -997 -430 -410 71 286 -465 -287 -193 349 -347 -435 -295 -501 530 -714
5649 -714 -784 290 -824 626 527 -328 -8 566 128 156 -239 -993 836 -740 -66 132 -735 -428 -581
5668 -581 -413 397 -300 1235 987 261 -193 199 -327 692 338 -870 386 -797 153 -19 289 -176
$$ packed form
5529CO7j17k77j2N97K10n42O26p9j086N45J462k117Q04M80M83n36r59L32N37m40
5550a9o24J041j048P79K30K70j207J300j577J27N22l56N60M4p66N55K35l55O2
5569b27K43N84o1k06K0m81k90l71K88R93L57l61o31k14k00j15J075p94q88J163
5589a16J89m03P21n36K73o40m4J703o94p32k55J7M18j56l2J54p51n46J869j005
5609e66M24K04J36k96K32R8Q0p71R97n56j52P24J76j434M37K06m33l20J388r41
5629c67N82p05P09K43j171k88N67K0M81K15p51J78R4N42o96q8J40k06J031j244
5649g14p0J074j114J450r9q55L20N74m38K8l95p54J829j576O74J98q67L07j53
5668e81J68Q10o97J535k48p26m54L92n26J019l54j208J256j183R50j72L08m65
$$ plain form
5686 -176 338 -496 152 -7 118 -345 -1133 100 432 81 -572 -3 449 1032 247 859 83 -917 486
5705 486 603 748 143 -48 -1303 359 736 -619 -476 -760 -1262 -149 51 -624 503 209 325 -944
5723 -944 625 1283 606 -100 -24 143 277 723 -94 818 599 -454 440 -126 -1027 -334 421 6 -129 -419
5743 -419 178 408 354 133 546 -360 -8 62 -160 117 603 45 363 28 57 -366 246 34 340 -85 -1303
5764 -1303 -536 44 -38 156 -691 146 256 18 -276 145 -520 -1646 850 -1078 -135 -1392 820 -157
5782 -157 -6 -719 -135 459 -21 1520 -199 -158 104 -386 563 -401 -999 -293 161 -282 553 565 301 809
5802 809 -643 -70 107 215 342 -375 -1394 -771 843 3 447 382 586 974 -948 -503 -901 -189 -1016
5821 -1016 -14 -241 156 -214 111 -856 985 -507 -450 82 541 720 -565 130 -794 310 -527 -222
$$ packed form
5686a76N14q34O48j59J25m63p88J233L32l51o53N69M52N83p85O12p76j000J403
5705D86J17J45o05j91j255J662L77j355J43k84n02J113K00o75J127k94J16j269
5723i44J569O58o77p06P6J67J34M46q17R12k19j053Q94n66r01O93P55m15j35k90
5743d19N97K30n4k21M13r06L52P0k22K77M86n58L18l35K9m23O12k12L06m25j218
5764a303P67N80q2J94q47Q37J10k38k94M21o65j126K496j928R43j257K212r77
5782a57J51p13N84N94m80J541j719M1K62m90R49r64n98P06M54m43Q35J2k64N08
5802H09j452N73J77J08J27p17j019O23J614q40M44o5K04L88j922M45l98P12q27
5821a016J002k27L97l70L25r67J841j492N7N32M59J79j285O95r24J104q37L05
$$ plain form
5839 -222 404 323 -438 -5 10 131 -1404 -283 671 84 365 -409 913 533 70 -105 266 291 595 -625
5859 -625 141 292 -214 -1260 235 775 -340 -405 734 149 286 539 663 -1439 634 -331 -64 -378
5877 -378 -786 265 -210 340 -642 15 -680 -359 153 -492 -418 402 -211 -525 -399 -589 318 -510 1308 -89
5897 -89 147 -9 -494 445 578 -350 103 973 -12 -222 -131 -333 1004 -568 -1146 369 -103 -1303 -813
5916 -813 -452 663 662 -190 54 -681 488 584 -609 -524 -493 -781 -391 173 -117 214 71 -864 -137 552 -615
5937 -615 -1061 673 873 -683 25 -179 608 580 -257 1285 525 466 -769 681 419 -670 -1184 -541 -632
5956 -632 311 221 -596 -313 66 -648 -930 127 -328 -122 -637 453 -888 -609 -367 -1427 464 -25 1753
5975 1753 210 513 767 386 -367 -497 93 -856 -87 -414 905 253 67 695 134 -273 -236 -973 550
$$ packed form
5839b22O26q1p61M33J5J21j535J121R54n87K81p74J322l80m63j75L71K5L04j220
5859f25P66J51n06j046J495N40j115o5J139n85J37K53J24k102K073r65K67l14
5877c78m08J051m75N50r82O57o95L21N12o45P4Q20o13l14J26j90R07q28J818j397
5897h9K36j56m85R39J33r28M53Q70r85k10R1k02J337j572n78J515m72j200M90
5916h13L61J115jq52K44p35J169R6j193Q5L1k88L90N64k90L31j43r35P27O89j167
5937f15m46J734K00j556P08k04P87k8q37J542p60n9j235J450k62j089n14O43r1
5956f32R43r0q17K83L79p14k82J057m55K06n15J090j341K79K42j060J891m89J778
5975A753j543L03K54l81p53j30N90r49P69l27J319o52j86O28n61m07L7p37J523
$$ plain form
5994 550 -899 -733 -885 -29 -381 14 -114 453 -165 -302 0 131 306 -639 -585 321 595 -281 -204 -543
6014 -543 778 -654 -285 489 -68 75 -474 -291 93 -832 -407 -710 -598 -268 719 -335 -337 -788 -263 189
6034 189 243 361 276 24 -174 718 -359 -1054 -1271 -399 107 252 442 496 -600 37 -49 565 266 -289 747
6055 747 -152 230 -1005 -790 728 319 -327 -276 -415 -511 -287 -24 -356 219 -298 -369 151 224 -293 -947 -245
6076 -245 -82 -559 148 -824 -764 -140 793 -513 446 -405 160 190 382 563 59 377 -203 -22 -1735 -492
6096 -492 655 -19 -403 -114 -73 -509 219 -317 -611 -417 1520 -685 -30 1032 91 -45 -1241 684
6114 684 184 -188 -595 965 119 18 -543 -31 473 -893 -49 -26 -303 -286 470 -116 168 193 -306 317
6134 317 -574 -281 138 54 -564 -556 362 -1491 89 -224 746 -521 12 -645 -29 -38 -645 728 -892 -715
$$ packed form
5994E50j449J66j52Q56l52L95j28N67o18j37L02J31J75r45N4R06K74q76P7l39
6014e43J321j432L69P74n57J43n49J83L84r25M25l03J12L30R87j054km51N25M52
6034A89N4J18q5k52j98Q92j077o95k17Q72N06J45J90N4j096O37q6O14k99n55J036
6055G47q99L82j235K15J518m09o46N1j39r6K24K63l32N75n17p1N20P3n17o54P02
6076b45J63m77P07r72O0O24R33j306R59q51N65L0J92J81n04L18n80J81j713J243
6096d92J147o74l84K89M1m36P28n36k94J94J937k205O55J062r41j36j196J925
6114F84n00l72m07J560q46j01n61N12N04j366Q44K3k77J7P56n86K84K5m99O23
6134C17q91K93M19q4o18QR18j853J580l13R70j267N33o57O16ro07J373j620J77
$$ plain form
6154 -715 -132 -461 -365 742 55 -61 -40 563 78 -324 1014 1963 -532 1047 444 51 285 550 -541
6173 -541 -720 636 433 189 -446 -378 174 720 -112 -150 -665 -542 592 507 141 245 -27 -672 41 388
6193 388 -751 35 -1245 398 -124 858 775 1145 1253 -282 567 448 978 503 -114 548 166 1132 139
6212 139 -963 -455 597 464 937 -47 -353 -769 -315 959 408 -190 -287 -383 368 336 -625 -405 -223 47
6232 47 317 -226 252 186 -123 -7 -765 339 -750 -809 466 429 -622 169 847 -699 -907 -798 313
6251 313 -906 619 -39 -789 193 15 2505 -684 -506 112 416 -766 111 -34 -869 302 -572 -178
6269 -178 28 302 -712 -668 483 1483 62 694 -430 230 -1626 400 -35 190 616 694 -567 658
6287 658 465 -303 66 107 355 -138 -259 -461 -666 -24 -12 90 -240 -425 363 564 466 -437 222 -179 120
$$ packed form
6154g15N83l29R6J107o87j16K1O03m85m02J338R49k495J579o03l93K34K65j091
6173e41j79J356k03k44o35O8N52N46q32l8n15J23J134q5l66J04k72o45P13L47
6193C88j139P86j280J643n22R82q3L70J08j535Q49j19N30m75o17O62l82R66r93
6212A39j102N08J052j33M73r84l06m16M54J274n51n98r7r6P51l2r61K20J82K70
6232D7K70n43M78o6l09J16p58J104j089n9J275l7j051P91O78j546k08J09J111
6251C13j219J525o58p50R82j78K490l189J78O18L04j182Q77j45q35J171q74L94
6269a78K06K74j014M4J151J000j421O32j124O60j856K026m35K25M26P8j261J225
6287F58j93p68L69M1K48m93j21k02k05O42J2J02l30j85P88K01r8r03O59m01K99
$$ plain form
6308 120 -273 111 915 370 -548 -123 35 28 -225 -1910 772 -318 -78 1236 20 -275 -192 566 -213
6327 -213 -1042 -260 563 -280 985 248 114 810 -228 888 40 -50 416 -92 -256 -47 -924 272 -318
6346 -318 411 -557 -281 -584 320 -1120 -774 -78 -1088 545 -280 -283 -675 -819 91 284 190 186 890 182 -245
6367 -245 358 -568 -365 414 57 -301 -109 57 -201 471 -418 31 -161 -185 -416 772 60 77 201 -452
6387 -452 -839 -244 729 226 -432 65 -440 -37 -253 458 -729 -556 898 -640 -1067 -258 -1064 81 -480
6406 -480 -276 345 -726 449 -417 11 -303 -304 445 -398 -503 -492 133 -312 1009 243 220 324 -360 -552
6426 -552 -670 -1738 533 -1091 -682 894 758 157 1111 -359 26 722 814 908 266 155 -160 147 -417
6445 -417 83 -95 -301 -375 -144 423 465 -425 -903 -362 -148 364 -1011 494 604 412 1206 44 -773 -529
$$ packed form
6308A20l93L84Q04n45r18M25J58pk53j685K682j090K40J314j216k95Q3P58p79
6327b13q29P82Q23q43J265p37j34O96j038J116q48r0M66n08j64K09q77J196n90
6346c18P29r68K76l03R04j440L46O96j010J633q25ll92j44R10J93r4mP04p08m27
6367b45O03r26K03P79l57l58J92J66k58O72q89M49j92k4k31J188p12J7J24o53
6387d52l87N95R73n03o58M97n05M03k16P11j187J73J454j538m27Q09q06J145n61
6406d80K04O21j071J175q66M28l14jP49q43j05J1O25m45J321p66k3J04o84j92
6426e52j18j068K271j624M09J576j36o01R54j470L85O96R2R4o42j11l15L07n64
6445d17N00j78k06p4K31N67M2q90m78N41K14N12j375J505J10j92P94j162q17K44
$$ plain form
6465 -529 -188 724 -360 -138 281 -523 84 -396 372 42 -139 -195 326 -315 723 106 30 133 -478 712
6485 712 -396 539 -1079 -830 -147 791 -1284 -504 454 452 115 480 -908 -1308 -365 -536 -901 267 -494
6504 -494 848 -122 -16 404 872 761 119 -306 443 26 -452 -459 579 -609 -426 -596 -71 -116 -473 8
6524 8 -459 -552 931 1608 131 -63 -494 720 46 1077 -601 126 -83 153 -1301 -395 589 878 -310
6543 -310 -372 -303 -5 -358 -904 608 -130 -40 -297 -450 145 67 -1007 24 -533 -365 -291 613 287 -23 -1363
6564 -1363 -579 287 498 -335 -590 127 139 181 672 -373 -71 -547 310 733 -811 183 -78 -76 960 133
6584 133 234 388 59 904 252 585 -89 -193 -59 10 367 -79 85 614 -263 1098 507 604 226 -29
6604 -29 -275 166 850 -312 -4 1360 -255 514 -469 65 -682 -630 249 -75 -183 683 -928 -484 240
$$ packed form
6465e29L41R12j084K22M19q04O07m80P68l30j81n6N21o41J038o17p6J03o11J190
6485G12j108R35j618K49O83R38k075P80R58kl37L65j388m00R43j71l65J168p61
6504d94J342r70J06M20M68j11o42m25P49m17m78pJ038j188J83j70N25m5l57M81
6524Hm67r3J483O77j477j94m31J214o74J031j678P27k09K36j454R06R84K89j188
6543c10o2O9K98l53n46J512p38R0k57j53N95p8j074J031n57J68P4R04l26l10j340
6564a363P84Q66K11q33k55P17J2M2M91j045L02m76Q57M23j544R94k61KJ036q27
6584A33J01J54l29Q45o52L33o74j04J34O9L57m46J64N29q77J361n91R7l78k55
6604b9k46M41O84j162L08J364j615P69r83N34p47N2Q79l24j08Q66j611M44P24
$$ plain form
6623 240 457 -447 -346 -1049 45 -116 -642 -1156 -755 580 -222 -318 737 19 -288 354 306 -552 -538 42
6643 42 67 92 -26 32 1206 527 -10 -793 -474 973 249 -240 -689 -110 -561 54 -580 -824 -211 -68 389
6664 389 -227 -94 -784 524 1348 -474 -143 87 -436 -363 -550 368 494 916 127 287 -341 1035 125
6683 125 -364 226 -215 395 19 252 486 -1005 -229 -731 336 -689 -852 257 263 -306 87 -686 1131
6702 1131 8 1029 775 309 223 125 542 -549 1064 405 557 1160 -35 -537 474 -39 -465 1286
6720 1286 -306 -73 369 -267 215 -292 -79 -173 -528 -238 305 805 -16 -618 463 887 -228 -629 -204
6739 -204 -176 178 -760 878 -374 -576 343 846 62 -51 -697 42 -1067 -789 -62 -361 -197 459 100
6758 100 261 475 607 -798 477 584 193 -762 -3 40 -42 763 564 -1015 240 369 -338 -32 224
$$ packed form
6623B40K17r04J01p03J094j61n26n14M01J335q02r6J055p18l07O42m8q58J4N80
6643D2K5K5j18N8J174o79n37p83L19J447p24m89m49N79m51O15o34k44O13J43M57
6664C89o16J33o90J308Q24j822L31K30n23P3j87R18J26M22p89J60o28J376r10
6683A25m89N90m41O10l76K33K34j491P76n02J067j025j63J109On69L93p73J817
6702A131j123J021k54m66q6r8M17j091J613o59J52O03j195n02J011n13m26J751
6720A286j592K33M42o36M82n07K13r4l55K90N43N00q21o02J081M24j115m01M25
6739b04K8L54r38J638j252k02R19N03p84j13o46P39j109K78P27k99J64O56l59
6758A00J61K14J32j405J275J07l91r55P59M3q2Q05j99j579J255J29p07L06K56
$$ plain form
6777 224 -174 -1298 -400 218 -213 808 1622 -261 446 -221 546 191 129 -123 -1073 -1314 -89 -481 80
6796 80 530 -1199 448 -889 -9 655 639 -223 67 -316 -378 226 934 82 113 336 -141 260 -30 1010
6816 1010 -547 -500 -921 -434 913 1038 -243 752 579 -968 148 -90 -552 -537 -390 -8 692 878 -167
6835 -167 -11 -758 -767 681 -895 -501 -258 5 -370 -224 836 -375 -293 -876 -260 235 476 -1003 333
6854 333 -8 442 -166 580 635 125 1164 788 416 -198 208 197 699 342 -10 -115 255 -170 161 656
6874 656 297 -801 -1282 963 420 454 -1450 836 255 384 -10 -497 -600 -257 239 -151 992 -216
6892 -216 -97 493 1093 -1004 -407 -887 -301 361 1177 1046 338 273 679 642 -1037 613 333 155 104 574
6912 574 -722 -459 329 -471 677 1075 428 -874 381 175 893 515 -405 278 -190 938 901 771 90
$$ packed form
6777B24l98j124Q98O18m31J021Q14j883P07o67P67l55o2k52r50k41J225l92N61
6796H0M50j729J647j337Q80O64j6q62K90l83o2O04P08q52L1K23m77M01k90J040
6816A010j557M7m21M87J347J25j281R95j73j547J116k38m62J5J47L82P00J86j045
6835a67J56p47rJ448j576L94K43K63l75J46J060j211Q2n83O16M95K41j479J336
6854C33l41M50o08P46N5n10J039l76l72o14M06j1N02l57l52j05L70m25L31M95
6874F56l59j098m81K245n43L4j904K286n81J29l94m87j03L43M96l90J143j208
6892b16J19N90O00k097N97m80N86O62Q16j31p08o5M06l7j679J650k80j78n1M70
6912E74j296K63P88q00J148L98o47j302J255k06P18l78r20O83m68J128l7j30o81
$$ plain form
6931 90 -684 744 -180 -1034 1090 -176 -423 -1001 82 269 -76 304 -572 730 230 943 -307 308
6949 308 -54 -261 -229 617 444 88 -362 859 533 -127 64 166 484 -729 371 -431 -29 278 287 -203
6969 -203 232 816 207 651 -74 467 541 404 -56 -104 324 294 664 -493 358 482 -168 207 -548 -563 -4
6990 -4 165 8 206 -591 652 -181 475 178 441 -55 -605 223 300 -110 -267 544 138 -294 -100 509 -305
7011 -305 421 -780 -798 -902 518 -820 923 -121 -234 3 -128 -347 197 459 448 67 -783 796 655
7030 655 -220 -37 130 -25 291 368 126 -66 -702 -555 -53 546 615 849 -228 -422 626 -401 -206 -452
7050 -452 -193 -441 220 -775 -1683 985 461 322 -522 1020 67 -206 -191 254 -1014 1038 542 -293 150
7069 150 190 224 -154 224 -1330 425 -148 35 -128 -900 872 -94 -133 204 -824 313 368 -891 8
$$ packed form
6931I0p74J428r24q54K124j266k47n78J083J87l45L80q76J302n00P13j250O15
6949C08l62k07L2Q46j73l56m50J221l26o60J91J02L18j213J100q02M02L07Rm90
6969b03M35N84o09M44p25N41P4j37m60m8M28l0L70j157Q51J24o50L75p55j5N59
6990dJ69j57J98p97J243q33O56k97K63m96n50Q28P7m10j57Q11m06m32J94O09q14
7011c05P26j201j8j04J420j338J743j044j13K37j31k19N44K62j1l81q50J579j41
7030F55q75J83J67j55L16P7k42j92o36J47N02N99O9K34j077j94J048j027J95k46
7050d52K59k48O61r95r08K668n24j39q44J542r53k73J5M45j268K052m96q35M43
7069A50M0L4l78L78j554J755n73J83j63p72J772r66l9L37j028J137N5j259Q99
$$ plain form
7088 8 -66 -142 -14 530 89 608 -408 44 -354 640 269 556 1010 158 -1353 -398 240 -627 1871 -117
7108 -117 335 -222 796 233 -44 -168 590 28 809 433 -149 770 -144 944 -169 -21 -105 217 -456
7127 -456 118 180 -67 -489 268 154 216 -680 -485 14 -708 -775 -788 574 -75 -763 -398 1124 -490 964
7147 964 144 313 496 265 95 291 -182 -523 306 -210 456 94 -207 184 -631 574 1033 294 805 -139
7167 -139 -5 -54 361 241 -794 415 -578 544 -871 873 -521 222 382 165 -186 27 886 18
7185 18 194 -846 -544 213 -21 376 -17 526 341 499 415 80 -487 -1079 -538 -1440 -101 350 228 447
7205 447 -229 149 55 467 -45 453 562 903 230 -85 -186 423 -111 -189 -619 -362 334 -922 -229 -182 66
7226 66 675 488 -454 449 271 248 -236 -57 -396 321 -17 383 -674 -365 -285 451 -982 559 -1224 586
$$ packed form
7088Hp4p6J28N44m41N19j016M52l98R94l71K87M54q52j511R55O38q67K498j988
7108a17M52n57J018n63k77j24P58n62P81l76n82R19r14J088j113J48q4L22o73
7127d56N74O2k47m22P57j14O2q96J95M99p22o7j3J362o49o88L65J522j614J454
7147I64q20J69J83k31j70J96m73l41Q29n16O66l62l01L91q15J205M59p39N11r44
7167a39J34m9M15j20j035J209r93J122j415J744j394P43J60k17l51K13Q59q68
7185A8J76j040L02P57k34L97l93N43j85J58q4l35n67n92N41r02J339M51j22K19
7205D47o76L78r4M12n12M98J09L41o73l15j01O09n34p8m30K57O96j256O93M7K48
7226F6O09j87r42R03j78k3m84J79l39P17l38M00j057L09Q0P36j433J541j783J810
$$ plain form
7246 586 -694 67 763 -467 -188 463 -762 145 8 165 345 -17 311 601 1224 -755 745 396
7264 396 -619 101 55 217 -6 1775 -47 -310 841 462 598 -133 1025 380 391 1238 1121 409 602
7283 602 125 1565 310 -596 82 169 -250 838 -555 183 149 -1149 78 559 -820 -350 -165 1410
7301 1410 -198 -533 185 536 -265 -92 -326 717 -447 -155 -562 552 -10 -230 -382 672 -156 -63
7319 -63 315 -499 -254 -316 -242 -127 -955 48 372 423 -520 -223 123 -47 -655 -74 252 -999 130 386
7339 386 -273 -654 -742 -471 -582 168 -503 -449 -185 545 289 -116 856 -638 -719 -230 -783 -352 -1314 -147
7359 -147 106 -671 807 316 15 972 20 -241 371 126 -35 534 378 153 125 393 118 34 -444 -48
7379 -48 -66 -318 -1649 -204 319 200 -739 318 178 350 -2167 230 886 846 269 -85 1123 315 435
$$ packed form
7246E86j280P61O96j230K79O51j225R07j37J57J80l62L28K90O23j979J500l49
7264C96j015P20m6J62k23J781j822k63J151l79J36p31J158o45J1Q47j17p12J93
7283F02m77J440j255r06O78Q7m19J088j393P38l4j298J227M81j379M70J85J575
7301A410j608l35P18L51q01J73k34J043j164K92m07J114n62k20j52J054q28R3
7319f3L78q14K45o2P4J15q28J003L24N1r43K97L46j70o08N81L26j251J129K56
7339C86o59l81q8K71j11P50o71N4K64P30k56m05R72j494q1M89n53M31r62J167
7359a47K53p77J478m91l01R57r52k61O12k45j61N69j56k25k8K68k75q4m78L96
7379d8j8k52j331J445N23j19r39J057j40J72k517K397O56m0n77l54J208q08J20
$$ plain form
7398 435 -130 150 -484 -1279 -1 -587 -94 251 -334 422 252 -295 -724 -480 -446 -571 -501 1122 -164 -465
7418 -465 -662 -50 1519 121 -715 394 355 507 -485 -1024 -770 486 -216 -340 566 -551 -179 -534 781
7437 781 -232 -154 254 381 -531 330 380 -636 -105 -671 30 -42 -34 -713 -7 589 -998 -371 283 474 -310
7458 -310 -33 -120 -178 453 -10 -12 662 559 498 508 337 -79 71 -317 -292 -29 -110 -422 57 -1118 125 234
7480 234 320 -237 -761 344 -686 632 -196 -421 -535 208 -637 1076 -858 555 -464 368 -29 9
7498 9 -641 5 -524 194 94 -206 -645 285 455 434 388 418 -142 288 -460 -52 334 371 824 -129 -647 435
7520 435 138 -643 133 1176 333 -224 262 37 -301 288 808 -75 -744 998 -69 -416 151 -420 692
7539 692 -373 -511 900 -1008 -282 402 -123 318 345 40 -99 389 -1613 558 -954 -1479 -1399 -427 -1115
$$ packed form
7398D35n65K80o34p95J278n86M93L45n85P56j70n47m29K44L4j25P0J623j286l01
7418d65j97O12J569j398q36J109l9J52r92n39K54J256p02j24R06j117L72l55J315
7437G81j013P8M08J27r12Q61N0j016N31n66P01p2Qo79P06N96j587O27O54J91p84
7458c10K77q7n8O31m63kO74j03o1J0j71m16J50l88K5K63q1l12M79j175J243J09
7480B34Q6n57n24J105j030J318q28k25j14P43q45J713j934J413j019Q32l97L8
7498Io50O46n29P18j00l00m39R30J70k1m6L0n60M30p48M08L86L7M53r53n18J082
7520D35k97p81P76J043q43n57M86k25l38N89N20q83o69J742j067l47N67n71J112
7539F92j065j38J411j908P26O84n25M41K7l05j39M88k002K171j512n25Q0R72o88
$$ plain form
7558 -1115 -541 430 843 721 124 -198 -447 -977 461 -1043 167 -944 -216 106 1445 275 -326 237
7576 237 -29 270 200 -1080 -249 676 -1008 -141 447 646 -107 -818 -707 -448 165 382 258 -1040 364
7595 364 -496 -89 177 -791 -509 127 493 277 -285 705 373 -20 569 -551 847 -895 -144 -396 946
7614 946 -571 75 -471 -894 -494 5 -425 -452 193 -22 -80 829 -232 -273 -47 741 1115 -354 745 -513
7634 -513 -657 -58 204 369 -386 403 172 54 1097 -203 57 -333 -384 -551 -619 1201 -631 186 98 989
7654 989 -318 -113 510 -305 -602 -970 321 -311 -1425 91 65 539 -658 46 716 715 183 -664 -153
7673 -153 -923 -812 -48 -309 46 -299 -416 -50 -65 -489 514 -1429 -459 -623 -105 -844 -600 18 -627 -814
7693 -814 241 1060 -396 -290 456 604 -104 -350 -324 55 177 1098 -990 54 -209 353 -499 -149 656
$$ packed form
7558a115N74R71M13j22n97l22k49n30J438j504J210j111P28L22J339j170o01N63
7576B37k66K99p0j280Q31R25j684Q67N88J99p53p11J11K59O13K17j24j298J404
7595C64q60M07K66r68K82O36L66k16n62R90l32l93N89j120J398j742P51k52J342
7614I46j517O46n46m23M00M99m30k7O45k15n8R09j061m1K26P88L74j469J099j258
7634e13j44N99K62J65p55P89k31j18J043j300K60l90n1j67o8J820j832Q17q8Q91
7654I89j307K05O23q15k97l68J291o32j114J516k6M74j197P04O70jn32q47N11
7673a53p70J11P64k61L55l45j17L66j5m24J003j943R70j64N18p39K44O18o45j87
7693h14J055Q19j456J06P46J48p08k46K6L79J22R21k088J044k63N62q52L50Q05
$$ plain form
7712 656 796 -431 31 -659 -516 -859 186 289 5 -105 393 -353 -170 0 173 -945 1129 -726
7730 -726 -538 230 -715 -102 -109 770 549 -844 203 280 -193 -427 353 -443 -300 194 -37 -231 -9 64 471
7751 471 -757 -407 -1183 193 -522 -80 944 -178 473 -69 -351 669 -916 -76 899 -178 -271 -674
7769 -674 351 718 -749 -250 297 338 302 -1095 571 -429 -21 -837 -71 524 -233 144 -815 296 -536
7788 -536 -508 -696 382 -283 -437 348 135 -229 80 693 152 1037 740 -677 -212 542 388 -1250 -809
7807 -809 436 -585 515 386 -331 -306 505 185 675 1194 748 475 -64 -333 -281 1188 -365 390 88
7826 88 543 53 220 224 -1321 -701 298 -191 -564 647 -571 -215 -1097 157 711 -709 318 -490 838
7845 838 -1074 200 695 -66 -1090 957 -101 -34 136 -125 -711 170 -116 1065 -556 13 443 -217
$$ packed form
7712F56J40j227M62o90J43l43J045J03k84j10M98p46J83J70J73j118K074j855
7730g26J88P68r45O13pQ79k21j393J047P7m73k34P80p96J43M94k31j94K22P3M07
7751D71j228L50p76J376p15M42J024j122O51n42k82J020j585Q40R75j077r3m03
7769f74J025L67j467M99N47M1l6j397J666j000M08q16P66N95p57L77r59J111q32
7788e36K8j88J078o65j54P85k13l64L09O13n41Q85k97j417M65P54j54j638M41
7807h09J245j021J100j29p17K5Q11l20M90N19m46k73n39k69N2J469j553P55l02
7826H8M55m90J67Mj545O20R99m89l73J211j218L56q82J254N54j420J027q08J328
7845H38j912J274M95p61j024K047j058O7J70k61n86Q81k86J181j621N69M30o60
$$ plain form
7863 -217 102 839 -40 -364 -277 -255 -819 248 870 655 -1139 -1884 -114 -599 333 598 114 388 -569 -56
7883 -56 -156 93 319 -494 -64 -18 207 -163 -915 721 -263 52 227 -659 85 232 -444 472 32 -1118
7903 -1118 1121 -351 -487 -360 -186 362 79 -173 -945 -54 4 304 593 -225 336 -749 466 -419 460
7922 460 -244 -244 533 48 194 457 26 1181 -819 -201 433 -631 202 -245 -424 -564 99 -547 1120
7941 1120 728 677 -1361 -1029 1534 425 153 -314 1011 -388 -1288 646 607 1217 -505 -257 479 -1557
7959 -1557 -425 -7 -826 152 -56 -754 22 -771 243 239 654 552 207 476 152 26 -879 -303 30 -290
7979 -290 57 673 -455 -425 179 798 953 -458 618 -468 -725 -274 -21 -683 788 565 -701 438
7997 438 461 540 -675 -302 976 877 254 322 103 -278 -37 648 577 9 105 -81 350 -287 -458 639 -1676
$$ packed form
7863b17L19P37q79l24Q7K2n64J067O22k15j794p45J770m85R32K65m84K74r57N13
7883e6j00K49K26q13M30M6K25l70p52J636r84L15J75q86P44J47o76R16m40j150
7903a118K239j472j36J27J74N48k83k52p72Q91N8L00K89q18N61j085J215q85Q79
7922D60p04%P77m85J46K63m31J155k000O18O34j064Q33m47j79j40O63o46J667
7941A120l92n1k038L32K563j109k72m67J325j399r00J934l9O10j722K48P36k036
7959a557J132M18q19R78k08o98P76p93J014mM15j02l45K69l24j26r05N76L33l20
7979b90L47O16j128L0O04O19J55j411J076j086k57M51K53o62J471k23j266J139
7997D38K3P9j215L73J278r9o23O8k19l81K41O85p1n68R6j86M31o37j71J097k315
$$ plain form
8018 -1676 314 346 348 633 82 -133 -703 600 586 209 -648 473 -107 -300 -13 -110 1017 788 -146 705
8038 705 966 234 787 373 199 -25 -249 -317 1055 471 -165 826 1105 1077 -93 688 -305 -351 73 -758
8058 -758 -605 -953 385 701 435 75 -103 187 291 174 -6 727 603 1155 -60 184 195 -121 488 60
8078 60 133 -43 -572 716 256 134 -578 908 589 -812 -698 672 -859 463 258 107 683 -74 109
8097 109 92 63 -426 -193 488 -853 -1019 529 393 -306 831 781 311 -365 449 286 783 570 -805 1003
8117 1003 109 303 -520 -458 221 -238 -227 -1345 -1029 75 -254 -620 212 452 -157 844 -748 355 -683
8136 -683 859 -336 -509 -389 -69 39 -137 -709 174 364 -619 -134 84 -644 -899 -1268 -781 163 7
8155 7 -1124 506 18 488 324 275 -523 791 -561 213 -256 -74 451 606 74 493 384 755 -436
$$ packed form
8018a676J990L2KK85n51k15n70J303j4l77q57J121n80j93K87r7J127k29r34Q51
8038G05K61p32N53m14j74k24k24o8J372n84o36R91K79k8j170P81r93m6M24q31
8058g58J53l48J338L16k66l60j78K90J04j17j80P33j24N52j215K44J1l16O09m28
8078F0P3j76n29J288m60j22p12J486l19j401J14J370j531J322k05j51N76p57J83
8097A09j7k9m89K33O81j341j66J548j36o99J137n0m70o76Q14j63M97k13j375J808
8117A003q94J94q23O2O79m59J1j118L16J104l29l66Q32K40o09J001j592J103j038
8136f83J542j195j73J20L20J08j76n72Q83J90r83M85K18p28k55l69M87R44j56
8155Gj131J630m88M70j64m9p98J314j352P74m69J82N25J55n32M19j09L71j191
$$ plain form
8174 -436 -106 -301 -521 -653 -347 327 -803 -213 27 670 -112 -1247 -269 929 -315 -1238 -230
$$ packed form
8174d36L30j95k20j32L06O74j130N90K40O43p82j135R78J198j244r23J008
8191b30
$$ Imaginary data points
##PAGE= N=2
##DATA TABLE= (X++(I..I)), XYDATA
$$ plain form
0 0 0 0 0 0 0 0 0 -108 108 -108 216 -216 224 -324 432 -452 544 -652 776 -973 1089 -1299 1510 -1731
24 -1731 1965 -2273 2594 -2925 3322 -3757 4228 -4740 5311 -5945 6632 -7380 8206 -9120
38 -9120 10115 -11204 12413 -13739 15209 -16836 18660 -20705 23011 -25641 28666 -32194
50 -32194 36362 -41378 47545 -55358 65611 -79694 100324 -133498 195467 -349809 1505174
61 1505174 1461478 -2441430 246708 1717112 -567214 -966390 464504 -74720 -105179
70 -105179 43255 -406373 32478 578152 -363399 -178018 642471 -129062 -526803 657389
80 657389 265560 -933086 2363 983329 -397552 -981424 540957 821144 -634640
89 -634640 -610397 615956 504709 -448265 -359422 315159 316618 -190356 -293154 45629 241457
$$ packed form
0@%%%%%%%j08K16k16L24m32M40n48P56q84R96j196J428j749K062k388K809l241
24a731L696m238M867n519O247p079P985q968J0051j1256J2577j4012J5586j7326
38i120J9235k1319K3617k6152K8948l2045L5496l9365M3716m8652N4307o0860
50c2194O8556p7740Q8923j02903J20969j45305J80018k33822L28965n45276J854983
61A505174m3696l902908K688138J470404k284326l99176J430894n39224l0459
70a05179J48434m49628M38851N45674r41551J85381Q20489p71533l97741J184192
80F57389l91829j198646R35449R80966j380881n83872J522381K80187j455784
89f34640K4243J226353j11247r52974Q8843O74581J459n06974j02798L38783J95828
$$ plain form
100 241457 22108 -266001 -70230 296751 -15807 -271109 242962 127885 -458726 223293
110 223293 548895 -643649 -394214 941069 32643 -966159 313599 677688 -443974
119 -443974 -259685 261860 -40531 121248 68717 -467564 151084 586071 -432435 -433364
129 -433364 582557 119729 -508559 196224 254779 -385136 77254 412219 -368287 -307369
139 -307369 529386 140908 -539293 -7022 419171 -38568 -231112 -22133 61999 168366
149 168366 35530 -334576 -29971 451360 -45608 -472292 136475 391477 -197413 -245182
159 -245182 202768 59784 -149207 131790 31338 -287330 147366 351933 -333229 -287103
169 -287103 434980 131218 -383550 13330 178818 -49906 86368 -66338 -286062 283649
$$ packed form
100B41457k19349k88109J95771L66981l12558k55302N14071j15077n86611O82019
110B23293L25602j192544K49435J335283r08426r98802J279758L64089j121662
119d43974J84289N21545l02391J61779n2531n36281O18648M34987j018506r29
129d33364J015921m62828o28288P04783N8555o39915M62390L34965p80506O0918
139c07369Q36755l88478o80201N32271M26193m57739j92544K08979Q4132J06367
149A68366j32836l70106L04605M81331m96968m26684O08767K55002n88890m7769
159b45182M47950j42984k08991K80997j00452l18668M34696K04567o85162M6126
169b87103P22083l03762n14768L96880J65488k28724J36274j52706k19724N69711
$$ plain form
179 283649 327994 -480578 -201881 553286 14067 -442205 130648 210925 -156719 35892
189 35892 65045 -227614 75538 304310 -221483 -287169 305851 197691 -296966 -71976
199 -71976 196594 -10193 -3318 27126 -192444 53400 339460 -196920 -384595 322713 299000
210 299000 -394181 -154282 328567 -3652 -159794 93341 -54992 -70867 264209 -18226
220 -18226 -358886 160174 344573 -261958 -220661 260827 34624 -145065 97459 -81979
230 -81979 -129516 306166 31889 -432774 134986 419773 -255872 -273829 274265 96594
240 96594 -168598 34929 -13479 -80889 183747 35035 -291273 43506 311385 -104755
250 -104755 -255403 126025 164335 -93220 -56009 14953 -42832 100370 100059 -236120 -99889
$$ packed form
179B83649M4345q08572K78697P55167n39219m56272N72853Q0277l67644J92611
189C5892K9153k92659L03152K28772n25793o5686N93020j08160m94657K24990
199g1976K68570k06787O875L0444k19570K45844K86060n36380j87675P07308k3713
210B99000o93181K39899M82849l32219j56142K53135j48333j5875L35076k82435
220a8226l40660N19060J84399o06531M1297M81488k26203j79689K42524j79438
230h1979m7537M35682k74277m64663N67760K84787o75645j7957N48094j77671
240I6594k65192K03527m8408o7410K64636j48712l26308L34779K67879m16140
250a04755j50648L81428L8310k57555L7211P0962n7785J43202l11l36179J36231
$$ plain form
261 -99889 337689 34834 -365610 55693 302128 -114978 -154831 105071 -14573 -4072
271 -4072 147027 -157704 -186983 311842 113723 -389311 13809 333338 -124662 -168113 144773
282 144773 -38087 -43118 202405 -134916 -247203 313346 168628 -397186 -24666 338241
292 338241 -94587 -170231 106851 -26550 -14331 159582 -133599 -191805 258580 140909
302 140909 -301208 -56900 256773 -5964 -149906 18049 27530 14238 70999 -70169 -137279
313 -137279 128022 171978 -170368 -171582 199228 138920 -191066 -77038 132612 12513 -24663
324 -24663 9965 -109641 18861 218383 -100247 -262130 193572 216020 -237918 -98727
334 -98727 197908 -21079 -57958 85322 -122205 -49040 267270 -64108 -315202 182196
$$ packed form
261i9889M37578l02855m00444M21303K46435m17106l9853K59902j19644J0501
271d072J51099l04731k9279M98825j98119n03034M03120L19529m58000m3451L12886
282A44773j82860n031K45523l37321j12287N60549j44718n65814L72520L62907
292C38241m32828p5644K77082j33401J2219J73913k93181n8206M50385j17671
302A40909m42117K44308L13673k62737j43942J67955R481j3292N6761j41168o7110
313a37279K65301M3956l42346j214L70810o0308l29986J14028K09650j20099l7176
324b4663L4628j19606J28502J99522l18630j61883M55702K2448m53938J39191
334i8727K96635k18987l6879J43280k07527P3165L16310l31378k51094M97398
$$ plain form
344 182196 242556 -242854 -105427 188308 -30802 -42578 88806 -133863 -46081 263734
354 263734 -56085 -286912 158397 219155 -186920 -105033 133567 7969 -23660 33369 -99116
365 -99116 -25728 182909 -20184 -219835 59446 204821 -79012 -154918 69555 98839 -29795
376 -29795 -33860 -22890 -17882 97627 48530 -174511 -43461 223349 20 -228686 44182
387 44182 167083 -68932 -66588 40265 -38020 45970 110526 -153487 -108251 244911 47148
398 47148 -261700 33722 189250 -82642 -66648 54498 -59616 36354 127127 -149374 -122851
409 -122851 233617 64804 -242962 13742 179199 -52935 -68380 31372 -40385 34688 100369
420 100369 -119016 -114885 175922 85787 -189415 -40880 159962 10018 -88074 2738 6388
$$ packed form
344A82196O0360m85410J37427K93735k19110j1776J31384k22669Q7782L09815
354B63734l19819k30827M45309O0758m06075Q1887K38600j25598l1629N7029j32485
365i9116P3388K08637k03093j99651K79281J45375k83833p5906K24473K9284j28634
376b9795m065J0970N008J15509m9097k23041J31050K66810k23329k28706K72868
387D4182J22901k36015K344J06853p8285Q3990O4556k64013M5236L53162j97763
398D7148l08848K95422J55528k71892J5994J21146j14114R5970R0773k76501K6523
409a22851L56468j68813l07766K56704J65457k32134j5445R9752p1757P5073O5681
420A00369k19385M131K90807r0135k75202J48535K00842j49944r8092R0812L650
$$ plain form
431 6388 19659 66112 -63978 -116768 108824 125445 -149120 -107665 155954 62351 -122577
442 -122577 -11502 51394 -6219 47495 -8867 -126451 63190 161211 -124497 -147215 151994
453 151994 84299 -134275 -23292 61186 -15588 40251 9897 -124499 44065 168676 -96985
464 -96985 -152797 126109 100782 -113249 -47728 52986 5543 23193 -130 -94464 22853
475 22853 142907 -50775 -147016 79455 125388 -76117 -84945 47765 37301 -5653 -8202
486 -8202 -57518 -11728 113464 3570 -151152 27865 160821 -49838 -118580 62687 60483
497 60483 -35073 4769 -29142 -49976 100607 40660 -167489 -5499 177827 -44962 -132858
508 -132858 68814 57849 -35599 21297 -26041 -54646 105366 47672 -157464 -12366 155650
$$ packed form
431F388J3271M6453j30090n2790K25592J6621k74565M1455K63619r3603j84928
442a22577J11075O2896n7613N3714n6362j17584J89641R8021k85708k2718K99209
453A51994o7695k18574J10983Q4478p6774N5839l0354j34396J68564J24611k65661
464i6985n5812K78906k5327k14031O5521J00714m7443J7650k3323r4334J17317
475B2853J20054j93682r6241K26471M5933k01505q828J32710j0464m2954k549
486h202m9316M5790J25192j09894j54722J79017J32956k10659o8742J81267k204
497F0483r5556L9842l3911k0834J50583n9947k08149J61990J83326k22789q7896
508a32858K01672j0965r3448N6896m7338k8605J60012n7694k05136J45098J68016
$$ plain form
519 155650 -30334 -119061 37529 49548 -11280 5704 -38469 -29994 93023 36039 -116571
530 -116571 -19630 121666 11372 -99561 -12905 66603 19151 -34974 -35152 159 50412 29240
542 29240 -64978 -52764 84848 67739 -95948 -60501 97686 36370 -74278 -12103 18367
553 18367 4205 43428 -28072 -92723 70993 104317 -108890 -73664 120487 26843 -80562
564 -80562 14374 7124 -16255 70273 -25716 -114978 81741 104928 -117467 -62275 107408 12646
576 12646 -54155 10638 -15510 961 75416 -37633 -96429 74872 83858 -85971 -51906 64056
588 64056 28985 -24032 -23798 -18325 33188 43640 -42655 -55818 43051 61176 -35364 -63340 23256
601 23256 66631 -11692 -63622 3596 52125 5795 -24899 -27923 863 59314 9511 -92895
$$ packed form
519A55650j85984q8727J56590J2019o0828J6984m4173Q475J23017n6984j52610
530a16571R6941J41296j10294j10933Q6656P9508m7452n4125j78L5311N0253k1172
542B9240r4218J2214J37612j7109j63687L5447J58187o1316j10648O2175L0470
553A8367j4162L9223p1500o4651J63716L3324k13207L5226J94151r3644j07405
564h0562R4936p250k3379Q6528r5989q9262J96719K3187k22395N5192J69683r4762
576A2646o6801O4793k6148J6471P4455j13049n8796J71301Q986j69829L4065J15962
588F4056l5071n3017K34N473N1513J0452q6295j3163R8869J8125r6540k7976Q6596
601B3256M3375p8323n1930O7218M8529m6330l0694l024K8786N8451m9803j02406
$$ plain form
613 -92895 781 104577 -21440 -83723 31604 39629 -16154 7129 -26509 -32470 77950 24058
625 24058 -112736 7269 110435 -36546 -67861 39639 15025 -4930 23175 -45148 -30254
636 -30254 87098 9307 -102869 13173 83412 -27471 -50585 14351 14501 16335 11313 -47300
648 -47300 -10409 73092 7064 -73124 -1920 61430 3906 -47499 -17124 27285 27065 -15370
660 -15370 -38608 2607 43308 11536 -41346 -23124 47378 36846 -46750 -36056 45478 25706
672 25706 -33948 -19583 1611 16457 25681 -32304 -46361 52254 48738 -60328 -30563 55992
684 55992 14836 -26561 -6910 -13478 15202 41070 -38315 -53147 53197 44034 -54983 -27885
696 -27885 39388 19731 -12130 -15870 -11547 20544 31653 -28082 -42546 29507 42102 -31487
$$ packed form
613i2895R3676J03796j26017o2283J15327Q025n5783K3283l3638n961J10420n3892
625B4058j36794J20005J03166j46981l1315J07500k4614j9955K8105o8323J4894
636c0254J17352p7791j12176J16042P0239j10883k3114O4936J50J834n022n8613
648d7300L6891Q3501o6028q0188P1204O3350n7524n1405L0375M4409k20m2435
660a5370k3238M1215M0701l1772n2882J8222P0502j0532q3596J0694Q1534j9772
672B5706n9654J4365K1194J4846R224n7985j4057R8615l516j09066K9765Q6555
684E5992m1156m1397J9651o568K8680K5868p9385j4832J06344r163r9017K7098
696b7885O7273j9657l1861l740M323L2091J1109n9735j4464P2053J2595p3589
$$ plain form
708 -31487 -39159 23211 32354 -9188 -24894 -2304 22798 21219 -17767 -33927 16828 42881 -20650
721 -20650 -45821 15503 37513 -10968 -28519 -925 18577 19426 -8423 -36233 7464 50463
733 50463 -11059 -52581 15369 40473 -13665 -23208 -1554 7406 23334 -1879 -42175 6866
745 6866 49492 -11483 -42893 12585 30257 -1938 -17386 -15598 12432 29277 -15592 -36545
757 -36545 14302 31182 -5283 -26754 -7737 28685 19800 -30019 -21064 29666 19414 -18568
769 -18568 -18301 901 20175 14940 -29754 -25767 38247 24366 -39138 -14570 28948 6631 -7569
782 -7569 -7030 -13816 19529 25772 -34275 -26393 41469 17253 -37024 -5489 19483 1618 4511
795 4511 -12051 -25034 29146 27038 -45908 -16727 43457 3480 -23735 1070 754 13135 19775
$$ packed form
708c1487p672O2370R143m1542j5706K2590K5102j579l8986j6160N0755K6053o3531
721b0650k5171O1324K2010m8481j7551K7594J9502Q49k7849k7810M3697M2999
733E0463o1522m1522O7950K5104n4138r543K1654Q960J5928k5213m0296M9041
745F866M2626o0975l1410N5478J7672l2195j5448J788K8030J6845m4869k0953
757c6545N0847J6880l6465k1471J9017L6422q885m9819Q955N0730j0252l7982
769a8568K67J9202J9274n235m4694L987O4014j3881o3504K4568M3518k2317j4200
782g569N39o786L3345O243o0047P882O7862k4216n4277L1535K4972j7865K893
795D511j6562j2983N4180k108p2946K9181O0184l9977k7215K4805l16J2381O640
$$ plain form
808 19775 -28397 -21062 41404 13247 -39879 -6201 20912 3090 -2589 -17784 -10129 32265 9267
821 9267 -37660 1023 30436 -787 -11658 -5646 -1644 21414 4408 -37722 -494 38427 -9535
834 -9535 -30864 10578 12838 -482 3823 -18851 -4518 37874 -3127 -41513 14111 30563 -15057
847 -15057 -11986 3101 -4631 17001 5858 -35287 4249 44118 -16453 -32478 22422 12645 -10144
860 -10144 6222 -12415 -7338 32948 -5526 -38495 17179 27464 -19251 -11148 9675 1318 11762
873 11762 -346 -26077 12481 29092 -20568 -20782 19811 6069 -6053 -1367 -13756 6873 24915
886 24915 -16465 -23682 23685 15973 -18880 -5939 6113 2391 10596 -7429 -21144 17499 20178
899 20178 -24430 -12312 21056 1582 -6807 321 -8545 8207 18849 -18972 -17069 25224 9305
$$ packed form
808A9775m8172P335O2466k8157n3126L3678K7113j7822n679j5195P655M2394k2998
821I267m6927L8683K9413l1223j0871O012M002K3058j7006m2130L7228L8921m7962
834i535k1329M1442K260j3320M305k2674J4333M2392m1001l8386N5624J6452m5620
847a5057L071J5087p732K1632j1143m1145L9536L9869o0571j6025N4900r777k2789
860a0144J6366j8637N077M0286l8474l2969N5674J0285m6715Q103K0823q357J0444
873A1762j2108k5731L8558J6611m9660k14M0593j3742j2122M686j2389K0629J8042
886B4915m1380p217M7367p712l4853J2941J2052l722Q205j8025j3715L8643K679
899B0178m4608J2118L3368j9474q389P128q866J6752J0642l7821J903M2293j5919
$$ plain form
912 9305 -23513 -1063 10159 -1284 7271 -7545 -16327 18784 15523 -26113 -6315 19844 596
925 596 -8906 -1797 -5140 9524 9757 -17889 -7858 21316 2930 -17207 -504 6384 3665 2005
939 2005 -10197 -5733 17612 4136 -18230 923 14419 963 -5729 -5068 613 11561 5
952 5 -15678 46 15379 -1167 -12185 453 6865 4782 -2105 -9148 1272 14551 -1195 -14162
966 -14162 2084 9789 -368 -7233 -6254 4131 8902 -5334 -12057 4146 9695 -1497 -8271 -73
980 -73 7801 5865 -5400 -8358 7486 7554 -5976 -8122 2594 5652 2783 -7613 -6846 11475 6874
995 6874 -10190 -3974 7768 3273 -1608 -4009 -4821 8577 6466 -12173 -5458 12101 1252 -8913
1009 -8913 1299 1874 3104 5982 -8115 -6289 14723 2290 -12048 2232 6561 -1686 -1335 -4479
$$ packed form
912I305l2818K2450J1222j1443Q555j4816q782L5111l261m1636J9798K6159j9248
925E96r502P109l343J4664K33k7646J0031K9174j8386k0137J6703O888k719j660
939B005j2202M464K3345j3476k2366J9153J3496j3456o692O61N681J0948j1556
952Ej5683J5724J5333j6546j1018J2638O412k083o887p043J0420J3279j5746j2967
966a4162J6246P705j0157o865R79J0385M771j4236o723J6203N549j1192o774Q198
980g3P874j936j1265k958J5844O8j3530k146J0716L058k869j0396P67J8321m601
995F874j7064O216J1742m495m881k401q12J3398k111j8639O715J7559j0849j0165
1009h913J0212N75J230K878j4097J826K1012j2433j4338J4280M329q247L51l144
$$ plain form
1023 -4479 -4498 9508 4699 -14613 -301 13913 -4543 -6185 3058 -599 3494 6088 -12312 -3332
1037 -3332 15280 -4504 -13058 6256 4901 -4879 2951 -2074 -6520 11631 4056 -17726 4715
1050 4715 15656 -10979 -5665 7833 -5974 3039 7748 -13233 -823 17602 -7360 -12115 12341
1063 12341 3379 -7459 6287 -2097 -7505 13996 -677 -18076 9328 13082 -14023 -754 9587
1076 9587 -6204 2587 6312 -13052 2748 15360 -11325 -10439 12966 -1073 -8816 4719 -2724
1089 -2724 -6670 12511 -3305 -14437 12985 7858 -14162 3444 9664 -6930 4242 4692 -13030
1102 -13030 5081 13790 -14609 -7333 14745 -4030 -9752 10425 -3392 -5362 14437 -4195 -12048
1115 -12048 15805 3903 -15470 5885 6118 -9579 3240 3361 -12775 5724 10835 -14462 -3169
$$ packed form
1023d479j9J4006m809j9312J4312J4214j8456j642R243l657M093K594j8400Q980
1037c332J8612j9784q554J9314j355r780P830n025m446J8151p575k1782K2441
1050D715J0941k6635N314J3498j3807R013M709k0981J2410J8425k4962m755K4456
1063A2341q962j0838J3746q384n408K1501j4673j7399K7404L754k7105J3269J0341
1076I587j5791Q791L725j9364J5800J2612k6685Q86K3405j4039p743J3535p443
1089b724l946J9181j5816j1132K7422n127k2020J7606O220j6594J1172M50j7722
1102a3030J8111Q709k8399P276K2078j8775n722K0177j3817j970J9799j8632p853
1115a2048K7853j1902j9373K1355K33j5697J2819J21j6136J8499N111k5297J1293
$$ plain form
1128 -3169 14730 -5321 -5911 9710 -4238 -2526 10872 -7866 -8814 12788 -707 -13068 7591
1141 7591 3618 -6663 5692 2307 -9366 7852 7496 -12664 -912 12176 -7021 -4089 6961
1154 6961 -5078 -2003 9213 -7151 -4964 12497 -1819 -9859 7976 2328 -6439 4658 1057
1167 1057 -7843 6545 3942 -11361 3161 8013 -7262 -1147 7164 -6523 1038 6937 -7423
1180 -7423 -1146 10334 -3469 -6507 6313 782 -4135 4249 -108 -5339 6898 1102 -7795 2920
$$ packed form
1128c169J7899k0051n90J5621j3948J712J3398j8738r48K1602j3495j2361K0659
1141G591l973j0281J2355l385j1673J7218l56k0160J1752J3088j9197K932J1050
1154F961j2039L075J1216j6364K187J7461j4316q040J7835n648q767J1097l601
1167A057q900J4388k603j5303J4522M852j5275O115Q311j3687P561N899j4360
1180g423O277J1480j3803l038J2820n531m917Q384m357n231J2237n796q897J0715
$$ [...]
##END NTUPLES=NMR FID
##END=
