##TITLE=1H_UK-7'
 THF-d8+pyridin-d5, 108 sc, 
 28.7.2020
##JCAMPDX= 6.0         $$ Bruker NMR JCAMP-DX V2.0
##DATA TYPE= NMR FID
##DATA CLASS= NTUPLES
##ORIGIN= UXNMR, Bruker Analytische Messtechnik GmbH
##OWNER= root
$$ XWIN-NMR		Version 3.5
$$ Tue Jul 28 12:12:38 2020 Russian Standard Time (UT+4h)  she@DPX200
##.OBSERVE FREQUENCY= 200.1315
##.OBSERVE NUCLEUS= ^1H
##.DELAY= (6, 6)
##.ACQUISITION MODE= SIMULTANEOUS
##.ACQUISITION SCHEME= undefined
##.AVERAGES= 108
##.DIGITISER RES= 18
##SPECTROMETER/DATA SYSTEM= spect
##.PULSE SEQUENCE= zg30
##.SOLVENT NAME= THF
##.SHIFT REFERENCE= (INTERNAL, THF, 0, 15.7039)
##AUDIT TRAIL= $$ (NUMBER, WHEN, WHO, WHERE, WHAT)
$$ ##TITLE= Audit trail, XWIN-NMR		Version 3.5
$$ ##JCAMPDX= 5.01
$$ ##ORIGIN= Bruker BioSpin GmbH
$$ ##OWNER= she
$$ F:/spectra/data/she/nmr/H-F/1/audita.txt
$$ ##AUDIT TRAIL=  $$ (NUMBER, WHEN, WHO, WHERE, WHAT)
(   1,<2020-07-28 12:10:56.98 +0400>,<she>,<DPX200>,
      <continue with go, POWCHK disabled, PULCHK disabled
       configuration hash MD5:
       00 E9 B6 7A A2 85 ED C7 34 08 36 98 17 FE 4E 26
       data hash MD5: 16K
       9D 9A 47 51 A9 81 24 D3 8C 31 1A 07 A8 81 DC 8D>)
$$ ##END=
$$ 
$$ hash MD5
$$ D2 9A 7F 1C BC EC 14 00 8A 02 FD 55 CF C9 A0 A2
##$RELAX= 
##$RELAX= 
##$RELAX= 
##$RELAX= 
##$RELAX= 
##$RELAX= 
$$ Bruker specific parameters
$$ --------------------------
##$DU= <F:/spectra>
##$EXPNO= 1
##$NAME= <H-F>
##$PROCNO= 1
##$TYPE= <nmr>
##$USER= <she>
##$AMP= (0..31)
100 100 100 100 100 100 100 100 100 100 100 100 100 100 100 100 100 100 
100 100 100 100 100 100 100 100 100 100 100 100 100 100 
##$AQSEQ= 0
##$AQ_mod= 1
##$AUNM= <au_zg>
##$AUTOPOS= <>
##$BF1= 200.13
##$BF2= 200.13
##$BF3= 200.13
##$BF4= 200.13
##$BF5= 200.13
##$BF6= 200.13
##$BF7= 200.13
##$BF8= 200.13
##$BYTORDA= 1
##$CFDGTYP= 0
##$CFRGTYP= 5
##$CHEMSTR= <none>
##$CNST= (0..31)
1 1 145 1 1 1 1 1 1 1 1 1 1 1 1 1 1 1 1 1 1 1 1 1 1 1 1 1 1 1 1 1 
##$CPDPRG= <>
##$CPDPRG1= <>
##$CPDPRG2= <>
##$CPDPRG3= <>
##$CPDPRG4= <mlev>
##$CPDPRG5= <mlev>
##$CPDPRG6= <mlev>
##$CPDPRG7= <mlev>
##$CPDPRG8= <mlev>
##$CPDPRGB= <>
##$CPDPRGT= <>
##$D= (0..31)
0 1.2 0 0 0 0 0 0 0 0.06 0 0.03 0 0 0 0 0.0002 0 0 0 0 0 0 0 0 0 0 0 0 
0 0 0 
##$DATE= 1595923514
##$DBL= (0..7)
120 120 120 120 120 120 120 120 
##$DBP= (0..7)
150 150 150 150 150 150 150 150 
##$DBP07= 0
##$DBPNAM0= <>
##$DBPNAM1= <>
##$DBPNAM2= <>
##$DBPNAM3= <>
##$DBPNAM4= <>
##$DBPNAM5= <>
##$DBPNAM6= <>
##$DBPNAM7= <>
##$DBPOAL= (0..7)
0.5 0.5 0.5 0.5 0.5 0.5 0.5 0.5 
##$DBPOFFS= (0..7)
0 0 0 0 0 0 0 0 
##$DE= 6
##$DECBNUC= <off>
##$DECIM= 24
##$DECNUC= <off>
##$DECSTAT= 4
##$DIGMOD= 1
##$DIGTYP= 9
##$DL= (0..7)
0 120 120 120 120 120 120 120 
##$DP= (0..7)
150 150 150 150 150 150 150 150 
##$DP07= 0
##$DPNAME0= <>
##$DPNAME1= <>
##$DPNAME2= <>
##$DPNAME3= <>
##$DPNAME4= <>
##$DPNAME5= <>
##$DPNAME6= <>
##$DPNAME7= <>
##$DPOAL= (0..7)
0.5 0.5 0.5 0.5 0.5 0.5 0.5 0.5 
##$DPOFFS= (0..7)
0 0 0 0 0 0 0 0 
##$DQDMODE= 0
##$DR= 18
##$DS= 0
$$ [...]
##$SUBNAM2= <"">
##$SUBNAM3= <"">
##$SUBNAM4= <"">
##$SUBNAM5= <"">
##$SUBNAM6= <"">
##$SUBNAM7= <"">
##$SUBNAM8= <"">
##$SUBNAM9= <"">
##$SW= 24.9337058887773
##$SWIBOX= (0..15)
0 0 2 0 0 0 0 0 0 0 0 0 0 0 0 0 
##$SW_h= 4990.01996007984
##$TD= 16384
##$TD0= 1
##$TE= 0
##$TE2= 300
##$TE3= 300
##$TEG= 300
##$TL= (0..7)
0 120 120 120 120 120 120 120 
##$TP= (0..7)
150 150 150 150 150 150 150 150 
##$TP07= 0
##$TPNAME0= <>
##$TPNAME1= <>
##$TPNAME2= <>
##$TPNAME3= <>
##$TPNAME4= <>
##$TPNAME5= <>
##$TPNAME6= <>
##$TPNAME7= <>
##$TPOAL= (0..7)
0.5 0.5 0.5 0.5 0.5 0.5 0.5 0.5 
##$TPOFFS= (0..7)
0 0 0 0 0 0 0 0 
##$TUNHIN= 0
##$TUNHOUT= 0
##$TUNXOUT= 0
##$USERA1= <user>
##$USERA2= <user>
##$USERA3= <user>
##$USERA4= <user>
##$USERA5= <user>
##$V9= 5
##$VALIST= <valist>
##$VCLIST= <CCCCCCCCCCCCCCC>
##$VD= 0
##$VDLIST= <DDDDDDDDDDDDDDD>
##$VPLIST= <PPPPPPPPPPPPPPP>
##$VTLIST= <TTTTTTTTTTTTTTT>
##$WBST= 1024
##$WBSW= 4
##$XGAIN= (0..3)
0 0 0 0 
##$XL= 0
##$YL= 0
##$YMAX_a= 2214472
##$YMIN_a= -2444209
##$ZGOPTNS= <>
##$ZL1= 120
##$ZL2= 120
##$ZL3= 120
##$ZL4= 120
##$ABSF1= 10
##$ABSF2= 0
##$ABSG= 5
##$ABSL= 3
##$ALPHA= 0
##$AQORDER= 0
##$ASSFAC= 0
##$ASSFACI= 0
##$ASSFACX= 0
##$ASSWID= 0
##$AUNMP= <proc_1d>
##$AZFE= 0.1
##$AZFW= 0.1
##$BCFW= 1
##$BC_mod= 2
##$BYTORDP= 1
##$COROFFS= 0
##$CY= 11.3945322036743
##$DATMOD= 1
##$DC= 2
##$DFILT= <>
##$DTYPP= 0
##$F1P= 16.9975609425685
##$F2P= -3.02152046262296
##$FCOR= 0.5
##$FTSIZE= 0
##$FT_mod= 4
##$GAMMA= 1
##$GB= 0.15
##$INTBC= 1
##$INTSCL= 1
##$ISEN= 128
##$LB= 0.24
##$LEV0= 0
##$LPBIN= 0
##$MAXI= 10000
##$MC2= 0
##$MEAN= 0
##$ME_mod= 0
##$MI= 1.114404
##$NCOEF= 0
##$NC_proc= 0
##$NLEV= 6
##$NOISF1= 3.799351
##$NOISF2= 2.8
##$NSP= 1
##$NTH_PI= 0
##$NZP= 0
##$OFFSET= 15.70392
##$PC= 1
##$PHC0= -9801.488
##$PHC1= 21.20091
##$PH_mod= 1
##$PKNL= yes
##$PPARMOD= 0
##$PSCAL= 0
##$PSIGN= 0
##$REVERSE= no
##$SF= 200.130013532006
##$SI= 16384
##$SIGF1= 3
##$SIGF2= 2
##$SINO= 400
##$SIOLD= 16384
##$SREGLST= <1H.CDCl3>
##$SSB= 0
##$STSI= 0
##$STSR= 0
##$SW_p= 3612.71676300578
##$SYMM= 0
##$S_DEV= 0
##$TDeff= 0
##$TDoff= 0
##$TI= <>
##$TILT= no
##$TM1= 0
##$TM2= 0
##$TOPLEV= 0
##$USERP1= <user>
##$USERP2= <user>
##$USERP3= <user>
##$USERP4= <user>
##$USERP5= <user>
##$WDW= 1
##$XDIM= 8192
##$YMAX_p= 0
##$YMIN_p= 0
$$ End of Bruker specific parameters
$$ ---------------------------------
##NTUPLES= NMR FID
##VAR_NAME=  TIME,          FID/REAL,        FID/IMAG
##SYMBOL=    X,             R,               I
##VAR_TYPE=  INDEPENDENT,   DEPENDENT,       DEPENDENT
##VAR_FORM=  AFFN,          ASDF,            ASDF
##VAR_DIM=   8192,          8192,            8192
##UNITS=     SECONDS,       ARBITRARY UNITS, ARBITRARY UNITS
##FACTOR=    0.0002004,     1,               1
##FIRST=     0,             0,               0
##LAST=      1.6414764,     0,               0
##MIN=       0,             -2444209,        0
##MAX=       1.6414764,     2214472,         0
$$ Real data points
##PAGE= N=1
##DATA TABLE= (X++(R..R)), XYDATA
0@%%%%%%%%%J08k16K16k16K17l25M32n26O34p27Q36r73J188j399J610j840K121
26A140k440K780l165L590m064M586n155N788o480P227q055Q983r985J1069j2270
41f451J3602j5062J6661j8444K0436k2656K5148k7977L1206l4931L9298m4495
53b3665N0787n8592O8573q1844J00380j28108J74343l83108K495706j433186l023585
64b242299K389001J250083j309359m55618J48177K48516Q95296j098980j136269
73a311452J721304P85268k038375J8132J790450n01195j260268P34704O28906
82E67474o37590k84166M05525R6180j53343j47525L6510L07534k1664n37499J55204
93b13360P02320l46054p93270N55152Q41443o82747q38697Q32005P96971r48939
$$ plain form
0 0 0 0 0 0 0 0 0 0 0 108 -108 108 -108 109 -216 216 -310 324 -403 433 -540 648 -751 859 -981 1140
26 1140 -1300 1480 -1685 1905 -2159 2427 -2728 3060 -3420 3807 -4248 4735 -5250 5819 -6451
41 -6451 7151 -7911 8750 -9694 10742 -11914 13234 -14743 16463 -18468 20830 -23665
53 -23665 27122 -31470 37103 -44741 55639 -72469 101874 -281234 2214472 781286 -2242299
64 -2242299 146702 1396785 87426 -368192 -220015 28501 923797 -175183 -1311452
73 -1311452 409852 1195120 -843255 -825123 965327 464132 -796136 -61432 567474
82 567474 -70116 -354282 51243 147423 -5920 -153445 -116935 190599 168935 -368564 -213360
93 -213360 488960 142906 -650364 -95212 746231 63484 -775213 56792 853763 -95176
103i5176o55538R38584L70026p21867j51241K66959J87055K51295n16260m95111
113f21274J018801L23220j367546J48298J221371o65400o67543P91109m9709m17786
123b86459N37276j93581m97129P22489Q1993q33125L94987M94265o56209L7663
133a97830N68749m88374k07788P25981j76107o68279M45752M28896n09131j76050
143b54181L22116j0451k5917L4118k78781R3230M98916k88857n67744M52811M77077
154D52337n31681l35058M66253J96005k97054q6740J10478N8561J08672o8048
164G3725l18962J42429M64873l10012m77384M85910L16337n13794m749L40477
174A98850k47332L1353K78401m57044r7735O60213k40919n93477M90730K92631
$$ plain form
103 -95176 -750714 187870 557896 -163971 -315212 -48253 138802 390097 -126163 -621274
113 -621274 397527 720747 -646799 -498501 722870 57470 -610073 181036 131327 -286459
123 -286459 250817 57236 -439893 282596 364589 -468536 -73549 420716 -235493 -197830
133 -197830 370919 -117455 -325243 400738 224631 -443648 2104 431000 -78131 -254181
143 -254181 67935 57484 31567 65685 -213096 -119866 379050 90193 -477551 -24740 452337
154 452337 -79344 -414402 51851 247856 -49198 -135938 -25460 33101 141773 73725
164 73725 -245237 -102808 362065 52053 -425331 60579 376916 -136878 -141627 198850
174 198850 -48482 -17129 261272 -195772 -293507 366706 125787 -467690 23040 315671
184C15671m63475Q3739J95558k86437J95143K37536n33234m4185O39155j97047
194A42424n45681L49879L49159l20884q0859J75881j05980P5458J72888l54215
204a41930j16507N35051m5941n62628K16767M39922k88624k12440K16892l0368
214A0194m2715J66489k15974j93676M30774J03364n23169N8752M86841j86268
224I4612l09972K23417M8744j44277J91950p2615l15161L60391K81370n48905
234a90446o5589N65070j64000l69589K56471L5682j71584K25503p4530l29818
244b82830L55021K68319n04423q3391M82009r1436l27920J37012P5303q8437J22589
255F1816n0789k33994K31955K77660l50166k10280M15098Q9320l77014K5721K12877
$$ plain form
184 315671 -147804 -64065 131493 -154944 40199 277735 -255499 -299684 339471 142424
194 142424 -403257 -53378 295781 -25103 -105962 69919 -36061 39397 212285 -141930
204 -141930 -258437 276614 230673 -331955 -115188 324734 36110 -176330 40562 10194
214 10194 -32521 133968 -82006 -275682 155092 258456 -264713 -205961 280880 94612
224 94612 -215360 8057 56801 -87476 104474 31859 -283302 77089 358459 -190446
234 -190446 -256035 309035 145035 -224554 31917 67599 -103985 121518 46988 -282830
244 -282830 72191 340510 -163913 -247304 234705 143269 -184651 -47639 27664 -60773 61816
255 61816 11027 -222967 8988 286648 -63518 -273798 141300 230620 -146394 -120673 92204
266I2204r6002J2126O5029k13029Q1159L45494k52932l36453L83585K04083m18647
277a33383l0811K90704j16334n0125J41528k12909k4303L93629j91561m21211
287c54776L71678K72663m42247m1266L31744j38055m9615J95501k38358n8369
297a51100M26602j76714m36052L52944K61029l85591m5112K56192q1769j2234
307H195J06365j99239j3979L15028j30730l39087K04643K51372k27001j46672
317a71105J72481O5115n5431L684o0821l4790J83938J5529k97358L6768L43197
328B01207j19911k91291J87013J76220j62178o679M7987j20211J28901J49252
338A90310l23800p1135M32903q1483l84773K17512K08224k34937K2004Q8767k05788
$$ plain form
266 92204 -3798 8328 73357 -139672 -58513 286981 34049 -302404 81181 285264 -133383
277 -133383 -164194 126510 10176 -39949 101579 -111330 -135633 257996 66435 -354776
287 -354776 16902 289565 -152682 -193948 137796 -259 -49874 145627 -92731 -151100
297 -151100 275502 98788 -337264 15680 276709 -108882 -153994 102198 20429 8195
307 8195 114560 -84679 -98658 216370 85640 -253447 -48804 202568 -24433 -171105
317 -171105 1376 66491 11060 14744 -46077 -80867 103071 118600 -178758 -141990 201207
328 201207 81296 -209995 -22982 153238 -8940 -15619 32368 -87843 41058 190310
338 190310 -133490 -204625 228278 146795 -237978 -20466 187758 -47179 -25175 63592 -142196
349a42196J38816K19167l66551r2566M69834r0465l81262K32839J68934k22525
359f5975O3569M9156k06785J78131J90327l46172n1534L95399p1308k89940J40245
370a4887J31676j09613N173j6516j02044J32736J11170k22642p2810K63242M2012
381A47497k34921j4518J80875q260j14258m714P958K4489R5871q4240j61830J84020
393A7969J81924k54648j20434K72203J9375k02460O4230M6377p1323J37398j2354
404G8257k55638J69740K60252l06179j52444L20667j1564k14810J14420J3390
414A6091r5777J86406k0336k85383J82367K50124l04521j30647K84842j8533j56104
425i1471R1362j6295m4295J79914m9861k29196J59964J97871k21305j26350J88298
$$ plain form
349 -142196 -3380 215787 -150764 -243330 226504 136039 -245223 -12384 156550 -65975
359 -65975 -2406 46750 -160035 18096 208423 -137749 -189283 206116 134808 -155132 -14887
370 -14887 116789 7176 12349 -4167 -106211 26525 137695 -84947 -157757 105485 147497
381 147497 -87424 -101942 78933 70673 -43585 -48299 -40341 -15852 80019 -4221 -166051 17969
393 17969 199893 -54755 -175189 97014 116389 -86071 -21841 24536 -46787 90611 78257
404 78257 -177381 -7641 252611 -53568 -206012 114655 103091 -111719 2701 16091
414 16091 -79686 106720 86384 -198999 -16632 233492 -71029 -201676 83166 64633 -91471
425 -91471 -109 -16404 -60699 119215 69354 -159842 122 197993 -23312 -149662 38636
436C8636M2472j07655L059N935P307R6866l5438j53958O8358J72745j07285j78990
448a47948J14259J41830j11197p9061P5483J7390J1232K7958j16316k7762K03702
459A09570k8522k41570R7742K08906j32752j03572J19122l933j9818P6461j23451
470d1817p5336K31647l896k69624R6945K16346j40625r4311J08603k2295r409
481c772P9073j31924p5234K24103K358k42149P6676J93288r8666q7788O6997j677
493A285J1067M2214j03710n4165J69521K9954j89482J7182J80159l2197j17726
504d5898L1545M4362n965J0936n6943o3980J12746P6555j64433m9660J88644P962
516H5871j56462K8102P4835l2623J2818j8310q5243R3462J12550j55101q1725
$$ plain form
436 38636 81108 -26547 -23488 -17553 -10246 86620 51182 -102776 -34418 138327 31042 -147948
448 -147948 -33689 108141 -3056 -82117 -6634 10756 21988 49946 -66370 -94132 109570
459 109570 81048 -160522 -62780 146126 13374 -90198 28924 24991 5173 81634 -41817
470 -41817 -117153 114494 110598 -159026 -62081 154265 13640 -80671 27932 5637 -3772
481 -3772 75301 -56623 -131857 92246 94604 -147545 -70869 122419 23753 -64035 2962 1285
493 1285 12352 54566 -49144 -103309 66212 96166 -93316 -76134 104025 71828 -45898
504 -45898 -14353 30009 24044 34980 -21963 -85943 26803 103358 -61075 -110735 77909 85871
516 85871 -70591 -42489 32346 -277 12541 -5769 -91012 2450 115000 -40101 -121826
527a21826J91999K9678j64429J8132Q2364l1372J5211r931q4062Q4107J12281
538A22152j39389q7198J59926M0119j39082j3158O9634j207K848k0260o1378O8320
550A327R7119j02055r6181J16231P1237j14991n4718P8671K8485k6678q376k6591
562c6520K5445R3580m5539j24587Q2862J16686j14686q5804J00817L1330n1822
573h238J2708k1776j1247J05503k7004j49713P7429J30221j18408q0907J00195
584H763J4369l2988K0952m6732q747J16362l0678j42508P5991J17999r5585o4631
596f7433P4414K1520j1074L602n1785R046Q8792l4146j07346M4317R3678m0440
608B3145p2339K5991O1621M514m6270k8982K9711L7994k0824o6185o118Q4806
$$ plain form
527 -121826 70173 99851 -64578 -46446 35918 4546 19757 9826 -74236 9871 122152
538 122152 -17237 -104435 55491 95610 -43472 -56630 13004 11797 14645 -5615 -66993 1327
550 1327 98446 -3609 -99790 16441 87678 -27313 -82031 -3360 25125 -1553 -9929 -36520
562 -36520 -11075 82505 36966 -87621 -4759 111927 -2759 -88563 12254 43584 -8238
573 -8238 4470 -17306 -28553 76950 49946 -99767 -22338 107883 -10525 -91432 8763
584 8763 23132 -9856 11096 -35636 -44383 71979 41301 -101207 -25216 92783 -2802 -67433
596 -67433 6981 28501 17427 21029 -30756 -21710 67082 32936 -74410 -30093 63585 23145
608 23145 -49194 -23203 38418 42932 -3338 -32320 -2609 35385 14561 -51624 -57742 27064
620B7064J6688r9138k280J07426n605o9084J5604J2792P420L3219o7897n4148
632g7939J17845L3751j37324J4795J16440m3275m6786L6431k9854J6469O7488
643F8041r1722n8887J36466J3589j33125K9582Q2559m2274j7726O050l7741M9392
655D204N0005r7495k4981J21165j521q9785J9916M4353m317o847l8830j5591O8855
668B9131J1444p6334r7O8751J2290m5023k9587K9230M6439l4777o1865L1021M6099
681B6722k1728k2901q284J5354N4804k4741q2023N3447P1670p4573l8733N4739
693C753M824m141J1765m9718J5325R0389n5032q6231Q0619M6610p7744j996K9513
706G936j7922L6794M727q1762L5633Q9173p4447o5212P4943K1930n0589L928J796
$$ plain form
620 27064 43752 -55386 -57666 49760 44155 -24929 -9325 3467 10887 44106 -23791 -77939
632 -77939 39906 73657 -63667 -48872 67568 24293 -22493 13938 -15916 553 68041
643 68041 -23681 -82568 53898 67487 -65638 -36056 46503 4229 -13497 -7447 -45188 4204
655 4204 54209 -43286 -68267 52898 51377 -38408 -18492 25861 21544 14697 -24133 -39724 29131
668 29131 40575 -35759 -35856 32895 45185 162 -29425 -195 46244 11467 -50398 -19377 26722
681 26722 4994 -17907 -26191 -10837 43967 19226 -62797 -9350 62320 -12253 -50986 3753
693 3753 8577 4436 16201 -33517 -18192 72197 17165 -69066 11553 58163 -19581 -21577 7936
706 7936 -9986 26808 31535 -50227 -14594 74579 132 -65080 9863 31793 -18796 -14868 -13072
719a3072k957M7461j6492o7623M8750N5564n7753l5168L8543J8142m339j7185
731f129k1129L9267L7398m9126l2399M4276J9944k7683k6026l623L8292J9984
743C3046n3744j4155N9540O723l7409p523O94K3375J5130n8404j6995P6559J089
756B7926o3079J4685M3817j3013n198p418k1437L8405K5762p0023o694P3559r654
769B7638n2263J8638K2661n616M483k6929j7405M9881Q790o3323L518N9998j0846
782A9225l5013N726O805J3813M379m1333p930N3290L35m6966P615L3884O775j5862
796D743k0320J0989K9268j2282l3599Q742K7678J596k0884j2367K2500K7080k7035
809F109l2455K6085K2600k3754j7294J988J7086J8067k3844k4052L4510K6216
$$ plain form
719 -13072 -16029 31432 14940 -52683 -3933 51631 -6122 -41290 -2747 15395 11056 -6129
731 -6129 -27258 12009 49407 281 -32118 12158 32102 4419 -21607 -25230 13062 33046
743 33046 -20698 -34853 24687 31410 -5999 -13522 -12828 10547 25677 -32727 -49722 26837 27926
756 27926 -35153 -20468 23349 10336 5138 -2280 -23717 14688 40450 -29573 -36267 37292 27638
769 27638 -24625 -5987 16674 11058 15541 -11388 -28793 21088 29878 -33445 -29927 30071 19225
782 19225 -15788 -10062 -3257 10556 14935 -26398 -34328 18962 19297 -27669 -20054 13830 20605 4743
796 4743 -15577 -4588 24680 12398 -21201 -12459 15219 16815 -4069 -16436 6064 33144 6109
809 6109 -26346 -261 22339 -1415 -18709 -16721 365 18432 -5412 -29464 5046 31262
821C1262l3328k3181K1687J6380q291j7333p119K1634K3224k3495k5095K8652
833D997K5644k3944k3473J2409J9045m012j9249n289J9154J5978j9169k0549J5661
846b797K3007j6862k6653R862K3073j335k2348r14K1609R032j3616j8153P252
859h843K6556r186l4520J2329K9471o943j5643J673R518J7380m804l0879M599
872i292L3635j4688l4065J4573J8381o855l072p796K847K5685r117l2850J6166
885f448K2668j7692j4045N008R871J1179r668j9067J8022K3148k0528k0619J7537
898f34J0379m037p211r910J3852K3276k2394k1420K5320J0600k1208n410J496
911g301M275J5921j2769k2310K4787K1892l0628r439K2227n040o671K943j5895
$$ plain form
821 31262 -2066 -25247 -3560 12820 4529 -12804 -19923 1711 24935 1440 -23655 4997
833 4997 30641 6697 -16776 -4367 14678 10666 -8583 -13872 5282 21260 2091 -18458 -2797
846 -2797 20210 3348 -23305 -13443 9630 8295 -14053 -14967 6642 15674 2058 -16095 -8843
859 -8843 17713 8527 -25993 -13664 15807 8864 -6779 -5106 4412 21792 16988 -13891 -9292
872 -9292 24343 9655 -24410 -9837 8544 1689 -1383 -9179 -6332 19353 10236 -22614 -6448
885 -6448 16220 -1472 -15517 -10509 -638 10541 873 -18194 -172 22976 2448 -18171 -634
898 -634 9745 5708 -1503 -11413 2439 25715 3321 -18099 7221 17821 -3387 -8797 -7301
911 -7301 -3026 12895 126 -22184 2603 24495 -6133 -15572 6655 1615 -5056 -2113 -18008
924a8008J1352K7860k9237j1951L6810J311k5364Q422L920o788J2957j2958k0779
937b2453L2013J3243l5803L361K6309j1462l071K684j8927J5661J5726l3338n965
950b2022L3724n569j8901J0760J177n58J3067j7375j3316K8855K808l0344J3657
963d037J9298j4627L031J129j3527J7282Q094l3502M751L1576j6506j5694J8523
976E791k379k578J2473j9703r477L1622q919l2339K1175J2440j7146P855J780
989E95j2308K3799K401l2515J2395K3942k3397o527J8377q843J561J3965j9107
1002e662j617L0061j7181k2108K3408K260j6434R167l330p184K0553n373k4446
1015a7886J7775J5872k5371k124J4903r542L333P352j6144O399K4828j9893j3196
$$ plain form
924 -18008 -6656 21204 -8033 -19984 16826 18137 -7227 1195 5115 -1673 11284 -1674 -22453
937 -22453 9560 22803 -13000 -9639 16670 5208 2137 4821 -14106 1555 17281 -16057 -22022
950 -22022 11702 6133 -12768 -2008 -831 -1389 11678 -5697 -19013 9842 12650 -17694 -4037
963 -4037 15261 634 3665 4794 -8733 8549 16643 -16859 -12108 19468 2962 -12732 5791
976 5791 3412 834 13307 -6396 -15873 15749 6830 -25509 -4334 8106 -9040 -1185 595
989 595 -11713 12086 14487 -18028 -5633 18309 -5088 -11615 6762 -2081 -520 13445 -5662
1002 -5662 -7279 22782 5601 -16507 6901 9161 -7273 1894 -1436 -8620 11933 6560 -17886
1015 -17886 -111 15761 -9610 -11734 3169 -6373 -3040 4312 -11832 -5433 19395 -498 -13694
1028a3694K3847j811j3531Q408m387n787J8690p805j7897K0386J0973k4099L688
1041c019J2399j1462J885M022j6222Q733J6098k0198n837K3606o665j1167R989
1054B162n900k807J2955j0723r629J9286M469j6555O854P908p251L378k49j1785
1068g887J0191Q936k0014J997J5424n869l847M639l796J810O386j2543o056J6502
1082E873l460j2181N970N380m461L846k409o517J2125K277j6010N409J1619o799
1096F62k961N864l915M056M261j1271n80J2452n891j0625Q909K015k592J131j850
1111c35j696P796j805j1226M994M831n420j711N16J310M131j092l723L502N019
1126E091k405m558K356J520j481j673q92K584L466k387k449K021L035m36n795
$$ plain form
1028 -13694 10153 8342 -5189 3219 -1168 -6955 11735 3930 -13967 6419 17392 -6707 -3019
1041 -3019 9380 -2082 -197 3825 -12397 -3664 12434 -7764 -13601 10005 3340 -7827 2162
1054 2162 -3738 -6545 6410 -4313 -13942 5344 9813 -6742 112 8020 769 4147 3898 -7887
1068 -7887 2304 11240 -8774 -6777 8647 2778 -1069 3570 -226 1584 7970 -4573 -10629 5873
1082 5873 2413 -9768 -3798 1582 -2879 967 -1442 -7959 4166 6443 -9567 -4158 7461 662
1096 662 -2299 3565 -350 3706 7967 -3304 -3884 8568 2677 -7948 961 2976 384 1515 -335
1111 -335 -2031 5765 3960 -7266 -2272 2559 -2861 -4572 -4056 -2746 1385 293 -3430 72 5091
1126 5091 2686 -1872 484 2004 523 -1150 -2042 542 4008 1621 -828 1193 4228 3792 -2003
1141b003p3M232k87l231j137K738J192j554k865Q60J860M14m073j355O006k2m201
1158c499K532K355J804j01m050r93N228j096n734K811K184J55N34n91j706M771
1174D604O68q682K159N230o243j932M560m132K083M682p896K509R401p888l410
1189d287O155k136k849O193m045m863J0759j203r474Q285N477j1373M515M328
1203E482q187N265K963r547M231Q609j0413k004P551n978k579O463n723l658J1657
1218D132l847q933J1761K589j0409N400L500r839N664L503j0291N706P525j0009
1232c548J257R967p435j823R299q166m286J3490r271q020J4117l046j0186J1091
1246C440p06j0361R602L65j1421R515M444j1997M860Q077r447K179Q676j0268
$$ plain form
1141 -2003 -2076 2156 1869 -1362 -2499 239 1431 -123 -2988 -2128 -268 146 -3927 -5282 724 702 -3499
1158 -3499 -967 1388 3192 3091 -959 -1952 3276 2180 -3554 -743 1441 1596 2130 1539 -167 4604
1174 4604 5272 -3410 -1251 3979 -2264 -4196 364 -3768 -1685 2997 -4899 -2390 7011 -877 -4287
1189 -4287 1868 -268 -3117 3076 -969 -5832 4927 3724 -5750 2535 8012 -3361 1154 5482
1203 5482 -2705 2560 5523 -4024 207 8816 -1597 -3601 3950 -2028 -4607 1856 -3867 -7525 4132
1218 4132 285 -8648 3113 5702 -4707 693 4193 -5646 18 3521 -6770 -1064 6461 -3548
1232 -3548 -2291 7676 241 -1582 7717 -449 -4735 8755 -516 -8536 5581 2535 -7651 3440
1246 3440 2734 -7627 1975 2340 -9081 434 4878 -7119 -2259 5818 -3629 -1450 7226 -3042
1260c042R25J0817j2389k325J4562p646o228J2366m599o881J1575k612j1039J0627
1274D111K750j4355O781N842j1398K924Q742j0047J133J1111j1390p30J1990q946
1288a482n757J2382o480o295J2747l559q815J1646J032j1831R176L386j1602O765
1302A313M286j1237N847P845j3583M409R693j1643j038R141r417p31R504o307
1316a918m625J1723m765p424J1666j761j0317R015K341j0756O645N325r304L814
1330c41P866j0854K109Q128q411j426Q839o916l198R811o035n766J0821j315r610
1345f298Q482J120r959P832J846j0319N447N668p601J325O237p798J608P995q100
1360b515j055R030p471j583R466m765n206R973k849o447P436j562o135O142q53
$$ plain form
1260 -3042 -2117 8700 -3689 -6014 8548 902 -5326 7040 2441 -4440 7135 4523 -6516 4111
1274 4111 6861 -7494 -713 5129 -6269 -3345 5397 -4650 -3517 7594 -3796 -4526 7464 -1482
1288 -1482 -7239 5143 -1337 -7632 5115 1556 -7259 4387 5419 -6412 2764 6150 -5452 1313
1302 1313 5599 -5638 209 8054 -5529 -1120 8573 -3070 -4108 5033 -4384 -5115 4389 -1918
1316 -1918 -6543 5180 415 -7009 4657 2896 -7421 1594 3935 -6821 -176 5149 -4155 -341
1330 -341 7525 -3329 -1220 6908 -1503 -2929 5910 -1006 -4204 5607 -428 -6194 4627 3312 -6298
1345 -6298 2184 3304 -6655 1177 3023 -7296 -1849 3819 -3782 -2457 3780 -4018 -2410 5585 -2515
1360 -2515 -3570 5460 -2011 -3594 5872 1107 -4099 5874 3025 -3422 4014 2452 -3683 2459 1606
1375A606n761M030L168n978K555K777n120N75N499n183k811O754l176l855O901
1390A981k986k650O863j468m179M513M33m847K688K826n269K030L223m260J465
1405C63K142m029O13L719m426j281N088k549k639N505l998j211M768j871m373
1420d179L976O35k159J062P71m33J118J634k110q78K278J98j337k53j734K350
1436I39j045o4J01K12J081k62j758J411l6j449P98l05r58M32m25o02J357K46j829
1455b156O82J479j26m93J468j1r85J767l46j789K690j112k146J496P87j991J287
1472E01J087k486K44L452k319j689L552j512l365L059l40l992M979K46n467M492
1488D42N96l875L281K366m755N39M945l880r45M700l688k194P036m059l645N758
$$ plain form
1375 1606 -4155 -125 3043 -2935 -380 2397 -2723 -2148 3351 -1832 -4643 2111 -1065 -4920 1981
1390 1981 -1005 -3655 3208 1740 -2439 2074 2507 -2340 348 3174 -2095 -65 3158 -1102 363
1405 363 2505 -1524 -911 2808 -1618 -2899 2189 -360 -2999 2506 -1492 -2703 2065 194 -4179
1420 -4179 -203 432 -1727 -665 106 -327 791 2425 315 -563 1715 1913 576 323 -1411 939
1436 939 -106 -170 -69 143 1224 962 -796 615 579 -870 -72 -377 -1335 -903 -1328 -1930 -573 -327 -2156
1455 -2156 -1474 5 -121 -614 854 843 -142 1625 1279 -510 2180 1068 -1078 418 1205 -786 501
1472 501 1588 -898 -654 2798 479 -1210 2342 830 -2535 524 184 -3808 1171 1417 -4050 442
1488 442 1038 -2837 444 2810 -1945 -1406 3539 -341 -1286 3414 -274 -2468 4568 509 -3136 2622
1504B622j865k940N367j258m728N170m82n841L863J563m607L191K959p704K706
1519a984M662n458M81N563m175j634O808m570l410P283l491l345N625K41n916
1534c320N826N4o910M885L541o641K145N584p855J892N250p523J26P362o071j805
1550c460P286n842k547Q707m751m347P937L17p540O952K01o817N611K540q123
1565c876M134M398p527L177N400q039M77O099o553M12O728n132l935Q027k501
1580A289o419P322j198n408O211K66p748O405L506r103L294N864p668K392O363
1595E368o773q2O796o104k731P717k603m888P880k496q231R667j53q371N671K760
1611C427p425L274L708p123L045M000n312L51N928p234j72P171m366k832P122
$$ plain form
1504 2622 757 -2183 3184 1926 -2802 2368 1886 -3955 -92 1471 -3136 55 3014 -4690 -1984
1519 -1984 2678 -2780 -2299 3264 -911 -2545 4263 -307 -3717 3566 75 -3270 2355 2596 -3320
1534 -3320 2506 2560 -4350 535 4076 -2565 -420 5164 -2691 -799 4451 -3072 -2946 4416 -1655 -3460
1550 -3460 3826 -2016 -4563 4144 -607 -4954 2983 3300 -4240 2712 2913 -3904 1707 4247 -3876
1565 -3876 258 4656 -2871 306 5706 -2333 -1856 4243 -2310 -1898 4830 -302 -4237 3790 1289
1580 1289 -5130 2192 994 -4414 1797 2063 -5685 720 4226 -4877 -1583 4281 -3387 -995 5368
1595 5368 -1405 -1487 5309 -795 -3526 4191 1588 -3300 4580 2084 -6147 3520 3367 -5004 667 3427
1611 3427 -3998 -724 2984 -4139 -1094 2906 -2406 -2055 3873 -3361 -3533 3638 -728 -3560 3562
1626C562l306m021O842k614m102P877j933n912M498K299o266L695K980n865J966
1641c00L100n026J63N975n607q75O088l567l868O645l600k515N875j227n204N919
1657A976m0n470L756K373n244L613K040m946J618M327n194O21N525n514j407N577
1673C611l817k814N407j404l432M061j373k377K284J505l827K139K259m623K215
1688a86J481k052j13M511m555j81L621m900J416L555k745r81K696N12l192J828
1704G15J05k390J782K050m277J188K263l835J251K531j244k054L491k525m10K013
1720F54r11p55J698k9j953J165L97j275P97J240j804J024P54k181J82K452o00
1737H55p43K12K75o43q19J145j095J168j028l6n36L97J294o35j27j8m99J367j031
$$ plain form
1626 3562 256 -3765 3077 463 -3639 4238 2305 -3607 891 3190 -3076 619 3599 -2266 -300
1641 -300 2800 -2226 -2063 3912 -1695 -2570 3518 -49 -3917 2728 -872 -3387 2488 1261 -3943 1976
1657 1976 1936 -3534 222 2595 -2649 964 3004 -1942 -324 4003 -1191 -570 4955 -559 -1966 3611
1673 3611 -206 -3020 2387 983 -2449 1612 239 -2138 146 1651 -2176 -37 2222 -2401 -186
1688 -186 1295 -757 -870 3641 -914 -1095 2526 -2374 -958 2597 -148 -1129 1567 2079 -1113 715
1704 715 820 -1570 212 2262 -2015 -827 1436 -2399 -1148 1383 139 -1915 1576 -949 -1359 654
1720 654 -257 -1012 686 657 -1296 -131 266 -1009 -212 1028 -776 248 1002 -1179 -997 1455 855
1737 855 112 324 599 -44 -863 282 -813 355 -673 -709 -1245 -848 446 -189 -316 -334 -833 534 -497
1756d97j022J253N27o69O91J564l047J276J584k842J188K293k445j59J280j616
1772f41q64K779j364q25J649j261j163K115N15k472K320M44k072l5J585k259J341
1789b08K267j868k047M314j712j923K767r55k328L471n49k268J101J633l432J865
1805A28J710l770R69L130l446J38M043m301j04K270j441j560L896j919l471M752
1821A024n61k883L247R41m204K668K203n183K438K802m561J640L419l833j53L190
1837B194k153k868N775k138l382L013P80m041M614jn609N128J137n107L569J917
1853B828n665J805L809l722k12M287m305r30O380m232k116M959k182l007M178
1868A875j469m444O687j89n840N144L24m600K736K271l806P91M332n497r81M942
$$ plain form
1756 -497 -1519 -266 261 -408 283 1847 -1200 76 1660 -1182 6 2299 -146 -305 975 -641
1772 -641 -1505 1274 -90 -915 734 -527 -1690 425 940 -1532 788 1232 -840 -875 710 -1549 -208
1789 -208 2059 191 -1856 2458 746 -1177 1590 635 -1693 1778 1229 -1039 62 1695 -1737 128
1805 128 1838 -1932 -963 2167 -1279 -1141 2902 -1399 -1503 767 -674 -2234 1662 -257 -3728 1024
1821 1024 463 -2420 827 1768 -2436 232 2435 -2748 -310 2492 -2069 -429 2990 -843 -996 2194
1837 2194 41 -2827 2948 810 -2572 441 1221 -2820 1794 1793 -3816 1312 2449 -2658 911 2828
1853 2828 -2837 -1032 2777 -945 -1157 3130 -1175 -2105 4275 43 -2073 2886 704 -2303 1875
1868 1875 406 -4038 2649 2460 -3380 1764 2088 -2512 224 2495 -1311 -520 3812 -1685 -2666 2276
1884B276l578p38M750l584k133M912j854m030O177j473l005K403K214n006L215
1899E46J825m863K698K709m602J318L380m572j093O019m125j652N359k845k829
1914b727M643j926l913M632o1m154M546K86m271K687J947l362K276K898n458J50
1930a807M859m208j088N454l567j250L828k218k695N083k053l196M837k42m205
1945b468L589J411n436K293M001n613K46M461m207m76M842m348l33M214k413j675
1961a912L980j297k545M211o45k896J243J729l003J956J500n218K252K977l894
1976a562Q77L535l497j379L581l112n92L784k509r94K690q96j922K008J940l537
1992a585K579R97l979L721L00k949R77J053k453N60K726k199M22J275q11j608
$$ plain form
1884 2276 -1302 -2040 2710 -874 -3007 1905 51 -3979 2198 725 -2280 123 2337 -2669 546
1899 546 2371 -2492 206 2915 -1687 -369 3011 -1561 -2654 3365 -760 -2412 2947 102 -2727
1914 -2727 1916 -10 -3923 709 648 -3506 1040 1326 -2945 -258 1689 -1673 603 3501 -1957 -1807
1930 -1807 3052 -1156 -2244 3210 -357 -1607 2221 3 -2692 2391 338 -2858 1979 1737 -2468
1945 -2468 1121 2532 -2904 -611 3390 -2223 -1977 2484 -1723 -2199 2643 -1705 -2038 2176 -237 -1912
1961 -1912 2068 771 -1774 2437 1792 -1104 139 1868 -1135 821 2321 -2897 -645 2332 -1562
1976 -1562 -685 2850 -647 -2026 1555 -1557 -2149 1635 -874 -1868 822 -74 -1996 12 1952 -1585
1992 -1585 994 1991 -1988 1733 2033 -916 61 1114 -1339 -779 1947 -252 170 1445 634 -974
2008i74L449j413k100J234M80j459J350l19k017K263J125k630N48J365j734K98
2024e34J956j974j010L151m01k489L140p53k027J583J186k357Q78J112k142J804
2040A123p47M35k029J822m90l72O47l75m05R20m19j360K385n39j909K417K03j845
2058e38j9J121K51j922K754k319L06N26J42O28l25J43l142K338L38j246P96P65
2076E97l020K014J565r66j126J726P02k653J365r08k03J890L62l233J877J756
2092A745k733J484O28j132l41J592k414P30J467j697l44K439j641j039K737j337
2108A44j868K166n6k357L159Q46l226J298K152l471R62K283l480K480j2j479j396
2125a855M052j972k022L708k088k60K069j340k602L313L51k841K519Q56k763O39
$$ plain form
2008 -974 2475 1062 -1038 196 676 -783 567 248 -1769 494 1619 -1011 -463 902 -832 -534
2024 -534 1422 -552 -1562 1589 1188 -1301 1839 1086 -941 642 1828 -529 349 1461 -681 1123
2040 1123 376 811 -1218 604 114 -258 389 14 -391 529 110 -1250 1135 596 -1313 1104 1307 -538
2058 -538 -557 564 815 -1107 1647 -672 -366 160 302 930 605 748 -2394 -56 282 -964 -168 597
2076 597 -2423 -409 1156 190 -936 790 1492 -1161 204 -704 -907 983 1345 -1888 -11 1745
2092 1745 -988 496 1124 -8 -349 1243 -1171 -441 1026 -671 -1015 1424 -217 -1256 1481 144
2108 144 -1724 442 386 -1971 1188 2034 -1192 106 2258 -1213 -251 2032 -1448 1032 1020 -459 -1855
2125 -1855 2197 225 -1797 1911 -177 -437 1632 292 -2310 1003 1354 -1487 1032 1888 -875 -236
2141b36K258l153R3K987l326j64L144l139m72L509r59k351M056j813k004K901
2157A331j33l461K777J582m177K729O13k426N50K810l912Q84L330k628j016K938
2173A791j481k200M236j206l390M983k209m220M251J023m626L451J586m014K456
2188D31J165m134K416K898m186M41K819k595k10K401j798j641L739k437k469M025
2204H65R27l488K635M54l600L480n2l082K490J306l279l69M465l153j001L493
2220B091k336j973M638k455k274M520j470k110K428K60l411J598K380l493K533
2235I26R51m353K496J551k478l24L948l787L73K040j085k462L763j026k628L045
2251I50J22l146K363J303m054L281n63k675K494J880k708M89K243k512r19K692
$$ plain form
2141 -236 2022 -1131 -1038 1949 -1377 -1541 1603 -1536 -2008 1501 542 -1809 2247 434 -1570 1331
2157 1331 1198 -2263 514 2096 -2081 648 1261 -1165 -615 2195 -1717 -833 2497 -131 -1147 1791
2173 1791 310 -1890 2346 1140 -2250 2733 524 -3696 555 1578 -3048 403 1989 -2025 431
2188 431 1596 -2538 -122 2776 -1410 -969 1850 -745 -955 1446 -352 -1993 1746 -691 -3160 865
2204 865 1792 -1696 939 1393 -2207 1273 1221 -1861 629 1935 -1344 -1713 2752 -401 -1402 2091
2220 2091 -245 -2218 2420 -35 -2309 2211 741 -1369 1059 1319 -2092 -494 1886 -1607 926
2235 926 1877 -2476 20 1571 -907 -1231 2717 -1070 -697 1343 258 -2204 1559 533 -2095 950
2251 950 1072 -2074 289 1592 -2462 819 256 -2419 75 1955 -753 -264 1979 -533 -1452 1240
2267A240j538j156M027k800k289L803j399j372K216j167p57K559j06m821L292
2282b68K175l212P28N99o38M52J293k575m62L772j799j740L015L63k539K633j125
2299F72k518K030Q22j249J032M93k309Q68K194k558L50J770k572O94K425j713
2315D31j895K179j797l27J297q88L29J371l00n32K50J703j957j19J017j079R8
2332b19J619j972m06L052j889j689K615o09q59R12n54n82O18J577l125R77J781
2349A247k096M53J248j075j33N21m75p2J873j961j011J121J779k308M4J167p65
2366d43O85q96k24q6K201j751j038K730j66j232O57L01j459J611j492l30K56J499
2384H23j322J3J631o23j105P21j216J024J902k748o44L225j165j580J661l80q37
$$ plain form
2267 1240 -298 -1454 2573 -227 -2516 1287 -112 -1484 732 -435 -1192 1367 1261 -3560 -268
2282 -268 1907 -1305 -577 22 -616 -164 1129 -1446 -1908 1864 65 -1675 1340 1703 -836 1797 672
2299 672 -1846 184 1006 -243 789 1282 -1027 -159 2035 -523 -173 1597 -975 -281 2144 431
2315 431 -1464 715 -1082 -1409 -112 -1000 -671 700 400 -132 118 1821 -136 -255 762 -317 -219
2332 -219 1400 -572 -978 2074 185 -1504 1111 502 -357 555 1 -581 37 1614 -1511 -534 1247
2349 1247 -849 -396 852 -223 -356 165 -310 -382 1491 -470 -1481 -360 1419 -889 -845 322 -443
2366 -443 242 -654 -878 -964 1237 -514 -1552 1178 1012 -220 437 738 -721 890 -602 -932 -676 823
2384 823 -499 -486 1145 522 -583 138 -1078 -54 1848 -900 -1544 1681 516 -1064 597 217 -620
2401f20K056j624j105J211Q10j653R46j78m55J029K28J35j596J838j806j363L089
2418I42m30j107M46N16o87l46P92j329J481N57j367N13P10j452p71J656q86j33
2436h95J532j482K42K542j775j384K039o94r48J801q72j564K518j51k302J902
2452E09J493k885l47K057j611N89K101k057r21K118j264j945K605n44q45J745
2468G98j20j532K097l41l028K836Q97k397L8K025k294P85J849k151j011L465k267
2485c51r98K828j612r12K538n84k667K933m6l357K817J541l302J757L9j979J00
2502a255K616k947J144K772k728k17J896n56k978K935j139j806K919l53k964K531
2518a30J045l355K824K4j634J479M57j145k34K198j891j107K810j721jK185k363
$$ plain form
2401 -620 1436 -188 -1293 -82 728 -925 21 -157 -612 417 645 780 -816 1022 -784 -2147 942
2418 942 512 -595 -149 367 -320 -666 126 -1203 278 835 -532 -19 691 -761 -1532 124 -762 -895
2436 -895 637 -845 -603 1939 164 -1220 819 125 -823 978 106 -1458 1060 909 -1393 509
2452 509 2002 -883 -1230 827 -784 -195 1906 -151 -1072 1046 -218 -2163 442 -102 -947 798
2468 798 678 -854 1243 902 -2126 710 1607 -790 -752 1273 -1021 -236 1613 -538 -1549 1916 -351
2485 -351 -1349 1479 -133 -1045 1493 909 -1758 1175 1129 -2228 589 2130 -1172 585 624 -1355 -1255
2502 -1255 1361 -1586 -442 2330 -398 -615 1281 725 -2253 682 -457 -2263 656 303 -2661 -130
2518 -130 915 -2440 384 408 -1226 253 710 -435 -669 1529 -362 -1469 1341 -380 -381 1804 -559
2535e59j950K862j057j283L276p97j905M34J961k152K065J025l984J295K757l462
2551a474Q62K008k171J79R39j126l91K599k249O0J697j347k43M48M09o51M74J067
2569A090j679L92J425k353J506Q84k113O41J224k814R96O95k7j172J434M61l072
2586b482L633J63j968J081k65j771K825L2k417O77J844j842L71K159k950M57J511
2603A058j662r08K375K84k321J082J236j769Q44K47j620K264N4k631N27L080k590
2620d50M75R34p88o78J252o40j831K465N48j427p97K552l112J283P6o90P60R05
2638H37n30j83J474j700k50K7O72q61J113k89n69L24M85k008J174J395j471N64
2656B04Q18j829K96Q77j139M02J187q75l1N27K04r99J149j472n80J745L54o36
$$ plain form
2535 -559 -2509 353 -704 -1987 1289 492 -1413 -979 982 -1170 895 1920 -2064 -769 1988 -1474
2551 -1474 -612 1396 -775 -596 343 -783 -1174 1425 -824 -764 933 -414 -657 -209 200 -451 23 1090
2569 1090 -589 -197 1228 -1125 381 1265 -848 -207 1017 -1797 -801 -106 -133 -1305 129 590 -2482
2586 -2482 1151 1314 -654 427 162 -1609 1216 1248 -1169 -492 1352 -490 -119 2040 -910 -453 1058
2603 1058 -604 -1512 863 1147 -1174 -92 1144 -625 219 466 -1154 1110 1164 -1467 -940 2140 -450
2620 -450 25 959 171 -507 745 105 -1726 739 1287 -140 -937 1615 -1497 -214 -138 -828 -68 837
2638 837 307 124 1598 -102 -352 -325 347 -514 599 310 -259 65 550 -1458 -284 1111 -360 204
2656 204 1022 -807 -511 366 -773 -371 816 -59 -90 437 641 -358 791 -681 -1261 484 838 202
2674B02m57M61n31Q42N5n70j9P17j166p99J823q82r01J806o88K58p54J625r76
2693D6K57J21j920J368P99j183k10J359j356L89N93j91j173J660j052r47L255
2710A815j889r46J521K67k075R03K85j029J435P54k459J287L53R1j444K181p53
2727B97r75J805p65j388J483n72j519L192n19j554R25Q50j477J138j002o99N62
2744b18J224j63j740K495q27j741J718m62j490L300k752j384K542pq38J799j119
2761C37j288l9J707j266O93J956k735R0J983k371Q48J453j029m06L19m51r36K023
2779H88j484K2J183j13j768Q66J309j469p44J904j448Q79J481k101R98J453k245
2796c89k14K121j459o81Q32K24j471K615r89j089O82m95q16Q15J214j315J143
$$ plain form
2674 202 -255 206 -325 517 572 2 -17 700 -466 -1265 558 -324 -1225 581 -107 151 -603 1022 46
2693 46 303 424 -1496 -128 671 -512 -722 637 -719 -330 263 72 -1101 559 -493 -1440 1815
2710 1815 -74 -1020 501 768 -1307 -404 -119 -1148 287 1041 -1418 -131 222 313 -1131 1050 297
2727 297 -678 1127 362 -1026 457 -115 -1634 1558 1039 -515 410 1260 -217 921 -81 -780 -218
2744 -218 1006 843 -897 1598 771 -970 748 286 -1204 2096 -656 -2040 502 495 -343 1456 337
2761 337 -951 -990 717 -549 144 2100 -635 -545 1438 -933 -85 1368 339 -67 252 -199 -1135 888
2779 888 -596 -574 609 496 -1272 -406 903 -566 -1310 594 -854 25 1506 -595 403 1856 -389
2796 -389 -603 1518 59 -622 210 434 -1037 1578 589 -500 182 -313 -1129 -314 900 -415 728
2813G28M22j353o33J435j982j73K078l03j129K077j511o36J098P11k021J571J143
2830A522k728J931j74j611J640p8r21Q98n11l06n62J577Kj505J917k309N56J990
2848A328j282j136K280j169r03L10J226q22R50l7j397J392M76j249o29J420r79
2865b21n40J564Mj261J683l7k119J456o60r67J934k94j206J253o42j097P38M73
2883F1m63k1J867k105MJ318m15k187L030m35j545K465j714l87J346R3j675P45
2901a8J372k388J429J26n9j033J893j053q3L71o94m35J394j361r02J649o99k10
2919g01N75K21k53m5J59N42n95R28m88j003J257q74n84J795j67j333J979p43j524
2938h54J908p89p77P31Mo34j12P39j330Q79N19q18o19K345j390k52J698r88j231
$$ plain form
2813 728 1150 -203 -836 599 -1383 -1556 522 219 -910 1167 -344 -980 118 829 -1192 379 1522
2830 1522 -1206 725 551 -1060 580 502 -419 479 -32 -338 -900 677 679 -826 1091 -1218 -662 1328
2848 1328 46 -1090 1190 21 -882 -572 654 -168 782 745 -652 740 1216 -33 -662 758 -221
2865 -221 -761 803 807 -454 1229 1192 -927 529 -131 -1098 836 542 -664 589 -53 -1150 -412 61
2883 61 -402 -423 1444 -661 -657 661 246 -1941 1089 654 -891 1574 -140 -527 819 912 -763 -18
2901 -18 1354 -1034 395 521 462 -571 1322 269 186 557 -137 -572 822 -539 -1441 208 -491 -701
2919 -701 -126 95 -158 -203 -44 498 -97 831 343 -660 597 -277 -861 934 767 -566 1413 670 -854
2938 -854 1054 265 -512 219 223 -411 -523 216 -1114 -235 284 -534 -1153 1192 -198 -450 1248 260 -971
2957i71J039L52j732J912q85l47n46k92J403p62K657j485r85J105p13pN09l22
2975g0jl05k02k40K002k70j232J286p62n64j099K066j617J23P31j006J16J272
2993B28n45n73J859q56kO73l25o55J126J19j381N88L81r30q37J915l00n8m9j075
3013f97L80M35j253K19J276k73j022J919j219m03J8O44j342K026N40k076K29P17
3031A18r81L19J776j578J65J132j446K93J351j416l79R17q09o24K081p86j457
3048a324J870n74n82R72o0o65P25M90j462J307K32j197L23Q11j231p03J217O84
3066H33j366J627P39j851O53k15j349R69m5j086Q25M19k149K299N13j009%P11
3084E18m64j055J341j040Q33K86M00j444J40P99j317N65P49j985K167R73j785
$$ plain form
2957 -971 68 420 -1312 600 -285 -632 -1178 -1470 -67 -829 1828 343 -642 463 -250 -257 252 -70
2975 -70 -71 -376 -578 -818 1184 914 -318 968 206 -358 -1457 609 -1008 -885 -154 -1160 -1044 228
2993 228 -317 -890 969 113 111 784 459 -196 930 1049 -332 256 637 -293 -1130 785 485 427 378 -697
3013 -697 -317 118 -1135 -916 360 87 -935 984 -235 -638 -620 24 -1318 708 1248 -828 -599 118
3031 118 -863 -544 1232 -346 -181 951 -495 -202 1149 -267 -646 271 -538 -1162 919 133 -1324
3048 -1324 546 -28 -610 362 302 -363 362 852 -610 697 929 -268 55 866 -365 -1068 149 833
3066 833 -533 1094 1833 -18 635 420 -929 40 -5 -1091 -266 153 -1996 303 816 -193 -193 518
3084 518 54 -1001 340 -700 133 419 819 -625 -485 314 -1003 -438 311 -1674 493 1466 -319
3101c19J49L33m70K52J067n46p42J102j273j540K403J03j415J544L83k215L59
3118h25Q09r69K22J588j867M50J650j310p72J880r92p5J013r84j049Q99m10l15
3136a057J074O97j866J798j451m89J023Q64j269R63L61k491J755O23m08l52O70
3153D45n11q39K309l112J859M16r56j303J107O46o99R46l83m38M76L66o16M53
3171A66j22K0L73O95j580q19K119j288j28Q8J252j193N00O68j338Q63l04p35R8
3190f65J285r71m0K614l113R81J067j164j347J855m61o48m18J833j268J465p73
3207B32j032P83L08j422k11J777j235j0J105J87p67J091q91M89O59j096p92K068
3225A243k425P22O65j449Q60N59j45K7k79L18k55L4O55j96o15o71O97N36J92r01
$$ plain form
3101 -319 -170 163 -307 -55 1012 466 -276 826 -447 -1987 416 519 -896 648 1031 -1184 -825
3118 -825 -16 -985 -763 825 -1042 -592 1058 -252 -1024 856 -136 -211 802 -182 -1231 -332 -742 -1057
3136 -1057 17 714 -1152 646 -805 -1294 -271 593 -676 287 648 -1843 -88 535 127 -225 445
3153 445 -66 -905 1404 -1708 151 567 -389 -1692 -585 61 -638 308 -75 -513 -37 329 -287 166
3171 166 44 64 437 1132 -448 -1267 852 -436 -564 -476 776 -417 83 751 -587 276 -28 -763 -665
3190 -665 620 -351 -391 2223 -890 91 1158 -6 -1353 502 41 -607 -1025 808 -460 1005 232
3207 232 -800 -17 291 -1131 -1342 435 -800 -810 295 482 -285 806 -85 404 1063 -33 -825 1243
3225 1243 -1182 -460 205 -1244 -384 175 30 57 -222 96 -159 -125 530 334 -281 -952 -255 281 473 -428
3245d28j53N88m31j09J412o10o09R87m81j546J763o86n9J047o73k148K783l40
3263C07j412J037J65m5o30J521j194O17j510J321q47m39N62P1M30K06o90J94L08
3282b8r1P83p17n21R21J83j047pn6l66J927q89M17l44o91M80J7J02K57m79Q21
3303F72L94j593K86P59N84j459P83j245n25J633O68j267J178j73j472P12L63j64
3321A34l69L54o54K20J036j812M98J147K79j942J281R21j531l22J682j453J060
3338E29n00r93k03K956j358j217J175q66K01N11p05j85R18j98j041O65J016j971
3356a266P59m78M41J464n2k089K116k93j625J385j667J125n77J019p91N77L52
3373D00r1j484K072m89j166J020O27j587R48J75j946J063J255j390Q84K71n59
$$ plain form
3245 -428 -581 7 -424 -533 879 269 -340 647 166 -1380 383 -303 -362 685 12 -2136 647 307
3263 307 -1105 -68 97 52 -578 943 -251 366 -1144 177 -670 -1109 -547 -476 -46 160 -530 -336 -28
3282 -28 -119 664 -53 -574 347 530 -517 -524 -580 -946 981 92 509 165 -526 -46 -29 73 330 -149 672
3303 672 1066 -527 -241 518 1102 -357 426 -819 -1344 289 957 -310 868 695 -777 -65 298 134
3321 134 -235 119 -535 -315 721 -1091 -593 554 833 -1109 172 1093 -438 -760 922 -531 529
3338 529 29 -964 -1167 1789 431 -786 389 -477 -276 235 -470 -655 263 65 -976 -311 705 -1266
3356 -1266 -507 -985 -544 920 868 -1221 895 602 -1023 362 -1305 -180 -757 262 -529 48 400
3373 400 309 -1175 897 408 -758 262 889 -698 250 425 -1521 -458 797 -593 291 562 3
3390Cj86N43l76J39O41j428L15R03j286KL66o61R29L13l89p41J329o05Q0N21R63
3411A375k034P38O87o28L3K68j070o82K660k55j236k29P18r58O40l0r31J187n12
3430b59Kq38K299k503J225Q86k164J713K06p28q35J417l89k46o8J211j371M04
3448c8k90K18N45k33n56K28O50k715K315M41r97q40J636k192J860K46n58r85P22
3467e43J245j752J630l65j065K507j519q91L44P51j354J59J209k22j920J599R93
3484H06j417Q31j56m55P04m05l76N67L37j050J538j025k28M58l55k87R69k19j546
3503a309P45J692j502m35Q36o00J232j116J362j680Q09N51j247J983k61r75P9
3520A64k3l04l31L37Q94q05Q11k25q64O46r0j48l23n82R50o45J191m88M10r22
$$ plain form
3390 3 -183 360 -16 123 764 -664 -349 554 -732 -730 -364 -1025 -96 217 -172 -913 416 -189 -109 412 1375
3411 1375 -659 79 766 138 171 439 -631 -1313 1347 1092 -144 -373 345 -613 27 -3 -934 253 -259
3430 -259 -257 -1095 1204 -1299 -74 812 -1352 361 567 -161 -996 421 32 -214 -282 929 -442 -38
3448 -38 -328 -110 435 202 -354 -126 524 -2191 124 565 -432 -1272 364 -1828 32 278 -280 -1265 -543
3467 -543 702 -1050 580 215 -850 1657 138 -753 -409 342 -1012 -853 356 134 -1786 -187 806
3484 806 -611 220 64 -391 313 -92 -468 99 436 -614 924 -101 -329 129 -226 -513 456 237 -1309
3503 -1309 -564 1128 -374 -809 27 -573 659 -457 905 -775 34 585 -662 1321 1060 85 164
3520 164 141 -163 -494 -157 737 -68 743 518 -346 300 210 62 -261 -843 107 -538 653 165 575 -347
3540c47k27l61J280P3n31m26J041K40k91j631J83R92O12n27m02L71o09M39K23
3559A02N8P08j452P05K78q71m99N38M62k94J4J080n71K68J89j032M06p25J496
3578H60L07n37j448O0J17J135j077M27J421j340o65K435j605P05q26l77J057o09
3596D0j14r88J219l17l23P10K05q46M52r3o34J000J51p35Q1Q40k238J234J898
3615A542j794K52k11k82k85J002j93j078J726J47j251M86N32j361N53N04l07l57
3633c75K12K43J24R49j395K88J171j481Q19M19p65j035J6R29m6O86n48q77J677
3652A011q67p14K66O14M84j520N98O5M10O70o14r61M48L63r90J162k26j475J025
3671b51N33r14N85J150j181j164K037r41r75J287j13k08L20R0j368O97J252k033
$$ plain form
3540 -347 -574 -935 345 418 -113 -539 502 742 451 -1180 -997 -5 607 80 -322 49 -560 -121 102
3559 102 160 868 -584 121 399 -472 -971 -433 29 -265 -251 829 258 526 715 -317 89 -636 860
3578 860 1167 630 -818 -758 -641 494 -583 -156 1265 -75 -740 1695 90 795 -31 -408 649 40
3596 40 -74 -1062 157 -160 -483 227 432 -414 38 -55 -689 311 462 -273 -192 648 -1590 -356 1542
3615 1542 -252 0 -211 -493 -778 224 31 -1047 679 826 -425 61 593 -768 -215 289 -18 -375
3633 -375 -163 80 204 1153 -242 46 1217 -264 555 974 209 -826 -810 119 73 759 211 -666 1011
3652 1011 144 -570 -304 310 794 -726 -128 -63 347 1017 403 -558 -110 253 -737 425 199 -1276 -251
3671 -251 282 -632 -47 1103 -78 -1242 795 -146 -1121 166 53 -155 165 255 -1113 -416 836 -1197
3689a197J224J108j448m32J099o64K59M43j315N20R48j281P4J972j253l48J723
3706A432j377r18Q87k85l2K18L62q24P46J073j473O21r04m22J572o83Qn57N17
3725c9L27r1M36k29j23J34p18J24N53K17j673J336P11j182O79o00K49q56M38j47
3745d54n20J079N51o40J177j192L97M80k465J620O77j036m75L40J86M46J30K66
3763E67k236K595J9l97j375K030q80k33p82j19N29M08j6M79p6K10j903J288M05
3782E13r76P53j122J281q37L53N02j85J004n58j020R43j052L77O08j395M37O42
3800B68K45n50P46J78r95j017J156o28Q74l74m74N57L09l97K41O88r47Q08K43
3819I31j454N46J326q78k139J606Q30j982J211J80l79m57M21M38j67J69K04L25
$$ plain form
3689 -1197 27 1135 -313 -745 354 -310 -51 392 -923 -403 545 -736 -662 1310 57 -291 1432
3706 1432 55 -863 24 -261 -293 -75 287 -537 209 1282 -191 430 -474 -896 676 -7 1 -556 -39
3725 -39 288 197 633 404 281 415 -303 -179 374 591 -1082 254 965 -217 462 -138 111 -745 -307 -454
3745 -454 -974 105 656 16 1193 1 398 878 -1587 33 710 -326 -801 -461 -275 171 301 567
3763 567 -1669 926 945 548 -827 1203 323 90 -692 -811 -282 126 110 589 513 723 -1180 108 513
3782 513 -463 290 -832 449 -388 -35 467 282 1286 728 -292 651 -401 -24 584 -811 -374 268
3800 268 513 -37 709 887 -108 -1125 31 -597 277 -97 -571 -14 295 -102 139 827 -120 688 931
3819 931 -523 23 1349 471 -1668 -62 768 -1214 -3 177 -202 -659 -238 200 33 202 406 731
3837G31n17j00L50j305J444j043K72m97l6J272l33o75J25Kk73N28L93j68P7L68
3857F15k25J91m18l24p7J7O51O55q88J103j736M04M12q44Q6J210l23o84L37j009
3877h47M86J304n60o40Q48l44m75L8M38l00o2M12m35P69j550J089o44O23p71N88
3897c3m4Q00K95j236J15m72L52J039p49K32l09r10M73P61j96J87j064p7l77J022
3917a91K21k14J152n51o24Q15j374K25O94O92j583J217k24n91L41J437j950P74
3935B66K11j773K139q76j23N01P72k398O85P25k52O98j730J327k82O45R9o71N0
3954A3Q08p05J179m58j512J397J32o06r56J526j092M08k91K82q78J091O60q85
3972A13q91J453o43L24P34j616M5Q80k82J12m71l49j06M32P5K47R5o89J85O94
$$ plain form
3837 731 214 114 464 -841 603 -440 -168 -665 -701 571 238 -437 -312 -310 -583 -55 338 170 247 615
3857 615 390 581 163 -161 -238 -221 430 1085 197 1300 -436 -32 380 -464 -378 832 509 -175 162 -847
3877 -847 -361 943 383 -257 591 247 -228 -190 248 -52 -114 298 -137 632 -918 171 -473 150 -621 -33
3897 -33 -77 723 1018 -218 -103 -575 -223 816 67 299 -10 -920 -447 314 118 305 -759 -836 -1213 -191
3917 -191 30 -184 968 417 -207 608 -766 -541 153 845 -738 479 255 -336 5 1442 -508 266
3935 266 477 -1296 843 -33 -156 345 1117 -1281 -596 129 -123 575 -1155 172 -110 535 634 -37 13
3954 13 821 116 1295 837 -675 722 854 248 -708 818 -274 134 -157 125 -753 338 998 113
3972 113 -778 675 32 356 1090 -526 -481 399 117 229 -242 -591 -697 -265 -190 57 152 -537 -352 342
3992C42L77j82Q6j29j170R53Q04j827J024j630J047M37J81n86J38Q54j478L34
4010d25J559j792R1P77l71J98k53J25k5j14J054j863J223K55m00k70L15j583J668
4029A69o30n68N11m80J297j128P86j89k16N0J7k07R21r36L76p52N99q01R92J25
4049f4L02n9R4q04O55M49j211O29n30M34n5J521j680k86K19k8N84P10j250K096
4069A726j488K55k154K730m43j196N91J159j488j08N62p35M32j99k2p09Q31n6
4087c12o0J006k243J287J41m10K52M63n96N84jn99J195j144J504k82o41L63p91
4106b84J19O25j315L38o04P92J104j254P61m52K66m60q97O14P00p48P25qj246
4125a224J190Q13j014m8L1M30m97L26q43k64J444q36K56J113j778K23L20J295
$$ plain form
3992 342 719 537 623 494 -676 277 1081 -746 278 -1352 -305 132 313 -273 -135 719 -759 -425
4010 -425 1134 -658 -567 210 -161 37 -216 -91 -116 -230 824 -1039 184 439 39 -231 84 -1499 169
4029 169 -461 -1029 -518 -998 299 -829 -43 -232 -448 -398 -381 -588 333 -603 -227 -979 -380 -1181 -189 -64
4049 -64 238 179 273 -531 124 573 -638 -9 -539 -105 -160 1361 -319 -605 -386 -414 170 880 -370 1726
4069 1726 238 493 -1661 1069 626 -570 21 1180 -308 -416 146 -589 -157 -356 -378 -1087 -256 -312
4087 -312 -372 634 -1609 -322 -181 -591 -339 124 -472 112 111 -488 707 -437 1067 785 144 507 -284
4106 -284 -165 460 -855 -517 -1121 -329 775 -479 282 -170 96 -364 -1261 -647 53 -695 30 22 -1224
4125 -1224 -34 779 -235 -283 -252 178 -319 7 -836 -1100 344 -492 -236 877 -901 -678 -358 937
4143I37j011r20J545l45p4P23j151K06J220j219l33O71k12r57N17L2k16J045o87
4162b29m66J02J808o09r34J124q33j0N23j015K00Q53q7M14j094M40m19r31K000
4181H37j809P78K15j219L89J976j492J36m93K78JL06l70J600j51j204o84O75R03
4200F72j171p25J669p80n48M59M9J336j546K87J80j79n02M55N79m66J16P22n86
4219B1R68M10r20j059P32l54j24J072j082K10L38P28k160J055R97o29J21J78r08
4238d06O29J6j57J58K78k02o07Q56L61k303J432q06J361p71o9M86n20R93r49K49
4258B9p67j33J126l09j016J203K50q77m92J894p01j07r93O68r06P96o81J31R23
4277C8M11m6j337M52n74J523j031j29O23M68l30K72p63L34J8oP80j84J26p44j37
$$ plain form
4143 937 -74 -994 551 206 132 855 -296 -90 1130 -89 -422 249 37 -920 -403 -371 -587 458 -229
4162 -229 -695 -593 1215 606 -328 796 -37 -47 476 -539 -339 514 427 841 -253 187 -232 -1163 837
4181 837 -972 -194 21 -1198 -809 1167 -325 -189 -682 -404 -403 -97 -467 1133 982 -222 -906 -231 672
4200 672 -499 -1224 445 -335 -883 -424 -375 961 -585 -298 -118 -297 -799 -344 235 -231 -115 607 21
4219 21 989 1399 479 -580 152 -202 -326 746 -336 -126 212 940 -1220 -165 832 203 324 502 -406
4238 -406 223 239 82 240 518 316 -291 565 926 -1377 55 -751 610 -161 -230 256 -264 729 -220 29
4258 29 -738 -871 255 -54 -1070 133 383 -494 -986 908 207 100 -893 -225 -1131 -335 -1016 -885 38
4277 38 449 403 -934 -482 -1056 467 -564 -693 -70 398 68 340 -423 -89 -71 -77 703 519 645 -99 -236
4298b36j20J9J353q81j17P46j751J49kJ762q58l46j27QQ46q21O60j03m23M16l39
4319a65J04O84p54K38j134Q65L87l60q6M15k03R29j866M57J328n9k84M88j234
4338b50J50M56n78P30n9n50m34O83j20O30p28K28j154J069k10J94n26P79Mj242
4358i28O84K13N27m36j67l3J018r91j052J517J305j199j205J119j70j94Q20o05
4376B23n57P95j199o04M16J374n09N12j42m03J459j069j34q33J779j051n00K22
4394b21l42R7n53J103Q89p58j482J70Q96P51m31p62M79n87J145m77m08r1J391
4413H09j481L65O23R83j319k83J5p19J419m72o74L00J058q73N2p40J430p0R07
4432A330k186J127N65j072o67N69k23j61l19P94N67n18J54p92R76oR60j716Q66
$$ plain form
4298 -236 -356 -337 1016 135 18 764 -987 -838 -840 922 64 -282 -409 -401 445 -376 284 181 -242 174 -165
4319 -165 -61 623 -131 107 -1027 -162 225 -135 -221 194 -9 920 -946 -489 839 780 496 984 -250
4338 -250 -100 356 -222 508 449 -101 -535 148 28 658 -70 158 -996 73 -137 57 -469 310 314 -928
4358 -928 -244 -31 496 60 -107 -140 878 -113 -1165 352 1657 458 -747 372 202 8 828 223
4376 223 -334 461 -738 -1342 -926 448 -61 451 309 -94 1365 296 162 -671 1108 57 -443 -221
4394 -221 -563 -466 -1019 84 973 215 -1267 -1097 -201 550 119 -643 -164 -751 394 -83 -491 -582 809
4413 809 -672 -307 316 1299 -20 -303 -288 -1007 412 -60 -734 -434 624 -249 -197 -937 493 423 1330
4432 1330 -856 271 836 -236 -903 -334 -557 -718 -1037 -243 324 -194 -40 -832 144 138 1098 -618 248
4451B48L83j28q38n7J378r13j248Q62J219j396n22J552n68l07R97p40n34Q53J34
4470C75n01O93m67p92M03j166J775P10m29m83L12N0j433J093Q24r62P36q18l38
4489d18l82J382Q0j240R10O11q18o0P07n47j70o66L86N89o05q08j22J309r17M1
4509g38Q46j131J289O93q09J33j97n19K28J456j380L88j96Q01j915J362j540J648
4527D19q97O87n88J032p6m98O34k94Pr65J018N72n17M20j401K06J062j725n4J302
4547C44n1J71j691J278R55j410P52o0O3l69m42pJ393l92J57j831J987j361J680
4566A166j461L05m46J450j420L18L05q76Q58m44k3N31n92K42j172J759l18j97
4584a5j23O3k48N12L3q10J304j68j857J210Q48m0j375K31J94k33J439j054m47
$$ plain form
4451 248 631 503 -335 -392 986 73 -1175 -313 906 -490 -1012 540 -28 -335 662 -78 -612 241 375
4470 375 -126 567 100 -692 -289 -1455 320 1030 601 118 430 480 -953 140 964 2 738 -80 -418
4489 -418 -800 582 662 -578 332 943 125 65 772 225 55 -611 -225 364 -241 -1049 -1171 138 -779 -738
4509 -738 108 -1023 266 959 150 283 86 -433 -205 1251 -129 259 63 864 -1051 311 -1229 419
4527 419 -478 209 -379 653 577 79 713 419 426 -539 479 1051 534 954 -447 -241 821 -904 -958 344
4547 344 293 464 -1227 51 1006 -404 348 288 351 -18 -460 -467 926 534 691 -1140 847 -514 1166
4566 1166 -295 10 -436 1014 -406 -88 217 -659 199 -245 -268 263 -329 -87 -1259 500 182 -15
4584 -15 -138 -75 -323 189 222 -588 716 548 -1309 -99 749 709 -666 -435 -241 -474 965 -89 -536
4603e36O26N80M9j474J233m49k12J307j040k93M75M31j106L19l11l25O92k28P29
4622D67k12j115N87K21Q05m64p59O23n39J038m34p47J65K27J2q08K195j177r4
4641ij54R59K80j003k07j12J084l3j819Q63J166j733P86o34J32k47Q22L29r47
4660d77k8N92j585K227J052l037M56J249n62k81N60J057j805N77m62m27L24k12
4678g82L90O43j102K260j449J53n91K2Q62j222J049J97q37l10Q94j244O64J406
4696A003j545L12O55J61j076pJ131j463K668j680o90P97J034j622j98O15L59J69
4714F23o58O93q80J646p26j302P85L53m04P03j035K24m07l13L95j00J8L03K23
4733A41l69O17N02o37l60J55q1O3o45Q38l01L19q15r64J711l24J12J75J97J49
$$ plain form
4603 -536 90 670 719 -755 478 29 -183 1124 84 -209 266 697 -409 -90 -401 -726 -34 -262 467
4622 467 255 -860 -273 -52 753 289 -470 153 -386 652 218 -529 -364 -137 -125 -933 1262 85 -9
4641 -9 -163 796 1076 73 -134 -246 838 805 -1014 -151 1015 -718 68 -566 -434 -681 141 470 -477
4660 -477 -505 87 -1498 729 1781 -1256 -800 449 -113 -394 166 1223 -582 -5 -467 -894 -570 -782
4678 -782 -392 251 -851 1409 -40 113 -478 -456 406 -816 233 430 -407 -717 177 -1067 -403 1003
4696 1003 -542 -230 425 586 -490 -497 634 -829 1839 159 -531 266 1300 -322 -520 95 454 623
4714 623 -35 658 -222 1424 698 -604 181 534 130 833 -202 22 -385 -698 -303 -403 -385 -82 141
4733 141 -228 389 891 254 -106 49 -32 31 -614 224 -77 242 -573 -1537 174 -150 -38 137 334 483
4753D83j571J529q88J11N46j99m58l86k38J428K96q8O7q07q04R93q8J96j9j577
4773a474J680r5l04o02J030j219j16L67P93P36q51q5L64L24l54L35j361O15k4
4792b41J62N93l81j035J364k72K41j52m29k47k34K81J121k70j393L84Q30k43j36
4811e7l37p07L9P44N38j38L91k82p09m3J044p07J143r53m90K127r15j566J068
4830A90m17M35L4L53j691J145M22q16M09O86J04j002J33N61o52q04J85M30m20
4849g15O74m18M24L23O34r91j11N11O2n76K41K37P14j033J292j608j14J459j894
4868h89P83r69J981r96o99O82J38q66P47K62J002n78l23k40K50N69J75j591Q1
4887d81L07q33J247r81P2J454n00o59P37M56p39k75Ql10Q49r31K87K12M49J6o72
$$ plain form
4753 483 -1088 441 -447 -336 210 11 -447 -833 -1071 357 653 565 632 -175 -979 14 -74 122 103 -1474
4773 -1474 206 111 -193 -795 235 -984 -1100 -733 60 796 -55 -140 224 548 194 529 -832 -217 -241
4792 -241 -79 514 133 -902 462 190 431 279 -150 -397 -631 -350 771 501 -892 -508 322 79 -57
4811 -57 -394 -1101 -1062 -318 220 82 473 191 -518 -561 483 -224 919 -34 -524 1603 688 -878 190
4830 190 -227 208 242 595 -1096 49 471 -345 64 750 854 -148 -15 546 -106 -910 -725 -295 -715
4849 -715 -41 -459 -35 288 922 -69 -180 331 393 -183 58 295 1009 -24 1268 -340 -454 1005 -889
4868 -889 -106 -1075 906 -90 -789 -107 31 -835 -88 174 1176 598 275 35 285 854 1029 -562 -481
4887 -481 -174 -1007 240 -741 -669 785 285 -374 363 819 80 -195 -187 -497 352 -579 -292 -80 369 385 -287
4908b87N06N84q66L67J7n46J75N49k176R71N01l25N38k98N74o64J253j404J29
4927d02Q13j68j028O98Q67m48n87Q18Q0j307L56K96K04M97j804M98N87p78K393
4946A585j667l78N26L90j352N39J567j271M42O38j311O21L85j036M59m27K68j0
4964c2O06n7q21L72m91L32K52j002N07J12O72l41J28o22R00j506K58Q84L97R4
4984F42n11J294j751R61O89j786J242l89l92m85Q48n96P37k35q01r31K189n23
5002B02j435J526p53J46p41K35J91M3O86r64J934q51q26P06q3L1j87P5J590j204
5022C21p17m81Q24P91j550K034m64j707k31R42j77M79l24J116k24n78K45M64K5
5041G88m10L42j266k18M84M63J2q3P6j79m37J70k71P16j04R78j830R89n47q44
$$ plain form
4908 -287 219 803 -63 304 321 -225 -50 499 -1677 -706 -205 -530 8 -290 284 -380 873 -531 -402
4927 -402 411 243 -785 -87 780 332 -255 563 643 -664 -308 -12 192 689 -1115 -617 -30 -808 1585
4946 1585 -82 -460 66 456 -896 -357 1210 -61 381 1019 -292 329 714 -322 137 -290 -22 -32
4964 -32 574 517 -304 68 -423 -91 161 -841 -334 -222 450 109 237 -385 515 -991 -733 151 548 642
4984 642 131 1425 -326 635 1324 -462 780 391 -1 -486 362 -234 503 268 -533 -1464 725 202
5002 202 -1233 293 -460 -314 -1055 -820 -629 -586 100 -864 1070 219 -607 99 16 47 -140 -65 1525 321
5022 321 -396 -877 -53 738 -812 1222 758 -949 -1180 -238 -415 64 -260 856 632 54 299 763 788
5041 788 378 720 -546 -764 -280 183 195 112 188 9 -428 -258 -529 187 83 1061 -769 220 -327 -1171
5061a171J245P67j0n68K31j781J160N01Q38j167j47n1l57j053J518J42j048N07
5079d44J503j85j396L7L25O41j509O63j032J998j624J202m70l93K62J283p68L80
5097D73n38J62o95N05L22L43j227J74J122j78l98j241J319q20J837j867N11J37
5115e9L01p66n59J034M28K43n14J295k274J521j238J286J59m50r66P07O73q30
5133iq78R72p05j42J546m96q6J94m95q0P8J432l97j157L33m84O97M67j256Q88
5153D22o96o63P94j03N39k14j49k47n6M8M90p05L92L03m88K68J11l22k35O23l78
5174b66O1L5M43j16j025J715n87o66L37M54M04M07j586O15n00N60n85k01J185
5193F84r24N00m60n93l2M22n4L26P51q78K57j60Q86j051L94j193J337j013J037
$$ plain form
5061 -1171 74 841 831 263 494 -1287 -127 374 1212 45 -102 -153 -510 -1563 -45 97 -951 -444
5079 -444 1059 874 -522 -485 -160 481 -1028 -365 -1397 601 -1023 179 -291 -684 -422 861 93 473
5097 473 -65 97 -598 -93 229 572 -655 -481 641 463 65 -1176 143 -677 1160 -707 -196 -59
5115 -59 242 -524 -1083 -49 379 622 108 1403 -871 650 -588 698 857 407 -559 148 821 -9
5133 -9 -887 85 -620 -762 784 288 202 396 -99 -179 -101 1331 934 -223 110 -374 323 790 -466 422
5153 422 -274 -937 -143 -246 293 79 -70 -317 -373 -325 165 -540 -148 155 -333 -65 46 -276 -511 112 -266
5174 -266 -205 -170 273 157 -868 847 260 -406 -69 385 789 1196 -390 225 -275 285 -300 -501 684
5193 684 -240 260 -200 -793 -825 -403 -457 -131 620 -258 -1 -161 725 -326 68 -1125 212 -801 236
5212B36k83k75J853j711J311k155J088o67J16Kr9J449j080N12J48n09L67r76J850
5231A177m90j088j67P83j165J426j437J454j366P49P58q16m7j47K05n9r1r65J376
5250I0j625J252NJ80q3j24K6q66J421j309K231j356m94N32m73J371j53p58l45
5269d78R83q55j54M44k83m51O77L3rO91R96j698q23p0J299j840J421j314J026
5288d05k52P75r5N2j79O42n5K8r48Q46l53r86O67k00KL24M1Q58k77n66J478j797
5310d00Q55j039J590o10j327J445k49k86J84r31J307n82o40K441j738k0l6P71
5328G35n23q61L65J58K17N02J79j236Q47j108r50R04O71r79j50J297j119R02l28
5347d77j05J527m37p75J61k92M88k21k36L60j362K29J431q64k0L91O85J98o37
$$ plain form
5212 236 -47 -322 1531 -180 1131 -1024 64 -603 -487 -485 -584 865 -215 297 445 -64 303 -673 1177
5231 1177 687 -401 -568 215 -950 476 -961 493 -873 -124 634 -182 -229 -376 -171 -230 -321 -1286 90
5250 90 -1535 -283 -278 -98 -181 -305 -279 -1145 276 -1033 1198 -158 -652 -120 -593 778 625 -133 -478
5269 -478 505 -350 -504 -60 -343 -794 -117 -84 -93 598 1594 -104 -927 -997 302 -1538 -117 -1431 -405
5288 -405 -657 118 23 75 -104 538 483 511 -437 409 56 -930 -263 -463 -461 -137 -96 762 485 -81 1397 -400
5310 -400 455 -584 1006 396 -931 514 265 -21 163 -768 539 -43 -683 1758 20 0 -36 735
5328 735 212 -649 -284 -126 91 593 772 -464 383 -725 -1675 -771 -100 -1079 -1229 68 -1051 -149 -477
5347 -477 -582 945 508 -267 -106 -398 90 -131 -367 -7 -1369 -1140 291 -573 -593 -202 483 681 44
5366D4l75P46j164J588p7j75l07r69N70k95J269n67p23O92k05k26l60N28P54l66
5386C82j293O11n58K36J058j111J281n69l46J444J33k038Q71k13L5P84o78J37
5404A66K97m9Q08m83o5J3n97p5L53m39j22M13k42L45r55Q57n50J015K69n11Q6
5425E34n45n81J994j893J048r94M57M12j508Q39q50n30J689l37L76K9j079J202
5443B63K39j086K24L14m10J44Q32j6R5m6p62O6K68m34L46r12J026K90P1o10j09
5464b07R72o47L9p58M96k33n85P76k13R73q23K78m89m64J007r58J078j52O44j424
5484f90O11n28N21J61M57p40L46n33N04p10O42R3J40l72n78J157o67K43O11k89
5504C79q6M80j002L71p72O74k36Q22j039P29l57K43p00L2J051j160k85J42P11
$$ plain form
5366 44 -331 415 -749 839 762 587 280 -689 -119 -414 855 288 -435 257 52 -174 -534 -6 748 382
5386 382 -911 -300 -858 -622 436 -675 606 37 -309 1135 1268 -770 101 -112 -77 707 29 166
5404 166 463 414 1222 739 674 687 90 15 368 -71 -193 220 -22 323 -632 225 -325 690 959 448 534
5425 534 -11 -592 1402 -491 557 -437 20 432 -1076 -237 -1087 -1617 72 -265 111 140 -939 263
5443 263 502 -584 -360 -46 -456 -312 520 504 599 553 -209 -143 125 -309 37 -875 151 441 512 -98 -207
5464 -207 765 118 157 -601 -105 -338 -923 -147 -360 613 -210 68 -421 -885 122 -836 242 90 734 -690
5484 -690 -79 -607 -86 75 532 -208 138 -395 109 -601 41 134 274 -98 -676 481 -186 57 668 379
5504 379 293 773 -229 142 -630 44 -192 630 -409 320 -37 206 -494 -462 589 -571 -856 -714 -3
5523cK62L59l71q85R32o64K13J101m09o3p01l77N55l4J05m22r7L23O03l78N23
5544E72m39K5Jo73O81L39m27J3r51M53P71J10p28j10J000k54k51K45J03q21N86
5565B45p44l58N31k4m38j1J214j29j61K93m16p15J058O68j129Q97p80O7N20j533
5585i45J61j27J721j162p7k26N29J077m15r21k86O37P37j54n15k98M59j171K265
5604A289j667P79o42N97L05o74K45L56j31m27q81K009n65k25p89O50j037Q79m39
5623c68J082q55k92R73r1L67r42Q9M74l07Q59r40j287K18J421j585J150k16p86
5642a036R21q78M36N14Q30J69k80o23N43M37m49r95J24P00m90l46N89Q8j227J504
5662E31k42l2p85Q28O81n78o32P2k50O3j76J48N31l79J17J82j295J734j379M27
$$ plain form
5523 -3 259 618 247 -638 294 -370 -157 944 535 472 -229 -606 -51 -85 20 -402 -499 -176 427 49 572
5544 572 133 158 159 -514 167 506 79 92 -859 -406 365 475 -253 -363 637 383 132 377 480 -341 245
5565 245 -499 -857 -326 -350 -788 -799 415 286 125 418 2 -713 345 1013 -116 781 1 68 588 -945
5585 -945 -784 -911 810 -352 -429 -655 -126 951 536 -385 -671 -34 703 549 34 -264 195 -976 1289
5604 1289 -378 401 -241 356 661 -13 232 588 457 30 -851 1158 593 368 -421 229 -808 71 -368
5623 -368 714 -141 -433 540 449 816 -126 -37 437 130 989 49 -1238 -1020 401 -1184 -34 -250 -1036
5642 -1036 -115 -993 -557 -43 787 956 676 53 596 1033 584 -411 -287 413 -77 -423 166 254 -973 531
5662 531 289 257 -528 300 981 403 -229 -157 -407 -344 -520 -372 159 -220 -103 79 -1216 518 -861 -434
5682d34J110j377P78m21O41O60j132K12L33J116j618L71L21l97M41k29po44P78
5701E02j391J162o65L00L81kj00Q08j151n71J224j082J819n61n48m85M57L68r26
5720d61R56p25M11m49p6L09o39J539j11k14n73M84M70p66m29Q8R15Q10k292N85
5740a68L97l05P06o96L06m40m18J58O66l51J15N48p15J188k91m13k89r40R63L12
5760C33j77L62k19L94j262R91m45Q74p76k03J00m02L11n81O63m05o9K52m55J562
5780H48j395N62R34p27j32q76Q87m54M66K85m36P15j602M91n57M40J303j64l18
5799B70j25j009J434o79O57n77P16j683R48J90j119J159M13m71k43J132r96P08
5817G25k435K658j238L70n22m58R51k52o73L17J310p02l54m2K21M5K58l54J034
$$ plain form
5682 -434 676 -701 77 -344 297 957 -175 37 370 1486 -132 239 560 163 604 375 368 -276 502
5701 502 -889 273 -392 -92 289 287 187 995 -156 -727 497 -585 1234 673 125 -360 97 465 -461
5720 -461 495 -230 181 -268 -344 -35 -674 865 754 540 -33 451 921 155 -274 -186 729 1539 -753 -168
5740 -168 229 -76 630 -66 240 -200 -618 -460 206 -145 -30 518 -197 991 700 287 -2 -942 21 333
5760 333 156 518 299 693 -569 422 -23 851 75 -128 -28 -430 -119 -700 -37 -442 -511 -259 -714 848
5780 848 -547 15 949 222 90 -786 101 -353 113 398 -38 677 -925 -434 -991 -551 752 588 270
5799 270 145 -864 570 -109 548 -29 687 -996 -48 142 -977 182 595 124 -119 1013 17 725
5817 725 -1710 948 -290 80 -442 -900 51 -201 -874 -557 753 51 -303 -345 -124 -79 179 -175 859
5836H59L86r59j169Q67k64j33P78o33m80l3J080O8j91J00j056J539o51M38Q9J47
5856G82m51j176N51R4P36p11l40k84J403o21k09O86p54k21l71J446k18k97m65
5875d20N70j97n86P39K8N81r72P65m72M32%j92k77O8r00Q20J313j335O02l56N06
5896G17l64l30O46j086K15k27l4M8J430j517J82j6J15j14j83J186K58k057J834
5915G03j241N75J799r63r31L21l13J35k92o91R37o39J565j426J514p78j080l43
5933a148Q05J268p36M47j492M46J411j951J083L51r54L81j20J060j291Q18J78
5950E56p25k29O0K18K33M07m55j025J390q53J272m5p69J78l81Op93J281R4m31
5970a1l89L9M97r4Q27j342K63k34P03J40k99l20Q1R91p79q4o5R1o45R13j39r77
$$ plain form
5836 859 1245 286 -883 -16 -280 -413 365 -268 -748 -781 299 367 176 276 -780 759 108 546 635 782
5856 782 331 -845 -294 -200 536 -175 -515 -799 604 -17 -226 460 -294 -515 -886 560 342 45 -420
5875 -420 150 -47 -633 106 134 715 -257 508 36 468 468 276 -1 67 -833 -13 1300 -35 567 211 717
5896 717 353 23 669 -417 -202 -429 -463 -415 1015 -502 -320 -336 -221 -335 -518 668 926 -1131 703
5915 703 -538 37 1836 873 -58 263 -50 85 -207 -898 39 -600 965 -461 1053 275 -805 -1148
5933 -1148 -343 925 189 636 -856 -410 1001 -950 133 484 -470 -89 -209 851 -440 378 556
5950 556 -169 -398 -338 -120 113 520 65 -960 430 -423 849 804 35 213 -168 -162 -955 326 420 -11
5970 -11 -400 -361 136 42 869 -473 -210 -444 259 399 100 -220 -139 852 73 -11 -76 15 -630 283 144 -833
5992h33O54N41l8N0K55j842J372k3J02l85l40J71K62P33o86p23M50l28m2O5l72
6013i57J421l79q03N15O02j074r3O98J90R01j500J080j761J489r50J115j50k35
6031A09J361r82l63j185J904p66O06j007Q85o09M82J06m14q2M55N44p55o59J531
6050A161l95M49k597J268O45p62m50N00M30j17K5l64O17O84r82o4O3j363J648
6069C96M15m47j215J249p96Q17m14m7n82J228n10j299J009n2O94O86j159K045
6087B018j535k39K68M33l86q07L64M87r07N8L91k96n35J07J041J01k04j65N2l41
6107i5J86n1O19j120P36N98j42j66j187O46j040M82N23j007J449J03k51K67p38
6126a88K88O37m71j174J020j207J685j657J162J99p75K66L73L11p60L27M32J30
$$ plain form
5992 -833 -179 362 324 374 629 -1213 159 136 238 -147 -487 -316 -54 679 -7 -730 -280 -608 -650 -585 -957
6013 -957 464 85 -718 -203 399 -675 -768 -70 120 1021 -479 601 -1160 329 -621 494 344 109
6031 109 1470 488 125 -1060 844 78 684 -323 562 -47 435 541 127 45 500 1044 289 -370 1161
6050 1161 766 1215 -1382 -114 531 -231 -681 -181 249 132 157 -207 410 1094 112 48 111 -1252 396
6069 396 811 364 -851 398 -398 419 5 -42 -624 604 94 -1205 -196 -248 446 1132 -27 2018
6087 2018 483 244 512 945 559 -248 116 603 -304 -246 145 -151 -686 -579 462 563 359 194 246 -95
6107 -95 91 40 659 -461 275 873 731 565 -622 24 -1016 -534 -11 -1018 431 534 283 550 -188
6126 -188 100 737 266 -908 112 -1095 590 -1067 95 294 -481 -215 158 469 -291 36 468 598
6144E98l65k90N79l75n20Q26J74j31K87j009k67J062JK89r12L94j96j12r66N17
6164d16J178r35j482Q63J294j066P86L48N22k055J004o32N35O26j91j139N77M49
6182B66o87J065j300J053O03q17l26M90K5p97q6N87l68N61n32Q15j461R40J215
6201A246j095J80n9L49K57q9p87M11r75p3K45J555j178l22J865j103q12K31K25
6220G1k81L4L78j41o79P79J224j350o03P87N33M55k081N82m7j57N46O28q50L75
6240B03P66n81j161P89K12j42n91M33J87q25J904j690j43J788m62j092L45M71
6258D11k188J981m38N46l24p82L29L45J55O71j106L10n28M67Q77p08j83N59J00
6277D94r56O77n77%K48m14k31N92l17N38K08N13r89L61j64k15L13Q57j566M45
$$ plain form
6144 598 233 -57 522 147 -373 453 627 496 783 -226 -493 569 570 859 -53 341 145 33 -933 -416
6164 -416 762 -173 -1655 -792 502 -564 222 570 1092 -963 41 -591 -56 570 379 -760 -183 266
6182 266 -421 644 -656 397 1000 183 -143 347 372 -425 -511 76 -292 269 -263 552 -909 31 1246
6201 1246 151 331 272 621 878 789 2 413 -562 -635 -390 1165 -13 -335 1530 427 -385 -154 71
6220 71 -210 -176 202 61 -618 161 1385 35 -568 219 752 1207 -874 -292 -339 -496 50 678 -172 203
6240 203 969 388 -773 16 228 86 -505 -72 115 -710 1194 -496 -639 1149 687 -405 -60 411
6258 411 -1777 204 -234 312 -12 -794 -465 -120 35 706 -400 -90 -618 -151 726 18 -165 394 494
6277 494 -462 215 -362 -362 -114 -528 -759 -167 -484 54 262 775 -214 147 -17 -232 81 938 -628 -183
6297a83N22o07p4L66M6k21J586j431L06j098J074o80J616k69m67m86O75j320N02
6316a43P6J94K53k88L65j357K176j576N03k53j21k71J63l45K79O46L98l20qm67
6336i6j422K642N77k489M94PJ62m52J089J79l58k09m83N34N1n38m17J067m24o5
6356a51L25l37k97n23N75N19J43l83J30k22j1r9L26K16J07N94j765M49J851j069
6376C78M84j578L94Q8O34L27j89n85M81J339k097N20J85p41J682j417n09J63N68
6395A27O52j595J348K0p56L77L93j461p7J195L72n94M8K88n65P70j280Q13m77
6414d02M46P73J58j138O13l39r45J260P1k92j064N39O17P37j295J021j181N06
6432H5m46R42k46n54L40p27O14k46M38q77j24P82l52P30M39n6r77n96P63j58n84
$$ plain form
6297 -183 339 -268 -342 24 70 -151 1435 4 310 -788 286 -394 1222 953 486 0 675 -645 -143
6316 -143 -67 127 380 92 457 -900 1276 -300 203 -50 -171 -442 -279 -624 -345 301 699 379 371 -96
6336 -96 -1518 1124 1701 -788 -294 -287 -125 -577 512 691 333 124 -359 175 226 -312 -729 338 -86 -151
6356 -151 174 -163 -460 -983 -408 111 254 -129 1 -221 -232 -331 -5 211 318 912 -853 -404 1447 378
6376 378 862 -716 -322 -234 400 727 538 -47 434 1773 -324 196 381 -360 1322 -95 -604 -441 127
6395 127 779 -816 532 552 -204 173 566 -895 -972 223 595 1 49 337 -228 542 -738 75 -402
6414 -402 44 817 975 -163 450 111 -834 426 497 205 -859 -320 297 1034 -261 760 -421 85
6432 85 -361 581 335 -219 121 -606 8 -238 200 -677 -801 -19 -371 359 798 742 -235 -831 -68 -226 -810
6453h10J328n52m97P84N96j708J170O15j863N76M56r9k63n2J40K39j58l82N92
6472A12Q32p16j2K9J38j147Q54j21n35k53K07K044j705L01k2L74m83Q4l44P35
6492C72n68Q73p97L99l30J052j438j580J544m04P74J005o45J05p69L32k21l44
6510f40N62j17k81O19k96L7m37L80K38l80N33n69j219Q90J288J61l7n99J029m72
6530F90J7j494N31L97K0j116N47O94J68K49j829J571J27j139K20J749j116k98
6548a2l8M15j60q4J034j731N44j608J789n44K41K13P6J79J44m00o34O21R17j661
6568f99J963m36p92r4M72r70K58j67l96O44J341n20q70K27M6J095j974P09Rq71
6588a025J083l48l67P17O2N00o59n25J031j234J14M70O34j005J699k437J676k77
$$ plain form
6453 -810 518 -34 -531 253 849 -859 311 926 -937 -361 95 -4 -267 -319 -179 60 -98 -480 112
6472 112 944 228 216 245 383 -764 90 -31 -566 -819 -612 1432 -273 28 6 380 -103 -19 -363 372
6492 372 -196 677 -120 279 -51 1001 -437 -2017 -473 -877 -103 902 257 362 -407 -75 -296 -640
6510 -640 -78 -195 -476 143 -153 -116 -553 -173 65 -315 218 -351 -1570 -680 608 769 732 133 1162 690
6530 690 707 -787 -256 141 161 -955 -408 286 454 703 -1126 445 572 -567 -347 1402 286 -12
6548 -12 -50 365 205 121 1155 -576 -32 -1640 149 -395 -154 59 135 314 458 58 -576 45 962 -699
6568 -699 1264 828 36 -58 414 -556 -298 -465 -861 -217 1124 604 -266 -39 7 1102 -872 -163 -154 -1025
6588 -1025 58 -290 -657 60 122 622 -37 -562 469 -765 -651 -181 453 -552 1147 -1290 386 109
6606A09o83L66M08n60K04K69Q1m59J295j295R94n98J000j644N76J289j286J2J16
6625A94k8P14l54q1r33Q42J42l44J48K88j068l96O53p18J255L25j204o8J226r62
6645c69M25j05N63j008Q0Kj92P02l12K86j04J42n34m31K47N06j40R1J484k285
6665i52M27K35j47J319j430L98J57k42M4k40J21J005p40J069m5l72Q21j859O8
6684c63j58J02j4J360j163J055p7L79j337L63K16M82j183j23J283K55m50r99O46
6703B74j156J341L05r36qL19R13k269J883K02j239J290Q17k129N88O69j111L34
6721H7j04K90n59K54K02k90l48O7J228p99j66k6q66J031O3M72n61j13o27R96k40
6742iN98j311J148j730J71J073J053p69k43j22Q21n21L7l00M75o91j81J30J15
$$ plain form
6606 109 -574 -208 200 -360 -156 113 194 -265 1030 -265 729 131 1131 -513 63 1352 66 78 194
6625 194 166 880 526 445 -488 354 496 152 300 588 -480 -876 -223 -941 314 639 -565 -633 593 -369
6645 -369 56 -49 514 -494 -414 -412 -604 98 -214 72 -32 110 -424 -855 -608 -102 -242 -151 1333 -952
6665 -952 -525 -290 -437 882 -548 -150 7 -235 -191 -431 -310 695 -45 1024 979 607 1428 -431 -363
6684 -363 -521 -419 -433 927 -236 819 742 1121 -216 147 363 845 -338 -461 822 1077 627 -372 274
6703 274 -882 459 764 -172 -180 139 1052 -1217 666 868 -371 919 1736 -393 195 864 -247 87
6721 87 -17 273 -286 -32 170 -120 -468 -401 827 28 -138 -164 -1030 1 64 536 -25 -138 -765 231 -9
6742 -9 589 -722 426 -1304 -1133 -60 993 224 -19 -141 680 159 196 -104 371 -320 -501 -371 -256
6761b56L92o88J296q95o4P67j472L63Q47q84N7O50K58p21N19J27o35J326j371
6780c84N88m14J33M00P33j055P31o51k31JM50k16Qq90R16j349K447j803R36L11
6800F61o57P72j68j068J95J214j427k92O46O76l61M38l68L73o04K65k01l12o6
6819b84J166k36l94Lj106N69l7n22m52K325r11r98Q7J81k8J28O12N83K06j117
6839b25o51J87K17N27q51J663q51L99l72m9K90m08K76n5n00L11N86n17M04N19
6859I00j303O68q42R38k83L26l82J55p4n98p7J123n30n26P93j476J732N66j655
6878e45L70J0J6l50q4J005k37j22p42o0K73K52j27K33R23j653J48l64J401n67
6898b20L83k46K56o05N61N81j129P58n8J54n25R96k88r92n5R66q45M42j50M12
$$ plain form
6761 -256 136 -552 744 -151 -215 552 -920 -557 290 -594 -537 113 371 -350 169 296 -339 987 -384
6780 -384 204 -210 -77 323 1056 1 732 81 -150 -149 301 85 93 -797 119 -1230 1217 -586 350 661
6800 661 4 776 608 -460 -265 949 -478 -770 -124 552 191 629 261 634 30 295 94 -218 -284
6819 -284 882 646 252 255 -851 -282 -319 -841 -1293 1032 121 -877 -790 -609 -637 -509 103 686 892 -225
6839 -225 -876 -689 -472 55 -796 867 16 415 43 -6 284 -124 152 97 -403 -92 494 -23 381 900
6859 900 -403 265 -577 361 78 404 22 177 103 -495 -572 551 21 -505 288 -1188 544 1110 -545
6878 -545 -175 -165 -149 -499 -583 422 185 63 -679 -739 -466 -214 -341 -108 815 -838 -690 -1054 347 -220
6898 -220 163 -83 173 -432 129 710 -419 339 281 435 -90 906 618 -374 -429 537 -308 134 -16 396
6918C96m74M19K25n18k49j91l67J397j034m4Q79L33j201J747j378m74J285r22
6936a71o30R22J11l79N2J028k72o31q04J312p05l74Q79k37o27P31M45o9p94N13
6956C00N69j240j42Q91Q8J34L41j536n96J132J367j561J110p90J593k424L71P22
6974C29o27O06n48M02j36o92J50M92k96M34p30o5L03K72j59QP81m10k12k63J53
6995b08j23m89L54J501j525p9J110j013j04K66m90J586q92J37n6q96J58K59j23
7014f27J140j355J085j41J7p01M20O09j30N3q5j83q73J041M53k04R63p83k36N08
7034I71j061P37Q6r92K92K32J23j69k98k99l7m0P19n06P20k44r25J589n04j187
7054g93O86Rj508K650m02q46R81j099J91J3N43j302P88l9J29PJ259r97o12N35
$$ plain form
6918 396 -78 341 566 48 -201 -392 -759 638 -396 -440 439 772 -429 1318 -60 -534 751 -171
6936 -171 -801 121 232 -147 -95 933 661 30 -774 538 -167 -541 338 101 -526 205 650 581 -213 300
6956 300 869 -371 -513 378 466 600 941 -595 -1191 -59 1308 -253 857 67 1660 -764 -393 329
6974 329 -298 308 -240 162 26 -666 -516 -24 -320 114 -616 -681 -378 -106 -265 -257 524 114 -98 -361 -208
6995 -208 -331 -820 -466 1035 -490 -569 541 -472 -576 -310 -800 786 -106 31 -25 -921 -763 -504 -627
7014 -627 513 -842 243 102 119 -582 -162 447 317 370 285 102 -771 270 723 519 1482 699 463 971
7034 971 -90 647 733 -259 33 265 388 219 -79 -378 -415 -455 264 -242 478 234 -691 898 394 -793
7054 -793 -107 -98 -1606 1044 642 -204 777 -322 -131 -118 425 -877 -89 -128 1 8 1267 270 -342 193
7074A93n86J17L16P17p47K46R29n91l5j632J312J25r64R71m98l18l44k85J387
7093C13p64L70J16n09p4J79O28J27l62l41m10P69o50P15p5P70p41P04q49J12K14
7114B42o1o50J143o24J35k65o50K00N43O52o25Q0r32Q36j21J83p37l44J397p05
7134c03Q0L1r89P88N85m87J012k71l61J72O26r75K17M70l18l12j54Q07o61N9p86
7155g70J067k4L9J54o19n91J624o13q0L10n89Q55j031k41R29n72j55j52J058l68
7175B31j191P39m67N04n69L90K61N12o40M15q02K01P67j12j36j108O15o23J255
7194B42p84l4P22j450Q87K67L73n36J62O37m54K03j385O36J60m3P84N47p43o78
7214d87J026j179J091j070L20j0J420j432N67l05l59K6j20O98k27O61l7j387M32
$$ plain form
7074 193 -393 -276 40 757 10 256 1185 594 559 -1073 239 364 -600 371 -127 -445 -789 -1074 313
7093 313 -451 -81 35 -474 -548 -369 259 386 24 -317 -727 42 -608 107 32 802 61 765 -84 28 242
7114 242 181 -469 674 50 185 -80 -730 -530 13 665 40 120 -812 24 -97 86 -651 -995 402 -303
7134 -303 -223 -192 -1181 -393 192 -295 717 446 85 257 883 -92 125 595 277 -35 -189 618 -43 16 -770
7155 -770 297 273 312 466 -153 -744 880 267 187 497 -92 763 -268 -509 420 -152 -307 -459 599 231
7175 231 -960 -221 -688 -184 -753 -363 -102 410 -230 185 -617 -416 351 239 103 -1005 -390 -1013 242
7194 242 -542 -576 146 -1304 -417 -150 223 -313 -151 486 32 235 -1150 -514 -354 -397 387 934 191 -487
7214 -487 539 -640 451 -619 -299 -309 1111 -321 246 -59 -418 -392 -512 186 -41 620 583 -804 -372
7233c72O33j034L65Q92n55j89j36J262k207J646M8m24m73N13k85j550Q16K59K051
7252A260j174L53k81n56nQ37q64L28j021J014m98k72O93p31N45M64o75J131p52
7271b04OJ042j433L73k4o34R2N39R7j089K357r43l50NK11m3m65O33L78n37K7o98
7293f60O21j069R12J023j578J590j320J688j218m19J01J217k469J483M32r62Q67
7310B39n70L02O58j510J945j391N43k5M14j341M59K41J83p52l79J150m79J2O23
7329C22k18o60K00m8M6Q53p52q02J027Q1K75M47p79N43L62j199O68j239l9J195
7349B83J24o66O43n68J471k322J125J82J0l78n29P66N92j293P13r3p73J266O52
7368A205k95r14K4L36k066K001M34o9q43j67N07N1K97k91N72q40M11n26q04J386
$$ plain form
7233 -372 261 -773 -408 484 -71 -260 -396 866 -1341 305 353 -71 -544 -31 -316 -1866 -1050 -791 1260
7252 1260 86 439 158 -398 -403 434 -430 -102 -1123 -109 -607 -879 -186 -917 -372 92 -583 548 -204
7271 -204 -198 844 -589 -216 -240 -874 -782 -243 -146 -1235 1122 179 -171 -166 45 2 -463 170 548 11 38 -660
7293 -660 -39 -1108 -196 827 -751 839 -481 1207 -11 -430 -329 888 -1581 -98 334 -628 239
7310 239 -331 -29 629 -881 1064 -327 216 191 605 -736 -277 -36 147 -605 -984 166 -313 -301 322
7329 322 104 -556 -356 -404 -358 495 -257 -1059 -32 49 324 771 -8 535 897 -302 366 -873 -912 283
7349 283 407 -259 384 -184 1287 -1035 90 272 282 -96 -625 141 733 -560 153 60 -713 553 1205
7368 1205 910 -4 20 356 -1710 291 725 656 -187 -354 153 204 501 210 782 -58 353 -173 -977 409
7388D09p17j38Q03J6m60R32m83m61P30j049m01k09J177l63N94q98K94l08Q90j532
7408a174K225j902J170j64J53j035M34O37j26m60q8J126m76L88n11J014j967O07
7426a49J90K46R12j259L18K64m32k55m1o91N65J27k72O20o03O95k95j92P65J036
7446A549k500O14N15N46j679J274o89Q47k88J22j213J266K69MJ36p89N85j20j206
7465g57J39o53J955o18j08m00L64N13l32K9p67O35r06J387q78J403o00o08R79
7484G77o56p98O85L19j510K256k59j333P6j71K20K36J67M35l60p03N48M67j592
7503a196J476q65N77J42L87L36m64L85j184k14M39O80o00Q88k21p20k43J005n11
7522I7O70j301J392j321R31L16O6o13k54r6m52J191j23j189M50j463K331o57J47
$$ plain form
7388 409 -308 -446 357 373 -87 845 362 -99 631 -418 -819 -1028 149 -214 380 -518 -224 -532 358 -1174
7408 -1174 1051 -851 319 155 308 -727 -293 344 218 -242 -330 796 320 708 197 1211 -756 -149
7426 -149 41 287 1199 -60 258 522 90 -165 -206 -897 -332 -205 -477 143 -460 235 -60 -252 513 1549
7446 1549 -951 -337 178 724 -955 319 -370 477 189 311 -902 364 633 637 773 -16 569 449 -757
7465 -757 -618 -1271 684 66 -42 -442 -78 435 103 132 -635 0 -906 481 -397 1006 406 -202 777
7484 777 121 -677 8 327 -1183 1073 814 -519 -443 -614 -394 -158 9 444 84 -619 -71 396 -1196
7503 -1196 280 -585 -8 134 521 857 393 778 -406 -620 -181 499 -101 787 566 -154 -397 608 97
7522 97 767 -534 858 -463 468 784 850 237 -17 -113 -565 626 503 -686 -236 -1699 632 -25 122
7541A22N51q70j106K392j684k61J569j318J26l6K084k121K501k517p56Q68R78
7558E22j649P15J176k9O84l72q43j143R97L89k08q26O19K13j097P39l5J014j154
7577b88K79J47p14J239j82K13j73o56o55Q9k30R06M89j661J465K93n00q99R30
7596I2Q10j717N95p91N31K99n46R11j12p81Q96m89M13q78R26p01L72M48J53j75
7616B56j58K06q01L48J08m45J805j688J016r97Q98m53J69m40j054K050j3n65L08
7635E50j312O83j83P60p41R31o55p90K80k06k88J293l23L00m8n32J59M50j005
7654f77m1l44R54M88q47p64J318j103R84K81k62q72J261p28r31K034j864J096
7672a7L94q38Q01o03O11l8j98L7l21l24P27R2l0n75q8j05N25k85O37m22Q49q28
$$ plain form
7541 122 673 -197 -1303 1089 -595 -856 713 -605 -479 -515 1569 -552 1949 -568 -1324 -456 522
7558 522 -1127 -412 764 735 1419 1047 204 -939 58 447 239 -587 32 245 -852 -113 -148 866 -288
7577 -288 -9 138 -576 663 481 694 521 -135 -790 -701 -931 -25 464 -1197 268 561 61 -838 92
7596 92 902 -815 -220 -1011 -480 -181 -727 184 72 -709 187 -302 111 -767 159 -542 -170 278 431 256
7616 256 98 304 -497 -149 -41 -486 1319 -369 647 -350 548 95 264 -176 -1230 820 807 242 550
7635 550 -762 -79 -262 498 -243 688 33 -757 -477 -683 -971 322 -1 299 251 -281 -122 328 -677
7654 -677 -718 -1062 -108 380 -467 -1231 87 -1016 -32 249 -13 -885 376 -352 -1283 751 -1113 -17
7672 -17 377 -461 340 -263 348 310 112 149 -172 -496 231 323 293 -282 -370 -475 50 -235 402 -20 829 1
7694Aj62O91o98r19J484%q05J92R76j220K71M36k731K579p06l55R15o1k57P71
7714D02j490m6J268R06r80M25o86J94o2j29P89p64J04p86P55o8O09j445K10R80
7734A86l13q24J159J38q31O10l24p14Q90P85N75j005j060m59J520M13j894J097
7752e1K89Q20k51j322L53N21l43r55J102j81l04l55O86j50j24J42L29m30k87J027
7772E16j396M58R11r58R19j102O54p3j81N98K05m37l40N04l46J95L27K45m84K17
7792D32M1k31j88N71j796K103o28j281J348o96L17K22k56P83j039M26k8O16p37
7811b1l26L43j689J053J86K5o65J701j038P11M7l98O61K05j371O68k69O66j311
7830h22O46J405j657J14L98m81Q53J67j274O06M69L09j011O17k29K44o18R57n35
$$ plain form
7694 1 -161 530 -168 -1087 397 397 -408 -216 760 -460 -189 247 -2484 95 -611 -966 -51 -112 -369 402
7714 402 -1088 -1134 134 1040 60 485 -201 -7 -69 -198 591 -173 -69 -855 -100 -168 441 -1004 -794 186
7734 186 -127 -951 208 346 -485 125 -199 -913 -23 762 1337 332 -728 -1187 333 746 -1148 -51
7752 -51 238 1058 807 -515 -162 359 16 -939 163 -18 -322 -677 9 -141 -265 -123 206 -224 -511 516
7772 516 -880 -422 489 -469 450 -652 2 -71 -252 346 551 114 -226 278 -68 127 454 699 215 432
7792 432 473 242 54 625 -1171 932 304 -977 371 -325 -8 214 -42 741 -298 128 100 716 -21
7811 -21 -347 -4 -1693 -640 -454 -429 -1094 607 -431 280 327 -71 590 795 -576 92 -177 489 -822
7830 -822 -176 1229 -428 -314 84 -397 456 623 -651 -45 424 733 -278 339 110 354 -264 693 158
7849A58n45J040p93N71o32O10k31r27J029j009L53N43k36k47M30M24J36j579P66
7868a39q4L57N95m16P92p51OM64j037J86N95K19K51j110L80p91k08L85m8J79O42
7889D67o65p07J801m63j87q05J193j27n05j26M22l8J47ok8Q5n57L48J8J18p94
7910d09N15J72M6J55P7P6K43j033q17P45K68L94n87j317J473m90J196j618N98
7929c13L96j010J793l21j51p02n86J040K8o36O58k4J2j063Q75P13n50p57J131
7948E33j24k55k83o0K35m10O7J036m09j93o54O25j67n2J617j606L50N88j370N63
7968C1q13n18J969j0k06p07Q0O27p44Q04j57j73j21p60J029r10P58p5M20j442
7988i18O1J610j607J087p86P32r7o08k47N49K74p01M41J86M55j38P7r3J4k57q55
$$ plain form
7849 158 -387 653 -140 431 -201 409 178 -749 280 -729 -376 167 -69 -316 114 538 674 -905 -139
7868 -139 -223 134 729 313 1105 354 360 824 -213 -27 568 787 1038 -72 308 -483 -691 -306 -354 -175 467
7889 467 -198 -905 896 433 246 -559 634 507 2 -124 298 260 407 401 373 458 -99 249 267 385 -409
7910 -409 106 278 324 479 556 632 875 -158 -975 -230 38 432 -155 -1472 1 -489 707 -911 -313
7929 -313 83 -927 866 545 394 -308 -894 146 174 -462 196 172 184 -879 -4 709 159 -598 533
7948 533 409 154 -129 -189 46 -364 -297 739 330 137 -517 108 -59 -111 1506 -100 250 838 -532 31
7968 31 -782 -1300 669 659 453 -254 -174 453 -291 513 356 183 62 -698 331 -579 179 104 524 -918
7988 -918 -857 753 -854 233 -553 179 82 -526 -773 -224 50 -651 -210 -24 431 293 370 277 291 34 -821
8009h21N09m42O48l22Q78L1r68j1R51n10K69N72J1O2j018M23k57m61P70n69P48
8030D93j443N17J60J024l24j16p72P26l71J226j549M07k82M3M40J67k90K63n04
8049a85J229p84n03Pk69j91J023k28k20l51J260j769J837j595J456j114Q29k48
8067A84j98N91L34q77O71j067O10m28K86J63l95O74R6p63J65K86N1L48J59r09
8087a9r44P11J09O93j141J04p48P80j002K274j23O3p32j104J416j208R93L59j868
8106a387J206K31O0l29N38N63p68Q37j044J036j082r51J294P5N6m53k14N57N13
8125G38j826O53J73n9R16j290Q03n40J168o86l00l80J774j226N81N65j828J001
8143B37j49J41J01m85K29l60K96O04q16M81N49p00j09j96M94J03K38j485K390
$$ plain form
8009 -821 -312 -754 -106 -428 450 481 -487 -498 453 -57 212 784 795 857 -161 262 5 -456 314 -255 493
8030 493 -950 -433 -273 751 427 311 -461 265 -106 1120 -429 -22 -304 -261 179 346 56 319 -185
8049 -185 1044 260 -243 -236 -505 -696 327 99 -121 -472 788 -981 856 -739 717 -397 432 184
8067 184 -14 577 911 34 705 -362 248 -180 106 269 -126 548 644 -119 46 332 383 731 890 -19
8087 -19 -963 -252 -143 550 -591 -487 -1235 -455 -1457 817 694 757 25 -1079 337 -871 122 481 -1387
8106 -1387 -181 50 110 -219 319 882 114 951 -93 943 -139 -1090 204 279 335 -118 -332 225 738
8125 738 -1088 -435 -262 -321 595 -695 108 -432 736 50 -250 -630 1144 -82 499 1064 -764 237
8143 237 88 229 330 -155 74 -286 10 614 -202 279 828 128 19 -177 317 420 658 -827 1563
8162A563k419Q68m40M45o41N71P35Rp98L40k91O07m20K7j063J091r63J149m02
8181c2R1N92j92o12N98o79Q45l33o00K74
$$ plain form
8162 1563 -856 12 -428 17 -624 -53 682 691 -107 233 -58 549 129 156 -907 184 -779 370 -32
8181 -32 59 651 459 -153 445 -234 611 278 -322 -48
8191d8
$$ Imaginary data points
##PAGE= N=2
##DATA TABLE= (X++(I..I)), XYDATA
0@%%%%%%%j08K16k16L24m32N03o11P56r66J093j215J495j811K114k444K817l254
24a739L776m339M924n619O378p203Q129r142J0259j1484J2814j4281J5902j7667
38i292J9597k1731K4075k6655K9504l2660L6193m0134M4559m9596N5369o2051
50c2822O9890p9253R0666j04928J23345j48171J83612k38588L35971n58152J906496
61A548066J07632m099907K367691J794539j794982q94625Q88524J50585N62527
70F30050p01762j051918J369886J071228k006114l39902J934832k54499j571363
79i19562O96089R00867o96435m55594N44445J40092k54236j10382R6851K10219
89A52354M781m28175Q6445O25261k39457p61139M60542Q17192o18946q50094P56084
$$ plain form
0 0 0 0 0 0 0 0 0 -108 108 -108 216 -216 287 -324 432 -534 559 -656 839 -972 1142 -1302 1515 -1739
24 -1739 2037 -2302 2622 -2997 3381 -3822 4307 -4835 5424 -6060 6754 -7527 8375 -9292
38 -9292 10305 -11426 12649 -14006 15498 -17162 19031 -21103 23456 -26140 29229 -32822
50 -32822 37068 -42185 48481 -56447 66898 -81273 102339 -136249 199722 -358430 1548066
61 1548066 1655698 -2444209 -76518 1718021 -76961 -971586 -83062 67523 630050
70 630050 -71712 -1123630 246256 1317484 -688630 -1028532 906300 651801 -919562
79 -919562 -223473 677394 -19041 -474635 69810 209902 -44334 -154716 -57865 152354
89 152354 157135 -271040 -184595 440666 201209 -559930 -99388 717804 98858 -751236 4848
100D848Q21365r01397p48549R64916N17807q58556k41831N20753J31677M743l18112
111a02336m24746P59130M57818j243580j13460J360342m28072r80724P98226L10722
121C93320o53028L51665J23373n81278M92870L16794q40264J67684P07633n64484
131h5715k32566O56218k84069m08342O41408O418p32594L28848N54401n10837
141f6830l00446M40622O9713j81376M4684j30501J5291M03932j89206n53586L78701
152f9002N35868n06494m04092N20506K64308l86380j30297K06224O4478l933o0145
163C1041k18995R5519M02764k18205m89108M04345M22306n26170j69998M51143
173A84642j44869j76343K89409k57382k14954N95433o4161o58075L97517M65811
$$ plain form
100 4848 826213 -75184 -823733 141183 658990 -199566 -441397 79356 211033 215776 -102336
111 -102336 -527082 232048 689866 -553714 -667174 693168 265096 -715628 82598 393320
121 393320 -259708 91957 215330 -365948 126922 443716 -396548 -228864 478769 -85715
131 -85715 -318281 337937 53868 -354474 286934 293352 -439242 -110394 444007 -66830
141 -66830 -367276 73346 143059 -38317 6367 -124134 -108843 295089 105883 -447703 -69002
152 -69002 466866 -39628 -443720 76786 341094 -45286 -175583 30641 95119 91186 31041
163 31041 -187954 -92435 310329 92124 -396984 7361 429667 -96503 -266501 184642
173 184642 39773 -136570 152839 -104543 -319497 275936 211775 -446300 -48783 417028
183D17028n11724r8367L51458k14332q037K89221l84252j50916O19020p5909o08368
194c75178K94652M62911l56330k14312K60018k9565o2855J53629k22236j61981
204b51247M61848M3633n71687J38646N16549k71575l36656K68681Q3119j43821
214f2510J14946q2002j92495L38855J63618m93163k2642N23253j31436m14721
224b58297K19147J85142k00589Q2901N1622k69845K19426L22449m76149j89560
234c13753N80514o2581m93408K30351K06223k37865J14550O2580k99395K22497
244I713L17188m52755j84217N11665j7343m22872J33219K04911j22036L8477L1936
255D7886j86681J46982K68109k99573k55607L90646J52056m13854k8513L08596
$$ plain form
183 417028 -94696 -193063 158395 -55937 -63974 225247 -159005 -309921 309099 233190 -375178
194 -375178 -80526 382385 26055 -188257 71761 42196 -20659 132970 -89266 -251247
204 -251247 210601 254234 -317453 -178807 337742 66167 -270489 -1808 81311 -62510
214 -62510 52436 -29566 -222061 116794 280412 -212751 -235393 287860 156424 -258297
224 -258297 -39150 145992 -54597 28304 79926 -189919 29507 351956 -124193 -313753
234 -313753 266761 204180 -289228 -58877 147346 -90519 24031 86611 -212784 9713
244 9713 326901 -125854 -310071 201594 184251 -238621 -105402 99509 -22527 15950 47886
255 47886 -138795 8187 276296 -23277 -278884 111762 263818 -150036 -178549 130047
265A30047o9921j01137R4898j20239j687K92505j70220l61170L24613K80092m21205
276a23424j19458L73707n0745j80041J47459q2869j00202L17406p8156m29180
286c25503K93975L66374m25001j55520M15245n8465k03648J86600j00055j50043
296a56041L49384n8707m58032K78311L64516l88487j47257L41685l2017j40859
306d7504J07377j06916p5894K68111o2908l43006J77678L05664k22111j94043
316a93552K10111J06847j15145k8883m647k4084J22512K8939k44892O857L33348
327A97411p4226l26800J61973K42267j88459r4580J13779o6460L2602J46398k31565
338h7660j20672L93505o34m30459J58038L07835k48430r3396J78522j29421K0379
$$ plain form
265 130047 60126 -41011 53887 -66352 -68039 224466 54246 -306924 17689 297781 -123424
276 -123424 -242882 130825 80080 -99961 47498 -35371 -135573 181833 103677 -325503
286 -325503 -31528 334846 -90155 -245675 169570 111105 -92543 94057 -5998 -156041
296 -156041 193343 134636 -323396 -45085 319431 -69056 -216313 125372 93355 -47504
306 -47504 59873 -47043 -122937 145174 82266 -260740 -83062 222602 491 -193552
316 -193552 16559 123406 8261 -20622 -25269 -49353 73159 102098 -142794 -135937 197411
327 197411 123185 -203615 -41642 200625 12166 -82414 31365 -35095 -2493 143905 -87660
338 -87660 -208332 185173 184539 -245920 -87882 219953 -28477 -121873 56649 -72772 -52393
349e2393K35115k58103j68169M41442M495m46714J74648K84453k48886m7788J50674
360F8774j51536O7241K18149k71493j27187L88831j4982l60751J13571K09403
370A40020j41746o0389N0348o1608P8650J17602j81417r3157K52105N5435k56196
381a00353k8012K07001l77j50738M911O5792J3324M8159m5236j31206J32619J81308
393A97192k25312j59961K72131P0013k49631K8180J33006p7326M5977M0178k10610
404a36163Q5619K72578k49553k19128L29066P0927k80794P5543J21682j19167
414d9390R3269M7138k53320R9405K81606k54114j98602L13011N5768k27248P1926
425b0551P3949p9038J07778J684k20058J02864K19459k01518j64918K12712Q1900
$$ plain form
349 -52393 182722 -75381 -243550 197892 202387 -244327 -69679 214774 -34112 -81900 68774
360 68774 -82762 -15521 202628 -68865 -196052 192779 177797 -182954 -69383 140020
370 140020 -1726 -62115 -11767 -73375 5275 122877 -58540 -151697 100408 155843 -100353
381 -100353 -128365 78636 78259 -72479 -67568 -1776 11548 59707 14471 -116735 15884 197192
393 197192 -28120 -188081 84050 154063 -95568 -67388 65618 -11708 34269 74447 -136163
404 -136163 -50544 222034 -27519 -246647 82419 153346 -127448 -51905 69777 -49390
414 -49390 43879 91017 -162303 -62898 218708 -35406 -234008 79003 134771 -92477 -20551
425 -20551 53398 -25640 82138 83822 -136236 -33372 186087 -15431 -180349 32363 114263
436A14263j51624j2214N7925m43M6265k2307j31353M8617J65268r1225j78268
447a55096J12848J67774j13606j10251R9353M8732l6086Q904o3599l5309J64766
458H8430M902k28352O4799K37355j20745j62101J35660M5247q0668M8037n3221
469b0657q7730J82994M1785k61162N4838K53384j27009j60669J32988L0670o7899
480b8467N9213o2981q5326J87893M6221k40888M3177K27869r5146j43714Q8260
491c889L8514l4297K7398n7417n1489J42906M8147j82663o594J89939k9166j55159
503g3770L1574P8840k6565j5371k4785m0075Q7146P6754j40856o6019J83890L0569
515A01332j80578R935J19812l5794k9614J5850n2271N5135J07568j26092j02297
$$ plain form
436 114263 -37361 -49575 8350 7907 54172 31865 -99488 -50871 114397 23172 -155096
447 -155096 -42248 125526 11920 -98331 1022 49754 13668 22572 -41027 -76336 88430
458 88430 93332 -135020 -70221 167134 46389 -115712 19948 65195 -15473 32564 -20657
469 -20657 -108387 74607 116392 -144770 -89932 163452 36443 -124226 8762 39432 -28467
480 -28467 30746 -32235 -117561 70332 116553 -124335 -81158 146711 51565 -92149 -3889
491 -3889 34625 328 27726 -29691 -81180 61726 109873 -72790 -79384 110555 81389 -73770
503 -73770 -42196 36644 10079 -5292 -30077 -70152 16994 93748 -47108 -113127 70763 101332
515 101332 -79246 -69311 50501 14707 -14907 943 -51328 3807 111375 -14717 -117014
526a17014J79287N6487j86488k501J25443l0091l2794J7375n4353M5710J04761
537A05822j17345j07093J54786O2229j57968k4287J07560M169l1500m170l3313
548d1110M3013Q4246q9026j01809J12154Q3685j19641o0671J02522M2340n0830
559D873j4537L095J3134O1141l4354j16708O1900J23684j02593j06140J12718
570F213N9905p9220n078J7139j7115O3727n051j35992M9385J47976j03383j07823
582a09317J17701M8199p0975J1071n156k0012Q5591r571j35982N6526J35595q9257
594A4413r2988R1642M1202m6521n768k4806j030P2652k2105j01522M1234J02596
606F8999m2943q3286L6747O6130j3050n5499k0769L6954L3428k6050n1181R187
$$ plain form
526 -117014 62273 118760 -67728 -70229 55214 25123 -7671 9704 -44649 1061 105822
537 105822 -11523 -118616 36170 98399 -59569 -83856 23704 27873 -3627 -7797 -41110
548 -41110 1903 86149 -2877 -104686 7468 91153 -28488 -89159 13363 55703 4873
559 4873 -9664 -6569 6565 67706 33352 -83356 -21456 102228 -365 -106505 6213
570 6213 66118 -13102 -18180 -1041 -18156 45571 40520 -95472 -46087 101889 -1494 -109317
582 -109317 8384 56583 -14392 -3321 -8477 -28489 57102 47531 -88451 -31925 103670 14413
594 14413 -78575 13067 54269 7748 1980 -22826 -23856 48796 26691 -74831 -33597 68999
606 68999 26056 -57230 -20483 45647 32597 -22902 -43671 -6717 26711 661 -50520 -41333
618d1333P8363J7382q9832j1238J08548l833r1862J1989L8916r558J3088l6868
630a6238m8017R5955M9891j32096r756J33620l3405q6796M4057N739j6949N3861
642C9866n3176o9844J19622L8798j41051J0459J10244m1035m8805K8371j1741
653a8292K1203N0300p1542l9942J15115J1032j11216J2609O6579j7890k2523j7338
665b1905p988N6597J7977p4926n151P3983M029n8151k2938L4126L6535l0982n7789
678e6583L3586N8847k8143l1939J3138J4480L2837j7702p2978L7801Q2011o7809
690b454n7096P2075K1859l2712P931k2129k206P2088l5680r4728P0258O8294q5013
703a9513k2248N8986j2607L598J5791o3709J2665Q8189n8545q0027P7543M5060
$$ plain form
618 -41333 37030 54412 -35420 -46658 61890 58057 -33805 -21816 17100 7542 20630 -16238
630 -16238 -64255 31700 81591 -50505 -60261 73359 39954 -46842 -2785 2954 -13995 39866
642 39866 -13310 -83154 36468 75266 -65785 -55326 54918 13883 -34922 -6551 -18292
653 -18292 2911 53211 -18331 -58273 56842 67874 -43342 -30733 35846 17956 -4567 -21905
665 -21905 -29893 26704 44681 -30245 -35396 38587 42616 -15535 -38473 -4347 32188 1206 -56583
678 -56583 -22997 35850 7707 -24232 -11094 3386 36223 18521 -54457 -16656 65355 -2454
690 -2454 -59550 12525 34384 1672 9603 -12526 -14732 57356 21676 -73052 -2794 65500 -19513
703 -19513 -41761 17225 4618 8216 24007 -39702 -27037 61152 2607 -77420 123 45183
715D5183o4917n225K9337n791K4907k945o0429K9893O5505n5847m7556N4146K4264
728C0525k1364j3828j0244K8197L0579m8366l6910M6169K4343l6725k3163J2914
740a7873L2791J4234m4935j9684N8422J0825n3251o108J9904J1845Q845l9356
752b4341j7152P1668J2436p1001R795N4519j7841k4099L352j3148K4565K6107
764C4860n7755j5734P5304k880o4943J6592L6597j6603q878j0639j1899L8276
776A2298J7140n9877k797O6882r971m8284R540J9142K560J910k9503p186N2099
789B3953M820m9859N807M1406n59k5766j4996J1885K5004j2997l3103J0671L2926
802A9192l023k4721n937J9604J9716k5675l2864K6463K7344k5983j8270J4906
$$ plain form
715 45183 -19734 -24959 4378 -1413 23494 20549 -39880 -9987 55518 -329 -47885 6261 30525
728 30525 9161 -4667 -14911 13286 43865 -4501 -41411 4758 29101 -7624 -30787 -17873
740 -17873 14918 29152 -15783 -35467 22955 33780 -19471 -25579 -5675 6170 15015 -24341
752 -24341 -41493 30175 42611 -28390 -18595 35924 18083 -6016 -2664 -15812 8753 34860
764 34860 -22895 -38629 36675 33795 -31148 -14556 22041 5438 -3440 -14079 -25978 12298
776 12298 29438 -30439 -33236 33646 23675 -24609 -15069 4073 6633 8543 -20960 -28146 23953
789 23953 28773 -21086 -15279 26127 25568 -198 -15194 -3309 21695 8698 -24405 -13734 19192
802 19192 16169 -8552 -14489 5115 24831 -844 -33708 -7245 20099 -5884 -24154 -9248
814i248J7363Q926j8983k0832K8792K7087l4441k8021K9083J9402j5552j5699
826a2123J534J9944J7687k2789k6368K7135K4657k8837k6386K0081K0513r561
838E487j8480J18J8417J0070j6993k0282J5597K1943j5823k4230J3210K5657l696
851A0995k3915K610K2071O099j9119j3485R207K2717o965l1271J0004L4260o777
864A6431k2950M746R975N769o409k6005J259L3298r409l4764J6155K7718j2101
877C713r586K38J843J8636o948l2719J4640K7763j7561j7784J4566J2887K343
890A2031q588j3842J1760K1585j9601k1948K0012J3360j0505p750l657R702J7146
903A9705j9141k4630K4255J6372k4633q399J1298O122O743n743k0069J8846K2774
$$ plain form
814 -9248 8115 17041 -1942 -22774 6018 33105 -1336 -29357 -274 19128 3576 -12123
826 -12123 -10589 9355 27042 4253 -22115 5020 29677 840 -25546 -5465 15048 5487
838 5487 -12993 -12875 5542 15612 -1381 -21663 -6066 15877 54 -24176 -10966 14691 10995
851 10995 -12920 -10310 11761 17860 -1259 -14744 -5537 17180 10215 -21056 -11052 23208 16431
864 16431 -6519 -1773 8202 13971 7562 -18443 -17184 16114 6705 -28059 -11904 15814 3713
877 3713 -5873 -5635 -3792 14844 7896 -24823 -10183 17580 19 -17765 -3199 9688 12031
890 12031 3443 -10399 1361 22946 3345 -18603 1409 14769 4264 -3486 -7143 2559 19705
903 19705 564 -24066 189 16561 -8072 -16471 -5173 949 7692 1949 -18120 726 23500
916B3500k9331j5723K7686N35j5579Q080m226L182K5108j9758k1797L3379R104
929B4160l4747K306J4955r175P107l993j9724K4479J8640l5531n557L4011j0669
942F262j6225Q396j1071Q326J8655k5758j1418L7789O83k9264J1226R894p400
955I5O349p951j2072K4162P759l1460N947K6536j6637p915R921j1885P852J2463
969A3164k6646k999L4601j1025k4521J9072O785j3128R017r746j3673K7071J734
982I706l5135J9933K3227k1055M05J1687j3449J1464R463l1014M995K9322j9019
995E30j6578K2363q34q246J2700j1448q486K6248r675k8226K0684J3487k2718
1008a0199M546Q605j0836J3606J447k3923J2220K1599k3156r925K1559l309n399
$$ plain form
916 23500 -5831 -21554 6132 6667 -8912 -832 -5058 -1876 23232 3474 -18323 15056 24160
929 24160 -10587 -8281 6674 -2501 4606 613 -19111 5368 24008 -11523 -17080 16931 6262
942 6262 -9963 -1567 -12638 -4312 14343 -11415 -22833 14956 15639 -13625 -2399 7495 95
955 95 6444 -1507 -13579 10583 18342 -13118 -7171 19365 2728 -5187 4734 -7151 701 13164
969 13164 -13482 -16481 18120 7095 -17426 1646 8431 -4697 4320 -5426 -19099 7972 9706
982 9706 -25429 -5496 17731 -3324 -2919 8768 -4681 6783 16246 -14768 -9773 19549 530
995 530 -16048 6315 5481 -2765 9935 -1513 -9999 16249 6574 -21652 -968 12519 -10199
1008 -10199 -5653 2952 -7884 5722 7169 -16754 -4534 17065 -6091 -16016 5543 2234 -3165
1021c165R768q875n68K2320j4763k0322K1706N545j9142M841O485r002J1605R68
1035G401j9634J4202J4508k3983m226J8623q949n438J0142j1142J823K0859j7182
1048b996j1264K3974j817j7807J0720r2o742J1768m201j1966J8022P512j9488
1061d377K526J1166r294k632M439j0217P073J1017j6034l240J8867n302j0915
1074f923Q160k379j975N983p993p070J6142J819j5452O735J0338q673J898K373
1088B983o948P051N728j4762J983J4338o733p519P502k80k291L856p710m286J1108
1103D020k455j1120Q004O797o121L77R52m401O873o4j1962L578Q370l429n481
1118f062M184K852L023r89l703J944N325l224p070K387M115j971k109O25K883
$$ plain form
1021 -3165 6603 -2272 -2840 19480 4717 -15605 6101 11646 -7496 -2655 3830 -5172 6433 7401
1035 7401 -12233 1969 16477 -7506 -11732 6891 -2058 -7496 2646 -8496 -6673 14186 -2996
1048 -2996 -14260 9714 7897 -9910 810 718 -6024 5744 1543 -10423 7599 15111 -4377
1061 -4377 -1851 9315 21 -2611 1828 -8389 -1316 9701 -6333 -9573 9294 3992 -6923
1074 -6923 1237 -1142 -3117 2866 -5127 -12197 3945 5764 -9688 -2953 7385 -1288 610 2983
1088 2983 -3965 3086 8814 -5948 -3965 10373 3640 -3879 3623 3343 1052 4908 -2802 -7088 4020
1103 4020 1565 -9555 -1551 5246 -875 -498 454 -3947 2926 2862 -9100 -5522 2848 -581 -6062
1118 -6062 -1878 974 3997 3008 -695 1249 6574 3350 -3720 -1333 2782 811 -1298 -673 2210
1133B210K314l421l474K920J956k798l302r05N253Q26n419J802K887R4j732l051
1149c840K049K175Q63m038L1O509P03l521l33M139j271p00k451l649O335p68p221
1166d988L925M026o97j158k63j533J495J590q168P48O429m039l917P400k03j94
1182D53L852n845o13Q945n042p422Q850j368n126N187p3m740P869Q71j0408M958
1198C48P430j0175m09O484o102J006O483q944N08J0164q642o466Q833n15n391
1213e388N814k61m786Q326J059r715P034O254j2307J732Q575j0357L570O260r019
1228c209K107R687q033m275J0511m923o930P870k777o882J0953l046j1181J2975
1242B847L338j4550P957N206j2205O246O363j2937P023Q296j1207O10J1188p977
$$ plain form
1133 2210 4524 1103 -2371 549 2505 -293 -3595 -4500 753 1579 -3840 -2038 849 943 -789 -3840
1149 -3840 -1791 384 1247 -2791 -2760 3749 4452 931 598 4737 3466 2766 315 -3334 3001 2233 -4988
1166 -4988 -1063 2963 2266 1108 845 -688 807 2397 -5771 -5023 1406 -2633 -6550 850 647 453
1182 453 4305 -1540 -2153 6792 1750 -5672 3178 1810 -3316 1871 1798 -2942 4927 5798 -4610 348
1198 348 7778 -2397 -2806 3678 -2424 -1418 5065 -3879 -3371 6793 -1849 -8315 518 3 -5388
1213 -5388 426 165 -4621 3705 4764 -4951 2083 8337 -3970 -2238 6337 -4020 -450 5810 -3209
1228 -3209 -1102 8585 552 -3723 6788 1865 -5065 2805 28 -6854 4099 1053 -10128 2847
1242 2847 6185 -8365 -408 4798 -7407 -1161 5202 -7735 -712 7584 -3623 -3013 8175 198
1256A98l989J0818p465m341J1414o368o888J3579k266j1311J2019Nj1682R341
1270C064J783j2902P059O436j3213K244J2447j0805j024J1032p676l878J1845
1283F412p033o775J3952n630q746J3101j700j0930J1112J173j1050R171M707j3391
1297e627N191Q861j1746J74J0315j0787P79J0921j1651k226J2318q202n639J2073
$$ plain form
1256 198 -3791 7027 -438 -4779 6635 267 -6621 6958 4692 -6619 5400 5405 -6277 3064
1270 3064 4847 -8055 -996 5440 -7773 -5529 6918 -3887 -4911 6121 -1555 -5433 6412
1283 6412 -621 -7396 6556 926 -7820 5281 3581 -7349 3763 4936 -6114 3057 7764 -5627
1297 -5627 -436 8425 -3321 -3147 7168 -3619 -2840 8081 -3570 -5796 6522 -1680 -7319 4754
$$ [...]
8191e20
##END NTUPLES=NMR FID
##END=
