##TITLE=1H_UK-7''
 THF, 108 sc, 
 3.7.2020
##JCAMPDX= 6.0         $$ Bruker NMR JCAMP-DX V2.0
##DATA TYPE= NMR FID
##DATA CLASS= NTUPLES
##ORIGIN= UXNMR, Bruker Analytische Messtechnik GmbH
##OWNER= root
$$ XWIN-NMR		Version 3.5
$$ Mon Aug  3 11:35:44 2020 Russian Standard Time (UT+4h)  she@DPX200
##.OBSERVE FREQUENCY= 200.1314999998
##.OBSERVE NUCLEUS= ^1H
##.DELAY= (6, 6)
##.ACQUISITION MODE= SIMULTANEOUS
##.ACQUISITION SCHEME= undefined
##.AVERAGES= 108
##.DIGITISER RES= 18
##SPECTROMETER/DATA SYSTEM= spect
##.PULSE SEQUENCE= zg30
##.SOLVENT NAME= THF
##.SHIFT REFERENCE= (INTERNAL, THF, 0, 15.7039)
##AUDIT TRAIL= $$ (NUMBER, WHEN, WHO, WHERE, WHAT)
$$ ##TITLE= Audit trail, XWIN-NMR		Version 3.5
$$ ##JCAMPDX= 5.01
$$ ##ORIGIN= Bruker BioSpin GmbH
$$ ##OWNER= she
$$ F:/spectra/data/she/nmr/H-F/1/audita.txt
$$ ##AUDIT TRAIL=  $$ (NUMBER, WHEN, WHO, WHERE, WHAT)
(   1,<2020-08-03 11:31:49.35 +0400>,<she>,<DPX200>,
      <continue with go, POWCHK disabled, PULCHK disabled
       configuration hash MD5:
       00 E9 B6 7A A2 85 ED C7 34 08 36 98 17 FE 4E 26
       data hash MD5: 16K
       95 C6 4B 54 6A 8A 83 8F BF 57 4D B8 50 0A 0E B8>)
$$ ##END=
$$ 
$$ hash MD5
$$ E6 86 A8 2E 5D 6D 5E C1 D7 BC 59 C5 CE 12 5C 24
##$RELAX= 
##$RELAX= 
##$RELAX= 
##$RELAX= 
##$RELAX= 
##$RELAX= 
$$ Bruker specific parameters
$$ --------------------------
##$DU= <F:/spectra>
##$EXPNO= 1
##$NAME= <H-F>
##$PROCNO= 1
##$TYPE= <nmr>
##$USER= <she>
##$AMP= (0..31)
100 100 100 100 100 100 100 100 100 100 100 100 100 100 100 100 100 100 
100 100 100 100 100 100 100 100 100 100 100 100 100 100 
##$AQSEQ= 0
##$AQ_mod= 1
##$AUNM= <au_zg>
##$AUTOPOS= <>
##$BF1= 200.13
##$BF2= 200.13
##$BF3= 200.13
##$BF4= 200.13
##$BF5= 200.13
##$BF6= 200.13
##$BF7= 200.13
##$BF8= 200.13
##$BYTORDA= 1
##$CFDGTYP= 0
##$CFRGTYP= 5
##$CHEMSTR= <none>
##$CNST= (0..31)
1 1 145 1 1 1 1 1 1 1 1 1 1 1 1 1 1 1 1 1 1 1 1 1 1 1 1 1 1 1 1 1 
##$CPDPRG= <>
##$CPDPRG1= <>
##$CPDPRG2= <>
##$CPDPRG3= <>
##$CPDPRG4= <mlev>
##$CPDPRG5= <mlev>
##$CPDPRG6= <mlev>
##$CPDPRG7= <mlev>
##$CPDPRG8= <mlev>
##$CPDPRGB= <>
##$CPDPRGT= <>
##$D= (0..31)
0 1.2 0 0 0 0 0 0 0 0.06 0 0.03 0 0 0 0 0.0002 0 0 0 0 0 0 0 0 0 0 0 0 
0 0 0 
##$DATE= 1596439556
##$DBL= (0..7)
120 120 120 120 120 120 120 120 
##$DBP= (0..7)
150 150 150 150 150 150 150 150 
##$DBP07= 0
##$DBPNAM0= <>
##$DBPNAM1= <>
##$DBPNAM2= <>
##$DBPNAM3= <>
##$DBPNAM4= <>
##$DBPNAM5= <>
##$DBPNAM6= <>
##$DBPNAM7= <>
##$DBPOAL= (0..7)
0.5 0.5 0.5 0.5 0.5 0.5 0.5 0.5 
##$DBPOFFS= (0..7)
0 0 0 0 0 0 0 0 
##$DE= 6
##$DECBNUC= <off>
##$DECIM= 24
##$DECNUC= <off>
##$DECSTAT= 4
##$DIGMOD= 1
##$DIGTYP= 9
##$DL= (0..7)
0 120 120 120 120 120 120 120 
##$DP= (0..7)
150 150 150 150 150 150 150 150 
##$DP07= 0
##$DPNAME0= <>
##$DPNAME1= <>
##$DPNAME2= <>
##$DPNAME3= <>
##$DPNAME4= <>
##$DPNAME5= <>
##$DPNAME6= <>
##$DPNAME7= <>
##$DPOAL= (0..7)
0.5 0.5 0.5 0.5 0.5 0.5 0.5 0.5 
##$DPOFFS= (0..7)
0 0 0 0 0 0 0 0 
##$DQDMODE= 0
##$DR= 18
##$DS= 0
##$DSLIST= <SSSSSSSSSSSSSSS>
$$ [...]
##$SUBNAM2= <"">
##$SUBNAM3= <"">
##$SUBNAM4= <"">
##$SUBNAM5= <"">
##$SUBNAM6= <"">
##$SUBNAM7= <"">
##$SUBNAM8= <"">
##$SUBNAM9= <"">
##$SW= 24.9337058888022
##$SWIBOX= (0..15)
0 0 2 0 0 0 0 0 0 0 0 0 0 0 0 0 
##$SW_h= 4990.01996007984
##$TD= 16384
##$TD0= 1
##$TE= 0
##$TE2= 300
##$TE3= 300
##$TEG= 300
##$TL= (0..7)
0 120 120 120 120 120 120 120 
##$TP= (0..7)
150 150 150 150 150 150 150 150 
##$TP07= 0
##$TPNAME0= <>
##$TPNAME1= <>
##$TPNAME2= <>
##$TPNAME3= <>
##$TPNAME4= <>
##$TPNAME5= <>
##$TPNAME6= <>
##$TPNAME7= <>
##$TPOAL= (0..7)
0.5 0.5 0.5 0.5 0.5 0.5 0.5 0.5 
##$TPOFFS= (0..7)
0 0 0 0 0 0 0 0 
##$TUNHIN= 0
##$TUNHOUT= 0
##$TUNXOUT= 0
##$USERA1= <user>
##$USERA2= <user>
##$USERA3= <user>
##$USERA4= <user>
##$USERA5= <user>
##$V9= 5
##$VALIST= <valist>
##$VCLIST= <CCCCCCCCCCCCCCC>
##$VD= 0
##$VDLIST= <DDDDDDDDDDDDDDD>
##$VPLIST= <PPPPPPPPPPPPPPP>
##$VTLIST= <TTTTTTTTTTTTTTT>
##$WBST= 1024
##$WBSW= 4
##$XGAIN= (0..3)
0 0 0 0 
##$XL= 0
##$YL= 0
##$YMAX_a= 2502306
##$YMIN_a= -2732412
##$ZGOPTNS= <>
##$ZL1= 120
##$ZL2= 120
##$ZL3= 120
##$ZL4= 120
##$ABSF1= 10
##$ABSF2= 0
##$ABSG= 5
##$ABSL= 3
##$ALPHA= 0
##$AQORDER= 0
##$ASSFAC= 0
##$ASSFACI= 0
##$ASSFACX= 0
##$ASSWID= 0
##$AUNMP= <proc_1d>
##$AZFE= 0.1
##$AZFW= 0.1
##$BCFW= 1
##$BC_mod= 2
##$BYTORDP= 1
##$COROFFS= 0
##$CY= 11.3945322036743
##$DATMOD= 1
##$DC= 2
##$DFILT= <>
##$DTYPP= 0
##$F1P= 16.9975609425685
##$F2P= -3.02152046262296
##$FCOR= 0.5
##$FTSIZE= 0
##$FT_mod= 4
##$GAMMA= 1
##$GB= 0.15
##$INTBC= 1
##$INTSCL= 1
##$ISEN= 128
##$LB= 0.24
##$LEV0= 0
##$LPBIN= 0
##$MAXI= 10000
##$MC2= 0
##$MEAN= 0
##$ME_mod= 0
##$MI= 1.114404
##$NCOEF= 0
##$NC_proc= 0
##$NLEV= 6
##$NOISF1= 3.799351
##$NOISF2= 2.8
##$NSP= 1
##$NTH_PI= 0
##$NZP= 0
##$OFFSET= 15.70392
##$PC= 1
##$PHC0= -9790.732
##$PHC1= 8.80093
##$PH_mod= 1
##$PKNL= yes
##$PPARMOD= 0
##$PSCAL= 0
##$PSIGN= 0
##$REVERSE= no
##$SF= 200.130013532006
##$SI= 16384
##$SIGF1= 3
##$SIGF2= 2
##$SINO= 400
##$SIOLD= 16384
##$SREGLST= <1H.CDCl3>
##$SSB= 0
##$STSI= 0
##$STSR= 0
##$SW_p= 3612.71676300578
##$SYMM= 0
##$S_DEV= 0
##$TDeff= 0
##$TDoff= 0
##$TI= <>
##$TILT= no
##$TM1= 0
##$TM2= 0
##$TOPLEV= 0
##$USERP1= <user>
##$USERP2= <user>
##$USERP3= <user>
##$USERP4= <user>
##$USERP5= <user>
##$WDW= 1
##$XDIM= 8192
##$YMAX_p= 0
##$YMIN_p= 0
$$ End of Bruker specific parameters
$$ ---------------------------------
##NTUPLES= NMR FID
##VAR_NAME=  TIME,          FID/REAL,        FID/IMAG
##SYMBOL=    X,             R,               I
##VAR_TYPE=  INDEPENDENT,   DEPENDENT,       DEPENDENT
##VAR_FORM=  AFFN,          ASDF,            ASDF
##VAR_DIM=   8192,          8192,            8192
##UNITS=     SECONDS,       ARBITRARY UNITS, ARBITRARY UNITS
##FACTOR=    0.0002004,     1,               1
##FIRST=     0,             0,               0
##LAST=      1.6414764,     0,               0
##MIN=       0,             -2732412,        0
##MAX=       1.6414764,     2502306,         0
$$ Real data points
##PAGE= N=1
##DATA TABLE= (X++(R..R)), XYDATA
0@%%%%%%%%%J08k16K16k16L18m26M32n40O73p81R64j154J344j550J791k060K365
26A268k714L100l540M017m533N103n747O461p219Q055q993J0017j1118J2332j3688
41g199J5167j6789J8583k0577K2791k5256K8034l1192L4795l8957M3838m9643
53b6405N6673o5388P6564r1443J12227j43422J95673m26181K814008j458670l526237
64b482601K389170J667697j137516q86046j82665O83399J346158j604916j619439
73a826759K260374J292098k549530n00078K219826P3704j628635N7570R56231
82C54801J59641o25282m69733M72905P57162n60799q63523P14142Q48388q98792
92a11090o95991R84849N28808j002190l61488J007765K88810r91377j63470R57331
$$ y = [0, 0, 0, 0, 0, 0, 0, 0, 0, 0, 108, -108, 108, -108, 210, -216, 216, -324, 349, -432, 532, -622, 722, -828, 963, -1097, 1268, -1446, 1654, -1886, 2131, -2402, 2701, -3046, 3415, -3804, 4251, -4742, 5275, -5843, 6489, -7199, 7968, -8821, 9762, -10815, 11976, -13280, 14754, -16438, 18357, -20600, 23238, -26405, 30268, -35120, 41444, -49999, 62228, -81194, 114479, -311702, 2502306, 1043636, -2482601, -93431, 1574266, 436750, -449296, -631961, 51438, 1397596, -207320, -1826759, 433615, 1725713, -823817, -1323895, 895931, 969635, -659000, -601430, 354801, 514442, -110840, -580573, -107668, 649494, 88695, -774828, -60686, 787702, -111090, -807081, 177768, 706576, -295614, -657102, 350663, 639473, -351904, -515374, 441957]
102D41957M0253q17491k4410N06773K05154k48474o35510K40393J153648n40788
112C21505j382323J031744J173634j359785o68782J160336J18697n55835k79j97149
122c58237M05059O83350j025880n94087J529837J32187j564186L48662J126172
131F82877n66104n22527L96595N7225M7253J48707m56430l6660P03914k27325
141B27525p10399M44002M64628n59074j51126M92537j23997k87029K78467O0932
151A36466k81385Q8932J46285j38507j2281M9214q7013J13635J51792k55391j44604
162b32857M15558J30888n70413p3567O73460p2111o63878K36060M91369k47708
172H6801j63843O9677q6184L03821J01218p22670Q7239Q83011m28689p62276O40911
$$ y = [441957, 482210, -335281, -359691, 147082, 352236, 103762, -531748, -291355, 862293, 321505, -1060818, -29074, 1144560, -215225, -884007, 276329, 395026, -160809, -161088, -358237, 46822, 730172, -295708, -889795, 640042, 772229, -791957, -443295, 682877, 116773, -405754, -9159, 48066, 95319, 244026, -212404, -249064, 454850, 227525, -482874, -38872, 425756, -133318, -284444, 208093, 84096, -202933, 75534, 136466, -144919, -55987, 90298, -48209, -60490, -11276, -98289, 15346, 167138, -88253, -232857, 182701, 313589, -256824, -330391, 343069, 270958, -392920, -156860, 334509, 86801, -77042, -7365, -93549, 210272, 311490, -411180, -323941, 559070, 130381, -631895, 9016]
183I016M24764n45991l9293K14006j25186K09421J3739n41448K18726N94366m65439
194c3319m42656N77300K20654m69404L5384K63664j62736J7710J52581k82048
204a22870l9913M13098j43369l79453K91767K23140l05222l577J81072j93239
214g8566J5779K52532k60290k22749M18951J08421m48173M1464L64792j24980
224F7181j77695J13707o2177n554K57009k12571l27020M74890K60866o06551l3108
235b51023N66091j71394l29800K06590j3061o9139K41934k10282k82753M85928
245A73091J71684n85150L5432M99985j95359k97021J72907K7206o5449J39820
255G7146j19078j92471L11011J82741l96661p5322M06643m2094l17667J14160
$$ y = [9016, 433780, -112211, -151504, 62502, -62684, 146737, 160476, -380972, -162246, 432120, -33319, -475975, 101325, 321979, -147425, -112041, 151623, -11113, 6597, 159178, -122870, -162783, 250315, 106946, -272507, 19260, 242400, -62822, -66399, 114673, -78566, -62787, 189745, -70545, -293294, 125657, 234078, -214095, -172631, 192161, 67181, -110514, 3193, -58984, -64538, 192471, -20100, -347120, 127770, 388636, -217915, -251023, 315068, 143674, -186126, 20464, 7403, -61736, 180198, -30084, -312837, 173091, 344775, -240375, -204943, 295042, 99683, -197338, -24431, 2775, -62674, 77146, -41932, -234403, 76608, 259349, -137312, -212634, 194009, 151915, -165752, -51592]
265e1592J23150j24231R3888L9500k48625J45539L11310k98580k43701L79544
275A26202Q4222l44826N8161J64525j41794Q2290R7932l03809O7438M08517k83439
286A5419l67356M10503J74171m04213M0879K27869j55273P8369J38977l32774
296a73429N7305M48225l00394l81618M25257J62511l81475M4395J87927j08853
306b0149Q9363O2533k68771Q3521L20539k41411k88657K79256J55847k47015n4859
317a29803J42078R090N624J5013j22704J833K16433n4522k88635J10737K81922
328A87066j66321j98718J92599Q1957j11279N6162l5056j26221K14149Q8025l63404
339a81041K5598M02675j65514k87800K47844Q4529j83232J13721k6663k22942
$$ y = [-51592, 71558, -52673, 41215, 80715, -167910, -22371, 288939, -9641, -253342, 126202, 210424, -134402, -76241, 88284, -53510, 28780, 126712, -177097, -109659, 298858, 15419, -351937, 58566, 232737, -171476, -130597, 97272, -58001, 20368, 159345, -173429, -116124, 332101, 31707, -349911, 75346, 237857, -143618, -99223, 88704, -20149, 69214, 131747, -137024, -53503, 267036, 25625, -263032, 16224, 172071, -74944, -129803, 12275, 21365, 26989, 42002, -80702, -78869, 137564, 83042, -205593, -94856, 187066, 20745, -177973, 14626, 96583, -14696, 41466, 6410, -119811, 94338, 182363, -181041, -155443, 247232, 81718, -206082, 41762, 126291, -56941, 56780, 30117, -192825]
349a92825K58937J48248m39802L1220M53634k02860k79864K71948L8068j70522
359h3818J53736p1529k11993L00807J08031m07394P7457L75274j77553j94533
369a31515J81407J5750p0440P8325j05489j09687K21053N5020k70068J6847K57857
380A39060l8835j84599L5700J04767j3768n0924l9549l0986P7104R6148j39063
391d4945j20420K19786J15513k54149m2589K23075l6091j19013O8474l9192j7740
402d7291J91461j00947k41684K55281J82247l41010m4203K81473j02533j12381
412g9587J33617j02583l1316K58050j35876k72343K90689J52689l47115o554K35887
423I5558j12818m6721J07879j30225K4298K42784j58947k09679K57273J05703
$$ y = [-192825, 66112, 214360, -225442, -194222, 259412, 56552, -223312, 48636, 86704, -83818, 69918, -1611, -213604, 87203, 195234, -212160, -134703, 240571, 63018, -131515, 49892, 65642, -4798, 73527, -31962, -141649, 79404, 134424, -135644, -118797, 139060, 100225, -84374, -48674, 56093, 42325, -8599, -48148, -79134, -2030, 94118, -44945, -165365, 54421, 169934, -84215, -126804, 96271, 60180, -58833, 9641, -29551, -47291, 144170, 43223, -198461, 56820, 239067, -101943, -146146, 135327, 32794, -79587, 54030, -48553, -79869, 178181, 42305, -230038, 60651, 213340, -133775, -140329, 95558, -17260, -63981, 43898, -86327, -62029, 180755, 21808, -187871, 69402, 175105]
433A75105k55712j5193J50608l8539j9624K1974p8942N2188J47502j08746j50939
444a20318J37171J17987j45444j06851J05721P3417o5365m0723J5629J7429O8773
455E7426q397j50011K9986J97044r0313j97253J36618J36433j28596k9522P3342
466B6757m4850N4126O7424j89134j7189K58692q7195k39010J68190J34883j55971
477b3277J401O0131q4790P8097P6022k18449q639K57687r4161k09647J55518J07357
489I7250j18323J2029J9988o6530R4182M2449j90374N296K08844n7156j62998
500a15343R2629J09313n3791l2017K613j5769N7867K4378j29997k6343J54302
511F7842J1059j60952J6283J42875k6023r1109K1496J4563M860M1693p4474p6677
$$ y = [175105, -80607, -95800, 54808, 16269, -3355, 18619, -60323, -8135, 139367, 30621, -120318, 16853, 134840, -10604, -117455, -11734, 61683, -3682, -44405, -28776, -11347, 57426, 49029, -100982, -70996, 126048, 35735, -161518, -24900, 111533, -17063, -46585, 26757, -18093, 36033, 103457, -85677, -102866, 155826, 68631, -170379, -2189, 132694, -23277, -21876, 38255, -46535, 31562, 107584, -110865, -119504, 138183, 44022, -165625, -10107, 97250, -21073, -9044, 10944, -55586, 38596, 81045, -109329, -104033, 104811, 47655, -115343, -22714, 86599, 32808, 791, 3404, -12365, 45502, 69880, -60117, -86460, 67842, 78901, -82051, -65768, 77107, 51084, -40025, -18529, -3966, 894, 42587, -31887, -108564]
523a08564J41462O8675j74062k0821J70074j8463j13108L7749J8351j0491O0910
534E1712n7239r4053J42711Q6780j79770k8467J63640k3323j05089K8025O443
545h630l800O4648n7775r2633J26928Q9360j57116m9517J40258J643r6506q11
557d3951K1926R602L9740l4520o8928Q2807R6375j04112q1997J14426M7224j01587
569b2995k2225M6409M942K0989q136p4078N1372J12177r1360j09670J13194O2417
581H3036j14323j8321N2177j4708K7791P058r3012L8799J23916q7323j12997J09677
593A770O5725r1923j6705M3343k169L3563j199q4647L4646J03258p0601r6333
605h1272P4074O5425n5447l4164K3444L1880K2364k5053n5015K2486O4879l6453
$$ y = [-108564, 32898, 101573, -72489, -93310, 76764, 58301, -54807, -17058, 1293, -9198, 51712, -5527, -99580, 43131, 129911, -49859, -78326, 85314, 61991, -43098, -15073, -8630, -12430, 52218, -5557, -98190, 28738, 118098, -39018, -88535, 51723, 53366, -43140, -43951, -22025, -12423, 27317, -7203, -76131, 6676, 103051, -1061, -83058, 31368, 78592, -22995, -45220, 1189, 6131, 27120, 18984, -55094, -3722, 108455, 17095, -92575, 20619, 83036, -31287, -49608, 2569, -12139, 15652, 22710, -70302, -31503, 92413, 5090, -107907, 1770, 67495, -24428, -41133, 2210, 41, 33604, 32405, -52242, -17596, 85662, 15061, -81272, -7198, 58227, 2780, -31384, -7940, 23940, 46304, 21251, -33764, -11278, 53601, 17148]
617A7148q8948K3447Q5425j9398p8103K5288O8213o992k5912j3428j1251N4947
629C0436J9245j08442p917J25954k1789j00621M9794N6143l2730J0814j4431m8107
641d1651P5654L8286j29566J425J32807m5624q7274N9952J4870k6739L1418m4662
653b1104m7573R8288J8623j23426K6767J10315m1427n3184L1061N690J1757J5407
665C1194o9145j2076R1135p639p9014K1243O0004L491k8657k9741K0332M8010
677D9137l1803o0700K2991M1993j0681k6120j5905K8681N1287m4805o1058O2440
689E457L4520o3378p743K1134l142L6393j0848p0209O1650P5275r1743m3883Q8532
702C2015m094m7086K4631j8986n929P5413l5338q4369Q3554N6026r8049j3068
$$ y = [17148, -71800, -48353, 37072, 17674, -60429, -35141, 33072, 26080, 168, -13260, -24511, 30436, 49681, -58761, -66678, 59276, 37487, -63134, -13340, 42803, 10073, 20887, 6456, -41651, 34003, 72289, -57277, -55852, 76955, 31331, -55943, 4009, 18879, -7860, 23558, -21104, -68677, 29611, 48234, -75192, -48425, 61890, 20463, -32721, -1660, 4030, 15787, 31194, -37951, -50027, 41108, 33469, -45545, -24302, 35702, 39193, 10536, -19205, 1127, 49137, 17334, -43366, -20375, 21618, 10937, -15183, -31088, -2407, 48880, 4075, -56983, 5457, 39977, -23401, -31144, -10010, -13152, 23241, 12393, -57816, 3834, 79109, -12634, -56517, 32015, 27921, -19165, 5466, -13520, -19449, 55964, 20626, -63743, 19811, 75837, -22212, -35280]
714c5280N8681k4809l783J3923m9723K2794P4189o1776n5848Q0248J9405o6545
726b8524N119K0361p178K7805j8496m1977N7776L9576o5443j4964M6286L544j7674
739F211k1687j2968M6422J7470n6844m529N6566j690k7695p735j0222L0432J3909
752B7640o8344n689P4673j5819m7625K8707J2543k001J7768l5064k1828O4412
764B9373k560p4032K7140N7725l5463j3406K2776j5388J9120K3801o2704q201
776c1819P8773k6640o5676M1823L2709k9361K324m953j8972M1312O341o8854R309
789c3684O2735k8087l1887K4384Q067R600N767l6820L183M6149k0737m1608K4379
802h559K1510n454n847r776J3403L0895k1726l4778K6859J7110k6500j1515J16
$$ y = [-35280, 23401, -1408, -5191, 8732, -40991, -18197, 55992, -5784, -61632, 18616, 38021, -28524, -23405, -3044, -10222, 17583, -913, -42890, 14886, 54462, -10981, -25945, 20341, 23885, 6211, -15476, -28444, 17978, 35448, -21396, -25925, 30641, 28951, 1256, -6479, -16701, 13731, 27640, -40704, -46393, 28280, 12461, -35164, -6457, 6086, 4085, 21853, -13211, -35039, 29373, 26813, -47219, -20079, 37646, 2183, -11223, 11553, -3835, 15285, 39086, -23618, -31819, 46954, 20314, -45362, -3539, 29170, -191, 2133, -2820, -21792, 19520, 25861, -42993, -33684, 29051, 964, -30923, -6539, 1528, 11128, 16895, -19925, -16742, 29407, 8670, -32938, -8559, 12951, 7497, 1650, -8126, 5277, 36172, 14446, -20332, 6527, 23637, -2863, -14378, -14262]
815a4262J0403K2130k0507k8966L8289K6013m0758j4486K1541L452k880r768j8762
828b8561K1679L5377l2757k5007M1743J6013l3773j193J0247k333J3450r514k6763
841b1392K8187K7614l7152j6637L1649M930k2259m862j416J0865J3389k0134j5126
854b2344L1468J3133k8135j0011J2673R363m088k1714l348K6797P912k0310m671
867a3275K2642J3996j1452k0408Q039J9648r072k1907J563J7825K553q852r225
880g925P960J9398j1430k4123Q502J8841r602j8030Q03J6673P801j4607r371J5541
894D31J2815j1195j7460O127J6153J072j6234m571K0996J1447j5688j2020J2639
907D512J1946q123j6376k561J7054P660j9801p882K1227O975j3222q918L806O114
$$ y = [-14262, -3859, 18271, -2236, -31202, 7087, 33100, -7658, -22144, -603, 2849, -31, -9799, -28561, -6882, 28495, -4262, -29269, 12474, 28487, -5286, -6479, 3768, 1435, 14885, 5371, -21392, 6795, 34409, -2743, -19380, 12269, 17199, -5060, -9922, -11338, -473, 12916, -7218, -22344, 9124, 22257, -5878, -15889, -3216, 6147, 2059, -19655, -23003, 3794, 11706, -8604, -13275, 9367, 23363, 11911, -8497, -458, 19190, 10118, -11789, -10226, 7599, 10152, 1300, -7925, 35, 19433, 8003, -16120, -7618, 11223, 1621, -16409, -15606, 1067, 8868, -5739, -15110, 431, 13246, 2051, -15409, -9282, 6871, 7943, -8291, -12862, 8134, 19581, 3893, -8127, 4512, 16458, 8335, -8041, -10602, 6452, 14112, -5689, -13571, 7656, 14631, 1409, -7509, -3703, 2411]
921B411Q89j5973r730K3213R439k3597J881K1411k417m467k383r493J3898Q426
935A3508k7571k478K9385k711j6111P163N961K745N761j7101j2612K8077l91l1252
949a7627P328J8595p540j118j922p840J7746L296k7417K015K5409j1247j4751
962a5073J1617L072K738P727j5631m037K7832q606k7833J7994J3239j4124L851
975B766O54q103J9356J483k9812R746K3965k3868j3460J6744o029K992J0993j9343
989a1916J838L0655j6973k5329K7427M95j8109J1148m499q342K4432k502k5997
1002a7672K2315J8514k6757p80J5882j3404L790O324j9248P201K7940k5507j2532
1015a3934K8321o861j6006J0163o772p627K0373r994k1255K5746J2028k6333O690
$$ y = [2411, 3300, -12673, -22403, 810, 10249, -13348, -11467, 9944, 7527, 3060, 677, -8816, 5082, 13508, -14063, -16541, 12844, 10133, -5978, 1185, 7146, 9891, 15652, -1449, -14061, 14016, 13625, -17627, -10299, 8296, 756, -362, -2284, -10124, 7622, 10918, -16499, -14484, 10925, -322, -15073, -3456, -384, 2354, 10081, -5550, -9587, 18245, 9639, -18194, -200, 13039, -1085, 2766, 3420, -4683, 14673, 16156, -13656, -3910, 20055, -3813, -17273, -529, -6558, -3566, 7427, -11916, -10078, 20577, 3604, -21725, 5702, 6197, -11912, -764, -5263, -13605, 10827, 8325, -17672, 4643, 23157, -3600, -4380, 11502, -1902, 1888, 8212, -11036, -3835, 24105, -1402, -13934, 14387, 7526, -8480, 1683, -5089, -12716, 7657, -2337, -23592, 2154, 14182, -12151, -5461]
1028e461J4091j3319O367N241k2403J2276K2823k6143n836K9193r438j1600J5026
1041A0817j0842m866J9276j4633k0196K9497N127k7387J2609J1967j7431J0847
1053D785J811k3836J4938J4737l0475L113K5299j4526m591J5954j0591J038J6408
1066A4064j7319j0219K5148m918k1062J6694O466j2610J1892O93j7215J8265O052
1079A5931k7660O863J7346j7130k766J2383j0277K255J3340j8510m566K3924j0302
1092H31j6756J6080K071j1524J3958k367j2464J9698J193k1937J2170J0536j7735
1105f246L166R935j1762O704R653j5524J426J9808j3597j2781J5776l787j0996
1118h225R370o015p377J7910l902j3554J2915O846j4165K811M579o864N273M271
$$ y = [-5461, 8630, -4689, 1678, 6919, -15484, -3208, 19615, -6528, -12364, 16829, 7391, -4209, 10817, -25, -4891, 14385, -248, -20444, 9053, 14180, -13207, -598, 11369, -6062, 4785, 6596, -17240, -2302, 12435, -18040, -14927, 10372, -4154, -8745, 7209, -3382, -2344, 14064, -3255, -13474, 11674, 6756, -14306, 2388, 8854, -3756, 8136, 8829, -8386, 9879, 15931, -11729, -4866, 12480, -4650, -7416, 4967, -5310, -3055, 10285, -8225, -12791, 11133, 831, -15925, 155, 2226, -9298, 4660, 2293, -10171, 9527, 10720, -11217, 953, 11489, -6246, -3080, 6855, -4907, 1797, 11450, -4074, -2648, 17160, 3563, -9218, 6558, 2771, -8225, 1145, -4870, -12247, 5663, 1761, -11793, 1122, 7968, -6197, -3386, 1193, -5671, -398, 3873]
1132C873j1397L875J4811j0771o420J2534r55p206N993n453k483J0216m691q887
1146f961J1446L800j2112M193L461o203K616J233j0589O291Q668j1414j742J1050
1160C737m784j867N209n831N67P741q481k571R574M41n150M571K649l310M328
1175F823k080o205L487K401j0004J646N827j763j627J942l82j442L560m618j908
1190d343L663J095o393J390M749o09r17R83j104J438K989l470k559M714J120l801
1206a055K227K623j113J321j615j525J35J832m022k227M653l36l057P82J432k59
1222b04j10J378l272M78K159l854j890N031q16k630M870o80J109K848l990l319
1238b892P714r28n845L336L527m752J637L023n643K134L447q160N16M870m876
$$ y = [3873, -7524, -3649, 11162, 391, -6029, 6505, 5550, -1656, 4337, -1116, -3599, 6617, 1926, -6961, 4485, 8285, -3827, 366, 3827, -2376, 240, 1473, -9116, -2825, 5843, -5571, -7313, 3737, -1047, -2914, 2295, -3536, -2969, 4772, -3709, -6280, 3294, 3735, -1415, 3156, 5805, 2495, 6823, 4743, -1462, 2025, 4426, -5578, -3932, 1895, 132, -1495, 447, 65, -1377, 2183, -2435, -4343, -680, 415, -5978, -4588, 161, -448, -1365, -382, -1486, -48, 2941, -529, -3088, 1626, 2746, -1055, 1172, 3795, 2682, 4003, 2388, 863, 998, 2830, -1192, -3419, 1234, 898, -2159, -1377, 55, -204, -314, 1064, -2208, -1730, 429, -3425, -5315, -284, -1100, -3730, 1140, 460, 1569, 4417, 427, -2892, 4822, 3894, -1951, 1385, 4912, 160, 1797, 4820, -823, 1311, 4758, -3402, -2886, 1984, -2892]
1253b892j461O838n272J0O803p927r79R495n499o758Q525j186o514Q304J854p131
1269c790O743N192r306K461P208r172l60O322o645r39P959p870k363J0531n159
1284H12p060R731j222q406Q808J96j1570R585M553j1952M533Q057j1972J985R969
1299F047j2015K419P617p405j53J2544r139k768J1654o103n388R530m662j0527
1313h349J4186k884j2328J1320M507j3491P539N685j2711N078N857j1217L039
1326c769R150r623j445J1336q046k684J0687n191p322J3647l890j0658J4033M98
1340F723j4480J0491N621j2017M364O704j2569L429J0058j2502r91J0955o986
1353a200l859J0061q830k158J2598q327q790J5283l936j0739J2542O09j1800J0243
$$ y = [-2892, -4353, 2485, -2787, -2777, 4026, -3901, -4880, 4615, -884, -7642, 883, -303, -6817, 1487, 3341, -3790, 2953, 8145, -1161, 1300, 8508, -664, -1024, 5298, -1347, -2286, 5673, -2197, -4560, 5971, 812, -6248, 3483, 2261, -6145, 2663, 2859, -8711, 874, 5427, -6525, -1992, 6065, -5907, -3922, 6047, -5968, -3549, 4068, -3337, -3490, 9054, -85, -2853, 8801, 2698, -2690, 6840, 2178, -8349, 5837, 2953, -9375, 1945, 6452, -7039, 500, 6185, -6526, -1448, 4409, -6808, -3769, 5381, -4242, -5687, 5649, -2397, -5081, 5606, 415, -6907, 6740, 2850, -7808, 6225, 6723, -7757, 2734, 8355, -3662, 702, 7406, -5163, -1734, 8324, -4178, -5169, 5786, -1200, -5059, 5002, -3828, -5986, 6612, -1715, -10505, 4778, 842, -9897, 2645, 3254, -8546, 1697]
1367A697L584j0762O346P257j0723O64R015j0070o0R641p588k329J1162q670l981
1382d817J2803p790p400J1528k712q250Q060P22j0335R030N221j3451L873R665
1396F147j1403K429Q883j0559O79J1257q962m299J3053o902l862R656m354p784
1410f021J1087p50j0092Q851J115r433O144N918j2450L488P240r462J159O884
1424C678p768O18P706o954j485Q057l238m336P816l225o354Q340J78p993O544
1439A584J890o638M556L554q112M504L867p737J725M752n920J070N002o422j820
1454d145P768l963m248O376j255q091R079O5p863N483N466o399J235L957p211
1469c746L444M225n841o29M928j012q33L880m004j799P144m187m682N212m9n506
$$ y = [1697, 5281, -5481, 865, 8122, -2601, -1937, 7078, -2992, -3052, 6589, -999, -3328, 7834, -836, -4817, 7986, 196, -7204, 4324, 1612, -6638, 1422, 2144, -8191, 839, 6060, -7391, -3518, 6147, -5256, -2827, 6056, -4503, -3824, 7433, -1529, -5828, 7225, 323, -3539, 6117, 1763, -6021, 5066, 4316, -5776, 3075, 4190, -5243, 901, 6819, -5631, -2143, 5097, -4365, -3206, 3678, -4090, -3472, 4234, -2720, -4205, 3852, 614, -3722, 4094, 869, -5485, 2855, 3033, -4960, 1584, 3474, -3164, 1392, 4946, -3166, 1338, 5205, -2532, -807, 3945, -1975, -905, 4097, -2325, -4145, 3623, -340, -4588, 1788, 533, -7558, 1521, 1586, -6277, -794, 4672, -1727, -492, 3465, -3746, -302, 3923, -1918, -2547, 2381, 1369, 536, 4416, 412, -1387, 5757, 1570, -3112, 2100, 2051, -3455]
1485c455M177J03m198R70L806k856o39J281o13l57K078p11k038K032J275o13O88
1502I30n82k471L752o44l481L581J929l035O31J453j290M0J607k501k111L822
1518A630j747l375L410J40l153L366P0k581J873O55l363K703K087m239J268K252
1534I96n39k635K474N09l184M365o79m388M294K452k972l23J867l095J81K180
1550A503j634k610L539o44l802M131j213k667L895O2m267M712J369n276M112K88
1566A498l932K210K790l697j085M329k522q06M378l418p84M828k469k691M262
1581B891j869m698O247j621n204N638K198p175K021K436l697J825M474o743J36
1596c141O903l889m198P961l860l163P287k704m903O061R11o224N308J072o198
$$ y = [-3455, 722, 825, -3373, -2403, 1403, -1453, -2092, -811, -1424, -1781, 297, -414, -2452, -420, 855, 242, 930, 348, -2123, 1629, 985, -2496, 1085, 3014, -21, 610, 2063, 773, 813, 2420, -81, -2192, 1630, -117, -3492, -82, 58, -3095, 271, 341, -2240, -367, 288, -3075, -372, 1715, -2524, -1256, 996, 457, -2178, 296, 805, -2379, 1986, 1307, -3081, 1213, 3665, 693, 370, 2237, -858, -677, 1503, -131, -2741, 798, 154, -3648, 483, -730, -3397, 498, 560, -3707, 1005, 2374, -2902, 1210, 1498, -2434, -224, 2566, -1131, -2216, 2113, -409, -1215, 3163, -255, -1039, 3789, 1320, -1371, 2891, 1022, -3676, 2571, 950, -4254, 1384, 3582, -3593, -1572, 864, -2833, -1008, 3466, -3277, -3141, 3762, -127, -4325, 3636, -224, -3387, 3900, 1196, -3707, 2354, 3265, -2959, 2349, 3421, -2777]
1611b777M014M535r117J865N693o505L20P156o879j591P539n220m708Q864k844
1626C45n449P926k102o469P514K66o760N849J444n378L179M677q830M224N117
1641E553p841R85O649o773j301Q098m282o037P596j530n448P291j249o206O764
1656B269J332q629O409K701q410L418L938q109K182P489p670J13P531n641l409
1671d486R703n264m062P870j150n665N224M12p156P519j80o790N306J505o398
1686c612L385L250o711K378M527o875j87P024m652m097Q552m379m857J0584k239
1701B091p110O629K116p425N218K654p434M446L476p627J284O684o426j597P546
1716D525o323j639P133l624m807P909k028o417P383m05o737N502J865p717N753
$$ y = [-2777, 1237, 5772, -3345, -1480, 4213, -2292, -1972, 5184, -1695, -3286, 4253, -967, -5675, 3189, 345, -5104, 2822, 720, -5749, 1765, 2031, -4729, 1120, 2564, -2814, 365, 5042, -3788, 436, 5553, -2288, -1303, 5346, -1427, -2728, 5370, 1088, -4949, 2647, 1117, -4331, 2960, 1711, -4495, 2269, 3601, -5028, 1381, 4082, -4328, -910, 3028, -5081, -2899, 4590, -3080, -2967, 4564, -1077, -4486, 5217, -47, -4109, 3761, 2611, -3054, 2170, 2582, -4574, 2945, 2765, -4025, 1281, 2786, -3612, -227, 3023, -3688, -1310, 3217, -3658, -3845, 3179, -1473, -5570, 2982, -1397, -6254, 4330, 2091, -5019, 1610, 3726, -3699, 1519, 4173, -3261, 1185, 4661, -2966, -1682, 5002, -1424, -3021, 4525, -1798, -3437, 3696, 72, -4735, 3174, 1146, -5271, 2112, 1707, -5030, 472, 2337, -5380, 373]
1731C73N29n455N110K791o035R08N955m101q39M689n200p96O543m455k928N534
1747B623j527m867N821j217m525N386k80n563M043L276o283K485L136m394n46
1762b432N340m761p05N170l302l162O536k718l124N800j198l470M345J30o125
1777c676M111K619n647J378M335n172J803K553m251N93M562m749K73L773k358
1792A47k534L373r44k627L771m47l673K807K246m521K478K329k690N16J452l035
1808a352K38M047l601r73M482j900k516K195L57k051J752n59j838K674R28k446
1824e63K47K616l977J00K337k846P14K770l027k17L071j028r43J745P36k881L130
1841A984L51l384J307J535l162J323J037r94j90K100k165n84J857j176p40K284
$$ y = [373, 902, -4553, 557, 3348, -2687, -1779, 4176, 75, -764, 3925, -1275, -2071, 4472, 17, -2911, 2623, 1096, -3771, 2050, 833, -3692, 1694, 1414, -4149, -106, 3170, -3113, -628, 2508, -1886, -2432, 2908, -1853, -2558, 2612, -690, -3852, 2684, -34, -3158, 2642, 1444, -2026, 2319, 2449, -3676, 435, 3054, -2593, -1215, 3120, -2052, -249, 2304, -1947, -1354, 3208, -1541, -1268, 2505, 147, -2387, 986, 42, -2585, 1186, 739, -2934, -127, 2119, -2402, 76, 2405, -285, 231, 1683, -1352, -1114, 2933, -668, -1641, 2841, 941, -1575, 620, 977, -1074, 678, 119, -1719, 955, 1883, -563, -316, 2300, -1677, -1577, 760, -2086, -1372, 1398, -1629, -1846, 1225, 197, -746, 999, 1735, -1146, 1984, 2335, -1049, 258, 1793, -1369, -46, 991, -3, -193, 1907, -258, -842, 1015, -161, -901, 1383]
1857A383j158k131K283R68k404L81K626l584J920J484m450J627K652k244o4K317
1873A606k227j178M281k319k793M391n64k281J779N63l315K703J674m101J616
1888a65J459k675r7K320k627N62J441j650m74M454k282l561M111Q36m209K948
1904C91J498m016M64L487l866J915L677m039j466N076l114k165M533k104k851
1919b580M147J88m760M517N50m979J978K730m985L588J804m457P54L650m014R74
1935h95M208l867k372O121k799l501N573j118m421M953n00m153M897j43m062L171
1951A092J243o137L025L404m930J243L231l510L54M758m086l425P333l751l058
1966c214N451k332k606M381m52m856N205J477m956K393K865n676K645M658o596
$$ y = [1383, 225, -1906, 377, 1345, -1059, -678, 1948, -1636, 284, 1768, -2682, -1055, 1597, -647, -711, 1606, -621, -1799, 2482, 163, -2630, 1761, 1197, -1084, 695, 1258, -2057, 646, 2320, -1781, -165, 1294, -1381, -1478, 842, -1785, -1223, 218, -1432, -1906, 2548, 266, -3295, 816, 1652, -2557, 391, 1889, -2127, -1663, 1824, -2042, -127, 3550, -489, -1955, 3121, 7, -2158, 2375, 271, -2580, 1567, 1755, -3005, 1512, 2062, -2917, -939, 1791, -3194, 394, 2198, -2259, -1505, 2145, -1869, -895, 3313, -554, -2926, 3195, 396, -3105, 2468, 1350, -3071, 1882, 1382, -2771, 2126, 1983, -2079, 1092, 2335, -3802, -777, 2627, -2303, -1060, 2171, -1339, -985, 3773, -313, -3738, 3595, -156, -3214, 2237, -95, -2701, 1680, 1228, -3628, 1577, 3054, -1902, 491, 3356, -2320, 325, 4983, -1613]
1981a613n58O393m799k011N800m811k177O926k757l825N747q56n616O268p56l321
1997a966K749K372n492J094M064n070J602M295n319L17N836n155j243M452k762
2012b26l062P439l255m763O106q90l969L343R57m661M626J685n978J759L764m434
2028a559n37N292n484J13N741n026n34M826k820k357N097j966l478M460N34m797
2044b495L688J839n896L572J993o001K923L895n240p41N176l493k455O019k601
2059A83l000N642l395k119L173K44m605M707N75l428K293L075n791L777K141n028
2075a556K83M265l658j260M912l536j749M806l074l508O237j825k731L107N69
2090A282m240M017J60m182K826K556l963m73L143k430l45L335k816k33M329l571
$$ y = [-1613, -2171, 4222, -577, -2588, 3212, -1599, -3776, 3150, 393, -3432, 2315, 1459, -4157, 2111, 1355, -1966, 783, 3155, -2337, -1243, 2821, -2249, -647, 3648, -1671, -1354, 4482, -673, -1916, 2536, -226, -3288, 4151, 896, -3867, 2239, 1349, -2620, 723, 1680, -2981, 1645, 3330, -2648, -889, 2875, -1559, -2096, 3196, -2288, -2175, 3566, -1460, -1994, 2832, 12, -2345, 2752, 786, -2692, 1768, 2302, -2495, 1193, 3032, -2864, 708, 2701, -3300, -377, 3518, -1722, -2463, 2713, -780, -3235, 2784, 183, -2817, 2825, -570, -2689, 484, 728, -3877, 830, 1405, -2023, 270, 3345, -2446, 1331, 3472, -1556, -1273, 2992, -666, -1926, 2986, -550, -2299, 2507, -567, -4075, 2162, 337, -2394, 713, 1282, -2958, 1059, 1219, -2963, -137, 2419, -1544, -2017, 1126, -1304, -1649, 1686, -1130, -1363, 2966, -605]
2106f05j110L951j176j852K605o95l802L885k65k661K272J828l795J426K891n024
2122b127Q08L264k162k75K618l003j508M430j950k128K656m38j201J961j109j447
2138a611K014K376l100l59L558m047m74L129j416k389K768q19j644K970r19j514
2154a477K455o17k065K770M01k241M51O56j949J293J541j070j344K810j788q54
2170a028K345j628j871L952n35j943Q17J469k919R77J223k317J291K391k838j101
2186a715L186k200O85J765j695k87J412j549j058L534k947n65K536o90k987K529
2202d6O79k022J124K188l862J258L597m368r0L263k412j41K257j738q14K426m54
2219H45k615K251J476l757J879J015k487J056K768l695o31L049j675k101M581
$$ y = [-605, -1715, 2236, 1060, -792, 1813, 1118, -2684, 1201, 936, -1725, 547, 2375, -1420, 6, 2897, -2127, -1319, 1945, -217, -492, 2126, -877, -2385, 2045, 95, -2033, 623, 185, -1016, 945, -164, -1611, 403, 2779, -321, -680, 2878, -1169, -1643, 1486, 70, -2319, 449, -370, -2014, 956, 37, -1477, 978, 361, -1704, 1066, 1467, -774, -323, 333, -1616, -323, 1218, 148, -1196, 1614, -174, -1028, 1317, -311, -2182, 1770, 1235, -708, 109, 1578, -1341, -364, 859, -1458, -167, 2224, -614, -1715, 1471, -729, -44, 1721, 26, -261, 1151, -398, -1456, 2078, -869, -1434, 1102, 412, -2575, -46, 633, -1389, -265, 1923, -1939, -681, 2916, -1452, -1542, 1721, -691, -832, 1425, -313, -1127, 1299, 845, -1770, 481, 1957, -1800, 79, 1094, -1393, -337, 2431, -1264, -1895, 1154, -521, -2622, 1959]
2234A959j289k336K658n3j981J739K30k919L046J223m521J367K837k561J324J059
2250A782l768O41L559l259o25L390k198m06K675k148r58L625k007j462K254O73
2266A768l217J508K123m862J367L882m963J314K987k666o59L746k075j371K689
2281A571j907j249L089j582l006N023L68m660K245J483k905J547J582l762L388
2296A225J373m384L07M785l840r54M120l360j302L757k144k704M298q13k429L144
2312A079J36l242K230K202m479K423J874m043J262K079k796j311M519j146k632
2327a845L561j831k772O459k652m466M930R68m213J928J179k927K725R23m368
2342b401J855K857l222q26M004l595j008M767k717k218N256j978k363L320j094
$$ y = [1959, 670, -1666, 992, 939, -1042, 697, 927, -1992, 1054, 2277, -2244, -877, 1960, -601, 723, 1782, -1986, -1345, 2214, -1045, -1670, 1720, -478, -884, 1791, -357, -1315, 2310, 303, -1159, 1095, 1768, -1449, 59, 2182, -2680, -1313, 2569, -2394, -1080, 1907, -759, -1418, 2328, 253, -1118, 1571, -336, -1585, 1504, -78, -3084, 1939, 2307, -2353, -108, 1375, -1530, 17, 1599, -2163, 1225, 2598, -1786, -1479, 3306, -534, -1488, 2632, -728, -2030, 1727, -417, -3121, 1177, 364, -2065, 1079, 1215, -2027, 203, 2405, -2074, 349, 2223, -1820, -558, 1521, -1275, -2586, 1933, 787, -1845, 1716, -115, -2887, 3572, 920, -3546, 1384, 2352, -1861, 67, 1246, -1681, 1044, 1967, -2401, -546, 2311, -911, -1737, 2267, -1328, -2336, 2431, -286, -2504, 2752, 774, -1589, 1731, 637]
2357F37k611K365P65l202L227K09m807L764K808m658l54L972k340n22J966j520
2373c01j238M265k072k855M533k047j965K533l4l592L893o12l530J901L701m321
2389a741R89L234l982P90K079l029J07M540k340l670M939j073k185K630l55k515
2405a582M285j440l091J841J838m348J970K192k740J224J307k137O90J863k741
2420h69q29K791j909r04K908q66j707K201k8m083L293J995l309R86K235k027q01
2437i23L182k371o27R63j973K36K633k155l62J685J077l328L036j28k023K902
2453A824j47l474J229J259j634J959j177j289J059O24j908R35K006j596j070K760
2469A360n39j955K228j378j327J967M85k288J249J197j739O68J188j646o58J175
$$ y = [637, -1974, 391, 1156, -2046, 1181, 1390, -3417, 347, 3155, -1503, -1857, 2115, -225, -747, 1219, -301, -1539, 2726, 654, -2201, 2332, 285, -1680, 853, 819, -2773, 1120, 508, -3022, -1121, 2580, -1741, -752, 2482, -1500, -710, 1369, -1660, -1553, 2987, 647, -3023, 1916, 843, -1342, 1288, 933, -1582, 2703, 1263, -1828, 13, 1851, -2497, -527, 1665, -1075, 149, 1456, -681, 9, 1872, -869, -1698, 1093, -816, -1720, 1188, 322, -1385, 816, 788, -3295, -2, 1993, -1316, -330, 1905, -122, -923, 2259, -112, -739, 224, -1749, -1513, 1120, -1035, -1397, 288, 1365, -1963, 1073, 945, -1078, 1824, 1677, -1797, -568, 691, -943, 1016, -161, -1450, -391, 233, -1675, -740, 1266, -330, -1400, 1360, 821, -1134, 1094, -284, -1611, 356, 841, -1447, -198, 999, -740, -72, 1116, -530, -1188, -13]
2485a3j336N65K194j184q55K423k46l386K759j711j397L514r68k310J312L212
2501B573l454L63K333k175J56K126j713j636L709j685j359K162j384j037K613
2516A592k90k392J730n3j895K493m15j275K92J031r82K1J30K75q08J490l57j798
2534a211K325n62k321K039J262l517L298n83k041J213J988k852O26J206j000j902
2550b032K771p04m32J872Q6k977L285n9l657K745p08j553J047J444j988JK842
2567A983k684R05R62j760k64K560j895o50K416j921j394L049l30k027K168p0l081
2584b033K800k22j938J605K240l019K30J221j692l93K006r69j176L469k310j358
2600a539L159r44k623L891j530k163J913J659l017J305J621l817J420K170k450
$$ y = [-13, -1349, -784, 1410, 226, -629, 1794, 1548, -1838, 921, -790, -2187, 1327, 359, -1951, -639, 2573, -881, -518, 1815, -360, -204, 1922, 209, -1427, 2282, 597, -762, 1400, 16, -1021, 1592, 1302, -1090, 640, 587, -1308, 1185, 770, -505, -213, 818, -164, -143, -13, 262, -546, 944, 587, -1211, 1114, 552, -1769, 270, 1532, -1985, 1313, 730, -1311, -98, 1890, -962, -336, 870, -130, -2032, 739, 35, -397, 1475, 1561, -1416, 1869, 1810, -1847, 898, 190, -1363, -316, 1128, -860, -859, 1983, -701, 204, 1166, -594, -858, 1702, -193, -843, 1573, -348, -1742, 1307, 977, -1050, 1118, 1048, -2033, 767, 545, -1393, 212, 2452, -567, -337, 884, -808, -1201, 805, -164, -1340, 2129, -181, -1539, 1620, 676, -1947, 1944, 414, -1749, 164, 1823, -1194, 111, 1732, -2085, -665, 1505, -945]
2615i45P38J275j597n81K857r98j066J315n58k070K999J97l196K382J97k719L096
2632A326M06l219J466K062l177J041K407l053J10K249k481q00L725j499k845K888
2648F06M39l384K458Q93k549L136L70l628J485K418k901J35K641l913O25K640
2664A471j561m40J718j547j456L853j695k045K821J25l562L918o03l789K851P19
2680G78j943J316J550k307J126J454k911n91L876k921j218L632j134k305K207
2695F09M51k120J974O17l801K500J910k860J050J563l121K92K597k931P76K766
2711B272l849L81K657j361j664K852j252k648L320J043l641K372J36k753K948
2726H13K84k845N60K982k579k67K984l061Q62L254l377j231K887k035j831K851
$$ y = [-945, -207, 1068, -529, -1110, 1747, 749, -317, 998, 440, -1630, 1369, 1566, -1630, 752, 949, -1770, 1326, 1732, -1487, -21, 2041, -1136, -95, 2312, -741, -631, 1618, -863, -1663, 2062, 563, -2282, 606, 1045, -2339, 119, 1012, -1537, 1599, 1969, -1659, -174, 2244, -657, -522, 2119, -1794, -1169, 1471, -90, -530, 1188, -359, -1815, 2038, 343, -1702, 1119, 1244, -2318, 1600, 997, -2792, 59, 778, -1165, 151, 1701, -606, 520, 1974, -937, -1528, 2348, -573, -1791, 1841, 707, -1598, 609, 1060, -1060, 914, 1531, -2270, 230, 2140, -720, 330, 1893, -1228, -936, 1661, -1270, -494, 2272, -1577, -1196, 1461, 100, -1564, 1288, 36, -2612, 708, 1751, -1890, 482, 618, -2135, 813, 1097, -1748, -1188, 1794, -785, -1052, 1932, -1129, -267, 2987, -390, -1621, 1266, -769, -2600, 251]
2742B51M36k525K792l48k193K810j06l298K182J180k239J070J371j697k70K282
2758A698j470j132K666j874j714K322N69k581K149N23k083O46K143k474k52K521
2774A657l419K146k6j622k7K380j546k41J947n84j605J600M85l603L834p86j791
2791a201R91J915l221K265M68k142pK249k375K66K091q12j699K975j209j540K410
2808A424p88k444K266L22k696K321J308l489J498K195j888r02K711k186J1K433
2824B096k516r8K144k128n4J707j043j338K370l96k373K455n04r34P37J754l033
2841a154R08J774k170q9K118k681J016O90m86j014K491m20j737J520k99j483K136
2858A120j93j581j72J340j103J57K339k276l12K115k523J98J602l5j877J945j36
$$ y = [251, 687, -1838, 954, 606, -1587, 1223, 1117, -2181, 1, 1181, -1058, 12, 1383, -314, -584, 1698, 228, -904, 1762, -112, -1826, 496, 1065, -1516, 633, 1156, -927, -281, 1862, -612, -864, 1657, -1762, 384, 358, -1264, -1291, 1089, -457, -698, 1249, 665, -940, 660, 1145, -2458, 1376, 590, -1201, -210, 1705, -1516, 749, 1217, -925, -932, 1317, -1058, -792, 1299, 487, -1212, 1763, 554, -986, 1424, 636, -1808, 458, 780, -1916, 405, 1713, -1776, -278, 1917, 29, -873, 1838, -348, -337, 2096, -420, -518, 1626, -502, -556, 1151, 108, -1230, 1140, 744, -1629, 826, 322, -612, 125, 1879, -1154, -246, 1528, -642, -731, 1387, -1294, -278, 412, -74, -1088, 1403, 983, -754, 766, 467, -1016, 1120, 927, -654, -826, 514, -589, -432, 1907, -369, -681, 1434, -1089, -891, 711, 676, -1201, 744, 608]
2875F08j484J843m48j276J471J417l355K369N58k639R33K85j314L43J613r80j079
2892a135K338j246m84J714o6j016Q77o76o97N50J115l355K457P74j636j13J575
2909I76j183k34J581k81j860J895j629K07K043o77k982K956n92j684J217J309
2925A062k862L463o95k466J548J009r09m7J183j319p53K660k201K07J308r13r04
2942f29O10N19k098J778J112k300J502J332l204K20L063k871l41L026k015j099
2958a395K468j450j10K962k228j950K632j298m80J345k71o34J137K85k237Q60
2974c64K451l401Q27K112k964N09K313j732p81K325j747p86K232l98l056K796
2990C36N12k600M25J261j914K445J126l660J317K847k811q11L950l416M54K425
$$ y = [608, -876, 967, 519, -757, 714, 2131, -1224, 1145, 1703, -936, -3, 282, -1032, -689, 924, -56, -1135, 1203, -43, -527, 1187, 1121, 105, 982, 306, -391, 159, 1274, -2081, 376, 1150, -486, -599, 976, -207, -441, 1140, 859, -1001, 894, -735, -528, 1515, 838, -2144, 812, 220, -1464, -247, 1062, -1800, 1663, 968, -1498, 50, 1059, 150, 103, 1286, -33, -786, 1874, -327, -120, 1188, 275, -629, -19, 500, -1598, 180, 1292, -1008, 494, 1826, -1378, -1158, 1905, -966, -1307, 1719, -296, -1395, 1073, -377, -487, 2475, 247, -1703, 929, -369, -849, 496, 225, -409, 728, 1013, -1224, -364, 2087, -1314, -487, 1625, -1339, -830, 1483, -249, -1030, 1295, -452, -1238, 994, 596, -2460, 336, 848, -1752, -1327, -66, -1980, 465, 1591, -2069, -752, 2095, -716, -1527, 2423, -993, -539, 1886]
3006A886j425k306L188j003j857J996k26j770K711L34k677J964Q78l246J175K127
3022A749k420L55Q66j257l13K164j033p76R51j152j218K903o19j003J273k19j652
3039a401J915o22j356J110Q88j566J189J503j510P20J027j886j080J680k8k301
3055a718J801J29q65J604o13k292L172J55j515l99J349k387J783O72j085p99J373
3072C65j422k46K117r10j121K365j463p83J407Q9j005J517j080j074J417R19k740
3089a648J239J369j017L82J242k615P9J730j047m61K210p64k360L077j207k383
3105b174K227k83m43J036J656k637R52J349k509N37J612j608j500K476j135L10
3121a34J507j021j061J343o92M98M85n82j525J797l10j159J040Q1p99J073J37
$$ y = [1886, 461, -1845, 1343, 340, -1517, 479, 253, -1517, 1194, 1528, -1149, 815, 1693, -1553, -378, 1749, -671, -316, 550, -707, -1020, 1144, 111, -665, 286, -866, -2084, 819, 200, -803, 470, 251, -1401, 514, -108, -1464, -354, 534, -1032, 157, 1660, 150, 870, 1897, 11, -1069, 611, 583, -1718, 83, 212, -653, 951, 338, -1954, 1218, 1373, -142, -541, 808, -1579, 204, 876, -209, -1008, 365, -1057, -1303, 814, -96, -1217, 1148, -315, -1098, 309, 398, -607, 910, -170, -1244, 173, 1092, -1648, -409, 960, -57, 325, 1567, -1048, -969, 761, -286, -747, 1463, 699, -1661, 1416, 209, -2174, 53, -230, -673, 363, 2019, -618, 334, 1683, -826, -289, 1323, -285, -1785, 691, -444, -134, 1373, 352, -709, 634, -58, 440, 925, 343, -1182, 615, 305, -854, 186, 267, -532, 541, 678]
3138F78j100J002q1r50r4J201q97m20J091j131M81M43L8q81O98J22j811M78J391
3157B58p46M33J068j537Q81K08l15j88J326j201j210J262l54q39J215l9j918J930
3175B34N12j643J173j41p55Q89J718j976j96J175q35l46jN48r13L99J054j208
3193c12Q44n32j685K954l43j759k03J493p95n06J370j002J35J222p27j796K275
3210F33o17j522J822l93k76R98J151l414J416q0n69J012J351k302n35K195j582
3227g12O12J302j704o07K724j777j269J562o51J215L38J84k151L2J765j860P26
3244b71J221j491M86J579k432R02J320j382P0J592k084p2J544j533m92J582Q1
3261F20j690J541J015j572Q43J605l995J364Q87n02j358L254k869k30J993n99
$$ y = [678, -422, 580, 499, -451, -545, 656, -241, -661, 430, -701, -220, 223, 261, -620, 78, 200, -1611, -1133, 258, -488, -55, 1013, -524, 357, 565, 250, 62, 1388, 187, -1023, 239, -115, -954, 261, 222, -1696, 234, 746, -897, 276, 135, -620, 269, 1987, 11, -185, 990, 155, -191, -192, 356, -557, -158, 896, -312, 532, 0, -1685, 1269, 926, -833, -1036, 457, -338, -844, 526, -476, -341, 881, 154, -1642, 633, 16, -1506, 316, -77, -353, 645, 1796, -1618, -202, -282, -851, 161, 1512, -790, -1325, 870, -712, -100, 1202, -502, -1109, 1615, -162, -1431, 131, -520, 695, 1033, 1217, -934, -902, 863, -997, -271, 950, -541, -55, 1524, -908, -6, 1314, -68, 2, 1594, -490, -562, 982, -551, -1043, 539, 620, -1070, 471, 1486, -86, 757, 2362, -1633, -269, 618, 116, -1242, 2012, -857, -1087, 906, 307]
3277C07o68M07N91j758M10J386j498K201j581l92R88O83k656J258R48j608J385
3294D03J043k360K56J929p46q57M67o41k062L639j72k348J889P28k000J209k44
3311A33o78P91R06k616L91J829j662J248P08l31j387J300j71j508J247n46r85
3328a331K176O2j933J721p7k845K042R71j841L65K164k079O7J882k161o8J899
3345A014r25p04K947j004k305J414p74o42P70J159j675N90J299j816R42J890k866
3362f86m98L189k120n14O63j58j09J868k373m40K652j717j728K577K33j489J028
3379C78J11j477O85J175j194j20J478K12l122K448j068j57J544j071l25J152K2
3396F71j087O66N32j188J02Q80q99J714o16j661n85J400j133J800p38R3r29K336
$$ y = [307, -361, 46, 637, -1121, -711, 675, -823, 1378, -203, -595, 393, 1076, -1580, -322, 626, -982, 403, 1446, -914, -658, 1271, 525, -332, 135, -506, -2568, 1071, 899, -1449, 440, 1168, -832, 377, 133, -545, 246, 1152, -1464, -1073, 756, -906, 342, 1050, 719, -668, 632, 461, -1047, 200, -346, -1331, 845, 907, -1026, 695, 618, -2227, -185, 786, -1055, -690, 1474, -605, -538, 1344, -817, -885, 1014, 89, -615, 2332, 1328, -977, 437, -337, -979, -209, 950, -725, -135, 1164, -652, 290, 2180, -686, -1184, 2005, -115, -629, 34, -124, -233, 1635, -738, -1178, 1474, -243, -1971, 606, 839, -650, 378, 489, -988, -303, 872, -322, -442, 1036, 1248, -1874, 574, -494, -651, 893, -178, -503, 649, 671, -416, 250, 782, -406, -304, 576, -323, 1391, 775, -886, -1471, -71, -1204, 596, -142, -49, -978, 1358]
3414A358q29p77J437j654j378K328m19j204Q01l06k90R81k55j156J931j94j194
3431h20P00Q80j229LP5l62P22P41l71k030J858k39o15N71L24m95K28Q58j421R68
3451C46P49l039L11K947j170n12J656j332K04P95J64p95J44M38j272L58N90k7
3469E55k51m66l11J417qj913L57M37R86j407J496O87k735J595o66J76J515j426
3487C8r12J096J75n95J65O4j226J360J565k208M69J072j615N41L10l00n55J915
3505A359j427o69K362j066k749K657n56l16J002o73q41Q92P87j710L98J258j101
3522c93J28O41J1j270O63m2m51K135j072j280J411j65j965K143m81j572K484l60
3540E65j698L81J538j83p97O73j285M66N71o44p41J731j141LJ274J64j001J33
$$ y = [1358, 529, -248, 1189, -465, -1843, 485, 66, -1138, -337, -643, -933, 48, -207, -1363, 568, 374, -820, -120, 760, -469, -466, -391, -753, -31, 710, 339, -1691, 167, -72, -687, -116, 208, -287, -59, 799, -622, 346, 1095, -1944, -1633, 1314, 144, -368, 1288, -44, 160, 955, 1119, 324, 468, 906, -366, -8, 582, 555, 304, -162, -473, 944, 936, -977, -620, -183, 803, -604, 892, 1579, -1156, 439, -227, -51, 1464, 38, -874, 222, 397, -198, -33, 31, -1195, 165, 1730, -478, -9, 1063, -552, -11, 299, -1, -556, 1359, -68, -737, 1625, 559, -2190, 467, -89, -405, 597, -76, -917, -25, 762, -948, -550, 708, -393, -265, 376, 387, -883, -220, -262, -713, 1422, 350, -930, 481, 316, -1649, 494, 13, -1559, 925, 565, -1133, -752, 786, 603, -194, 479, -806, -340, 231, -413, -1154, 577, -564, -561, 713, 877, -124, 9]
3558IL67p62O04O9j379Q89J356j874J545n61j480k01K531n32p61Q49n78q7R47
3577I51J93j455O61m78n42J037J26q21Q88j244J025j226K076j303L47J98j121
3594f88P83J009j542j064J995M54j036N67M26j330o45K543j738P00k21j469P23
3611e33R18q00l54J917p95o85J732j215j626J195Q31j234R1J145o98q0J08j101
3629a184K029j3j360P1J710j589K68J630j479l85J797j051L94q63M82K67L27M2
3647A093j915K007m82j906Q09J119k074J247O55j353m0J948p36j777K528j632
3663e09q21J947l96j089J289o41N33M9M31j539J476J208k863M99K164k462M26
3680b98J51j8N12K62m29j261K111j371j342Q18M56q65K009q46n30R10j6j025R45
$$ y = [9, 376, -386, 218, 287, -1092, -203, 1153, -721, 824, 263, -1217, -1418, 1113, 581, -180, 669, 91, 4, 951, 1144, -311, 350, -128, -670, 367, 493, -328, 560, -684, 341, -885, 1191, -112, 235, 433, -688, 95, 1104, -438, -1502, 493, 947, -89, 478, 904, -426, -1071, 1472, -266, 434, 213, -1256, -533, 385, -415, -769, 1148, 353, -332, 1400, 185, -1441, -246, 585, -649, -558, 587, -111, -191, -83, -1184, 845, 832, -528, -457, 1253, -336, -68, 1562, 83, -302, 1495, 444, 838, -25, 457, 724, 1051, 1093, -822, 1185, 703, -1203, -394, 725, -1349, -102, 553, -800, -840, 1108, 372, -1405, 1123, -509, -1330, 617, 221, -868, 421, -220, 313, 362, 793, -746, 730, 1938, -925, -426, 1738, -724, -298, -147, -165, 347, 609, 180, -1081, 1030, -341, -1683, -865, -409, -1274, 735, -111, -641, 269, 253, -772, 173]
3699A73k22k87l36J345m72j82O71p47J192O87k697J267p51O89r17j28N15n42J775
3718A033J16k876K306M03j378R82O57k008k59K067j067q62J461o63j406K049M46
3735A001j640J204k45l40R10j258m69k7K870k245n37Q93m17J245M22k004k55K108
3753A216o46k116K026l34j700K920j285q66J341L6j143K64K31q61J654o39j021
3770i23L14J653j355l37J088j687J011J477o90j253J371M5q26N13O24j486J66
3787b95L70n58P74M38p76r40J637q49j6J236j749Q90J09r45l91J717J10j492O99
3806c1N92k030J666J38k55K1Q06r74q62J488j016M31K9o68o14J212K33o99J048
3825E15Q72k075J172j5p37N54J70k03J43J670k097L51k63L49j335J911j821K79
$$ y = [173, -49, -336, -672, 673, 201, 19, 690, -57, 1135, 1822, -875, 392, -359, 330, -587, -715, -200, -742, 1033, 1149, -1727, 579, 982, -396, 586, 1243, -765, -1024, 1043, -24, -886, 575, -88, -1494, 555, 1001, -639, 565, 320, -20, 890, -368, -837, -864, 2006, -239, -776, 117, -300, 945, 1367, -637, -892, 1216, 570, -1546, 480, 146, -1554, 1366, 81, -785, 556, 592, -551, -287, -56, -917, 737, 98, -923, -609, 1044, -311, -648, 440, -1247, -236, 1241, 551, -702, 669, 714, -112, 401, 1025, -461, -295, 75, -483, 291, 729, -47, -987, 650, -199, -215, 1021, -728, 162, 271, -674, -1065, 652, 762, -730, -31, 561, -1469, 197, 335, 80, 101, 907, -67, -929, 559, -457, -26, 3, -665, -1279, -67, 166, -533, 515, 1387, -688, 484, 469, -268, 286, 456, 253, 396, 2066, -31, 320, 57, 406, -929, 982, -839, -560]
3843e60J512p66r39k5J530j102M32O17n39k1m14j91P13j29j267J456P07j585p42
3862a313J514L4r23O12N5q0M51q14jO44k37O1l66J693k382J729n79j502R63R98
3882E57j499R33R83j604P85Q25j439n31J392L85j746J266j754l00K126l90l29
3899c40J133m44j095P19J124p92L8L0q00n96J375r63p25K022j733k30J441l59
3917a95j802J887R99k112J537L17j358l42J049M04j042J329j089l54J115o42j81
3934d80P44K7j256J470j365M2Q76N67j386J456J34j287J29K200k615L66k27J244
3952F39j510J485m39m7N83j106n59J685m31q48J292j180j78M72m10Q44K1n41L90
3971A62l30J892j974JO22o3J38j98l12k77P28K55o08M27j443J645j62l87j321
$$ y = [-560, 952, 186, -753, -778, 752, -350, 82, 699, 160, 139, -275, -466, 247, 118, -1149, 307, 1014, -571, -1313, 201, 235, -688, -76, -21, -101, 350, -464, -465, 179, -58, 3, -363, 1330, -1052, 677, 98, -1404, -441, 557, -942, -9, 974, -630, 155, 980, -459, -990, 402, 787, -959, 307, -1447, -1747, 379, -11, -340, 793, 349, -746, -27, 1097, 305, 343, 373, -427, -1023, 352, -611, -1336, 686, -1047, -1277, 164, -195, -1997, -110, 889, -1223, 314, 631, -727, -1069, -20, 384, -658, 671, -418, -772, 343, -299, -480, 264, 291, -965, 505, -860, -818, 58, 625, -761, 695, 829, -458, -329, 1871, -744, -378, -605, 639, -871, 614, 175, 128, 711, -395, -954, 731, 300, -548, 744, -436, -614, -142, -552, 292, 313, -228, 162, -168, 1724, -250, -249, 373, 310, 448, 250, -62, -339, 389, 644, 36, 463, -980, 665, 503, 116, -1205]
3990a205J738ml62J4om06K15L51j57j225K059j060k82K268k927Q33O46j19k410
4009b039J972R85k990J832J237j841J146K19j766j88J132M06l42L9q70J66J942
4026A040q53j548K168j58j358Q30K13q52L33j25K00l56O85l92j11M08l69l96P68
4045A27k51K47K09o89L64J95j028q26J834m04R1J08M91j106K117k71k771K716
4063A153n01q69L80R9p06OP47p02K42J334r60n98j9j25M18R77o35n12P25P75k228
4084i99N60R20j048M80R65k112J464o0j44p42J330r87l33J667o10l1l68N39N14
4103A005n36o44J65p55Q68p2j95l78O69K97l52l77M02O01j420n9J755p85j55J173
4123A207j565Q04k61N13p89n8N08L51p95Q98j368P04N30j319K29P44k38n38P95
$$ y = [-1205, 533, 529, 167, 181, 175, -231, -16, 335, 178, -1047, 1012, -48, -330, 1938, -989, -156, 490, 371, -2039, -67, 918, -2072, -240, 997, -844, 302, 521, -1245, -1433, -301, 105, -237, -198, -1068, -902, 1040, 187, -1361, 807, 649, -709, 121, 334, -518, -185, -310, -110, -466, 219, -173, -284, 124, -245, -641, 127, -124, 123, 332, -357, 7, 202, -826, -1652, 182, -222, -131, -23, 468, -638, 1479, 1208, -1563, 1153, 652, -217, 163, 262, -444, -438, 309, -393, -151, 1183, 223, -375, -394, -519, -101, 876, 241, -271, 454, 1229, -999, -439, 481, -567, -87, 878, -1234, 230, 170, 26, -716, 614, -373, -706, 961, 351, 320, -48, 491, 1005, 469, -175, -10, -765, 103, 31, -164, -542, 127, 424, 72, -305, 97, 698, -722, -781, 974, 189, 34, 1207, -358, 446, 185, 698, -91, -149, 359, 710, -85, 813, -555, 149, 679, -640, -411, 333, 95, -443, 352]
4142C52M41j231J731r42L06n06q06m61J560l1n06o23Q51R69j727R68o35m43J201
4161D68q6o64J134j032j4m29J716n07j614J277j003J163j10r24J31O68M03j612
4179a035N20O89q59J466K04r40l24O17n99R1J53M44n32M36j314J600m90j546J235
4198a84N47p07P55R2j161M85J29L34l68J096K79k113O44P91q19o97O44L29J535
4217A611j716o44k59J825j044J35K73j176J146J34j362k46K913p17k337J699J123
4234A358j752N06M74K2l87P59q15p33K160r71p38p31P74O2M68j674R55J671j042
4253C66j380K457j191j76l65O88o43J590l5k211K506j084m55j62k63J47N93j22
4271B60r41K27L1K69L65R58p20j42P44r23l85j41j30k30J760l02j629P2Q16m4
$$ y = [352, 793, -438, 1293, 351, 657, 151, -655, -1116, 444, 413, -93, -716, 135, 1104, -623, 345, -290, -733, 468, 382, -282, 852, -180, -194, -623, 1093, 586, -1028, 249, -754, 409, 299, -625, -494, 174, 577, -1035, -515, 174, -685, 781, 985, 45, -279, 338, -261, -170, -17, 427, -105, 331, -983, 617, 127, -1419, -184, 363, -344, 411, 503, -658, -173, -44, 290, -78, 1018, 1297, -816, -172, 619, -200, -897, -253, 76, 1611, -105, -749, -1008, 817, -227, -92, 181, -995, 151, 285, -1077, -1323, 1590, 873, -1464, 235, 1358, -394, 112, 586, 608, 221, 980, 165, -568, 1592, 621, -117, -848, -74, -12, 456, -1218, -263, 1408, 366, -1014, 1443, 252, 76, -289, 399, -244, 1346, 1311, -900, 1606, 522, 67, -95, -358, -211, 382, 260, -681, -454, -423, -154, 211, 1169, 449, 307, 1051, 128, -257, -398, -528, -758, 1002, 700, -929, -857, -41, -85]
4291h5n20J140j192J2J051o92l53M67O83o48N56l8nk7k45m82Q94Q40j960Q01J73
4312C70l2j313R56j016J358N65j006j617K652J19j779Q27j92O83m05o16P41L1
4330C26j54q00J158n70P01j554Q69k17k63K94l88P18L67j175m56J042J34j041
4348a009L80J653k349J786J71j549R83N56K12j023J333n09m93M61j521n27K408
4365I63N7j847N13P70m98l33n68O30M22O90k074R22O33l83k17Q81J3r07J349k054
4385a038J965P52j728o22J065K32o58l12M00n64J002lp02J144r4K49j195j08J33
4404h2P7m10n5q97J295m23P8M04n17P32p42k42R76R05j458n34J578L90j941N48
4424c18J344r86J149j144j146M31R83J303j431P26j125l06J082j149O03k62J441
$$ y = [-85, -605, 535, -657, -645, 406, -286, -639, -172, 511, -137, 419, 381, 376, 349, 104, -378, 516, 1356, -604, 197, 370, 338, -975, -19, -1035, 323, 888, -118, -1735, 917, 1036, -743, 84, -108, 575, 170, -446, 295, 326, 172, -628, 530, -40, 661, -893, -24, -241, -504, -210, -598, 120, 487, -688, -1144, -102, 32, -1009, -629, 1024, -1325, 461, 632, -917, 66, 622, 834, -189, 1144, 635, 142, 603, -918, -1445, 963, 1020, -827, -314, 456, -42, -375, -943, -313, 109, 799, -1275, -353, 280, -103, -320, 561, 574, -333, 1016, -1038, 927, 1679, -49, -671, 394, 626, -32, -344, 56, -508, 494, 491, -211, 933, 839, 1088, -107, -215, -82, -5, -415, -470, -1367, -72, -495, -417, -13, -530, 202, -540, -782, 194, 1099, -359, -893, 685, 1075, -866, -318, 1026, 40, 1189, 45, -1101, -670, 313, 1616, 185, 911, -214, -520, 562, -587, 16, -246, 1195]
4441A195k833J324O49o20k67m12J085k03n8l79J432k53p31o63P86L45m93l70L73
4460i3L2K050k671m27J058j14k05q26J081m68L68L34m26k76J462m51r87R12n35
4479a82l54p71R16j99Q26k54M16J90j226n2Q2N97M13j143K61j15N28J500k103
4498f70l08J246Q46k434J341m88N15L44p99j08J186K91j877P29Q19P2m20J68j242
4517g89J116R2p88O93J02l88m89J126k12j99L71j38m77J585j537o75K98N50q32
4536e91L86J4l79J446n29r69j163K490n17n08O28P56j293r60J255l2J57j49J44
4555A86R79l84o04o21J27J129o8oj026q3R35r19O17J00q91m13P67P45j038Q16
4575C48l73n72J133L02n43n02L57r82J058P45k046J162K04j351J25J879q06O15
$$ y = [1195, -1638, -314, 335, -285, -552, -964, 121, -82, -140, -519, 913, 660, -71, -734, 52, 397, -96, -466, -93, -61, 1989, -682, -1109, -51, -165, -370, -1196, -115, -583, -215, 119, -307, -583, 879, 428, -559, 353, -182, -536, -1307, -391, -590, 236, -18, 398, 588, -638, -690, -608, -11, 402, -741, -480, -595, -67, 1433, -670, -978, 268, 1114, -1320, 21, -467, 48, 392, -407, -515, 671, 962, -915, -186, 633, 705, 285, 453, -789, 327, 419, -369, 324, 426, 38, -451, 675, 463, 264, 635, 497, 20, 1605, 68, -607, -309, 241, -591, -205, -191, -570, 876, 347, -622, -1785, 705, 188, -320, 308, 1064, -229, -1189, 66, 34, 191, 42, 186, 1165, 781, 177, -444, -317, 812, 744, 738, -288, -371, 564, -355, 262, 362, -529, -942, -175, 570, -468, 348, -25, -597, 536, 838, 295, -207, 150, -832, 226, 971, -1075, 87, 291, -1060, -935, 944, 138, 753]
4593G53j179M77P41o30j26o62Q25j36n24J154n65k15J77m22p44L91J746j294l32
4612e65Q68p12M45m55L23J76K139k665j43J599j61j450K35J081j470N59M07q00
4630e89J233N83j308r34J448j285J313j13j27l11Q99j150L99Q28Q37j563l95M76
4648B41l85J77P40n05K47L74r95p14J332L90j399P30j31L89n78J43K77L03j351
4667g15o08J157N90j476J531l07j056J356p50M03n82N08q63J701N14j786N29L38
4685D84m57O26J054j512j239J218l60p00J281p39J17p2M66p39M97J702j804J77
4703@m11L07K81o5L63k89n03O14j879K795p86k39p97J348p66O5k94N42l1M92l08
4724D39j299K272l67q36k26L14J49l83O46n76N90p89l83p6Q29j02J122j845K64
$$ y = [753, -426, 51, 792, 162, 36, -626, 199, 63, -461, 693, 128, -87, 90, -332, -1076, -685, 1061, -233, -565, 303, -409, 36, -419, -96, 80, 2219, -446, -589, 1010, 849, -601, -366, 715, -755, -196, 211, -589, 644, 1227, -81, -1015, 433, -852, 461, 348, 221, -90, 809, -341, 58, 886, 1723, 160, -235, 241, -144, 33, 773, 268, 515, 889, -106, -820, 512, 902, -497, 233, 102, 491, -87, 56, 333, 636, -715, -1323, -166, 424, -1052, 479, 172, -884, 472, -278, 125, -457, 51, -812, 889, 1403, -383, 146, 484, 27, 653, 1707, 195, -1044, 174, -186, -886, 395, -344, -227, -299, 167, -572, -75, 1627, -177, 0, -411, -104, 177, 112, 475, 186, -317, 297, -1582, 1213, 427, 188, -609, 739, -27, 38, -256, 286, 255, 747, 439, -860, 1412, 1045, 209, -17, 297, 446, 63, 709, 133, 723, -66, -449, -525, 304, 202, 1324, -521, -257]
4743b57N97k87r93K72K192j942M87P10n36n00J132r83K37O56J91j128K80K20q61
4762e13j39J011k044J795J34p09j011R10O15j193J385q6N96J29j835K85M65P64
4780E59j449K67J178L18n41j84L74j017O28r32N20J316j551m75K011K02o4o04
4798E56j209P76L84P5o71k63K91J83O6J76j74L2K06r57P90K76r71M45J55O2j07
4819A21M41l00j31Q0J06j068J265p68o88J205m59m67Q37l10rk86O84l56n77N99
4839h1o78K21k4R15k095J899L45k315K159k47j103K96J586r87q8J83K60p29J228
4858G45j027m58J620j183K72o50N80j65R95r33r75K9J781m59j012R49j40l62Q39
4877D46j657R42Q72p96m56P50O45j361L40n18R84L4k64j309K051r28r1K21j67
$$ y = [-257, 340, 53, -940, -668, 1524, -418, 69, 779, 243, -257, 875, -108, 129, 785, 976, -152, 128, 348, -513, -652, 359, -1685, 110, 244, -465, -1476, -566, 49, -1144, 241, 155, 751, 880, -955, -670, -205, 559, -890, -623, 555, 873, 332, 148, 522, -495, 133, -799, -279, 1037, -514, -989, 1022, 1224, 1160, 556, -653, 123, 507, 582, -89, -352, -61, 122, 188, 364, 190, 222, 428, -529, 261, 537, -434, 11, 166, 228, 121, 562, 262, 131, 211, 317, -751, 514, -254, -942, 263, -196, -663, 174, -136, -145, -431, 253, -103, -680, -81, -759, -538, -562, 353, -1742, 157, 502, -1813, 346, 99, -1004, -708, 878, -109, -197, -14, 246, -483, 745, -282, -740, 880, -303, -31, -681, -101, -266, 729, -204, -1179, -1150, 631, 172, -840, 109, -31, -393, 446, -1211, -269, 603, -193, -649, 101, 746, -615, -275, -793, 191, 225, -39, -1348, 703, -225, -316, -95, -262]
4896b62m18J092l88k36K62K24M24J10j55j239L79K43j054Q27J114j376J6J22J536
4915A221j155p3J936j936m45J088l42p56P02j383K14J262Q7l82P27j359K50L41
4933cJ54j33p72J295j337J075m73L36j10L88M9p43O34j787J517M08L5q56R10m08
4953A79K03n04O47q92J042o22J09J401j295k76R6p9l53P01K61j434n26J180k40
4972d02k50L24P47j077R01q53M09Q11j107m91J465K30n28R44j277n96Q29L64j8
4991D25m56j07p15N55J117Q45k019J321j536Q4J09R30j496J001j98j133J037k34
5009d70J79J33K21j389N09l6N08P13n63P26j069J460j417k14Q01o9J37o1J59p33
5029d75O46n3n04K60K26o93J203j817J983j185N04o04J39J276j303P24o16J18
$$ y = [-262, -680, 412, 24, -212, 50, 274, 698, 808, 653, -586, -207, 36, -1018, -191, 923, -453, -437, -315, 1221, 66, -7, 1929, -7, -452, 636, 294, -462, 240, -1143, -929, 333, 420, 38, 765, -594, -344, -3, 151, 18, -754, 541, -796, 279, -194, 142, 32, 420, 469, -274, 360, -1427, 90, 498, 533, -323, 587, 179, 382, -122, 525, -367, 675, 53, 162, 1563, 268, -8, 88, 9, -344, 357, 618, -816, -1342, -162, -402, -652, -328, 419, -658, 243, -610, -201, 610, -497, -988, 477, 707, 179, 1123, -154, -750, 79, 443, 425, -31, -138, -853, -298, 819, 1664, -355, 966, -570, -486, -377, 553, -943, 58, -140, -1273, -236, -470, -291, -158, 63, -1326, -817, -853, -345, 368, -195, 531, -538, 922, -495, -709, 92, 23, 160, 99, 258, -475, 171, 118, -386, -126, 100, -593, 610, -1207, 776, -409, 95, -509, -370, 906, -397, 327, -289, -171]
5047a71m99J0M48o35J092o86R22n87j94Q43K64K53j987J153l05m50L34j02m67
5066g64O78P80J81j722R77l21J152p86k35n49L01J161q47K74M8m49j04O77j31
5085C21j867Q62Q84m23o7M60k40N80q44K94l20O90p95M67L63L6j037M54N32p93
5105d43Q02j403L92R48j276J480M80j48j506J250m40q2n63m58K241r9p78j721
5123a324J239L07j65J84r6j28K05J97J56m64l26N67r38O40K43K13q19J11J16r7
5143a79O9m48m36J818n98K21j02j074j74P93K94j52J84p51M45L74j048R05l85
5162b44m74O53q44J229j132J537q82k65J03n7o87J120L80m60q4J356j68j325P59
5181E15l27r33K73J11k40J418r39j19m1O71Q63j734K43N78j166Q30m02M66J118
$$ y = [-171, -670, -660, -212, -847, 245, -441, 481, -106, -300, 543, 807, 1060, -927, 226, -79, -529, -195, -297, -764, -86, 694, 875, -847, 130, -191, 961, 175, -60, -609, -308, 853, 6, 280, 328, -121, -225, 452, 321, -1546, -684, 200, -223, -290, 170, -70, 510, -334, -40, -360, 330, -465, 2, 365, 401, -636, -182, 350, -443, 359, -1044, -652, 296, -980, 500, 980, 832, -674, 576, 136, 54, -509, -967, 1274, 1175, 397, -1324, -85, 222, 57, 241, 145, 17, 222, 419, 575, 111, -215, 352, -586, 54, 297, 510, -309, -198, -82, -179, -110, -558, -994, 824, 226, 447, 345, -729, -903, -110, 184, 32, 216, -535, -90, 284, -764, 141, -244, -718, -65, -909, 320, -812, 725, -157, -422, -319, -376, -1063, 57, 437, -23, -107, 1249, 1081, -244, 515, 188, -745, -472, -361, -601, 817, -122, -241, -282, 389, 1252, -482, -239, 339, -827, 3, -399, 67, 1185]
5200A185j632k53J848j283l93J088Mj654R65O58j011n84J412o01R77q05r78q0
5218a137P67O91k42R6p18J686p74q55L28J095j192L79l43L35l53p20J258j355
5236a054J660j279J33q8L73R84r04M84n24o49J329o50j026M68J002l11P48J11
5254H07j369M29L16p13R74l7J08j286R24M17n42J164j251j16M96J88K14p28m6
5273e1n81R47q13Q83k71q52J810K26j500M88l15j39L30K25K85j119O72M0j095
5292h30L92N56R3J43m19K5L54M3K87q42J125j485K34k15J099k044J193M67q90
5311g14R80m20J119j58j092l28N66R86q28k95O21k29n96k79J454m36n85P79r76
5330d31M50n8l47m90J170N09NL54j328O49k12j2k56K1J43K06l02N66p13j23R49
$$ y = [1185, -447, -700, 1148, -135, -528, 560, 564, -1090, -125, 533, -478, -1062, 350, -251, 726, -79, -1057, -1137, -370, 321, 79, 175, -543, 1143, 369, -486, -158, 937, -255, 124, -219, 116, -237, -957, 301, -1054, 606, -673, -540, -628, -255, 729, -175, 309, -215, -864, 465, -185, -1211, -743, 259, -52, 696, 807, -562, -133, 183, -530, 444, 407, 515, -771, 153, 570, 28, 1192, -59, -175, 321, 509, 723, -5, -51, -632, 315, -498, 385, 114, -738, 1072, 1298, -202, 286, -29, -168, 162, 387, 672, -447, 225, 265, -830, -438, 118, 211, 354, -65, -40, 314, 357, 644, -198, 927, -558, -324, -539, 560, -1484, -291, 176, -714, 266, -154, 965, 807, -285, -613, -47, 939, 111, -184, 437, 208, -388, -667, 787, 351, -234, 545, -431, 19, -39, -386, -876, 294, 803, 808, 1162, -166, 483, 271, 259, 3, 24, 167, 373, 71, 637, -76, -199, 750]
5351G50j880J865P7m85J80O80j585m66R93n44O30P72j272l70J356p01l54N47k0
5370A73l24N56l19q92J050R16m45k82j049J408j559J498n85qN47l97r92J250N57
5389A103j447J142j67j731P91l43J112l44J52o87Q14L17P6j05o26j75m94J019
5407D07k57o80l7K36P89j46j494J251M41L35j443m8J257j073K061k233O37o64
5425f61L55R41j207O82L61K32m02r53QJ430r97k92J372q74k15k94J560q23K49
5444D72q18M8O99Q94j499L3O35m29o25N82N11m33J129j647Q95n75k37k78R43q65
5464e65M08N92p19O64j035J13M84N11N96j136M65K6j058N22M17N55k014R64O62
5483D52p44l02O18l74l63J76O87N03j246M46m47m68O47J062k44j170J056M15p56
$$ y = [750, -1130, 735, 812, 327, 507, 1187, -398, -864, 129, -415, 215, 987, -285, -655, 701, 0, -354, 193, 173, -151, 405, 86, -806, 244, 1160, 715, 433, -616, 792, -767, 731, 146, 138, 685, 288, -704, 546, 1103, -344, 798, 631, -1100, -309, -652, 460, 116, 268, -419, 395, 712, 788, 683, 57, -118, -612, 407, 150, -530, -567, -331, 458, 312, -1182, 69, 510, 845, -598, -646, 611, -462, 1599, -634, 3, -661, -306, 635, -572, 110, 471, 703, 301, -652, -644, 786, -211, -503, 869, -5, -220, -514, 1046, 223, 472, -346, -298, 401, 1295, -204, -171, 464, 35, -590, -8, 503, 70, 1199, -448, 447, -128, -365, -643, 300, -565, -157, 435, -284, 380, -655, -542, -58, 453, 1049, -87, 378, 404, -654, -132, 285, 840, -1174, -210, 452, -292, -594, 24, -350, -713, -537, 150, 653, -593, -147, -594, -1062, -415, 647, 403, -767, 289, 704, -52]
5502e2K62n78R16l00k99m41o52L90L80Q27l41O3P1o72k36J081j168J832j326r7
5522c40R6P14N35j038J34J14P6k58n47Q64K56r23M82n86L08M12l90M06o60M18
5542G3M55P2q94l07r65K027m63N78j424J495o72m9J327k41q08m25J169j817N02
5561c67J373j482J798q87j433K019j631L87M71N97m33K23m05r87R29n65k61L89
5579b65P63j046O56l25r4J931j900j53l98J196k25p01k7J306r82Q06K58j065J054
5598G89j721q7J824q91l25J093m16l92P15K67R74j001J80q5j757O57p23M15K80
5617b04N76r90J020L1k73j076J679p98n82J331j59m94lj05k7O6M35R3O5m50L60
5638D95q18m12J043Q00j533o26J475l00j272P09L47O8n07J169J89n45N78p53N1
$$ y = [-52, 210, -368, 548, 248, -51, -492, -1144, -754, -374, 453, 112, 175, 246, -426, -662, 419, -749, 1083, -243, -340, -244, 470, 1005, -33, 101, 215, 291, 33, -514, 350, 606, -317, 165, -421, -113, 299, -91, 315, -345, 73, 528, 600, -294, -601, -1566, 461, -2, 576, -848, 647, -25, -74, 1253, 1012, 204, -221, 948, -869, -367, 1006, -476, 1322, 435, -998, 1021, -610, -223, 248, 845, 412, 635, 230, -757, 172, -393, -654, -265, 498, -548, 108, -217, -311, 1620, -280, -433, -831, 365, 140, -561, -588, 718, -264, 542, 800, -265, 789, -932, -1019, 805, -86, -411, 682, 266, -126, 589, 856, 1830, 829, 1009, 924, -833, -176, -899, -484, -204, 372, -618, 402, 433, 160, -916, 763, -35, -617, 714, 555, 61, 58, -47, -74, -8, 427, 520, 585, 135, 495, -323, -735, 308, 1108, -425, -1051, 424, 124, -1148, -439, -92, -24, -531, 638, 827, 282, 860, 107, 158]
5657A58j59L23j082J133K82j268J200m70q3P05o47L33j089K028j527J56j84n87
5675g78J38J460N46j316N30j025P19mJ27K07l57j030M10K87k81j00R49j307K581
5694A756k013L19n73O14J654k014J63m52J148j203R75r07R50j50r62j08M03N82
5712A82O6L73j154q06O43J007n32k51R27L24J68j403O34j94L87L50k069J070J320
5731A042j488k44j60J13R09m11l45R0J067o88n07L62J58J368j153m15O2P66r4
5750D32j01K5r36J253o09J46n68l39J164j211q4R07M41n51J965j628k6K55j087
5769e52L34J354j796M82J131o94r8M85j052M45K70Or31M55J129p16R16p81m46
5788e9K31J81P15j196L07N84j240N97K57o48K34n79J081o88K97o75M75J05l37
$$ y = [158, -1, 322, -760, 373, 655, -613, 587, 117, 34, 739, 92, 425, -664, 1364, -163, -7, -191, -778, -640, 820, 1366, 50, 580, -445, 274, 270, 397, 604, 247, -783, -373, -86, -367, -467, 482, -825, 1756, -257, 62, -511, 103, 1757, -257, -94, -546, 602, -601, 374, -533, 417, 267, -695, -803, -400, 182, 248, 621, -533, -1339, -696, 311, -221, -472, 455, 779, 947, -456, 178, -16, 371, 721, -1348, -278, 1042, -446, -690, -850, -737, 172, -239, -584, -494, 573, -115, -622, -260, -102, 1266, 113, -302, -240, 526, 432, 331, 356, -580, 673, 64, 210, -358, -697, 467, -744, -828, 79, 520, -31, 1934, 306, 280, 535, -552, -218, 1136, -660, -178, 953, 259, 161, 646, -406, 39, 309, 315, -616, -161, 968, 252, 1168, 387, -59, 172, 353, 1068, -128, 179, 763, -477, 120, 377, -271, -37, -616, 465, -223, 74, -601, -126, -21, -358]
5807c58Q04o05l64J77Q43k97o59J040n20r57J403o84J21r4q6K27K6j80M2j59r42
5828a222R71n6J041j595P45k66m09P6L40J748k887P68Q36m18l84J19O25Q52j286
5847d02J81K06M42n67R77o58l62P98n75O38P53J73k123K59R76J24k126J624o34
5866b96M13q4qo30J94J140j188n07K091o61o67N90p5K04j250R64J54J050j130
5885C04o93Q98p95K53K2Q81j557J153j415M10j47KO67j067J363r21J008r84R9
5904e19J76P95j8J23j377J168m56j080J048k65l10J392j644M72P90j071R8N34
5922a44R50j002O07q14J73l1m73M90L00n22J174j085m44R84K96rj066L88N35r12
5942f05P75R03j448o81J054N17n26K35j62o15K09J52l3j02L73j6J10o16J467j98
$$ y = [-358, 446, -159, -523, -346, 497, 200, -459, 581, 61, -896, 507, -177, -56, -150, -236, -9, 17, -163, -121, -280, -1222, -251, -307, 734, -861, -116, -382, -791, -715, -375, 1373, -1514, -746, 90, -328, -712, -593, 32, 884, -402, -221, -15, 427, -140, 837, 179, -183, 615, 40, 678, 1431, 1604, -519, -260, 716, 840, -1286, 338, -296, 117, 33, 25, -605, -411, 729, -459, -966, 1125, 464, -203, 387, 312, 516, -734, 230, 384, 1434, 304, -389, 509, -286, -33, -11, 870, -687, 466, -949, -539, -686, -684, -17, -1084, 279, -642, 366, -618, -519, -343, 452, 434, 557, -820, 348, -108, -1188, -140, -405, -715, 677, -967, -495, 295, -776, -678, -144, 806, -196, 411, -403, -230, -261, -734, -244, 56, -466, 708, -377, -821, 163, 459, 450, -616, -228, 307, -605, 170, 1073, -375, -1056, -2, 515, -11, 224, 62, -553, -344, -192, -225, -327, 46, 30, 140, -476, 991, 793]
5962G93p30K36m74oL13q2J80q29Q29O88j198l75J717o32o45J106k39j570Q80Q09
5982G71j665j07k8J417K1K8k51O88r77L49n70l83m17N65PL62N29k9J56l20n2P5
6004A69m35L36K72j091R99n16N43K56K21p72j80N47J46m95j93Q63j099N41j016
6023i04R10L41P27j292o05L00O24M6K96p99O07J35j580P11j82l33J469K20j665
6042i74K19J716r17N97K08j335O45m30J464j932N42P47n98N72j81M93m27lj20
6061B86q5q70O01n16J342m29m11o16n6R75J94k52l32p1P65m72l11L83L80j205
6081g00j2J192L77j347J91P23k80n53L48k37O60j487Q13N96j482Q08M45n51P5
6100d21R08k23Qp23o19J294j47r22R41p67J88m31M00L10M78k91l5J73j149J208
$$ y = [793, 63, 299, -175, -181, 132, 50, 230, -599, 230, 918, -280, -655, 1062, 430, -215, 891, 652, -918, -38, 771, -894, -1001, -1029, 388, 409, 437, 186, 874, -103, 246, -324, -707, -1124, -559, -552, -190, 339, 310, 466, 146, 94, 169, -266, 70, 342, -749, 250, -266, 277, 533, 754, -18, -198, 349, 495, 0, -193, 670, -429, 112, -904, 6, 347, 1074, -218, -823, -523, 101, 147, 443, -356, 251, 386, -1194, -483, -665, -998, 471, 691, -974, -755, 961, 44, 641, 849, -486, 159, -271, 1193, -739, -197, 550, -48, 524, 343, 836, 409, 406, 286, 201, -669, -68, -584, 758, 329, -82, -698, -754, 221, 415, 163, -169, -240, 525, 53, -258, 125, 505, -700, -712, 480, 857, -490, -299, 424, 144, -409, -61, -298, 362, -1125, -312, 284, -1198, -390, 55, -496, -421, 487, 264, 272, -451, -1070, 224, 77, -845, 96, -671, -483, -914, -514, -204, 274, -17, -52, 121, -1028, 180]
6120A80j45O91j782K199j536k86k71J049K51L58m19R01j575M59M62q31j49J413
6138I69n34j233J083l66K36o02R74l31j347J460o42m56N57p42J251m56L0l25J072
6157E98j65q82O1L36k82j84M70j75J868k197K03P18j07o45J32m64P49M73J58m61
6177B04k11k1k42o16J217k40j158M70N21o89P47P9r3o13M00L21M98j01j530J540
6197D83K90j008M01n89J212j120K23L90L73j178K33N74k14J5n52Q12M79j919R74
6216a21j47j31m7J080l24n81J059j812J431N1q65O75L07Q50j870Q44n88l18L02
6235b05O00q70L87K05q49J169l58n18J023L38j189PJ074j101K27r26J572n32J027
6254A081j143m80L36j75p01J235n58O29O46m55n16M8O61r3n10O74j337Q89n13
$$ y = [180, 35, 726, -1056, 1143, -393, -679, -950, 99, 350, 708, 289, 1190, -385, 74, 536, -295, -444, 969, 435, -798, 285, -81, 155, -447, 527, 196, -1151, 309, -333, -789, -232, -974, 277, -179, -149, -474, 598, 433, -449, -388, -52, -334, -518, -48, -223, 1645, -552, -349, 369, 262, -383, -251, -715, 34, 507, 665, 204, -7, -28, -270, -886, 331, 91, -1067, -597, -76, -765, -18, 61, -32, -645, -245, 76, 574, 473, -1057, 483, 773, -235, 166, -423, 789, -331, -108, 282, 655, -523, -290, 284, 70, 85, -467, 345, 824, -1095, -121, -268, -399, -446, 634, 310, -271, 788, -1024, 407, 458, -407, 268, 575, 1425, -445, 399, -189, -507, -205, 395, -475, -88, 117, -732, 437, 79, -439, 584, 922, -267, -260, 814, -287, -60, -986, 586, 54, 1081, -62, -542, -206, -381, -1082, 153, -405, 224, 870, 415, -101, -53, 608, 515, 5, 679, -658, 231, -282]
6273b82l45l70J868n68o83o3J43l30O04j140M75J415o01M02l39k63J575k129R71
6292C40J75j703K117k22j422J319Q36j756J12m17o00J839j542J30J150P59j339
6309b24r95J129o53R43k80R50k199R00J341q64J55O33k58j018N3M07n20K48K92
6328D0n89R93n99Q17j207l86J527o7j018o8J653j040m23J901j837Q04q48N78j084
6347h53J242n97k48o33N2R93m36J146j006J096q52j28r8k32N72J224j565l44j6
6366f83Q77J0m5K90K38n72l5k63K32K40L80r1j478J932o11j114L03K42K76k27
6386i9Q50j883N21J407n76o33P05j181J405K11j319R00M67q47n67J770r52k49
6404g0N50k0j003L18Q86q74j56O51J37j132R13j074J431M50q34J73k04o78N45
$$ y = [-282, -627, -997, 871, 303, -380, -443, -300, -630, -26, -1166, -691, 724, 123, 525, 186, -77, 1498, -631, 340, 515, -1188, 929, 707, -715, 604, 1440, -316, -204, -621, -1221, 618, -924, -794, 356, 1115, -224, -1219, -90, -743, 200, -80, 870, -1329, -429, 912, 48, 203, 836, 578, -440, -387, 20, -500, -252, 40, -549, 444, -155, 662, -545, -931, 596, 529, -489, -557, 1096, 56, -367, 1534, -303, 501, -347, 231, -853, 389, -208, -456, -1089, -1037, -44, -480, 666, -340, 756, -96, -224, -322, -554, 18, 1242, -323, -667, -683, 194, 204, 159, 449, 687, 115, 80, -183, 49, 289, 669, 578, -900, 1032, 421, -693, -390, -148, 128, -99, 751, -1132, -611, 796, 220, -413, 292, -889, 516, 727, -592, 308, 775, -72, -639, 1131, 179, -70, 480, 460, -543, -225, 661, -213, -369, 282, 419, -713, 200, -874, 557, 1007, 173, 346, 142, -536, 9]
6423IM42p53J069j284J306j342J165N2k75K55J69j092R87n84k66j38N74M12j222
6442e16J70K47O62l7j073o9J209q27j013J409n07m80P40J72J27O52j001J963k049
6461b21N62k08j06J10N83j179K07R51n44p04J41K19Q18k51k040J204L47n9O20
6480D50J43J65m34o90j79m7J089o7o73l55O00o68P06P20j079N14p08L93J068n83
6500C65J4o38m75J551p31q52k5k11K255j582M25k50N18J67O61j426L82J344j265
6519B27L37j069J328p8m04O48r85L17K26o82K06j52k096K299P36j053l31J113
6537E87N07j728J285m95K28m08j086Q45J203j43j027O36o87R87o03Q50k98R55
6555A608r18p72O44j004J4K01Q31k045K137r47N30r72J675m65q22P1r32j9J45
$$ y = [9, 451, -302, 767, -517, 789, -553, 612, 664, 389, 644, 813, -279, 708, 124, -142, -280, 294, 706, -516, -346, -99, 563, 526, -547, -616, 593, -234, -1247, 162, -345, -825, -85, 87, 214, 866, -135, 1828, -221, 341, 133, 27, 137, 720, -459, -252, 699, 155, -549, -408, -189, 629, 378, -1662, -458, -111, -170, 450, 593, 758, 324, -366, -545, -592, 497, 430, -243, -598, 2, -666, 40, 760, -319, 195, -513, -120, 948, 365, 379, -259, -734, 817, 86, -766, -791, -1002, 1253, -329, 96, -154, 364, 531, 1192, -234, 148, 1492, 227, 564, -505, 823, 745, 341, 989, 4, 321, 547, -135, 71, -81, -2177, 122, 858, -195, -526, 587, 1094, -634, 651, 156, 384, -24, -1110, -265, 938, 795, -232, 404, -283, 704, 101, 951, 653, 1608, 690, -82, 562, -442, -428, -227, 604, -1441, 696, -251, 279, -693, 982, 517, -305, -234, -1166, -1185, -1040]
6574a040K056q82K05L82j478k50J052M64n78k96J262k023O2J689J98l94rJ6k03
6593B33Q46j267P84o16M35l13J520j604J77J479j520j438J436k5M30k88L43r00
6611b88K96m18J18P82K21j76m10j49K84q54Q85n60L89l49%M39l75m19L12L96l63
6632b39L93O45p27j10J88p76K34o58Q46N87k76j43o8N09N94j598M3O54j19L39
6652C18L18j252M39K10P05j319Q74m1J15j55l16N17k46j586P54j92P68J051j617
6671f55K371j830J315l33j612P32J065j584L89k44N19r5O00j382L74K9o56O58
6689c39R36L04j829P54k41N5P02P87k495J613M80q66n97j47J062j152R10k04n8
6708c25j73M73o07M07L92l22P49k01J29q63R92j056J018n14l23M81M31j90o15
$$ y = [-1040, 1016, 134, 339, 721, -757, -1007, 45, 509, -69, -365, 897, -1126, -1064, 625, 823, 429, 420, 436, 233, 1079, -188, 596, -20, 415, 102, 1622, 18, 195, 1674, 154, -1284, 152, 127, 557, 269, 612, -288, 8, -410, -292, 490, 711, 535, 125, -24, 260, -594, 291, -269, 120, -229, -229, 210, -165, -584, -272, 124, -239, 154, 799, 72, -38, 150, -626, -392, -1050, -204, 383, 107, -36, -104, 405, 999, -599, -556, 98, -21, 318, 636, -616, -177, 33, 738, -581, 293, 252, 367, 212, -104, 413, 167, -1419, -665, -857, -89, 962, -655, 1716, -114, 1201, 868, -744, -12, 1053, -531, -142, -386, 133, 38, 638, -744, -370, -341, -997, -339, 597, 901, -928, -174, -415, -360, 342, 1129, -1366, 247, 727, -139, -736, -883, 179, -973, -63, -267, -325, -498, -25, -632, -225, 167, -155, 594, 393, 522, -341, 651, -405, 613, 99, -224, 257, 688, 498, -117]
6727a17L56K44p83m81K15j71J012K88k93o13M30k15n99J611j648R09o33N80J00
6746A92N85j730N11q22J365N28n79k38j162J711r48j107K085k41j57p47J348p96
6764b02O2r93J6J492l46j392O47J546k22k42o73Q53j146M79K97m03J052o49P93
6783I69j585Q37j103R27l70k7n9j00M48o9O63k67l48L27l49K44l26Q16q39P7R94
6804H60j441P78p86J192K90N2l80j306R66j245J159Q01l61n08j092O59P59l30
6822F7j277J612l24O73q26O48N13j066N16n54q48N71Q99p87J40O69r74L02Q88
6841H42j045n97J153j096L00K94J01o80J434J99P0q43J00j005K323j034j370J694
6859H40r29O56m25p40J408o43R3kj414Q61j67o58R64o55J167p53k73M49O13Qj078
$$ y = [-117, 239, 483, -300, -781, -566, -737, 275, 563, 270, -343, 87, -128, -727, 884, -764, 145, -488, 92, 192, 777, -953, -442, -1264, 101, 629, 50, -188, -1350, 361, -587, -1694, 391, 150, -7, -754, 594, -202, -140, -1133, -1117, 375, 29, -1363, -716, 830, 608, 366, -307, 546, -600, -121, 176, -227, 825, 176, 969, -616, 221, -882, 45, -325, -352, -411, -511, -63, -132, 531, 264, -84, 243, -106, 138, -188, 628, -211, -134, 860, -581, 197, -589, 603, 893, 945, 565, -741, 225, -1020, 139, 940, 579, 71, -1021, -362, 397, 67, -1210, 402, 78, 751, -75, 573, 1086, 20, 536, -18, -866, -295, 604, -183, -43, 626, -348, -46, 842, -203, -800, 353, -743, -443, -149, -48, -728, 706, 905, 975, 132, 232, -773, 1550, 516, -854, 840, -89, 567, 142, -598, 810, 167, 260, 258, -1156, -295, -462, -1120, -156, -811, 356, -397, -670, -221, 392, 400, -678]
6880f78l35J323k49l55N14J006r16N30k15Q3l90l79j036J204k45o81l20J390j72
6899G9r10J781k029R48N83J6n23O15j363j46Q20m03K34r15Q4J250n68L70L07p11
6919d81L32K29j173J334m02J82M74n75L92L06q75l45O10l70J36j96p51O31J034
6938D92q13L50R9l18LL67Q5l83K66M3j11L85j091K95j18M0J171p11N6p45M80M18
6960B60L9L16q28k14M92K55j056L69l01J8K30J16P09m12j397J455o69L25K61O53
6980F21r76l33J458M4j330n10O72r30J935j251N51j38j0k17l37J335n09o62N68
6999a9Q1J66J93N43o88l93q54J354m20m15m71R25j127Q08M35O64j582P04O71j782
7019a207J847j299M39k0M57j612P57J737k4n34J83j300p2N69j88N06o11l02m4
$$ y = [-678, -1013, 310, 61, -294, 220, 1226, 310, 840, 625, 708, 318, -61, -1097, 107, -138, -819, -1139, 251, 79, -831, 950, -1079, -131, 452, 468, -55, 560, -803, -949, -129, -532, -298, -1213, -1129, 121, -447, -77, 230, -481, -149, 80, -1093, 241, -161, 21, 495, -80, 312, 618, -257, -602, 8, -362, -226, -422, -1173, -542, 492, -321, 29, 128, -190, -187, 180, 265, -118, 148, 191, 80, 465, -626, -331, -449, -409, 762, 51, 107, -638, -158, 260, 299, 615, -213, -427, 65, 320, -736, -367, -668, -650, -420, -304, 405, -7, -1404, 51, -618, -293, -32, 621, -355, -688, 770, 814, -516, -1026, -354, -1284, 651, -600, -49, -187, -197, -414, -751, 584, 75, -587, -19, 62, 228, 421, 964, 276, -117, -971, 383, -37, -452, -923, 2, -1125, -317, 118, 782, -800, -96, 575, -1207, 640, -659, -220, -240, 217, -1395, -638, 1099, 1075, 541, 724, -576, -648, -79, -267, 239, -372, -674, -718]
7038g18Q15j345J173J60j77r02l84Q06m41K572k087o8J292m27J65r61Q93N30j855
7057i59J192p03L82N2J08K54M39l0j115J665p50q97n70l61R55L13O95j027N72
7076B15N54j342j75O05m09N07O91L98o03j006M25J073j405K85K50K69q68O98o06
7095d44Q98l16j126J31O72M44j121M00k32j77J240k41N43p36N67l77L55p22O51
7114D09q79p18J355j166J982j150L09l10j96J272p9r42J395n86j83J398j238k59
7132D14p90J650m49j131R21p94mk62o53R98o89K19O45L29m31j116J360k68n53
7151f04J248n58j83n8Q10j058J77L44R5PR6j5n65j090J946j162K02k12J28L11
7171a41J00m74J24K80l95J183p80K48M61o88O82j088L87j028J202j12Q23q80p40
$$ y = [-718, 97, -1248, -75, 85, -92, -994, -1378, -572, -1013, 1559, -528, -596, 696, 269, 434, -527, 366, 896, -959, 233, -470, -88, -36, 72, 326, 765, 735, -380, 1285, 535, -362, -932, -1293, -338, -25, 670, -357, 215, 769, -573, -748, -143, -552, -45, 646, 1044, 441, -565, -140, 933, -472, -187, 63, 332, -536, 162, -444, 454, 138, -988, -857, -185, 259, -862, -462, -694, -871, 369, 128, 671, -65, 502, 125, 480, -242, 409, -470, -1188, 167, -999, 983, -167, 142, -168, -364, 908, 829, -113, 1282, 696, 513, 1911, 673, 414, -376, 1274, 825, -306, 615, -179, -183, -445, -1098, -100, -789, -570, 75, 404, -27, -1143, 217, -51, -604, 644, 86, -97, -155, 655, -403, -226, 118, 213, 220, 316, 301, -264, -1354, 592, -570, -368, -580, -452, -141, -41, -515, -391, -111, -506, 677, -103, 145, 606, -82, 600, -488, -101, -1129, 73, -39, 784, -96, -836]
7190h36J185j041O08l59n03R89N8j280K225n93j670J191J218j270q01N25K74J32
7208E2r79J022O37j333j2j77J378q14M13o89j73R22j289N87J51R11q1q22L85j51
7228f2m93J290kK97j682K89R99j024k04J34J210k12n44Q2o18J7r2J412K37j183
7248a49o92J260j146N13J054p35J33K98J50j44Q3k3q41N01j123M69k0r4J091k41
7268C44j60m8L86j88J105j499M4k5m76P0L24Q6L3Kr3n84P46J12r8J14p34O52m33
7291c20M25N87j925N77J629q03q24Q51J15j29L15j390Q41l37N52Q82j637R01o65
7310c55L2p8o14L63O30j27m27N18N44j065O85Q26r05J05m47L5J10K92j96J07n79
7331e46Q66J29n04k86L92L97K29n3r34r4P92o98M7P23L96j101J340o78j016L05
$$ y = [-836, 349, -692, -84, -443, -946, 43, 101, -1179, 1046, 453, -1217, -26, 1192, -78, -879, -354, -80, 52, -927, 95, 732, -601, -613, -790, 588, -226, 187, -502, -675, 247, -1042, -455, -304, 607, 526, -296, 89, -62, -555, 735, 733, 1030, -652, -363, 636, -388, -592, -458, 752, 540, -4, 78, -540, -523, -615, 797, 1034, -149, -841, 419, -727, -214, 840, 105, 238, 536, 686, 542, 625, 602, -239, 262, -861, -392, -412, -506, 585, 344, 184, 136, 522, 334, 1439, -60, -16, -41, -517, -447, -123, -37, -4, -2, -95, -679, 67, 179, 81, 195, -539, 113, -320, 105, 692, -1233, -656, 973, 170, -654, 197, 312, 183, 498, -892, -51, -388, 164, 1046, -591, 310, -355, -323, -401, -1015, -652, -22, -149, -576, -58, 486, -579, 106, 932, 27, 132, -315, -280, -170, 122, -74, 33, -546, 320, 449, -55, -341, 51, 448, 677, 624, -310, -404, 388, -310, -263, 460, 856, -245, 1095, 417, -599, -294]
7351b94M8Q54j200J293j766J274r81J386n59K33O86j263R33q14M79L6M21p99k43
7370b76M18o62j73O7K89O63q80O20k61n26J138R10j718M03K24k35P1m15o0L92
7390a1l29L44k58N52k04n76K91kj59O28o72k62J045l39M54m84L61j179L58J068
7410F26k32j65m58j42j04K20L33m83P12n2j355J499n60P74l20R5n23k81N82q73
7430g07O84K4R2k51J235m88j042o98Q77L39m26J97j44O7R05L47j269O33j170J6
7450g79J249j38n62L44L29n74n55N25m03K98P6o29M18Q1J270m55P5j00k24J99
7470D45m74Q91k201J315P00j285P27q17J006q88R35K62N1r16j92J77m87O84k9
7489i6M54P15m48r16m8O46k81m25O6o8L86L32l54J25o21o35J377J22m34nm2O2
$$ y = [-294, -246, 608, -592, 701, -1065, 209, -772, 614, 55, 288, 974, -289, 644, -170, 309, 345, 766, -33, -276, 142, -520, -693, -626, -337, 326, -554, 66, -195, -721, 417, 1327, -391, 12, 236, 1, 72, -343, -403, -11, -340, 4, -254, 298, 94, -482, -191, -193, -352, 276, -396, -658, 387, 48, 502, 18, 379, -800, -442, 626, 394, 229, -229, -371, -475, -255, 78, -405, 307, 255, -1100, 399, -161, 613, 293, 388, -135, -416, 166, -707, -23, 1, 93, -158, 1077, 589, -453, -1151, -274, 65, -361, -164, -308, -241, 664, 1011, -258, 375, -795, -779, 470, 332, -230, 114, 443, -131, -686, -161, -564, -266, -190, -819, -401, -320, 950, 495, 570, 470, 246, 445, -29, 862, -1339, -24, 676, -609, 118, -699, 307, -581, 354, 616, 667, -249, -441, -264, -751, -67, -96, 358, 1073, 625, -291, -339, 307, 26, -399, -333, -401, -15, 317, -37, 88, -533, -1168, 209, 331, -103, -108, -150, -88]
7511h8J21n07M55Q53j66q30J50J0m00o73J87O29L3J34L57p05l54l4J260j227P53
7532d2n06j17m87J473k21L12o64R18j117l77j55J608j16j170O71K56K59j039O84
7551A70j017O09p11J554k79q5K6n17N91q73M05K01R08k39l85O46r28j86M95n13
7571a28R68j597k60J553n63N2j75N09j05m83o50Q72J95o29Q99l53L56j3m44J58
7591A62l43j483J899q20Q76p13Q78j601N22O41j309J524n90J3k40N28q19N85O88
7610C98j99n94J214n18L67j138M64M43j021Q95J66m17l08P77n28J02J51k42m63
7629d51R7M51O58j708J613N27p64m13P87j984M30R20j4P62l00j501P8O40j06J317
7649A039p55j400N97R56n41j89J23MJ35q54J080K11J16j146O29k56J186j721Q11
$$ y = [-88, 33, -474, -19, 834, 668, -162, -12, -2, -402, -1075, -888, -259, -226, -92, 265, -440, -794, -828, 432, -795, -42, -548, -665, -1152, 321, 100, 412, -252, 666, -451, -828, -983, 625, 509, -661, 10, 266, 525, -514, 170, -847, -238, -949, 605, 326, 241, 267, -250, 341, -532, -127, 74, 982, 743, 358, 1004, 76, -110, 385, -128, 840, -757, -1017, 536, -27, 25, -150, 359, 254, -229, -879, -7, 188, -441, 458, 105, 461, 448, 4, 162, -181, -1664, 235, -585, 291, -422, 456, -1145, -623, 18, -1291, 233, -357, -344, -584, -56, -875, -290, 398, 199, -395, 819, 301, 668, -470, -6, 437, -584, 311, 477, 60, -248, 529, 1, 103, 254, 12, -451, -354, 97, 755, -953, 660, 1187, 423, 10, 797, -1187, -757, 163, 149, 911, 611, -890, -812, -172, -278, 1039, 284, -1116, -519, 437, -104, -293, -170, -166, -31, -885, 195, 406, 522, -624, 5, -251, 935, -786, 25]
7668B5j96P38j126m69N48K19J339j703J227po22M31j147Q08N22j089k0M94J68
7687A40M83j360J043l52J470n59j022k64J87L25L57k19n41P65j424J101M51r60
7705c79J90k52K14R95n94N40r50j63M34m3M5k42j15k60K21Q46j559J097j428J239
7725a64o01J090p07L04l43p58J306j02M94J77m97j268J193n26R79j540J725p88
7743b6K08p61J613j125J40q73J562l24q79k38L97l58J216K24r40jj002J680l72
7762A41Op34j5P56q43M41l84j35O54k67Q18Q1j492J340J08L3r24J082M41j200
7782i3J215j323M90k43N17k167K164q87k72J414p83k26j45J485r98j44K59l59
7800i6K94M3O61l44n18J8J366k185O47q01J667m82k98L26q72P44p99J062k52J87
$$ y = [25, -171, 567, -559, -1028, -480, -261, 1078, -625, 602, 595, -27, 404, -743, 65, 587, -502, -522, -28, 140, 623, -737, 306, -46, 1424, 865, -157, -421, -234, 91, 448, 229, -312, 453, -971, 130, 581, -379, -189, -441, -227, 768, 174, 714, -236, -399, 35, -8, 37, -205, -320, -580, -359, 487, -1072, 25, -1403, -164, -765, 325, -382, -78, -421, -1179, 127, 25, 519, 696, 199, -1069, 124, -402, 577, -963, 762, -26, 182, -579, 1034, -91, 49, -824, 738, 414, -465, -703, -306, -664, 552, 776, -164, -165, -1167, 513, 141, 147, -587, -602, 154, -689, -248, -632, -767, -113, -380, 438, 519, -973, 367, 475, 508, -416, 666, 1107, -93, 1122, -201, 289, 46, 563, -1604, 560, -327, -599, 815, 32, -194, -339, 1146, 148, 4, 263, -96, 198, 241, 902, 558, 40, 58, 1424, -761, -114, -915, 752, 270, -28, 298, -574, 170, -629, 433, 181, 368]
7820C68j131J389o79R2M00M05j476O36K01L52m98J71m03m43O64j34J117j021l3
7839b3q02Q16J069j049O20K42p71l39k28Q09p32KP76n35j444J886J66o38N68M5
7859D38n51O08K57J9r64N10j34L0N12n73k27l15N93JJ38n11j58O07r87J77J016
7880D86N08j380O1K58m18K47R6R77J70j185j4J93L15K40K46n85q63M20J165j132
7900a95O89r17J67j214J533J54r9m66m50R90q13j46L07L87o64o03L24J009Q56
7919H49p36j137J671q39O93j708J042J95q85J400j097J048k289O88J361J64j38
7936B82J29o98o78Q06P59j421J049j92o9O82o65k29M73j03M46j081J720K12j308
7955A14o10Q18JN19j452K30j11J156n71O9r91O48k33m28N36O62j033J198n42k62
$$ y = [368, -763, 626, -53, 39, 439, 844, -632, 4, 205, 557, 59, 230, -173, -616, 48, -86, 1031, 10, -23, -825, -9, 1060, 11, 631, 873, 102, -237, -465, 344, -388, -386, 390, -145, -1589, 297, 463, -175, 393, 438, -113, 495, 752, 771, -193, 317, 183, 213, 725, 152, -75, -390, 203, 204, 342, -169, -327, 280, -707, -530, 486, 994, -386, -325, -67, -485, -238, -142, 835, 1005, -180, -194, -1, 314, 554, 800, 215, -648, -228, 937, -195, 494, -423, -256, -1470, 63, 217, 118, -348, -798, 192, -621, -767, -460, -73, -737, -1340, -1016, -7, 849, 113, -1024, 647, -192, 501, -1207, -165, 30, -855, 545, -552, 496, -1793, -1105, 256, 420, 282, 411, -287, -965, -159, 600, -821, 228, 36, -33, 649, -16, -245, 228, 125, 571, -510, 1210, 1422, 114, -496, 322, 323, 842, -610, -380, -491, 665, 94, 163, -828, -180, -413, -841, -305, 357, -676, 522, -20, -282]
7975b82k11N41J83l46J9j36m63j96O46M48q51J026m49k15P8K30R2L1J43k55n4
7996b1p07J283q94M96L31q1j160R34k68N61n32o37O46p08Q18j1j3L83j063J397
8016G54j117J205k50N3j344N22k85L59m00K27j40O21kJ79M84r15n76P91q41N2
8036f23L31R63j084N29q41M64n8N33j699J397Q6K73l15k9P24l19O43r55r80Q19
8056a41N98o98p42Q98O3l31p7P05p92J035k33l15j87l12j61l04J808p81J056j713
8076f24J40P43J241m62j892l7J412r30O47j112L10R16K45m67L81nr05L70Q56J7
8096H44j818P76k68k12m07J152R35o42L9p70Q23j211J383r05P11k6j54pj497K464
8116A210j407N16l32q72J058L33m30r17Q93J415j455j08R29j55p52l73K80N42
$$ y = [-282, -493, 48, 231, -115, -96, -232, -695, -891, -245, 203, -648, 378, -71, -286, -208, 22, 114, 145, 288, 33, -21, -728, 555, -339, 157, 488, 407, -753, 181, -87, 474, -58, -695, -49, -757, 61, 50, 37, 420, -643, 754, -363, 842, 592, 645, -699, -177, -462, -103, -503, -276, -416, 205, 203, 382, 866, -49, -625, 166, -675, -623, -292, 671, -413, 116, -725, -261, -319, 214, -1485, -88, -2, 271, -44, -73, 651, 332, 975, 20, -960, -141, 457, -241, -983, -85, -22, -353, -430, 275, -517, 518, 285, -30, -217, -529, -690, -994, 814, 33, 1089, -624, -484, 259, 1500, 1038, -854, -891, 521, -409, 238, -874, -564, 352, 597, 130, 511, 506, -399, -29, 827, 844, -974, -198, -466, -678, -1085, 67, 1002, 360, 399, -371, 452, -759, 624, -281, 430, 404, 250, 243, -1254, 1210, -197, 319, -13, -885, 173, 506, 76, -841, 52, 1467, 12, -96, 833, 678, -74, -447, -167, 375]
8134C75p75N7L22q99R66l60Q77N21k001R81l91J77P50j398L79O80P14j794J076
8153B57p27P08N06j069j10m25M34N61l96J011j107o16Q86K29M92R06j585J4J7
8172a4j14J119j556J086k31L94K0r19J158l16o49R0K35k10K01k41J29m85L04
$$ y = [375, -400, -343, -21, -920, 46, -314, 563, 1084, -917, 64, -327, -150, 600, -798, -419, 261, 975, -819, 257, -470, 238, 744, -325, -435, -860, -426, 135, -261, 750, -357, -973, -87, 142, 634, 1540, -45, -31, -14, -128, 991, -565, 521, 290, 684, 704, -215, 943, 627, -22, 68, 303, 93, 294, 53, 182, -303, 1]
8191A
$$ Imaginary data points
##PAGE= N=2
##DATA TABLE= (X++(I..I)), XYDATA
0@%%%%MmP7j85K16k16L24m32N40o50P58r72J188j404J637j963K370k748L166l656
24a950M209m831N496o255P098q014R033j0173J1415j2756J4244j5892J7687j9643
38a0332K1798k4175K6776k9634L2806l6329M0248m4631M9563n5166O1582o9013
50c6507P7739q8157J00855j16719J37219j64872K04341k65598L74232o22493K132435
61A732475J99094m663981K431791K225440j684306j327479O42996N56205R54411
70A066646j190335j518241J896459J586490k532112q37268K407996K86643j981297
79h15019O7100J233001M1736p85008k91399N03755O51679n08017q09911O22927
89h9156Q89036q21161p71118R49893O21939j004133m27726J000990L25462j006915
$$ y = [0, 0, 0, 0, 0, 4, 0, 77, -108, 108, -108, 216, -216, 324, -326, 432, -540, 648, -756, 881, -1082, 1288, -1460, 1706, -1950, 2259, -2572, 2924, -3331, 3767, -4247, 4786, -5387, 6028, -6728, 7516, -8376, 9311, -10332, 11466, -12709, 14067, -15567, 17239, -19090, 21158, -23473, 26090, -29076, 32506, -36507, 41232, -46925, 53930, -62789, 74430, -90442, 113899, -151699, 222533, -399960, 1732475, 1931569, -2732412, -300621, 1924819, 240513, -1086966, -443970, 112235, 1066646, -123689, -1641930, 254529, 1841019, -691093, -1528361, 879635, 1166278, -815019, -747919, 485082, 526818, -258190, -549589, -45834, 605845, 97828, -712083, -89156, 799880, -21281, -792399, 157494, 779433, -224700, -652426, 348564, 674026, -332889]
99c32889k32781R73811R4134r14564j2277O69892Q5379l56532l92789K05899R07960
110F95243l58410j322924P77638J325749j248672r49696J327980L70848q90075
119b72319J7543J79040J53850N04479p06254p07004J318050L87702j616791J26832
129f14872J389178n03520q19868N28380K62041j89255Q3168k70001j29440O01607
139C37418r4719p44378L46116O08156n21323l07771N49467M156l99552K17613
149d817J68319k97717K5971K22091j25986p3645J14259l9987L5131J28626j84277
160c2032j52918L31162J39436m97126j13322O32789J1257o86738J62612O01209
170C96329k66912l37792J80404J1515R3818J21107n30607l2958Q41425k51444
$$ y = [-332889, -565670, 408141, 502275, -412289, -424566, 245326, 330705, -25827, -418616, -212717, 695243, 336833, -986091, -208453, 1117296, -131376, -1081072, 246908, 617756, -272319, -254776, -75736, 78114, 582593, -123661, -830665, 487385, 875087, -741704, -614872, 774306, 270786, -549082, -20702, 241339, 52084, 135252, -134749, -264189, 337418, 242699, -501679, -155563, 452593, -68730, -376501, 172966, 177122, -222430, -4817, 163502, -134215, -108244, 113847, -12139, -85784, 28475, -11512, 23619, 152245, -32032, -184950, 146212, 285648, -211478, -324800, 307989, 319246, -367492, -204880, 396329, 129417, -208375, -27971, -16456, 77362, 198469, -332138, -365096, 476329, 224885]
180B24885q53363N70140O16429o31425k20588M00050p9217m791R7184m01230R5463
191a86463O06734l46243n30391N49024L41023n43838q6511L74595j19573j31874
201g3517J69816j62891j08527L67610n0012m15488K27746L12676l21178j17211
211a70976K53805j09029r0832K39501j39472k45786L58255J75907m45502k9626
221b03755M20760r3429k83170J34614N7240p1693J72396q8391l05864L49595L14205
232D02508n62556j60166O09012q9489m72317K11951J57179j60704J51134o0065
242B6487k84766L61972K43039n64007p4448N58910j34863m12575K02695J62334
252H4778j26743P9815j7856j74125K28267J97879l65337j38726M09846J3859l76749
$$ y = [224885, -628478, -58338, 558091, -73334, -293922, 106128, 26911, 22120, 119304, -281926, -186463, 420271, 74028, -456363, 92661, 433684, -110154, -196665, 177930, 58357, -73517, 96299, -66592, -175119, 192491, 142479, -273009, -45263, 267413, -53765, -170976, 82829, -26200, -117032, 122469, -17003, -262789, 95466, 271373, -174129, -203755, 217005, 123576, -159594, -24980, 32260, -39433, 132963, 44572, -261292, 88303, 402508, -160048, -320214, 288798, 199309, -273008, -61057, 96122, -64582, 86552, 26487, -258279, 103693, 346732, -217275, -291723, 267187, 132324, -280251, -77556, 84778, -41965, 37850, 19994, -154131, 74136, 272015, -93322, -232048, 177798, 191657, -185092]
263a85092Q5075K29318j30476r750R6895j80286M7635K92253k31514k96495L49698
274F7261J66099l83618r328K69637j10925m4781J38536k04063k8152L74883j77949
285E7600m06786L62754K86149m24747n7033L39615j11546p7853J67511k19263
295h3599o0798M10106j85368m37953L83348K82938m24356m5552L01811r4801m8885
306c109R5603k00503k41L06070j75591l18067K74519K28085k69736r5075K06610
317D8565K6686o6160P855o8113j3403J70849k6149k54404Q1351K98657j37342
328F8392k46995J89816J46292j63925j2597M2188j04427J21730J18737k99178
338a39967l6388L99589r7362l62201K17731J89173k38304K0230Q8273j88947J47158
$$ y = [-185092, -100017, 129301, -1175, -10925, 85970, -94316, -46681, 245572, 14058, -282437, 67261, 233360, -150258, -159586, 110051, -874, -45655, 92881, -111182, -139334, 235549, 57600, -349186, 13568, 299717, -125030, -182063, 157552, 46006, -31847, 135664, -83599, -144397, 265709, 80341, -357612, 25736, 308674, -115682, -161234, 140577, 45776, -3109, 92494, -108009, -108250, 197820, 22229, -295838, -21319, 206766, -62970, -158045, 48565, 75251, 9091, 16946, -51167, -64570, 106279, 80130, -174274, -92923, 205734, 68392, -178603, 11213, 157505, -6420, -19017, 23171, -81256, 40474, 159211, -139967, -176355, 223234, 125872, -236329, -18598, 170575, -67729, -47499, 40774, -148173, -1015]
349a015K07727l61943o4362M72176j20481l83477K56778J58947k43234P0446N9317
360E0879k01209J97088J81390l70607j3346M13581j43306k98734J91278R6332
370A03346j45490M0604j8901j05334J74756R0196k50530j7161K73112l4941k25723
381a16066L6373J41345k9388p8975j0009J2576O1005O9395j00418j10959J82796
392E7675J24603k42952q5294K46821l77j80664O1852M4396n3325J22483l5239
403E9979k32491J78489K23029l15451j20022L26093l6676k06700J36226N695r7558
414g9387J94844m9004k86148K18746K22616l36258q0538L12112o1878j41979J32791
425D5917m4575m7847K02256r6648k43101K15896J59846k72476n9457K12596j7474
$$ y = [-1015, 206712, -155231, -219593, 252583, 132102, -251375, 5403, 164350, -78884, -8438, 50879, -150330, 46758, 228148, -142459, -155805, 257776, 114470, -184264, 7014, 103346, -42144, -1540, -20441, -125775, 48981, 139177, -111353, -128514, 144598, 109657, -116066, -79693, 61652, 32264, -46711, -56720, -44144, 16861, 86256, -14162, -125121, 57675, 182278, -60674, -145968, 100853, 100476, -80188, -18336, 26060, -27265, 95218, 59979, -172512, 5977, 229006, -86445, -206467, 119626, 82950, -123750, 12476, 18171, -79387, 115457, 66453, -219695, -949, 221667, -114591, -195129, 116983, 55105, -86874, 45917, 1342, -46505, 155751, 59103, -183998, 31898, 191744, -80732, -140189, 72407, 54933]
436E4933q3505M0048l3661J1732J19048q7437j58301J22862J33121j47743j12270
447a41173J29851R2804q3996n4239M5124K9069K4686j0430j11121J4071J79011
458A13657n6811k02502J18390J76998j36275q5198J09455j6444j4334O2445j26956
469e7575n3439K35921l5500k60061J37195J92733j73732o8616J17508n5767M254
480a7079Q8760j56282m6069K54953m1246k43308J37239J65353j49039m5741P4010
491B1551m9942L6824O2065j47884j6697K08869k9201j87408Q1382J38270p9049
502C8780p3523K5973n41K4151K1661r8344k7380J47471K2078j59717M269J54944
514G9822k2936j21607K4564N3321j3348J6784l5235o1514J13551P8359j61368
$$ y = [54933, -28572, 11476, -22185, -10453, 108595, 21158, -137143, -14281, 118840, -28903, -141173, -11322, 81482, -2514, -56753, -11629, 17440, 42126, 31696, -79425, -65354, 113657, 56846, -145656, -27266, 149732, 13457, -71741, 37714, 21270, 6936, 69381, -57575, -111014, 124907, 89407, -170654, -33459, 159274, -14458, -83074, 34434, -21333, -17079, 71681, -84601, -130670, 124283, 83037, -160271, -23032, 142321, -6718, -52459, 21551, -28391, 8433, 70498, -77386, -94083, 114786, 85585, -101823, -20441, 117829, 38780, -34743, -8770, -9311, 14840, 36501, -61843, -89223, 58248, 80326, -79391, -75122, 79822, 56886, -64721, -40157, 13164, -184, 16600, -18635, -80149, 33402, 111761, -49607]
525d9607m6713J79146j72j48582L2445O8466l0006K5068j8469q3993J01710R8630
537A27923j71571o2225J75707m144j42532L1500N6867j9586L4256k1887q2086
548g7778R3331R5677j48805p2582J52168K1028j20684K732O2940P126J3636j6811
560A1978n4999O0983Q2904r6512r3630J09981O3145j14919l2070P7986J2295j2359
572A4783j785m8332K4435R5111p2728j19862J02892Q7717j21148l8310R1015j524
584A2264j1827J9020o2737J2907J13792o2818j23844J02748R3418j04657l7702
595d9436P1393N235n158J695o3847J4931R6977n6402j02385P6663Q2293o4427
607G532m9202M0305L1221j592l1057m4301K0791O0292l1220p8551L4099R1627
$$ y = [-49607, -96320, 82826, 82654, -65928, -33483, 34983, 4977, 30045, 11576, -72417, 29293, 127923, -43648, -105873, 69834, 65690, -76842, -45342, 11525, -8061, 26195, 4308, -77778, 15553, 111230, -37575, -110157, 42011, 63039, -57645, -54913, 8027, 15153, 28789, 11978, -43021, 17962, 100866, 4354, -89276, 20705, 83850, -31069, -63139, 14847, 27142, 14783, 12998, -35334, -10899, 84212, 11484, -108378, -5486, 82231, -38917, -77227, 13788, 12264, 437, 19457, -43280, -30373, 83419, 20601, -103243, -495, 92923, -11734, -49436, 21957, 27192, 22034, 23729, -40118, -25187, 71790, 15388, -86997, -10334, 71959, 7532, -41670, -1365, 29856, 28264, -2793, -47094, -26303, 33989, 2769, -75782, -41683, 49944]
619D9944j8041p7517K4504P5905j7868m9627k614M307L1300J7247q2348j5581
631f0389J23324l731j16773L8944Q1368m6723k3499J0645l5389M3185M7221j08563
643e0380k0787J37930k5022j15743N7141N1351m9015R584o445m2950P6659L7605
655E9928j12380O383J21651l5531q3167L9287K4329j3306O918l9594j6785Q5162
667D2895M420q8226K0405O9826j3866m3715k0087J9680L9506k9047n6207K8260
679b6156N4512j9174l0082q51K5421L6480l6983o0798N5323N0002o5867k0723
691c8896M9002J42R929J822n6776L4861P6868q0680o5448R4162J8293p2540J9096
704a0165J7470k0273N2945j4732q6691O0006P2729r9939l4747Q1381r376k9356
$$ y = [49944, 31903, -45614, -21110, 54795, 36927, -12700, -15314, -11007, 20293, 37540, -44808, -60389, 62935, 59204, -57569, -18625, 62743, 16020, -7479, 3166, -32223, 10962, 58183, -50380, -71167, 66763, 41741, -74002, -16861, 34490, -14525, -4941, -11386, -54336, 22323, 59928, -52452, -46069, 75582, 40051, -43116, -3829, 20500, 7194, 14112, -25482, -42267, 42895, 47315, -40911, -20506, 49320, 35454, -8261, -28348, -8668, 30838, 1791, -54416, -26156, 28356, 9182, -20900, -21751, 3670, 40150, 3167, -57631, -2308, 47694, -18173, -38896, 10106, 10248, 20177, 21999, -34777, 84, 76952, -3728, -69176, 24986, 43279, -29261, -10165, 7305, -12968, 39977, 25245, -61446, -1440, 71289, -28650, -63397, 17984, 8608, -20748]
716b0748K3620k4750M734O7168m3416o8902P5210L8707p8324l589M7045r583P665
729A4837j603l8466M0138M1752o7415k7911N7581M706l2753j0476m79L5127K0471
742C5509n5206j1229O0578l096m6987q90M960J6964J5780m9683j1155P8219l146
755C0618o1472K5348L1068j8330L654j6146k4718N0155J5460p4177J6937O9558
767D7955l3683l5166L2120m246m723K1090m5924j7168P4260j0121p5139L7287
779a3458N0663l8389j4221J2151j3706K2654J5723n8773L047P1036k0518m5836
791b9627L0329J9828r390J711k4888n707M4495j2865m4459K4273L2813j4999j1808
804b94k409Q252K0570k1912l5480K3171K5766k9607j3344J6320J0247J3126j4268
$$ y = [-20748, 2872, -21878, -17144, 50024, 6608, -62294, 12916, 51623, -26701, -30290, 16755, 7172, 14837, 13234, -25232, 14906, 56658, -10757, -38668, 18913, 23619, -9134, -19610, -20089, 15038, 35509, -19697, -30926, 29652, 26556, -20431, -21321, -16361, 603, 16383, -33300, -44455, 33764, 30618, -30854, -5506, 25562, 7232, 10886, -5260, -29978, 20177, 35637, -38540, -21603, 47955, 14272, -20894, 11226, 6980, 2257, 23347, -22577, -39745, 34515, 24394, -50745, -13458, 37205, -1184, -15405, -3254, -16960, 5694, 21417, -37356, -34309, 36727, 16209, -29627, 702, 20530, 11140, 12851, -12037, -17744, 26751, 13886, -30573, -6300, 26513, 11514, -294, -2703, 5549, 26119, 4207, -31273, -8102, 17664, -11943, -25287, -8967, 1280, 14406, 138]
817A38k6878L0152K9061m1825k0905L2545P493j2306l486o503J6736K8827k6705
830F344l1777L9844K0232m1704p574K1367k684K455k051k3095J9510K8298l3317
843d152k4621L3212J0457k8785l619J0986P298R754j4408j4514K7541J3440l1684
856i095j0772J9953P085q021j2274L86K8117Q074k4874l506K2100P367j9480j9902
870a4842Q358J9790j1176k0393M895K2271J555j3976o397R459J3535j0184k5622
883b2727J0329K1067p810j8115P381J6659O561j4105j0861J6848J0854j4740j3759
896a2418Q548J7566j628j6629j842J8550P355j8089j4033J4413J0433j2085j5079
909a4938L052J6751O198j8805p150K1474N881j8910q333R005O219m21j0687n017
$$ y = [138, -26740, 3412, 32473, -9352, -30257, 2288, 9781, -2525, -6011, -12514, 4222, 33049, 6344, -25433, 14411, 34643, -7061, -14635, 6732, 4048, 6503, 4452, -18643, 867, 29165, -4152, -28773, 4439, 14896, -13889, -17508, -6522, 776, 10530, -3878, -18392, 9149, 22589, -9095, -19867, 86, 7171, -850, -13124, -12738, 15379, 23453, -1421, -4927, 17173, 24540, 5060, -14842, -6484, 13306, 2130, -18263, -13368, 8903, 10458, -3518, -9915, -456, 13079, 2895, -22727, -12398, 8669, 859, -17256, -9875, 6784, 13345, -760, -11621, 5227, 16081, 1341, -12418, -3870, 13696, 12068, -4561, -6403, 12147, 19502, 1413, -12620, 1793, 12226, 141, -14938, -11886, 4865, 11063, -7742, -14892, 6582, 12463, -6447, -14780, -5775, 444, 23, -10664, -15681]
923a5681K2168J1464k3422k807K4691l691j4421M70l096P195J0891k2972o022
936a5233L2526p29k4239O793R607m130K95j3730r361K2060P099l1360N867K7812
950A3277j1017r254N345m625R537P021k4584l46K8037m799j9183J2645Q334m306
964F082K614r581q096K3005k140l0166J3936K2507j8316k782Q538q674P780N402
978A0109k8036L119K8215j9258j6053K2033K296o174J1617j1750o329K8327r820
991H296l0809K3572J3578k5206P605Q627j2257J6079O048k7218J2436K3021k6391
1004b619j1593K2854p471o444J0921j4368J90K6258j7435k2349K8153J752k2870
1017a5021R937L055q444J6098r17k2206K0147J8155k6676k610K0509j0701o012
$$ y = [-15681, 6487, 17951, -5471, -8278, 16413, 12722, -1699, -1229, -4325, 2870, 13761, -9211, -15233, 17293, 16564, -7675, -882, 8725, 4595, 4890, -8840, -18201, 3859, 10958, -20402, -14535, 13277, 2260, -6994, -1649, -6274, 3263, 10284, -14300, -14646, 13391, 8592, -10591, 2054, 10388, 6082, 8696, -885, -8981, 14024, 11884, -18282, -4346, 18161, -155, -2937, 5601, -3073, 4707, 10109, -17927, -14808, 13407, -5851, -21904, 129, 2425, -3749, 7868, -3882, -10211, 18116, 8296, -22513, 1059, 14637, -10569, -2964, 5663, -6594, 9485, 15533, -11685, 751, 23772, -2619, -14212, 8642, 1171, -5273, 5648, -8720, -8530, 17728, 293, -22056, 6097, 7849, -15021, -5084, -2029, -10473, 5625, 4708, -17498, 2649, 20804, -5872, -8482, 12027, 1326, -4686]
1030d686J2998j5358K699K5536k0386j5779K9902l575k2451J4107j402j1618J6186
1043F173m908k0803K3922J2523l0843N473K0797j7592j246J1313j9666P361J9727
1056A2231k0432p559L1401q055j5384J7904m849p844J3749j0106j5776K4520J587
1069A1387k3654J1405J3699j4163L044M594j5771R485J1904k5001O37K2157j3064
1082c341r436J6132l815n292J3687j1337q733K0535l738j9763J5168J1550j6999
1095e382Q750O489j5444J2189P429k3567O175J7642j8117m141J5806q759j529
1108b459J2355j1743o912J9846j0998j6973J6744K129j4270Q799K912q334J3849
1121D945K093j5425R553R899j4554k196J0066m880k55O758p974N88J3771q167
$$ y = [-4686, 8312, -7046, -4347, 21189, 803, -14976, 14926, 11351, -11100, 3007, 1605, -10013, 6173, 1265, -19538, 4384, 16907, -13936, -8463, 12334, -5258, -6504, 4809, -14857, -7496, 12231, -8201, -15760, 15641, 7586, -7798, 10106, 5257, -2587, 11162, 1056, -14720, 9800, 11387, -12267, -862, 12837, -1326, 1718, 6312, -9459, 26, 11930, -13071, -12434, 9723, -3341, -12777, 3355, -460, -5752, 7935, -3402, -12135, 8400, 4662, -15101, 67, 11617, -5382, 3368, 9857, -5587, 6602, 14031, -9536, -3361, 14281, -3836, -7977, 7829, -930, -2459, 9896, -1847, -8759, 11087, 89, -16884, -140, 1989, -12281, -3482, -570, -8904, 4945, 7038, -8387, 1166, 11065, -3489, -5685, 4381, -499, -754, 6004, -1970, -1382, 12389, 4222]
1135D222j1485J4001O79j1632M703j34m719P794r34j0523Q112O295j1392n0O658
1150A595m755o35L803o136K678J0562q463m464J1650j273p584M329k64l521P204
1165D726k170p243J0121J857p886J632N024n303q02k95n485L252L526n818k073
$$ y = [4222, -7263, 6738, 7417, -4215, 488, 354, -4365, 3429, 2495, -8028, 84, 6379, -5013, -5063, 1595, -3160, -3795, 8, -6128, -3450, 7112, -1351, -5815, 5835, 4562, -3022, 1307, 1043, -2478, 4726, 2556, -4687, 5434, 7291, -595, 1037, 6061, 758, -44, -339, -5824, -2572, 954, -4864, -6937]
$$ [...]
8191f77
##END NTUPLES=NMR FID
##END=
