##TITLE=1H_UK-5
 THF, 8 sc, 
 18.11.2019
##JCAMPDX= 6.0         $$ Bruker NMR JCAMP-DX V2.0
##DATA TYPE= NMR FID
##DATA CLASS= NTUPLES
##ORIGIN= UXNMR, Bruker Analytische Messtechnik GmbH
##OWNER= root
$$ XWIN-NMR		Version 3.5
$$ Mon Nov 18 16:01:32 2019 Russian Standard Time (UT+4h)  she@DPX200
##.OBSERVE FREQUENCY= 200.1341
##.OBSERVE NUCLEUS= ^1H
##.DELAY= (6, 6)
##.ACQUISITION MODE= SIMULTANEOUS
##.ACQUISITION SCHEME= undefined
##.AVERAGES= 8
##.DIGITISER RES= 17
##SPECTROMETER/DATA SYSTEM= spect
##.PULSE SEQUENCE= zg30
##.SOLVENT NAME= CDCl3
##.SHIFT REFERENCE= (INTERNAL, CDCl3, 0, 15.7039)
##AUDIT TRAIL= $$ (NUMBER, WHEN, WHO, WHERE, WHAT)
$$ ##TITLE= Audit trail, XWIN-NMR		Version 3.5
$$ ##JCAMPDX= 5.01
$$ ##ORIGIN= Bruker BioSpin GmbH
$$ ##OWNER= she
$$ F:/spectra/data/she/nmr/H-F/1/audita.txt
$$ ##AUDIT TRAIL=  $$ (NUMBER, WHEN, WHO, WHERE, WHAT)
(   1,<2019-11-18 16:00:18.79 +0400>,<she>,<DPX200>,
      <created by zg, POWCHK disabled, PULCHK disabled
       configuration hash MD5:
       00 E9 B6 7A A2 85 ED C7 34 08 36 98 17 FE 4E 26
       data hash MD5: 16K
       0A 24 5B 46 00 6B 80 BE 84 F6 CE 6C 54 D7 A2 CB>)
$$ ##END=
$$ 
$$ hash MD5
$$ 45 5A 94 71 01 B3 F3 16 28 A7 F6 89 EF E7 A9 CD
##$RELAX= 
##$RELAX= 
##$RELAX= 
##$RELAX= 
##$RELAX= 
##$RELAX= 
$$ Bruker specific parameters
$$ --------------------------
##$DU= <F:/spectra>
##$EXPNO= 1
##$NAME= <H-F>
##$PROCNO= 1
##$TYPE= <nmr>
##$USER= <she>
##$AMP= (0..31)
100 100 100 100 100 100 100 100 100 100 100 100 100 100 100 100 100 100 
100 100 100 100 100 100 100 100 100 100 100 100 100 100 
##$AQSEQ= 0
##$AQ_mod= 1
##$AUNM= <au_zg>
##$AUTOPOS= <>
##$BF1= 200.13
##$BF2= 200.13
##$BF3= 200.13
##$BF4= 200.13
##$BF5= 200.13
##$BF6= 200.13
##$BF7= 200.13
##$BF8= 200.13
##$BYTORDA= 1
##$CFDGTYP= 0
##$CFRGTYP= 5
##$CHEMSTR= <none>
##$CNST= (0..31)
1 1 145 1 1 1 1 1 1 1 1 1 1 1 1 1 1 1 1 1 1 1 1 1 1 1 1 1 1 1 1 1 
##$CPDPRG= <>
##$CPDPRG1= <>
##$CPDPRG2= <>
##$CPDPRG3= <>
##$CPDPRG4= <mlev>
##$CPDPRG5= <mlev>
##$CPDPRG6= <mlev>
##$CPDPRG7= <mlev>
##$CPDPRG8= <mlev>
##$CPDPRGB= <>
##$CPDPRGT= <>
##$D= (0..31)
0 1.2 0 0 0 0 0 0 0 0.06 0 0.03 0 0 0 0 0.0002 0 0 0 0 0 0 0 0 0 0 0 0 
0 0 0 
##$DATE= 1574078418
##$DBL= (0..7)
120 120 120 120 120 120 120 120 
##$DBP= (0..7)
150 150 150 150 150 150 150 150 
##$DBP07= 0
##$DBPNAM0= <>
##$DBPNAM1= <>
##$DBPNAM2= <>
##$DBPNAM3= <>
##$DBPNAM4= <>
##$DBPNAM5= <>
##$DBPNAM6= <>
##$DBPNAM7= <>
##$DBPOAL= (0..7)
0.5 0.5 0.5 0.5 0.5 0.5 0.5 0.5 
##$DBPOFFS= (0..7)
0 0 0 0 0 0 0 0 
##$DE= 6
##$DECBNUC= <off>
##$DECIM= 12
##$DECNUC= <off>
##$DECSTAT= 4
##$DIGMOD= 1
##$DIGTYP= 9
##$DL= (0..7)
0 120 120 120 120 120 120 120 
##$DP= (0..7)
150 150 150 150 150 150 150 150 
##$DP07= 0
##$DPNAME0= <>
##$DPNAME1= <>
##$DPNAME2= <>
##$DPNAME3= <>
##$DPNAME4= <>
##$DPNAME5= <>
##$DPNAME6= <>
##$DPNAME7= <>
##$DPOAL= (0..7)
0.5 0.5 0.5 0.5 0.5 0.5 0.5 0.5 
##$DPOFFS= (0..7)
0 0 0 0 0 0 0 0 
##$DQDMODE= 0
##$DR= 17
##$DS= 0
##$DSLIST= <SSSSSSSSSSSSSSS>
##$DSPFIRM= 0
$$ [...]
##$SUBNAM2= <"">
##$SUBNAM3= <"">
##$SUBNAM4= <"">
##$SUBNAM5= <"">
##$SUBNAM6= <"">
##$SUBNAM7= <"">
##$SUBNAM8= <"">
##$SUBNAM9= <"">
##$SW= 49.8667639355796
##$SWIBOX= (0..15)
0 0 2 0 0 0 0 0 0 0 0 0 0 0 0 0 
##$SW_h= 9980.03992015968
##$TD= 16384
##$TD0= 1
##$TE= 0
##$TE2= 300
##$TE3= 300
##$TEG= 300
##$TL= (0..7)
0 120 120 120 120 120 120 120 
##$TP= (0..7)
150 150 150 150 150 150 150 150 
##$TP07= 0
##$TPNAME0= <>
##$TPNAME1= <>
##$TPNAME2= <>
##$TPNAME3= <>
##$TPNAME4= <>
##$TPNAME5= <>
##$TPNAME6= <>
##$TPNAME7= <>
##$TPOAL= (0..7)
0.5 0.5 0.5 0.5 0.5 0.5 0.5 0.5 
##$TPOFFS= (0..7)
0 0 0 0 0 0 0 0 
##$TUNHIN= 0
##$TUNHOUT= 0
##$TUNXOUT= 0
##$USERA1= <user>
##$USERA2= <user>
##$USERA3= <user>
##$USERA4= <user>
##$USERA5= <user>
##$V9= 5
##$VALIST= <valist>
##$VCLIST= <CCCCCCCCCCCCCCC>
##$VD= 0
##$VDLIST= <DDDDDDDDDDDDDDD>
##$VPLIST= <PPPPPPPPPPPPPPP>
##$VTLIST= <TTTTTTTTTTTTTTT>
##$WBST= 1024
##$WBSW= 4
##$XGAIN= (0..3)
0 0 0 0 
##$XL= 0
##$YL= 0
##$YMAX_a= 193191
##$YMIN_a= -206970
##$ZGOPTNS= <>
##$ZL1= 120
##$ZL2= 120
##$ZL3= 120
##$ZL4= 120
##$ABSF1= 10
##$ABSF2= 0
##$ABSG= 5
##$ABSL= 3
##$ALPHA= 0
##$AQORDER= 0
##$ASSFAC= 0
##$ASSFACI= 0
##$ASSFACX= 0
##$ASSWID= 0
##$AUNMP= <proc_1d>
##$AZFE= 0.1
##$AZFW= 0.1
##$BCFW= 1
##$BC_mod= 2
##$BYTORDP= 1
##$COROFFS= 0
##$CY= 11.3945322036743
##$DATMOD= 1
##$DC= 2
##$DFILT= <>
##$DTYPP= 0
##$F1P= 16.9975609425685
##$F2P= -3.02152046262296
##$FCOR= 0.5
##$FTSIZE= 0
##$FT_mod= 4
##$GAMMA= 1
##$GB= 0.15
##$INTBC= 1
##$INTSCL= 1
##$ISEN= 128
##$LB= 0.24
##$LEV0= 0
##$LPBIN= 0
##$MAXI= 10000
##$MC2= 0
##$MEAN= 0
##$ME_mod= 0
##$MI= 1.114404
##$NCOEF= 0
##$NC_proc= 0
##$NLEV= 6
##$NOISF1= 3.799351
##$NOISF2= 2.8
##$NSP= 1
##$NTH_PI= 0
##$NZP= 0
##$OFFSET= 15.70392
##$PC= 1
##$PHC0= -9680.127
##$PHC1= 27.60087
##$PH_mod= 1
##$PKNL= yes
##$PPARMOD= 0
##$PSCAL= 0
##$PSIGN= 0
##$REVERSE= no
##$SF= 200.130013532006
##$SI= 16384
##$SIGF1= 3
##$SIGF2= 2
##$SINO= 400
##$SIOLD= 16384
##$SREGLST= <1H.CDCl3>
##$SSB= 0
##$STSI= 0
##$STSR= 0
##$SW_p= 3612.71676300578
##$SYMM= 0
##$S_DEV= 0
##$TDeff= 0
##$TDoff= 0
##$TI= <>
##$TILT= no
##$TM1= 0
##$TM2= 0
##$TOPLEV= 0
##$USERP1= <user>
##$USERP2= <user>
##$USERP3= <user>
##$USERP4= <user>
##$USERP5= <user>
##$WDW= 1
##$XDIM= 8192
##$YMAX_p= 0
##$YMIN_p= 0
$$ End of Bruker specific parameters
$$ ---------------------------------
##NTUPLES= NMR FID
##VAR_NAME=  TIME,          FID/REAL,        FID/IMAG
##SYMBOL=    X,             R,               I
##VAR_TYPE=  INDEPENDENT,   DEPENDENT,       DEPENDENT
##VAR_FORM=  AFFN,          ASDF,            ASDF
##VAR_DIM=   8192,          8192,            8192
##UNITS=     SECONDS,       ARBITRARY UNITS, ARBITRARY UNITS
##FACTOR=    0.0001002,     1,               1
##FIRST=     0,             0,               0
##LAST=      0.8207382,     0,               0
##MIN=       0,             -206970,         0
##MAX=       0.8207382,     193191,          0
$$ Real data points
##PAGE= N=1
##DATA TABLE= (X++(R..R)), XYDATA
$$ [...]
2450a927L722k777J829j962J124J766m464M480k613N67K71p61K794m493L995j223
2466C28j382J878j456K044l091K364N0k162J991p80Q52j838J989o14j181J523
2482E15q99J347k731L184j000k264L686k854K060k106J495R39m075M774k682M73
2498a38K86p86K350l993L689r70j730K350j563J405k152J928kj982K371j175O95
2515E83j770J987m06j515K348j627J041j714J885k25k234L157k415J326j148J004
2531B77Q55l503M481l051O89O31r83J899l357L950j854j339K652k123J761k170
2547a185K005m45k052K806j483N01r28J710r75j090K459k011J135j533K240p68
2563C86k121L454k980J611o29K09J201l444M858l256J34J335j477J898l079L257
$$ plain form
2450 -1927 1795 -982 847 -1115 9 1775 -2689 1791 -822 -255 16 -745 2049 -2444 1551 328
2466 328 -1054 824 -632 1412 -1679 685 735 -1427 564 -216 636 -1202 787 173 -1008 515
2482 515 -384 963 -1768 1416 416 -1848 1838 -1016 1044 -1062 433 1372 -2703 2071 -611 -138
2498 -138 148 -638 1712 -2281 1408 438 -1292 1058 -505 900 -1252 676 674 -1308 1063 -112 583
2515 583 -1187 800 394 -1121 1227 -400 641 -1073 812 587 -1647 1510 -905 421 -727 277
2531 277 1132 -2371 2110 -941 -252 379 -604 1295 -2062 1888 34 -1305 1347 -776 985 -1185
2547 -1185 820 375 -1677 1129 -354 147 -781 929 -46 -1136 1323 -688 447 -1086 1154 386
2563 386 -1735 1719 -1261 350 -279 -70 1131 -2313 2545 -711 -577 758 -719 1179 -1900 1357
2579A357j653q42K279j746J070j726K526j269j218K464j627P80j370K178j315
2594a12j164K485j983J274j212J862j227j352L476l531J834o19M19P30l129M698
2610B449l401N55J321j743K026k759L026j675j072K694k031R50j044J503j091
2625b92p67K130j457N52q00J952k026j18K215k436J441j329K037j225j288L422
2641B011l327J662l83L08L83k508M084l390Q14J469k165J904k308K994j880q66
2657a198K972k808J352p53J158p37j071K573k163P74k88Q72r54o07K163k450J602
2674D37q84J247q73j015L166l670K080j29o54R25k327L660l143R60J353k014J747
2691H66j928K579k393Q3K363k792J961j311J532j231p81K731k959J532n18Q96
$$ plain form
2579 1357 -296 -1138 1141 -605 465 -1261 1265 -4 -1222 1242 -385 395 -975 1203 -112
2594 -112 -1276 1209 -774 500 -712 1150 -77 -1429 2047 -1484 350 -269 150 880 -2249 2449
2610 2449 -952 -397 924 -819 1207 -1552 1474 -201 -1273 1421 -610 340 -704 799 -292
2625 -292 -1059 1071 -386 166 -634 1318 -708 -826 1389 -1047 394 -935 1102 -123 -1411 2011
2641 2011 -1316 346 -37 271 654 -1854 2230 -1160 -346 1123 -1042 862 -1446 1548 -332 -1198
2657 -1198 1774 -1034 318 -435 723 -14 -1085 1488 -675 99 -189 683 -271 -878 1285 -1165 437
2674 437 -447 800 -73 -1088 2078 -1592 488 359 -295 630 -1697 1963 -1180 -220 1133 -881 866
2691 866 -1062 1517 -876 -793 1570 -1222 739 -572 960 -271 -1052 1679 -1280 252 -266 630
2707F30j001l70K517l198J887k41J10n72o16K879l646K063j27n29Q13j964L411
2724B046l561J338J432k580K163j770K221k069j38K432k820J612m60O47j014j05
2740f26J804k391J417l42N78r76J47J752k616J987q15K42q4o92K485l515K088
2757D43J10j207J222j558K686l020J423J153k674K262j517J720j731K28K115l151
2773a496J954m61M15q82%J901k597J346m3j84l30R5J572k543J940p73J03k54k97
2792e34K233l527K567m17j076J733j988K642l293J834J298l259L017j852J537
2807I15j621L39J937l304K522q83J93k60j09J611k662K002n52j01n10J07J605
2824A229k985K523p44k84K59m94J890l138K819q48j205J681j402J993k930K036
$$ plain form
2707 630 -371 -741 1776 -1422 465 224 334 -238 -854 2025 -1621 442 315 -214 599 -1365 2046
2724 2046 -1515 -177 1255 -1325 838 -932 1289 -780 -918 1514 -1306 306 -154 493 -521 -626
2740 -626 1178 -1213 204 -138 440 -536 -389 1363 -1253 734 -81 161 77 -615 1870 -1645 443
2757 443 553 -654 568 -990 1696 -1324 99 1252 -1422 840 -677 1043 -688 -460 1655 -1496
2773 -1496 458 -3 412 -470 -470 1431 -1166 180 137 -47 -377 -282 1290 -1253 687 -86 17 -237 -534
2792 -534 1699 -1828 739 322 -754 979 -1009 1633 -1660 174 1472 -1787 1230 -622 915
2807 915 -706 -367 1570 -1734 788 -95 98 -162 -271 1340 -1322 680 128 27 -483 -376 1229
2824 1229 -1756 767 23 -261 -2 -496 1394 -1744 1075 227 -978 703 -699 1294 -1636 400
2840D00P27k826K836j810J420j302J67J886l204K883j145J52l44P7J288k642K261
2857H24q86k3n6K70N89k481K952j232m58O39o41J724l045K957p36j555K130j559
2875e87J580k208J858K59k412K709j416N70j062O38J025k695K843j119j58K9K67
2892A21R47k662K388q34m45O14j23P93k234K495j216l72J004p92J564k678K389
2909I59o58j378K311k242K181k247J418R85l153L150j891N92k83K05R47k421K450
2926I25r11k47L14j01O32j833K316j062n50N91j42P87k142K671j265p05J398j301
2944f25J380k295K671j023j460K625k046J600j734J579n7k458L458k408J145n92
2960b40K18J067k717L146j896P4N97m99P89j732K229j275j6O20l18K94j453K557
$$ plain form
2840 400 1127 -1699 1137 -673 747 -555 -388 1498 -1706 1177 32 184 -160 -83 1205 -1437 824
2857 824 -62 -85 -141 129 718 -1763 1189 -43 -501 138 -503 1221 -1824 1133 397 -1158 972 -587
2875 -587 993 -1215 643 902 -1510 1199 -217 353 -709 -71 954 -1741 1102 -17 -175 -146 121
2892 121 1068 -1594 794 -40 -485 129 6 799 -1435 1060 -156 -528 476 -316 1248 -1430 959
2909 959 301 -1077 1234 -1008 1173 -1074 344 1329 -1824 1326 -565 27 -256 -51 896 -1525 925
2926 925 14 -233 81 -20 612 -1221 1095 33 -517 74 -68 719 -1423 1248 -17 -722 676 -625
2944 -625 755 -1540 1131 108 -1352 1273 -773 827 -907 672 615 -1843 1615 -793 352 -240
2960 -240 -22 1045 -1672 1474 -422 -348 249 -250 539 -1193 1036 -239 -255 365 47 341 -1112 1445
2978A445j998Q6J316j276J132j995K479j190j004K547k630J677j272J123Mk098
2994a654L121k086M76K40L7P04k205K733j817oP76l86N92j661K426j881J31J375
3012I15j480J002j609K265j324m31J314j291R40j120K020j305q31K417k441J401
3028D42q28Q15Q7k100L536k855R05M09q50R89j760K631j739j69J223j038O24j206
3046h84J914j630n4J230j007Q82j248K245j964RJ683j952J406j385J682j118q56
3063a047K867l088J830p86L38K9j437K908k731J328J44n21N44j644K663k080M12
3080b71J002j233R14j442K144j838L07J204j335P20r66J857j771L95J498k120
3096i35J447j172J609j719L9K373l059J841o40M35j61j168K568k497J144K25p04
$$ plain form
2978 1445 -553 -467 849 -427 705 -1290 1189 -1 -1005 1542 -1088 589 -683 440 444 -1654
2994 -1654 1467 -619 -143 97 134 838 -1367 1366 -451 -457 319 -67 525 -1136 1290 -591 -460 915
3012 915 -565 437 -1172 1093 -231 -662 652 -639 301 -819 1201 -104 -935 1482 -959 442
3028 442 -386 429 516 -1584 1952 -903 2 411 -439 550 -1210 1421 -318 -487 736 -302 322 -884
3046 -884 1030 -600 -654 576 -431 451 -797 1448 -516 -507 1176 -776 630 -755 927 -191 -1047
3063 -1047 1820 -1268 562 -224 114 143 -1294 1614 -1117 211 355 -166 378 -1266 1397 -683 -271
3080 -271 731 -502 412 -1030 1114 -724 -417 787 -548 172 -794 1063 -708 -313 1185 -935
3096 -935 512 -660 949 -770 -731 1642 -1417 424 -216 219 58 -1110 1458 -1039 105 330 -374
3113c74O66j000K023k243P33R35j163Q04q85J560j917N96J064j485Q75n51J316
3130I54j573L71J419k129J191m33P26j064J24J833k820J930p82L94p6q98K380
3147A547k997J515O95j467J234j222J686j601L17J300j776P82l38J101j318O57
3163A15P46j767J253m93Q08j528P33J450k714K243j059N86o33l88K033k801K097
3180F81o30l26N89j075K309k796J558L45j350R13p83J652k155J127N25j592J486
3197D78r49J220j516P93P83j850J565o63P99j513J029Q82k358K169j199P90j001
3214e41J23J818l075K556j118Q9L82q20J973k990K083K70j664J333q75J194j671
3231i33J224K90j529J131j65L79j281J334k5j415J483q26P09j285J141O37k256
$$ plain form
3113 -374 292 -708 1315 -928 -195 740 -423 381 -504 1056 -861 -265 799 -686 189 -362 954
3130 954 -619 -248 1171 -958 233 -200 526 -538 -414 1419 -1401 529 -253 141 65 -833 1547
3147 1547 -1450 65 760 -707 527 -695 991 -610 -293 1007 -769 13 -325 776 -542 115
3163 115 861 -906 347 -146 662 -866 -133 1317 -1397 846 -213 373 -260 -648 1385 -1416 681
3180 681 51 -275 314 -761 1548 -1248 310 655 -695 218 -565 1087 -1068 59 584 -1008 478
3197 478 -471 749 -767 26 809 -1041 524 -139 660 -853 176 1058 -1300 869 -330 460 -541
3214 -541 -418 1400 -1675 881 -237 -148 234 -586 1387 -1603 480 750 -914 419 -456 738 -933
3231 -933 291 581 -948 183 18 397 -884 450 425 -990 493 -333 376 -909 232 869 -1387
3248a387K355j193L70j81j11J079k240K080n66m69O17o73J324k501K238l65j214
3265h37J587j028J123j751J235O93k214J846p07J50n76N43P43j902J502m59K38
3282A86p98Q09N22j941K193j209J31M8j91J227k466K563r97n95J317j346J650
3299A103k346J854k05j210J484r25P43j331J310M5j445J840j357Q54r25O08O97
3316G94k024K254j417L45l1K69M16j863K461j634M65l8O4O23k347K702j262l13
3334e36J162j075J211j910K100o76j125J577r76P41r43Q41k78j076J759j022J53
3351g3n16J121l57j147K096j628N96m96P67J79j784K471j458J24L49m28Q47j993
3369a330K464j384k98J309j185R08j237J519o98j055J933j402Q41q95R22K6j409
$$ plain form
3248 -1387 968 -225 145 -36 -147 932 -1308 772 206 -263 354 -319 1005 -1496 742 377 -837
3265 -837 750 -278 845 -906 329 1022 -1192 654 -53 97 -479 64 807 -1095 407 -52 186
3282 186 -612 197 719 -1222 971 -238 -107 -59 -250 977 -1489 1074 77 -518 799 -547 1103
3299 1103 -1243 611 406 -804 680 -245 498 -833 477 522 -923 917 -440 414 -511 97 794
3316 794 -1230 1024 -393 -48 -79 190 606 -1257 1204 -430 35 -3 61 684 -1663 1039 -223 -536
3334 -536 626 -449 762 -1148 952 276 -849 728 -248 493 -450 391 113 -963 796 -226 -73
3351 -73 -589 532 175 -972 1124 -504 92 -404 363 542 -1242 1229 -229 -105 244 -184 663 -1330
3369 -1330 1134 -250 -548 761 -424 484 -753 766 68 -987 946 -456 385 -510 412 438 -971
3386i71J915j068n0j28M92j14q31J749j229J30K2N37m39j031K178j799O66J20
3404A49m72P45j556K490j687n92J953j798J381j064J163p12q92J935j560O97n95
3421d15Q71l15q44J868k000J035l07J33K73j023J905j746M68L77m79N77j191J789
3439I76j621N24N75n28M93j404K142j623M7J135j457J449j428J528r32o31K025
3456A270k069J116l51K71j61p91J863j641O52qK52m67n96J700j834P02O4nK01
3475A68j042K310k015K54J072j286Q79r20J396j322Q0J363j574R28p37J071j100
3492d75j87J608j704J087o06O85o87k25J701k045R73M7j23m9m73J596j887Q02
3510C8K04k56K98q52J628j861P98P10j106Q44j212J756j436J45J323k179J655
$$ plain form
3386 -971 944 -124 -174 -302 190 76 -755 994 -235 -105 -83 454 15 -1016 1162 -637 29 149
3404 149 -323 422 -1134 1356 -331 -923 1030 -768 613 -451 712 0 -892 1043 -517 180 -415
3421 -415 456 141 -703 1165 -835 200 -107 26 299 -724 1181 -565 -97 280 -199 378 -813 976
3439 976 -645 -121 454 -74 419 -985 1157 -466 -419 716 -741 708 -720 808 -124 -755 1270
3456 1270 -799 317 -34 237 76 -715 1148 -493 159 151 403 -64 -660 1040 -794 -92 -28 -33 168
3475 168 -874 1436 -579 -325 747 -539 340 -580 816 -506 -426 937 -637 291 -446 625 -475
3492 -475 -662 946 -758 329 -277 408 -279 -504 1197 -848 125 172 49 0 -473 1123 -764 38
3510 38 242 -14 284 -568 1060 -801 -3 707 -399 445 -767 989 -447 -302 1021 -1158 497
3527D97o70M46o59m45K079j993P71j6J76m75k6J321j819J002Pj23j05m40J375
3546I03j823J152J40o38M47q86J792k021Q29P93j432J377j081J286j518L74J359
3563A053k125J682r12P79p55k47J830k425J678m70j39P9n42J514j907J228l5m99
3581b13L12k00J011j795J365j07o76P49j045J729k101J275J16j223J429j190J228
3598F64j472P28Q70j702J452p26N96o16j28J351k155J662l71j98J00m66J272k011
3616a150J318K4n06L71k83J129j828J250p1q09Q26n58R87j579J089L55j366J323
3634E22r71J073j321O67R54k296J800m28j13j10R5Q76j817J319n4m31K51j90Q88
3653G14j698J561m13m70L55j91P84j657J409k01r91J291r56J010j385R51L99j582
$$ plain form
3527 497 -173 273 -386 -831 1248 -745 26 10 186 -289 -315 1006 -813 189 196 73 -32 -472 903
3546 903 -920 232 372 -266 181 -705 1087 -934 -105 688 -744 633 -448 838 -680 -306 1053
3563 1053 -1072 610 -302 477 -278 -525 1305 -1120 558 88 -51 28 -514 1000 -907 321 286 -213
3581 -213 99 -101 910 -885 480 373 -303 446 -599 1130 -971 304 420 -803 626 -564 664
3598 664 -808 -80 790 -912 540 -186 410 -206 -334 1017 -1138 524 153 -45 55 -411 861 -1150
3616 -1150 168 192 -314 57 -226 903 -925 325 254 -555 271 -287 700 -879 210 565 -801 522
3634 522 -449 624 -697 -30 924 -1372 428 0 -113 -223 -128 748 -1069 250 196 -235 16 -174 714
3653 714 -984 577 164 -306 49 -142 642 -1015 394 193 -798 493 -463 547 -838 113 512 -1070
3671a070J941j169N67o86N10O90j923J791q82L66k17j61R75j620J703o64o31O32
3689A52m91J080j554J031J50q74Q29m65N58j446J624m36o02J097j075J116j674
3706i80J439j65j253J859j400J036r94M55P00j946K211j259j8M39l07Q08j665
3723a040J742p09j94K12r1O08j516J593m51p75Q56m07P68j055R52m10q72J510
3741G21j070P83r75J095m10r22J599j128N81o97N11M95j716K202j254N1M40m92
3759a86P72j713K032r67n40P44k81O53j208J160m07p07J204r18N87r18J295n12
3777I0r62J720j484P87m49O02J09j228J569j179L78m0L2L22j185J562j064K60
3795a60K63o5L41j242J781j051k42Q55o72M90r49J297o29o14J237r67N82q25J049
$$ plain form
3671 -1070 871 -298 269 -417 93 783 -1140 651 -231 135 -82 -243 732 -888 815 151 -480 152
3689 152 -339 741 -813 218 368 -506 323 -142 416 -1030 594 158 -444 653 -422 694 -980
3706 -980 459 294 -959 900 -500 536 -458 -3 697 -1249 962 -297 -315 124 -183 625 -1040
3723 -1040 702 -7 -201 11 -80 528 -988 605 154 -621 235 -172 596 -459 493 83 -789 721
3741 721 -349 434 -541 554 144 -778 821 -307 274 -423 88 583 -1133 1069 -185 -134 306 -186
3759 -186 586 -1127 905 -62 -602 142 -139 514 -694 466 59 -648 556 -362 225 -693 602 90
3777 90 -872 848 -636 151 -298 304 413 -815 754 -425 -47 -87 -55 267 -918 644 -420 -160
3795 -160 103 38 379 -863 918 -133 -375 480 -192 298 -651 646 17 -597 640 -327 255 -570 479
3814D79m35q02J750j632Q52n75P95k4j326J888j617P13j74J42N58j505J887j419
3832d45J99Q43r56P46j304J605r61k37J161q30L30q25J409j156j94J226r24N23
3850B10o19R41q32l41J304j277P59k84O51l61q32J851k097J200l55LL30r45J777
3869A083j770M56P22o00K26p27J421j267j14J252j151O42m91Q19o01k92J180j219
3887d31P43o13N69o40o3J157j263Q15m14L28p2o54J542j693P75J87l51J64q45
3906g59J555j383K89P66q22O61q00J387j180L9Q00j289R82o88R07q51m6J186j405
3925f51Q34k55L41l04m53J380j481P17j01JM3n54J331j561R53J09p36P67j059
3944f79J467j314L35P81j334R13n56R98r35K85O79j185Q97m94N72r04L85P29j311
$$ plain form
3814 479 44 -758 992 -640 212 -363 432 408 -918 970 -647 66 -108 34 592 -913 974 -445
3832 -445 -246 597 -359 387 -917 688 -273 -510 651 -179 151 -674 735 -421 -615 611 -313 210
3850 210 -409 532 -300 -641 663 -614 145 -139 512 151 -681 1170 -927 273 -82 -79 251 -694 1083
3869 1083 -687 -231 491 -109 117 -610 811 -456 -570 682 -469 173 -318 501 -100 -392 788 -431
3887 -431 312 -301 268 -372 -435 722 -541 274 -140 188 116 -538 1004 -689 86 273 -78 86 -759
3906 -759 796 -587 -298 468 -354 307 -493 894 -286 -247 553 -736 246 -442 465 -386 -432 754 -651
3925 -651 183 -72 269 -35 -488 892 -589 128 27 28 71 -483 848 -713 240 349 -387 380 -679
3944 -679 788 -526 -191 590 -744 169 -387 611 -324 -39 640 -545 352 -142 430 -474 -89 640 -671
3963f71J058m66L93m99j96J252j861J543o34O1J45n63J462j869J064q2m29N05
3981B13o57J229j719J042L20j022Q91o43P01n87J32N76j026J025o46O35p95L50
3999A9M17j104R47m80L51k76K3N05j153J184n85J54ok52J238j810J364m52m95
4018d11N36o09J218j469O88P51j210Q65p01Q43r08L85N62j243J119n56N59p66
4036c47J82O69j203J004l98OQ4l37J015j405J131j58m50J78m17J226j589J310
4054E01m15o79J101q22Q89j316O96N98j357J350q91O28o56L11N57j436J507n85
4072a9J55k49M2Q14j670J398n75j22J89k1O12j243J201o54k92P07n01O83j435
4091i80J370K0r94J065o90N44r76R99J2j012J439j093N91p54Q00O4r62J088q62
$$ plain form
3963 -671 387 -79 314 -185 -381 871 -990 553 -81 -20 125 -438 1024 -845 219 137 -292 213
3981 213 -444 785 -934 108 428 -594 297 -346 355 -232 -100 476 -550 475 -171 464 -331 19
3999 19 436 -668 279 -201 150 -126 -103 402 -751 433 -152 2 -4 -256 982 -828 536 84 -411
4018 -411 125 -484 734 -735 -47 704 -506 359 -342 501 -407 -22 540 -703 416 -140 419 -347
4036 -347 -165 504 -699 305 -93 -87 -3 -340 675 -730 401 243 -207 -29 -446 780 -809 501
4054 501 86 -593 508 -314 575 -741 -45 553 -804 546 -345 283 -373 -62 495 -941 566 -19
4072 -19 136 -113 -71 743 -927 471 -104 -226 -37 -58 554 -689 512 -142 -434 273 -228 455 -980
4091 -980 390 410 -584 481 -209 335 -641 358 370 -642 797 -296 295 -459 341 405 -557 531 -331
4110c31N06n31K67M16j135J493m65j55j46J75J43j070J576r51k21Q09p97Q67j115
4129f65J064l38p16J313r65O23p75N84K22j207J463p39R5j68J33L10q39J199p15
4148a21P2K7L48Q8j088J236p42J53J70j90O39j394J403o11l02O58n00O16j032
4167e70J273o95o30J155r52P68q62P07J12q10J416j157J35Q2M9J93j004J500j099
4186c89L36K02o0R2q51J253j105L46K60j22K75r36J550r32k09P76p68N79q93R62
4206C66m86n44J281q82N76o04P01k99n40J244j307N75l7K10o7r36J458j236M61
4225f6K84l01N37j180J353r77N6N43l53L80n97R84j082j72J266r63N72q20J145
4244F09q59k45J321j512Q29m99N95j38m18J039r34L34k45L9J6m65J115j097L49
$$ plain form
4110 -331 175 -356 -89 327 -808 685 220 65 -81 94 237 -833 743 -208 -429 380 -417 450 -665
4129 -665 399 61 -655 658 -307 316 -459 125 347 -860 603 -136 -41 -209 -76 234 -605 594 -121
4148 -121 -49 -22 326 414 -674 562 -180 -27 143 -47 592 -802 601 -10 -312 346 -154 462 -570
4167 -570 703 8 -622 533 -419 349 -513 194 306 -504 912 -245 -110 -28 21 214 -790 710 -389
4186 -389 -53 149 89 181 -670 583 -522 -176 84 -38 237 -699 851 -81 -290 486 -282 297 -596 366
4206 366 -120 -664 617 -265 311 -293 408 109 -431 813 -494 81 44 254 187 -749 709 -527 -66
4225 -66 218 -83 454 -726 627 -350 -294 249 -104 276 -321 663 -419 -591 675 -288 284 -536 609
4244 609 -250 -495 826 -686 143 -356 239 101 -317 722 -212 122 -123 -84 -68 -533 582 -515 -166
4263a66J88j85M13o08J139j250L59M62o45L96m55J181j175J06Q50j114Q85m87
4281a06N08n85k56J009j231P64r8L74k77n67J226j307N33qp8K80p06J259j155
4300d21K62M42l22J62m30J053j036K40N96q07M90o00J181j073N4Q14j196R37p68
4319d22P45m21m56J135j118P47l45J16j09m14J173j173P80k27k16L88n46J155
4337G92j194N15Q1n08N92p45J054j090M58L66o05J86j44P38r26M57K90r59Q73
4356B31o12P51p78J43J159j559Q68k57J93q5k94R50j316P32K38n97L05k91Q82
4375F63j196O69Q4p39P75n26Q03r75N16J48o98P99p13O73p01J93P55j055Q68m19
4395g6J33j35n9O35r47O04l22J29j1N1N96j505J179k3l92L58m80P79j087O67L77
$$ plain form
4263 -166 22 -163 250 -358 781 -469 -110 352 -293 103 -352 829 -346 -240 610 -504 381 -106
4281 -106 402 -183 -439 570 -661 103 5 379 102 -465 761 -546 -13 -21 -99 181 -525 734 -421
4300 -421 -159 283 -39 123 -307 746 -290 -50 546 -261 229 -371 810 -263 -209 605 -591 346 -422
4319 -422 323 -98 -554 581 -537 210 -135 -19 -128 -542 631 -542 238 11 -205 183 -363 792
4337 792 -402 113 194 -314 278 -467 587 -503 -45 321 -284 -98 -242 496 -430 27 317 -642 231
4356 231 -381 370 -408 -265 894 -665 203 -54 139 54 -240 710 -606 126 364 -233 72 -219 663
4375 663 -533 136 220 -519 256 -270 533 -442 74 222 -476 323 -390 283 -418 -225 530 -525 343 -76
4395 -76 57 -78 -137 498 -449 155 -167 -38 -49 2 598 -907 272 249 -143 215 -265 514 -573 94 471
4416D71q64M88k20L67p22O74J27p67R40p57N15p13N18N62j358J377r72N03Nl24
4436a50P63j118J006l14m34L45l49R10j182P17p7k67J97k73O40j199J078m4o29
4455c80P21p46R08r73P01P3j102J271o67L17l15J56L84j027J105m96J76k12J35
4474B9N65j125J051m24j34R8o1N91j234Q98p5n77P34m76N19q87O94K45q92O25
4494A64l90N41p74O46J5o48O55m88L65l95M99K20j167J201o27J74k3J9O06j168
4514e75J061l86j88K92k17K87j058J118k68m23O03n39P88r62P96L2q78Q51m98
4533a64M06m49J14L78j002J224p62L56l00K99J22q89J212p67OK73k51O61j221
4552g54J301o75j71O32m19L39r62J114j85o22P82o55M07n97Q37k53m99R16q34
$$ plain form
4416 471 -393 95 -125 242 -480 194 321 -446 494 -263 252 -461 57 619 -739 638 -334 169 174 -150
4436 -150 613 -505 501 187 -247 98 -251 659 -523 194 117 -150 47 -226 414 -785 293 249 -380
4455 -380 341 -405 503 -470 231 304 -798 473 -194 123 -192 -36 348 -679 426 -70 106 -106 29
4474 29 594 -531 520 96 -38 60 -1 590 -644 254 179 -398 336 -140 379 -508 186 431 -461 164
4494 164 -226 315 -459 187 202 -446 209 -279 86 -309 190 410 -757 444 -183 -9 -32 -13 593 -575
4514 -575 486 100 -88 204 -13 274 -784 334 66 -357 246 -293 495 -467 329 361 -517 334 -164
4533 -164 242 -207 -93 285 -717 507 -255 101 -199 100 222 -667 545 -222 -216 57 -194 467 -754
4552 -754 547 -128 -299 333 -86 253 -709 405 220 -402 380 -275 132 -465 372 119 -380 536 -298
4571b98N96q02O88J23j027J324j025N00OK2J55q57J292q09J36J93m03L16r06J559
4591G83r31k39P28o06N45p23Q73l02o38J026p09L63n14N48k51m15P75n45M07l73
4611a98M14j34n06J025r61M63m32K81L72q31J233j117K43K25k87M97p56R07m64
4630b6k63P38o04K70n74J002o26l62P45n09K56l85N81l90k87R63r46M78N4J38
4650B53k09m13Q26p26L2L47q1m8k97J026j195L76M02m94N10p89Q45m70j36P74
4670E33q87N58n24O29l46k83Q00p59L21l46O75l66m28J130j415R59j59O9j80n61
4690e80J305j229N26K24m94M68n52O45o55K69M18n93M59n67Q46p48J27N35p17
4709c13M69l90N37m25k19R71j045Q44n69L26l64k64J079j172O19lM2j68k97R76
$$ plain form
4571 -298 298 -504 184 307 -720 604 -421 79 85 107 262 -595 697 -112 24 217 -186 130 -776 783
4591 783 -148 -387 341 -265 280 -443 430 128 -510 516 -193 170 -344 204 -47 -462 313 -232 175 -198
4611 -198 216 82 -424 601 -360 103 -329 -48 324 -507 726 -391 -148 77 -210 287 -469 438 -26
4630 -26 -289 449 -155 115 -459 543 -83 -445 300 -209 47 -338 243 -147 -434 529 -417 61 115 253
4650 253 44 -369 457 -269 -237 110 29 -19 -316 710 -485 -109 293 -201 309 -480 365 -105 -241 533
4670 533 -354 204 -320 309 -37 -320 480 -279 42 -304 371 5 -423 707 -708 251 92 161 -19 -580
4690 -580 725 -504 22 246 -248 220 -332 313 -342 -73 345 -248 211 -356 490 -258 -131 404 -313
4709 -313 156 -234 303 -122 -341 630 -415 429 -140 186 -178 -442 637 -535 84 81 123 -45 -342 634
4729F34j195O54J4k09L58q12J075q33K01K76l35L89m24Q80q54k6P46q18O39o67
4749c07N16l44Q2N88r68O76n29M49k59p1N62p23M65qm8r9j97O89q80N86Mj36Q5
4772A33l09M30o96N20J46m70M27n42P51o33M4O48r11P61n04L32j65j97R47j194
4792d82N11k35K46l2j78N85q45M33mk34K66l00O60q95N72J09m06M44o46R23j054
4813e62N60L52r04O43k17M68p11M19L72r34Q43q30P97l11j58O26j083J166o76
4832a40ML7j66O29p38M50O4k70J57l02O26q99P00L9n05M87k52L46n20L72J70n99
4854c10M80m27O47p33K33M01p10P88m59R0j98K89R2p70Q64m10J30O7k55M97j102
4875g96J131k37k57M06n27O37p46N19J58n45K49l3M53q14L57K83o33Q00p60O81
$$ plain form
4729 634 -561 93 107 -102 256 -556 519 -314 -113 163 -172 217 -207 673 -181 -207 539 -279 360 -307
4749 -307 209 -135 -53 535 -433 243 -286 163 -96 -167 395 -328 137 129 81 -18 -215 474 -406 180 184 48 133
4772 133 -176 254 -442 78 224 -246 181 -361 390 -243 -199 449 -462 299 -205 127 -38 -235 712 -482
4792 -482 29 -206 40 8 -170 415 -430 3 -1 -235 31 -269 391 -504 68 177 -229 215 -431 492 -562
4813 -562 -2 350 -554 89 -128 340 -371 48 420 -514 329 -501 296 -15 -173 453 -630 536 -140
4832 -140 -136 -99 -265 364 -374 76 140 -130 27 -275 351 -548 152 191 -314 173 -79 267 -253 119 289 -310
4854 -310 170 -257 390 -343 -110 291 -419 369 -90 0 -198 91 183 -587 277 -133 -3 64 -191 306 -796
4875 -796 335 98 -159 247 -280 357 -389 130 288 -257 -8 -41 412 -402 -45 238 -395 405 -355 326
4895C26p44M31L62p95J103q72L19k25J02K93p94N66mj49J04q2M59q32P59k08k44
4916a25M01m82N81j088J037j14n74Q53n17M60p42O00K6q63J150p25L64k94J32
4935H0J99n39Q18q22K66N8j97M45o96Q85q31O6K39k21N98q31Q54k64l75M10m14
4956b72L19n23Q03l38l93O39m48L68p00P19n6o83J103o99K78j97J40K77q45R64
4976D56o68L78j4k07K26m35N33m78K13J69l39N25p30R37n21k46N20q02Q52p02
4996c33O40k50n64P97n37K97m39N34j72n22R37o29K06J02q9J95q39J133p50J65
5016a18K64m7J74o35Q68o63L6M41k91K25o08Q61o54j18N36l79M53o94N83j31n35
5037d32J050r66O21l18L52j87n08P68q21N59J59k21O8p25R01n57L49J03k38K18
$$ plain form
4895 326 -418 13 375 -420 683 -189 130 -95 7 300 -494 72 68 -81 23 -59 400 -432 327 119 -125
4916 -125 276 -206 375 -713 324 210 -364 489 -28 432 -310 290 316 -547 603 -122 242 -52 80
4935 80 279 -260 558 -264 2 60 -137 308 -388 497 -334 -268 -29 -250 348 -483 371 107 -268 142 -272
4956 -272 47 -476 327 -11 -404 235 -213 155 -545 174 118 -565 538 -161 117 -80 60 337 -508 456
4976 456 -212 166 152 -55 171 -264 269 -209 4 173 -166 359 -371 566 45 -201 319 -483 369 -333
4996 -333 307 57 -507 290 -247 50 -389 145 -27 -549 388 -241 -35 67 -22 173 -666 467 -283 -118
5016 -118 146 99 273 -362 506 -157 -121 320 29 254 -354 507 -147 -265 271 -108 345 -349 234 103 -432
5037 -432 618 -348 273 -45 307 120 -388 380 -441 118 277 56 124 -601 300 -257 92 195 -43 175
5057A75n90Q45p57K22M30m87L18n11M93k29j12P86o95L32m63M14j30l12P72o91
5077a90M67n94O22k22l76Q26j053M72j76K56K7m02J033r45J07M24l02J7l37O14
5097B68l61J01K72m75L64m81P21m34j57P39r58L77j69M23l01l37R68r54N70j87
5117a1K16k76l35P56o25K80k48J11K94o31J110j021L73K4j61L42o15R20o17J12
5137bJ45l97N62o18O47n12m5N46o78M44k24K16j45m3O33r33M05N3M2j27j33O10
5159D46q74N70j08k72L87m05P97r50J70N22m71L29l93O14o33M95M7n94K00k62
5179c85Q89o87O4M64q19P08l10K20j93j07N57j007Q65j92j00n1j28O55r98O89
5199A34r7j69L66n15P03p28M99j19l42L50l30N28n86L46K01n22L32j29L55n25
$$ plain form
5057 175 -415 430 -327 -105 325 -162 156 -355 138 -91 -203 583 -112 220 -243 171 41 -271 501 -190
5077 -190 277 -317 305 83 -293 533 -520 -48 -224 32 59 -343 690 -255 -148 276 -26 -9 -346 268
5097 268 -93 8 280 -195 169 -312 409 -25 -182 557 -401 -24 -193 230 -71 -408 560 -394 176 -11
5117 -11 205 -71 -406 350 -275 5 -243 -132 162 -469 641 -380 -7 17 -144 198 -417 503 -114 -2
5137 -2 143 -254 308 -310 337 -175 -220 326 -352 92 -132 84 -61 -104 529 -404 1 54 96 -31 -164 446
5159 446 -428 142 34 -238 149 -256 541 -409 -239 283 -188 141 -252 362 -271 224 271 -323 -123 -385
5179 -385 504 -183 -119 345 -474 234 -76 144 -49 -156 401 -606 259 67 -33 -84 -212 443 -555 134
5199 134 37 -132 234 -281 422 -306 193 74 -268 82 -248 280 -306 40 241 -281 51 -78 277 -248
5219b48L05K58o73O17l39J82l01J40N42j016P60m02J90K0k82O93p91M82o7k09
5239a39L89m94P80r66O94k28l85P32o25Q62j149L75L22o00P14l15K27m14M32L40
5259E52r32M83k35J06j67L57K60q26N91k91Rj4j35N11q55Q16j18m16N28n25N32
5280B31m96L63J45n71L68k13K09r0J19K06n52Q13q00L04j9P3M10p23O56m07q1
5301e5J73m66M97n54P04j80m10M47m55M11n22N93k65k90N00m15M81n45N47L9l43
5322a08L97l97L69l90K14K57n66M21k19L6M0k45K65n18P68j94l44J91j67M23o63
5343d30P90k47k60M70m95M74n96M18j9l79N57n41L32m12M44m2n87P49l83L54m08
5364b11N19K0q48Q06m40L41k46P0J81n21O31k19j41J47K5K6l63N14m73L4L95k77
$$ plain form
5219 -248 57 315 -358 259 -80 102 -199 -59 483 -533 227 -175 15 35 -247 446 -345 137 70 -139
5239 -139 250 -244 536 -430 264 36 -349 383 -242 620 -529 -154 168 -432 282 -33 194 -220 212 552
5259 552 -380 103 -132 -26 -193 164 424 -402 189 -102 -93 -107 -242 269 -586 230 112 -304 224 -301 231
5280 231 -265 98 243 -328 40 -173 36 -54 65 271 -281 532 -268 36 17 90 500 -223 433 26 -55
5301 -55 118 -348 149 -405 299 119 -291 156 -299 112 -410 183 -82 -372 128 -287 194 -351 196 235 -108
5322 -108 289 -108 261 -129 85 342 -224 197 -22 14 54 -191 74 -444 324 130 -214 -23 -190 233 -430
5343 -430 360 113 -147 323 -172 302 -294 124 105 -274 283 -258 74 -338 106 64 -523 226 -157 197 -211
5364 -211 308 328 -520 286 -154 187 -59 11 192 -329 302 83 -58 89 114 140 -223 291 -182 -148 247 -30
5386c0L31n54P03m83l23P60n95L11k93L98J0o31P73k42j95N8PK05m15N27l81O2
5408Cq8J51J27o10Q56n80J93oJ7M8m62O36m03m8K31j73J81n34M72J55n19N11l10
5431a52L51l80J66Pl70O98m52L56k70K24P0l84O33n46R3p9j04L10n97P96n61l
5453a94O12p60M68l08K56l06J04N19o89M97o19P89m58k47M79k88L77m34M27l02
5473g7p1N37o18M34j57P1q2n22P12n26L23K0k5R0o03P98m44P6L78m73L32n13N82
5496B42m26J69L59m49J66j91M05m93k03P66o16L83r6J06n0m12M41k35K58k3o9
5517C2J05m64O21o88K38L46j42J23m30P64r03M58lr1K28l21L67o00J58M10l41
5538a33K40k92L46k64m0M97o25L68j38O3j36j05O92p49K86o2J21M3l42M41m19
$$ plain form
5386 -30 301 -253 450 -33 -356 404 -191 120 -173 225 235 -396 377 135 -60 -2 5 210 -205 322 -59 3
5408 3 -85 66 193 -417 439 -141 52 46 63 111 -351 285 -118 -166 65 -108 73 -461 11 166 -353 158 -152
5431 -152 199 -181 -15 -8 -378 320 -132 224 -46 178 248 -136 497 -49 44 -35 -139 171 -426 370 -191 -194
5453 -194 418 -342 126 -182 74 -232 -128 391 -298 199 -420 369 -89 -336 143 -145 232 -202 225 -77
5473 -77 -148 389 -229 205 48 119 37 -485 227 -299 24 44 19 109 -494 304 -140 -64 314 -159 173 -340 242
5496 242 -184 -15 344 -105 61 -130 275 -218 -421 345 -271 112 16 122 72 -340 101 -134 124 101 32
5517 32 137 -327 294 -394 -156 190 48 171 -259 505 -398 60 57 -34 194 -127 240 -360 -202 208 -133
5538 -133 107 -185 161 -103 -143 354 -271 97 -41 22 -114 -219 473 -276 10 -52 69 112 -230 211 -208
5559b08K23K13j13J47m63M80m82L31K05o94M78l30L59j39R9J72m44L10k95J50
5579am9p5O23j027P28j61J94k70j75O48p35M03Lp4J62l52M29o48K69J46j41J74
5601G1l53O15p21K90K72m54O38o30M87m72J57L77n94M06j62J49l77m2N69k88P5
5622A3j06L87k97m8M47p98N74q8P1j08k22M31p75O47r9n5K73m73O98p76M05M3
5644A44m33K25j34N49p33K97K75n78P64m71K30r6k91M92n95O01l04j42J89J28
5664A17Q8o03P10m1l32J05l25M82o26O44j21l07N71l45K32m68L58j22l15N78m91
5685b11L23l31K93K86p00N83l95L52k94j2L72o64P61n04K31K7n26P25m40K92M3
5706B11l46J35k0M71o78M43j21k88L15l20N33n99M01P1k96L24l17L77l79J18K10
$$ plain form
5559 -208 15 228 115 262 -201 279 -203 128 333 -361 117 -213 146 7 106 278 -166 144 -151 -1
5579 -1 -50 -125 498 -529 199 38 232 -38 -213 435 -300 103 106 32 194 -158 271 -377 -108 38 -103 71
5601 71 -282 333 -388 -98 174 -280 358 -272 215 -257 -100 277 -317 89 -73 76 -301 -343 226 -62 13
5622 13 -93 294 -3 -51 396 -402 172 84 155 47 -175 256 -519 128 29 -26 247 -226 472 -304 101 144
5644 144 -289 -64 -198 351 -382 -85 190 -388 376 -95 135 39 -252 240 -355 246 -58 -200 -11 117
5664 117 205 -398 312 271 -61 44 -281 201 -425 219 98 -209 362 17 249 -219 139 17 -298 280 -211
5685 -211 112 -219 74 360 -340 243 -152 200 -94 -106 266 -398 363 -141 90 117 -409 316 -124 168 211
5706 211 -135 0 -20 451 -227 216 95 -193 122 -198 335 -264 137 208 -88 236 -81 296 -83 35 245
5727B45p36P81l55N3j43J51J80m57O18n62L15k4m74O78o97P26k93j98K38j92M17
5748B71p07M90j17k97M80n38N54l96M16j78k78M02k62M01n04K50J88o80O16k48
5768a37J16L1m0K65o06O38j73j74L03j28J62n68O68n26K11K62m39L53m53L85O8
5789B18m85N47m59L26m85L96J4m59R24o92K30q1J16R7l53M51o30L33m1j22L93
5810B38m93N12l50j56N22l00L91o98M83k70l14M08j42L63o12O07j86j90N29n16
5830a74J88k69K92J9l92R19p93K13r8J13J91o94P88o51L37rJ53K56q03P39l80
5851e5o3L45k76L17o46L16j9K5J9j02K28l69N24n70P4O57k34r8j20K49n4m09O07
5874C46m88J07o6J02j5k70N55n66J89O6j20O3j21O88n53j01L31l74L11k68M00
$$ plain form
5727 245 -491 290 -65 -12 -155 -4 176 -281 337 -225 90 66 -408 270 -427 299 6 -192 46 -146 271
5748 271 -436 54 -63 -360 120 -418 136 -260 156 -22 -300 102 -160 241 -263 -13 175 -505 111 -137
5768 -137 -21 10 -30 235 -371 267 94 -80 223 95 257 -311 357 -169 42 304 -135 218 -235 150 218
5789 218 -267 280 -179 147 -338 58 72 -387 537 -155 75 -6 110 207 -146 305 -325 8 -33 -155 238
5810 238 -255 257 -93 -249 273 -27 364 -334 149 -121 -435 -27 -169 194 -418 189 3 -187 342 -174
5830 -174 14 -255 37 56 -336 583 -210 3 -95 18 209 -485 303 -348 -11 -20 133 389 -414 325 -55
5851 -55 -118 227 -49 268 -378 -62 -81 -56 -37 -139 89 -280 244 -326 -252 405 171 73 -47 202 148 -261 346
5874 346 -142 -35 -101 1 -14 -284 271 -295 -106 -40 -160 -97 -218 470 -83 -184 147 -227 84 -184 216
5895B16l69j95N56l59L26l52L49l8k22O25q47K75K0k8O8k51Q19p80K36J77j20
5916A06O0l60N93o12J97P5j35K15l48M26m43K48L9l46M98l02K98k97k9M35m93
5937a75M36m91L02l3l57P50q15M44j82K9J38m17O70n46K16N4l4m7m37Q08n64J52
5959i9L19m92M69m70P07m97r6M51n69M11k00K52m32j30N32k44K15l45M42j09k20
5980a05M88n91K84o5k3J4j35N13r13M83P3r8K55n21N50n65L93J09l93R7L7L97
6002B84l90J56L90q16M30j21N3l8k72O14l42Q8p2%J35k54M45p05M81J53l40q0
6024b01N3L15l38L25m4l60K91q1J35k60J73K01m59K86q8N25p76K02L22n40K82
6045c7j26J60J2JK52p30L71K14r0J5j93M15m49L43j38o6O7j48K97k96J56p4J16
$$ plain form
5895 216 -153 -348 208 -151 175 -177 172 134 -88 537 -310 -35 -15 -43 25 -226 593 -187 49 226 106
5916 106 166 -194 399 -213 -16 59 -76 139 -209 217 -226 22 61 -285 213 -89 209 -88 -117 318 -175
5937 -175 261 -230 72 39 -318 432 -383 61 -121 -92 46 -371 299 -247 -31 23 -11 -58 -495 313 -251 -99
5959 -99 220 -272 197 -273 434 -63 -159 292 -277 134 -66 186 -246 -376 156 -88 127 -218 224 115 -105
5980 -105 383 -208 76 11 -12 2 -133 380 -533 -50 23 -75 180 -341 209 -356 37 146 -247 -150 -113 284
6002 284 -106 50 440 -376 54 -67 -14 -52 -324 290 -52 36 -36 -36 99 -155 290 -415 66 219 -121 -201
6024 -201 -148 167 -171 154 110 -250 41 -40 95 -165 8 209 -250 36 -52 473 -303 -101 221 -319 -37
6045 -37 -163 -3 9 10 262 -468 -97 117 27 42 -151 264 -185 158 20 -46 21 -127 170 -126 30 -44 72
6068G2J32m80O07m71K82n2j79K85m60L29j92J53J58k00L42m49M18l01L1K63n08
6089b20N59n96L61j07OJ53l88J87J25j30K49l98N76p21O05l24j08K93l96P25m76
6110b5K65j48l38N89n66K91k47J30K30n22O36k68P0j34J17K96m63M72n70Q4M6
6131e5M7L99o00N25l52K8J21j0J39n88O77l35k57K39j72M31l36J80p3j56J19k4
6153e3L55l54j2K42n71O54l20L66l87P6J92m10O09k95l79L96k47K82l12J71N2
6174E5j30L28l26K60m98M11p6OK16k67J23m10L16L3m84P04k83K03k03L4N7k06
6196a37N24m28J2j13J94J64n73L42O9k75L70k70J82l93M96l53r2M57m88N21m73
6217b64M18o5k78N69k19k01o6R1K16k55L62m66Q7m3K58j64k91P03n96L06j90J01
$$ plain form
6068 72 204 -276 331 -140 142 90 -89 196 -264 65 -127 26 184 -16 326 -123 295 -6 25 288 -220
6089 -220 339 -257 104 -3 3 156 -232 -45 80 -50 199 -199 377 -344 261 -63 -171 122 -274 451 -25
6110 -25 240 92 -246 343 -223 68 -179 -49 181 -341 295 27 97 -37 80 376 -87 385 -185 -101 -55
6131 -55 -8 391 -209 316 -36 -8 113 103 242 -346 331 -4 -261 -22 -194 237 -99 81 8 -148 -29 -53
6153 -53 302 -52 -64 178 -393 261 -59 307 -80 -4 188 -222 387 92 -287 109 -138 144 -168 3 55
6174 55 -75 253 -73 187 -311 100 24 30 246 -21 102 -308 8 41 -443 261 -22 181 -22 12 69 -137
6196 -137 387 -41 -29 -142 52 216 -357 -15 54 -221 149 -121 61 -332 164 -189 -281 176 -312 209 -264
6217 -264 154 89 -189 380 161 -40 -106 -15 201 -54 308 -158 -71 -114 144 -20 -311 392 -204 102 -88 13
6239A3J34n29P34j21j67j42j8K60n11N70k87j23J72j56L10m40M79k42k35L50j96
6260a45K69r0n1J24l00K96l82M86k23kJ7r2L58m43J49J5M7Q3l77L97j46K9K9o2
6284a4j67j34N05l56J83n6j42L48l63L19r3j96M01o02M29k26K81Q6o68O77m75
6305b63M89l25Q7J86l29K72k74J83O0k25J72l42N96n83Q3K37j81M16n05N06l44
6326h4j24K44k00L65m35L63o8k70M48k93J34N1j38l9j72L62l02K10j04J15j42
6347g9k0M05m67L38mk86K87l67M54m08R2L9j55J49k17K94k93K53K48l94M85l07
6369D7K5j70J02L11l35j3j24M56n40J34K92l43L43k22K24Rk68K26n47L63K05l32
6391a57K44k87L90k98K89qn16L62k11L12l09p6N00m23M48l63L35k83m2L00m53
$$ plain form
6239 13 147 -382 352 231 64 -78 -96 164 -347 223 -64 -187 -15 -171 139 -301 178 -64 -299 51 -145
6260 -145 124 34 -17 107 -193 103 -279 207 -16 -18 -1 -93 265 -178 -29 -14 33 116 -261 136 -10 19 48 -14
6284 -14 -181 -315 190 -166 17 -39 -181 167 -196 123 30 -166 235 -367 62 -164 117 203 -465 212 -263
6305 -263 226 -99 -12 174 -155 117 -157 26 86 -139 33 -309 287 -296 -213 24 -157 259 -246 260 -84
6326 -84 -208 36 -164 201 -234 129 61 -209 239 -54 80 131 -7 -46 -218 144 -158 52 -52 63 -79
6347 -79 -99 306 -161 177 173 -113 174 -193 261 -147 -55 -16 -171 -22 -239 55 -238 15 263 -131 354 47
6369 47 72 -98 4 315 -20 -33 -157 299 -241 -107 185 -158 185 -37 187 196 -72 154 -393 -30 175 -157
6391 -157 87 -200 190 -108 181 173 -343 19 -192 120 -189 -265 235 -188 260 -103 232 -51 -93 207 -246
6412b46L11q7L8o4kK63l76J92Mm7j57r3N10n05J19J65j22R8M4K32n05O5K61k16
6436a18K22j27L03k69R9M3l22K58j10J04j52r9N76n90L55j06j71K03l27M56l97
6457a69L01j15j18K44m06N46o28L69J62k48K76l93M99n47K12J44l96M70n17L07
6477gn4r6K62l34M08%l39Q8p4K83l39L42j42J25j32LK46o75L63R2l44L64k20L31
6501A51m65L72L3l51M25j31J79n62M81kl12J81j88R9j33L57J69n43K54J28j03
6522C9j62r1M11l28J79K1j56N8M5N0k56L11j43k0R2k21L09j39R3m9m35O40l56
6545a08M22l71m1J98m92O94m07J04k60J36K17k50N05l64l4N1k9K64m75L70j86
6566e6k56L10l2K65m45L33k0l32M31k09J67k90L20j14k20N50n82J34J02k07L71
$$ plain form
6412 -246 65 -22 16 -48 -50 213 -163 29 33 -14 -171 -264 246 -259 -140 25 -97 1 45 277 -228 -163 98 -118
6436 -118 104 -23 280 11 110 153 -169 89 -21 83 -69 -168 408 -182 173 67 -104 99 -228 228 -169
6457 -169 132 17 -101 143 -263 283 -345 24 186 -62 214 -179 320 -227 -15 129 -267 203 -314 -7
6477 -7 -61 -157 105 -229 179 179 -160 -72 -146 137 -202 140 -2 123 -9 -6 240 -435 -72 20 -324 40 -180 151
6501 151 -314 58 91 -260 165 34 213 -349 132 130 -182 -1 -189 -90 -223 134 303 -240 14 142 39
6522 39 -123 -214 197 -131 48 69 -87 -29 16 66 -190 121 -22 -42 50 -171 138 -1 92 43 -392 248 -108
6545 -108 314 -57 -98 100 -392 302 -105 -1 -261 -125 92 -158 347 -17 -51 0 -29 235 -240 130 -56
6566 -56 -312 -2 -34 231 -214 119 99 -233 198 -11 156 -134 186 72 -148 402 -180 -46 56 -151 220
6587B20n44K67lJ8J46n4j5l85N01l59K78j21J87j5k62M51l55J5p3n9L76o72Q69
6610D11k15l69M48j26J27m87J40J65j44K65m94M22j60o6J60k38L62n32L57p7q
6631e9J11l71M75J4k55K82j51J41m76M66j62J04k44J66J10l87M59l29k0L53k24
6652CQ7j33K40j78j92K76m75P86n61n9L20l01K97k12J0j01J64R8j55J85j84Q9
6674Dj66J25L18n14L81l80P5K03j62K63l64J62o9j71O69n72O3J20q8J64k07L49
6696B03l61K15k42K14m0k75P55o64L49k80L6K82l47M34l55o5L4m5L18l18L97l40
6718i5O1J05Q6r3k05K40o9j41K93l62J59ok8R2r0M16o00K20K33j38j24m1L53m48
6742a82L21j84m2K01m00N82m17J08J74j76L44m23oJ1L7J77k97L25l33M30k91l
$$ plain form
6587 220 -324 -57 -60 -42 104 50 35 -350 151 -208 70 -51 136 121 -141 310 -45 -30 -103 -162 214 -458 411
6610 411 196 -173 275 149 276 -211 -71 94 -50 215 -279 143 -17 -83 77 -161 201 -331 26 -51 -59
6631 -59 52 -319 156 170 -85 197 46 187 -289 177 15 119 -125 41 151 -236 223 -106 -126 227 3
6652 3 90 -43 197 19 -173 103 -372 414 -147 -206 114 -187 110 -102 -92 -193 -29 69 -86 99 -85 4
6674 4 -162 -37 281 -233 148 -232 -157 46 -116 147 -217 -55 -124 -295 374 -198 -135 -15 -103 61 -146 203
6696 203 -158 57 -185 29 -11 -286 469 -195 154 -126 -90 192 -155 279 -76 -141 -107 -152 166 -152 245 -95
6718 -95 -34 71 157 64 -141 99 30 -111 182 -180 -21 -27 -55 37 -53 363 -237 -17 216 78 -46 -87 266 -182
6742 -182 139 -45 -87 114 -286 296 -121 -13 161 -15 329 -94 -100 -89 -52 125 -172 153 -180 250 -41 -44
6764d4K53l73L88l48q7K90j01K31m13K96jq2P9k22K88k21J25o0P6j47q1L02j74
6787b6J05o7j39j01P6L55m48J95J77k68J56j90L81k00J08P8k85K39j04L0r8j74
6809b00L06l66M88o9k46J53k68M99n36J38O4j58L16l74M42m47J2M48m72L90k30
6830a10J97k33K14m4k48L65m36L14n8j46K56l00M39l02k01J34KJ28j21K12o7j
6852fK61l55O9j88K43O1k42J77j67M09l50L29j25k16J84k98J88o4o6K34k57K07
6874B8m07M05k3r0L11k95J91k57l8K23k22O60o53J97q3Q6Q0m7R0l28K59m6j23
6897h2J88j19M1k40K19J12l61L40j83K74l53J53K12k74J50j79P7J34l37N17n91
6918c02M11k5J01j60q5L50n72K89J93j49j67j52L20k57K53k9j86J73k52L78k44
$$ plain form
6764 -44 209 -164 224 -124 -211 79 -22 209 -204 92 91 9 88 -134 154 -67 58 -2 74 -73 -154 148 -26
6787 -26 79 12 -127 -228 -152 203 -245 -50 127 -141 15 -175 206 6 114 192 -93 146 42 72 -26 -200
6809 -200 106 -260 228 159 -87 66 -202 297 -239 -101 -37 -195 121 -253 189 -258 -246 202 -270 120 -110
6830 -110 87 -146 68 24 -224 141 -295 19 -39 -185 71 -229 210 -92 -293 -159 -157 -29 -150 62 -5 -6
6852 -6 255 -100 -31 -219 24 85 -157 20 -147 262 -88 241 116 -100 84 -214 -26 -90 -156 78 -179 28
6874 28 -379 26 3 -87 224 -71 120 -137 -175 48 -174 486 -167 30 -53 33 113 66 156 -172 87 41 -82
6897 -82 106 -13 28 -212 7 119 -242 98 -85 189 -164 -11 201 -73 77 -102 -25 109 -228 289 -302
6918 -302 109 84 185 25 -60 290 -282 7 200 51 -116 -268 52 -205 48 19 -167 6 -246 132 -112
6939a12K43j04O4Q1l38J99M2k24P5k03K63k81L56j99K1K42l50L61k79O7J37l8
6961B3L4l45M08K6k17Rn7L85k46n2n3N8K85m89K68MJ78j83l6J34l30L28k90L16
6985A58M3m47N16n68M07j21J60k4k99J74j23O9J60p6R3k94M92j38j66M5k24M18
7007B55o96K78J67k87N12k37J0r7N2J96m84O25j82K3j91R5J28m96M49k05J28j43
7029a00J11K98o21M32k91j0J61p2K78m33N78m40K8M55n64L87l95J74J37l80N04
7050B37l27J86j65K23n1j54J29l18L89j03P8L8n31O02l37J49o0N5j05k41O42k85
7072E1j12K71m20M74j44j01Lk97L03j15P2m6M6l1m6K90k26L7k32L39o6M6J38l44
7096a10L23k81P8K12k27L1k35L46J6j76J38k27L11j73r7K06l47J54j69R2J0m7
$$ plain form
6939 -112 131 27 91 172 -166 33 75 -149 -74 -277 -14 -295 61 -138 -117 125 -225 136 -143 -76 61 23
6961 23 57 -288 120 146 -71 -62 -119 266 20 -32 -85 -27 258 -231 37 41 219 36 0 134 -196 132 -158 158
6985 158 201 -246 270 -298 109 -12 148 124 -175 -1 -124 -55 105 29 122 -172 320 182 16 61 -163 255
7007 255 -441 -163 4 -283 229 -8 2 -95 -43 153 -331 294 112 135 -56 39 167 -329 120 -85 43 -100
7029 -100 11 309 -312 120 -171 -181 -20 -92 186 -247 331 -109 -81 374 -190 197 -198 -24 113 -267 237
7050 237 -90 96 -69 154 103 -51 78 -240 149 46 124 162 -369 233 -104 45 -15 40 -65 -306 336 51
7072 51 -61 210 -210 264 120 19 22 -275 28 -87 -15 -61 -15 -46 -92 198 -28 9 -223 116 50 96 234 -110
7096 -110 213 -68 10 222 -5 26 -209 137 153 -23 115 -112 199 26 -71 135 -212 -58 -227 -135 -125 -172
7118a72J59j67L12j56J59Kk18L22l53J50k15K01j24Q1K05l00N6J03q3J58l17L62
7140A65k97L35k24J73k25P3J08j86QK35k60K22l27L4K34p6J11l20J01J26O2N4
7162A26j99N33p94M29j11K31j8k17K44k01Q3j12k51K69j74L23j93J7K29l33L30
7183B11k20J12k3m5pj79L88k17M3j87J75J37l48K34o3K23k47k00L03l16P2K29
7205G5j5J60l16M8j4R5K4J90k50k89N88m75J53P8j64L61k84L49l88o7K77k07O
7228f5R2m2p1o6K77k37R0J12r6j72N7L34k90L13l06J8K35k99L94k61jj02J45j56
7252i7L6K98l73L60j82j04J24m2K54l48J57K19l33J53l34L01k07J59M8l39K66
7273A6P0j40R3P1r7j60J99R4o7r6p4L57n09J58J02k32L26k10O0l8J29Ml7K07m18
$$ plain form
7118 -172 -13 -180 132 -24 135 137 -81 241 -112 38 -177 24 -100 -19 186 -114 -58 45 -38 120 -197 165
7140 165 -132 203 -21 152 -73 0 108 -78 -70 165 -95 127 -200 -166 68 -8 103 -217 -116 10 72 126
7162 126 -73 460 -334 95 -16 215 197 -20 224 23 106 -6 -257 12 -162 161 -32 -15 214 -119 211
7183 211 -9 103 80 35 28 -151 237 20 63 -124 51 188 -160 74 11 234 -13 -213 90 -226 -154 75
7205 75 60 220 -96 -48 -62 33 57 247 -3 -292 296 -179 -26 52 -112 249 -35 314 -74 -141 136 -71 -65
7228 -65 27 -15 -86 -152 125 -112 -22 90 -6 -178 -121 213 -77 236 -70 -52 183 -116 278 17 16 -86 59 -97
7252 -97 -61 237 -136 224 42 -62 62 20 274 -74 83 302 -31 122 -212 89 -118 41 89 -250 16
7273 16 86 -54 39 110 13 -147 52 146 79 -17 -91 266 -243 -85 17 -215 111 -99 -39 -77 52 56 19 226 -192
7298a92K43l33K38m6j36M40m36M34k81Q5K29n72O48l76K43j25n9Kk25K58j54M0
7320g5K1jJ62l02L85k10j9K11l20L80m01L38k91j01L26l63M71q5KM3l84K86r3
7343b0P0j85j08L53k85M77l79L23l37l4K31l69K90j25J58n5j23L87l82K61k88
7364a40m0L54k75K85m55K53K08m44L83k43M36l69o1L60k93K12j09k02J86j21K97
7385B22k43O8n2j39J31j51O0NJ22k3k9J3O2K01l67K69r5q1mj52M05l41R6J68l68
7410b23J93N0j30J00qK03m05M88l74QJ44m9J20k23J09j5oJ6N5j05M8R6j42m4K83
7435A89l16O2L3k1J54k75J67p6K41o6k75K80l02L66l80L22l60J72o4O5K45k53
7457i2J06m5P9J35l61N76m45K6J08j93K92l79K98n0j95M02l91K26m46L93J58k30
$$ plain form
7298 -192 51 -282 -44 -90 -226 214 -222 212 -69 16 245 -327 321 -55 188 63 4 6 -219 39 -115 -75
7320 -75 -54 -55 107 -195 190 -20 -39 172 -148 232 -169 169 -122 -223 103 -260 211 126 128 171 -213 73 -20
7343 -20 50 -135 -243 110 -175 302 -77 246 -91 -125 106 -263 27 -98 60 5 -118 269 -113 148 -140
7364 -140 -180 174 -101 184 -271 -18 190 -254 129 -114 322 -47 -108 252 -41 171 62 -140 46 -75 222
7385 222 -21 47 -5 -144 -13 -164 -104 -99 23 0 -29 -16 46 247 -120 149 54 -27 -31 -183 222 -119 -23 145 -223
7410 -223 -30 20 -110 -10 -18 185 -220 268 -106 -98 46 -3 117 -106 3 -12 -18 -2 53 -52 -4 92 -50 -94 189
7435 189 -127 -65 -32 -53 101 -174 -7 -83 158 92 -183 97 -205 161 -219 103 -257 -85 -149 -84 161 -92
7457 -92 14 -31 48 183 -178 398 -47 -21 87 -106 186 -193 105 55 -140 262 -129 97 -349 44 202 -28
7479b8Q1k35J42j25J99k8m0L41j79l32J08L00j16k60L39j96j08J43j6K46m10J52
7501b2L8J07j24j38L41n4m7l28J69R1j84J52l83N39l24P8J57j86K19j42m4N4j26
7524a57L09k67K95l7l35K52k17K89m30L09K99n01L43l20J10j69K89J33k24J20
7544I1l94M65l63L61j99J09N5j12N5J47l64J50j85J08j6M9j5k37L93l30N09m41
7566a64L24R2m21K69m30L35O4j42J14J9k6j59MK95k27J38l25L76l17J82J81j83
7588aK32k04J9q0j22J24r4O4Q5j07J89k02L12l62K93j31J29j35r8L22k17j08j8
7611a10J48J6k87N55m63J85j20n3K54j64j69K72m9J34k07lj98L69L6j03P3j75
7633e9J22j68p3K08j06K60j98J01j48o7J75k78N11l85L6J0Q8J42l45L70k40j33
$$ plain form
7479 -28 53 -182 -40 -165 34 6 -34 307 128 -204 -96 204 88 -172 167 -29 -137 6 -10 236 -174 -22
7501 -22 16 123 -1 -139 202 148 101 -227 -58 33 -151 1 -382 157 -167 -89 68 -118 101 -41 -85 -31 -157
7524 -157 152 -115 180 143 -192 60 -157 132 -298 11 310 -191 152 -168 -58 -227 62 195 -29 91
7544 91 -303 162 -201 160 -39 70 125 13 68 215 -149 1 -184 -76 -92 -43 -58 -295 98 -232 277 -164
7566 -164 160 252 -169 100 -330 5 69 -73 41 60 34 -125 -121 174 -53 85 -240 136 -181 1 182 -1
7588 -1 231 27 46 -34 -156 -32 -126 -62 23 -84 105 -97 215 -147 146 15 144 9 -89 233 16 -92 -110
7611 -110 38 54 -233 322 -141 44 -76 -129 125 -39 -208 64 15 149 -58 -61 -259 110 146 43 116 -59
7633 -59 63 -105 -178 30 -76 184 -14 87 -61 -128 47 -231 280 -105 -69 -59 29 171 -174 196 -44 -177
7655a77L80l55J48J35j6j99P4J61n6L9k07K43j57k14M34m98N35m40J12J70j05
7676GO2j92J25J33j72K2j25L76l79J93l7r8J63j66L8L5j10K41m26M77k34J59j22
7699c0J12M7j10K6j25K39l64%L66k64KJ26j78L03k87K48l02M9N9rK15l56K59j51
7723a25R9N4Lo8j54K20j74R3L34m80L50m11L57j02j13J33j53J94J12Rn1k58L28
7746A97k55J26o9p6N3j34K47k93M20l25p4L66k76K72k71J45K2n7J15k89R8K89
7768B31k05L5P5j95J22J88k28k45K21k77M68l47K21j4o4J30n68O08q1j04j84P1
7790a42J31j9J22l3R9p9k39P0J66j63K16j88R1k38L38j23o7J78k75J30L1R5j25
7813b4pr4j82M20N8q4j90MK61m67L24J8j39Q3p2K13l98L67j05N3l4j31J10M2n
$$ plain form
7655 -177 203 -152 -4 131 115 -84 -10 151 95 134 -73 170 13 -201 233 -265 270 -170 -58 112 7
7676 7 69 -123 2 135 -37 -15 -140 236 -143 50 13 -85 78 -88 -50 -15 -125 116 -310 167 -67 92 -30
7699 -30 82 129 19 45 -80 159 -205 -205 161 -103 -101 25 -153 150 -137 111 -191 -142 -83 -92 123 -233 26 -125
7723 -125 -26 28 31 -37 -191 29 -145 -52 282 -198 152 -259 98 -4 -117 16 -137 57 169 178 127 -131 197
7746 197 -58 68 -1 -77 -24 -158 89 -204 216 -109 -183 183 -93 179 -92 53 75 18 133 -156 -58 231
7768 231 26 61 136 -59 63 251 23 -222 -1 -278 190 -157 64 50 -14 116 -452 156 75 -29 -213 -142
7790 -142 -11 -30 92 59 158 79 -160 -90 76 -87 129 -59 32 -206 132 9 -58 120 -155 -25 6 101 -24
7813 -24 -31 -125 -307 113 171 87 -103 -99 162 -305 19 37 -102 -19 -91 122 -276 91 -14 39 5 -126 -16 26 21
7838B1k4l8K46k98J99k23Q1J05k78K44k60M51k59L26k38o0J98l17J28j8j95K15
7860Fj98P4J62j83M21l63P2k25K90n2M3J98m77L01k09O5l8q4J65R8j06P9O5K44
7884C48l74J37l01K34j28K50j95j34J87Q2j35J05J71l12qn4J64l5J57k2m2L2j1
7907A16r6R9L0k0j5j42O1j10M7J1J67L2k46m7K50j82Q9j54J79j05m3L11n52K74
7931d6J98l13m9J19LP5O7j35L3J13j92J68j11n0q0QM44k59O5k19K40P6l88L32
7955I9J16j53n5J75j95n6K50m94L52j71J37J62l30lp1J83N6m4J01r3Q5J08k38
7978g9J83j82L79m26L28K4j93J59l14M60j99j89J09k44K43j64Q8j42j7M10l93
7999a59L78k89j32M2K21o0j36K54L5k96l0Q2K78m13L59r5P1J88l96J14n2K22k84
$$ plain form
7838 21 -3 -41 205 -93 106 -117 -36 69 -209 35 -225 226 -33 293 55 -5 193 -124 4 -14 -209 6
7860 6 -192 -118 44 -139 282 -81 -9 -234 56 4 47 245 -232 69 -140 -75 -113 -197 -32 66 -40 39 104 348
7884 348 -26 111 -190 44 -84 166 -29 -163 24 106 -29 76 247 -65 -73 -127 37 2 159 137 95 127 116
7907 116 20 119 149 129 114 -28 33 -77 -30 -19 148 180 -66 -113 137 -45 44 -110 69 -36 -79 232 -320 -46
7931 -46 152 -161 -210 -91 -88 -13 54 -81 -48 65 -127 41 -70 -120 -200 -192 252 -7 58 -161 79 155 -233 99
7955 99 215 62 7 182 -13 -69 181 -313 39 -132 5 167 -163 -166 -237 -54 2 -42 59 -34 51 159 -79
7978 -79 104 -78 301 -125 203 227 34 193 -121 339 140 -49 60 -184 59 -105 -17 -159 -176 234 -159
7999 -159 219 -70 -202 -160 61 1 -135 119 154 -142 -172 -90 188 -225 134 39 110 298 -98 16 -36 186 -98
8022i8J42q4P1j42M4K61q7k01L67o11L11K63k24J09j98M33m54J29P6l48L77j08
8044B8K26k88Q0J12k87J33j45M53m68L58p5l90M25j45k10K59j05N4j18K62k33
8065g4n6J17j21L45k75K38l10QQ6k8J34l07L62p8mkk27L33j04j17J74lQ2j90O7
8090E0n5j24K75k23J09J8M9j27J5R8j66R5j44K43ml52K73k41K92k3l67M05k77
8113a81K86k8j20N0n8Q2n6K05l36J48J76j34J58l42K97k47j6J91k18J92n3J2J55
8136A63k90L91m54K99j41n8Q9L0O8q9O4k26L03q3k11J35j05P9J3k18J87j66J51
8159f9q5k1J83q5j50K74K61l12j14L27k16K06q1j3j1J4N3m00K41N8j18n1L68k83
8183b4m0K56k96K43O8k33r0J3
$$ plain form
8022 -98 44 -40 31 -111 -67 194 107 -94 273 -338 -27 236 12 121 -77 356 -98 31 107 -241 136 28
8044 28 254 -34 46 158 -129 4 -141 312 -156 202 127 -263 162 17 -193 66 -39 15 -103 159 -74
8065 -74 -130 -13 -134 211 -64 174 -136 -128 -42 -70 64 -243 119 41 37 35 -192 141 37 -80 94 91 173 -17 50
8090 50 -5 -129 146 -77 32 50 99 -28 -13 85 -81 14 -130 113 109 -243 30 -211 81 58 -309 96 -181
8113 -181 105 77 -43 7 -51 31 -25 180 -156 -8 168 34 192 -150 147 -100 -116 75 -143 49 -4 8 163
8136 163 -127 264 -190 109 -32 -90 -1 29 97 8 72 -154 149 66 -145 -10 -115 -36 -23 -241 -54 -220 -69
8159 -69 -154 -175 8 -77 -227 47 308 -4 -118 209 -7 199 118 105 94 108 161 -239 2 60 -58 -109 259 -24
8183 -24 -64 192 -104 139 207 -26 -116 -103
8191a03
$$ Imaginary data points
##PAGE= N=2
##DATA TABLE= (X++(I..I)), XYDATA
0@%%%%%%%%%%%%%%JnRj2J6k2K9l5M2n1O1p2Q7j05J22j39J61j88K16k44K76l14
36a67L56l99M46n00N58o19O86p59Q34r15J003j093J186j281J372j451J508j517
54g52J424j126L81J471o739L1240J06433l39302L54632j72369o7346K37977k68633
67a22709J82744n6998m3500Q3385p1772N4426o0970P0457l9903m2698J32558j56428
79g1408Q1984M7351j48903J61720q1386m5750J49915j73030R9649K8656j33648
90h4850J56067r8227J2355N0249p7535Q5698q4991O6257j8844m8286J09483j37091
102f9715J12633l2195q0333J69695j77875Q9655M6326j49231J65263j00882L736
113b2923P7660j16045J03491m9565j7432O5134p6794O0106l3757M858L1984p0676
$$ plain form
0 0 0 0 0 0 0 0 0 0 0 0 0 0 0 0 1 -4 5 -7 9 -13 16 -19 23 -28 33 -39 48 -57 65 -74 87 -101 115 -129 147 -167
36 -167 189 -210 236 -264 294 -325 361 -398 436 -479 524 -569 617 -664 708 -743 765 -752
54 -752 672 -454 -73 1398 -5341 25899 132332 -206970 147662 -24707 -92053 145924 -122709
67 -122709 60035 3037 -40463 42922 -28850 25576 -35394 35063 -4840 -47538 85020 -71408
79 -71408 10576 57927 -90976 70744 -10642 -56392 93523 -79507 20142 48798 -84850
90 -84850 71217 -27010 -14655 35594 -41941 43757 -41234 25023 6179 -42107 67376 -69715
102 -69715 42918 10723 -69610 100085 -77790 11865 58191 -91040 74223 -26659 -22923
113 -22923 54737 -61308 42183 -7382 -24814 40320 -36474 23632 -10125 -5267 26717 -43959
125d3959Q5303n5328r241O9775r1690O9734k1714l0395O8903p9282N4178n663
137A0621l6912N2598m6066L5754k7424R065K6388o3110P3873m7130j612M5291
149C1336o6956O1984l0921j6226N4316n6416J9546K6206m4270K4781J1676l8289
161b3233M3858l0754K992L4216o5219O8723l8418q578M7223o5909O8030n5136
173b2205K2852K6428p2071Q7301o5358K3085J7323m6062O1902o0529L7818k219
185H265k6173L4710k9577K5161k4273J6042L715k3365K8297j8529P476l220K142
198F71Q05k182j881M049P648l1090M5501l2482m003M0607n8829N5834l5083k7
212a0462M2590p3414P1237l3817j6572N2023o1984N1522k6744r561M7243o5036
$$ plain form
125 -43959 41344 -13984 -23225 46550 -45140 24594 2880 -27515 41388 -37894 16284 10621
137 10621 -26291 26307 -19759 15995 -11429 -2364 24024 -39086 34787 -12343 -13955 31336
149 31336 -35620 26364 -4557 -20783 33533 -22883 -3337 22869 -21401 3380 15056 -23233
161 -23233 20625 -10129 -7137 27079 -38140 30583 -7835 -16413 30810 -35099 32931 -22205
173 -22205 647 27075 -44996 42305 -23053 32 17355 -28707 33195 -27334 10484 8265
185 8265 -17908 16802 -12775 12386 -11887 4155 7870 -15495 12802 -5727 1749 -1471 671
198 671 1476 -706 -2587 1462 9110 -21980 23521 -8961 -12964 27643 -31186 24648 -10435 -10462
212 -10462 32128 -41286 29951 -3866 -20438 31585 -30399 21123 -5621 -15182 32061 -32975
224c2975M8518p043l1872M8294m2130K3693L03k6878M4975m1110J4564J7284l3952
237a8329L1982k2507J2700J777k3013L9906l8136J6730R970k8352L6909l7612
249a7975K6514J109l5978N5332m5195J3737J8214l7036M2105l4629J2589J9491
261A8278m3993M2375j4832j7463L3635l0330J5081N986k8700M3724l5934K020
273a0153L9690o1855N1836j9989j6500M7073o5817O3052l2078j6484N7108p0225
285c4342N7388l2372L547K7847n6860O9659n4798J9263J8126m3640N5494n4809
297b5497L7772l925l3618N3478m6191K2304Q14j5928K4765k6059J4689O759k2780
310a3417J7541N519k7069L1579j7870m333K8149m8812N4039l1239j4616N8332
$$ plain form
224 -32975 15543 8500 -23372 24922 -17208 6485 6788 -20090 24885 -16225 -1661 15623 -18329
237 -18329 13653 -8854 3846 5623 -17390 22516 -15620 1110 11080 -17272 19637 -17975
249 -17975 8539 9648 -26330 29002 -16193 -2456 15758 -21278 20827 -13802 -1213 18278
261 18278 -25715 16660 1828 -15635 18000 -12330 2751 8737 -19963 23761 -12173 -10153
273 -10153 29537 -32318 19518 -471 -16971 30102 -35715 27337 -4741 -21225 35883 -34342
285 -34342 23046 -9326 -5779 22068 -34792 34867 -19931 -668 17458 -26182 29312 -25497
297 -25497 12275 8350 -25268 28210 -17981 4323 5137 -10791 13974 -12085 2604 9363 -13417
310 -13417 4124 9643 -17426 14153 -3717 -8050 20099 -28713 25326 -5913 -20529 37803
322C7803p3604N4383j6283k1591M9787o3415N5456k3402j9557M9699n2950L5686
334A2012j3093p588K6577m0010L7645j6147j1987K8840k8544J9585j0173k388
346e271J9835l2632K8735p512j7079L0725l1381K4232r029j5928M2065n1155L1803
359G408O319l9780N2051m2826J9694J1127m1703N6606m3023N954L1041m6146L6786
372A3508j5535n673K3316l3385K7721n115k1384L2676k1811M10J6383k3676K4169
385A1604j7157j271K6012m1227L4419j0730j3604K8149l4275L5865k8317O130
397d402K4051m6224N0006l7968J7620Q532l9272O3421o3468L3386J1764m7914
409c0468O1217n3366L1547L45l4501N3983m6731J8313J1534k5607K3338j4235
$$ plain form
322 37803 -35801 18582 2299 -19292 30495 -32920 22536 -866 -20423 29276 -23674 12012
334 12012 -1081 -8669 17908 -22102 15543 -604 -12591 16249 -12295 7290 -2883 -5271
346 -5271 14564 -18068 10667 3155 -13924 16801 -14580 9652 623 -15305 26760 -24395 7408
359 7408 13727 -26053 25998 -16828 2866 13993 -27710 28896 -14127 -8173 22868 -23278 13508
372 13508 -2027 -7700 15616 -17769 9952 4837 -16547 16129 -5682 -5272 11111 -12565 11604
385 11604 -5553 -6824 19188 -22039 12380 1650 -11954 16195 -18080 17785 -10532 -4402
397 -4402 19649 -26575 23431 -14537 3083 11615 -27657 35764 -27704 5682 17446 -30468
409 -30468 30749 -22617 8930 9275 -25226 28757 -17974 339 11873 -13734 9604 -4631
421d631L643P383j4458R353Q858k5868K4976m519k0178L3718l3629K4023o124
434B547j8901M1799m7795L0584j836k0722L0895l3109L1228k1307K65K3477l5974
447a8849L2197k0064P338O937k4233L6785l2640J0615J5124k9052K8037j8572
459f377N067J2041k8145L1804j5095j2965L2591l2037J5615M566k1658L3237l2792
472a4148J4694J5595l9813M0787k0537m678K1972k8991K7546j6300l717K2731
484A5141k7623J5480K316j1706J0460o843M584L3q214J3192p565n377J4151j2908
498d879O710k751p65R688k1417K5237j4807l534J8766k7168L0853k8245J2911
511E99J5692m3938N3380l8404R222K0374m2483N3163m6189J8410J9850m7602N0080
$$ plain form
421 -4631 -988 6395 -8063 1290 10148 -15720 9256 4737 -15441 18277 -15352 8671 2547
434 2547 -16354 25445 -22350 8234 6398 -14324 16571 -16538 14690 -6617 -6352 17125 -18849
447 -18849 13348 -6716 622 7559 -16674 20111 -12529 -1914 13210 -15842 12195 -6377
459 -6377 -1310 10731 -17414 14390 -705 -13670 18921 -13116 2499 7065 -14593 18644 -14148
472 -14148 546 16141 -23672 17115 -3422 -8100 13872 -15119 12427 -3873 -7590 15141
484 15141 -12482 2998 5314 -6392 4068 -2775 1809 1842 -6372 6820 -745 -6122 8029 -4879
498 -4879 1831 -920 -1685 8003 -13414 11823 -2984 -6518 12248 -14920 15933 -12312 599
511 599 16291 -27647 25733 -12671 -3449 16925 -25558 27605 -18584 -174 19676 -27926 22154
524B2154l1120O493J2712k4790K9151k2731N678J1757j6310O681M826o831Q85
537a445N055q524J2028j4765J0020N202k2627K9308k1749Q132K781j1728K3068
550A4756l1920K8721j1813r952K5147l1619L2340k6184Q352J8939m1242M4657
562B0182k8245L754J7690l2163L8071l0264O777K1642l7237L0712j0011r789K0533
575A1652k2598J7026k339j7369K8935k1863O00J8735k4790J9309r569j295J4241
588A0675k4817K3920r824p692J6666j5490J1690r774N523M487j4805J6610q998
601a829O43K527l620P590j1604P925L533j2642J0776n93q162J0954j0150P413
615B761R05j6207K8992k6307N537K0267l5400L5159k3837M771K0165m2218M7711
$$ plain form
524 22154 -8966 -2473 10239 -14551 14600 -8131 -2453 9304 -7006 -325 4501 -2330 -1445
537 -1445 3610 -4914 7114 -7651 2369 7571 -15056 14252 -7497 635 3416 -8312 14756
550 14756 -17164 11557 -256 -10208 14939 -16680 15660 -10524 -2172 16767 -24475 20182
562 20182 -8063 -4309 13381 -18782 19289 -10975 -4198 17444 -19793 10919 908 -8881 11652
575 11652 -10946 6080 3741 -13628 15307 -6556 -5956 12779 -12011 7298 -2271 -3566 10675
588 10675 -14142 9778 -46 -7738 8928 -6562 5128 -4646 877 5364 -9441 7169 -1829
601 -1829 -1186 1341 -2279 5311 -6293 1632 5165 -7477 3299 2706 -5456 5498 -4652 2761
615 2761 3666 -12541 16451 -9856 -4319 15948 -19452 15707 -8130 -3359 16806 -25412 22299
628B2299k9792j841K8290l8431L4360k2867O283J3645k9027L0771j8116J955O713
641D242q068R134j2026J1614n348j317K163N01R23p826J2681r640K385J144l6
656E26J156q199J6020j6868J0498k464m763J4645k7277L2439k0935m107K8226
669A8897l8831L4757k1026R90K2619m1248M2535k2840o064K6641l1565K4855j3043
682c323j633J7002k4634J7870q69j2967J4094o128j184M549p130R318o243l711
696d989J3504j4657P102J109m320N602r644J4268j2163J570R769j4517J3767j2277
710e876Q954O17j4853K4059j9762M691R913j5905J5047j1424L294R426j9139J6566
724E608q35j6447K1982j3876J2J2439k1536K5079j7953j903K5368l6312K8120
$$ plain form
628 22299 -7493 -9334 18956 -19475 14885 -7982 -1699 11946 -17081 13690 -4426 -2471 4242
641 4242 -3826 5308 -6718 4896 -452 -1769 394 895 1818 -6008 6673 -2967 -582 562 526
656 526 1682 -6517 9503 -7365 3133 669 -4094 10551 -16726 15713 -5222 -9329 18897
669 18897 -19934 14823 -6203 -5213 17406 -23842 18693 -4147 -10211 16430 -15135 9720 -3323
682 -3323 -4956 12046 -12588 5282 4413 -8554 5540 -588 -1772 2777 -4353 4965 -1278 -4989
696 -4989 8515 -6142 960 2069 -2251 3351 -6293 7975 -4188 -2618 7151 -7366 6401 -5876
710 -5876 3078 3695 -11158 12901 -6861 -2170 7743 -8162 6885 -4539 -1245 8181 -10958 5608
724 5608 4773 -11674 10308 -3568 -3556 8883 -12653 12426 -5527 -7430 17938 -18374 9746
737I746r126r097K1740k8866K8656j7401k922K1204k7195K1468j2535N628K064
750C364j2693K1377k0647J0902o18m815Q824j4483J7933j2881k02J1034j2039
763d944O464k175J423j033n20j51M903p660R96J3269k3555K0477o199j0052K2123
778A3366k8818K8112j5378q355L1218l8962K8413q601r208K1771k8753K7051j4304
791b448n575K0417k1900J3350m644M08L172q144J0341o202n45L092n8k172n79
806a487M029k822k290M035J019p493Q409l638j215M141q402J4119j5224N734J0999
821I914k2420K1310j1546N56R157j8187K2437j5949o67J6899k0866J2218k22p225
835d591J0148j0495O282M171j5275J6834n872r094J7008j5575R605k941n583J6177
$$ plain form
737 9746 620 -8477 13263 -15603 13053 -4348 -7270 13934 -13261 8207 -4328 1300 3364
750 3364 -9329 12048 -8599 2303 1685 -3130 5694 -8789 9144 -3737 -3939 7095 -4944
763 -4944 1520 -655 768 -265 -785 -936 3967 -3693 -2697 10572 -12983 7494 1295 -8757 13366
778 13366 -15452 12660 -2718 -11073 20145 -18817 9596 995 -8213 13558 -15195 11856 -2448
791 -2448 -8023 12394 -9506 3844 -800 -392 2780 -5364 4977 -1225 -1770 1322 1264 -908 -1487
806 -1487 2542 -280 -2570 1465 2484 -5009 3400 -238 -1453 2688 -5714 8405 -6819 -1085 9914
821 9914 -12506 8804 -2742 -2186 6971 -11216 11221 -4728 -5395 11504 -9362 2856 2634 -4591
835 -4591 5557 -4938 1344 5515 -9760 7074 1202 -7892 9116 -6459 3146 205 -5378 10799
849A0799k2099J6793l112r335J4550j4940J5415j3804N237Q407j9460K1025j5244
862e768Q035n55r795K1026k4525J5353P17j3445J6771j4172R974l445n548J2217
876F840r896L01P839o365k979J0280j0664O957j345o971J7689k3895J7721l32
890E180j8067K6407k3148J4414l655r675K2857k7943J9819l667r614J4909j5622
903g805J5785j3048M231P563j4862J4020r416O019l068l759J2465j5328Q654K077
917C528p965O927l459J259J664n630O489J31j0906J5639q998l953J3335j5924
931g863J4201r188j001J4849k4007K0610n901r221J6049j5444J1639n991l114
944d382J2650j4736P189L092p556M603l97p28J144l475N148j852n073R481o975
$$ plain form
849 10799 -11300 5493 2381 -6954 7596 -7344 8071 -5733 -496 7911 -11549 9476 -5768
862 -5768 2267 1712 -8083 12943 -11582 3771 4488 -8957 7814 -6358 3616 171 -5377 6840
876 6840 -3056 -2755 5084 -1281 -4260 6020 -4644 2313 968 -6003 11686 -12209 5512 5180
890 5180 -12887 13520 -9628 4786 1131 -8544 14313 -13630 6189 2522 -7092 7817 -7805
903 -7805 7980 -5068 -837 6726 -8136 5884 -3532 2487 -581 -4340 8125 -7203 1451 3528
917 3528 -4437 2490 -969 290 1954 -3676 2813 2944 -7962 7677 -1321 -5274 8061 -7863
931 -7863 6338 -2850 -3851 10998 -13009 7601 1700 -7521 8528 -6916 4723 -1268 -4382
944 -4382 8268 -6468 721 3813 -3743 860 463 -265 879 -2596 2552 700 -4373 5108 -1867
959a867J291J112j121L915j0286J4075r185j569J0278j4206J5196j4454Q234N771
973G184k0536K5965j8246M070P793j5291J9157j8270R543N310j6601J6503p376
986g95j243L699k985K630j497k022M910j746p395J4434j1584Q19Q853j2712J3011
1001F377j2374Q037K519j4340J9437j4978O566k91m091R967j6725J7956j0083
1014b023j674R969j3326J5349j5717J0015K761j6134K0661j4479M445L564q739
1027e328J2033j1952M999N715j1469P325K028p593O224j529k620O584j1018J1743
1041E142l831r713J8741j6679P049K417q430J2563j5187J2328j926r302J3141
1054F313r574M397j992R55K418o945P764l648p61R93N83R36m526M856K0n088L954
$$ plain form
959 -1867 -576 536 -585 3330 -6956 7119 -2066 -3635 6643 -7563 7633 -6821 1413 7184
973 7184 -13352 12613 -5633 -1563 6230 -9061 10096 -8174 1369 6679 -9922 6581 -795
986 -795 -2038 1661 -1324 1306 -191 -2213 2697 951 -6444 7990 -3594 -2775 6078 -6634 6377
1001 6377 -5997 2040 4559 -9781 9656 -5322 1244 953 -3138 6829 -9896 8060 -2023
1014 -2023 -3697 6272 -7054 8295 -7422 2593 5354 -10780 9881 -4598 -153 3411 -5328
1027 -5328 6705 -5247 -248 5467 -6002 1323 3351 -4242 1982 453 -2167 4417 -6601 5142
1041 5142 1311 -8402 10339 -6340 709 3126 -5304 7259 -7928 4400 2474 -6828 6313
1054 6313 -3261 1136 -856 99 2517 -4428 3336 -312 -1073 -80 503 1439 -3087 1769 1789 -3299 655
1071F55J989n960N116k217K7L201r125J4190j1900L85J3205j9665J6645r082J14
1086b422J0070j9335K2147j3578j874J3860j6341J2003o833J738M380r519R561
1099C857l655k611K757J777m262J933K153l625L235m852P371n733j130Q269j0006
1114d522O994m733M516j973m950J2388j4546J0275l691j871P716j5205J9638j4593
1128d557J127J2601j9015J7510j1880M021O171j6144J9270j1642j020R314r585
1141c829N670k985O50K739m634J922M321p757L827M221q961P949m672K153Q96
1156A510o928J2427j1576M037M092o947O618p085Q383o271n72P650j0216P914
1170C036n410M133m65p044J3010j1511L226M630p112N904m400K703J550o397O290
$$ plain form
1071 655 2644 -3316 1800 -417 -390 2811 -6314 7876 -4024 -3639 9566 -10099 6546 -2536 -2422
1086 -2422 7648 -11687 10460 -3118 -4992 8868 -7473 4530 -2303 -565 3815 -5704 3857
1099 3857 202 -2409 348 2125 -2137 -204 1949 -1676 1559 -3293 4078 -1655 -2785 5484 -4522
1114 -4522 2472 -2261 2255 282 -4668 7720 -6826 3449 -242 -2113 5603 -9602 10036 -4557
1128 -4557 -3430 9171 -9844 7666 -4214 -193 5978 -10166 9104 -2538 -3558 5756 -3829
1141 -3829 1841 -1144 -494 2245 -2389 -467 3854 -3903 -76 4145 -4816 3133 -1539 614 1510
1156 1510 -5418 7009 -4567 -530 3562 -3385 3233 -3852 4531 -1740 -2312 5338 -4878 3036
1170 3036 -2374 1759 1294 -5750 7260 -4251 -1025 3605 -3507 2397 -2003 700 2250 -4147 2143
1185B143Q07q675R421k706n100Q885r607R349n702l377J4012j8448J2472j217
1199B257p203J0907j2244J1768p292j731J0114j1866P342k502J837j736j598N786
1213C839p106M274j254J341j947o36N252o762L521L89j12k691K221K203o269O853
1229C116n574M966l685j972J1113j6997J4007l907o021J1873j4782J5208j0448
1242c103r20J3199j8192J3652m516k365N579q061R460o631Q5N308m815L72J639
1257F91O00l357K892q17P99k049R62L619p682O435j725j178J395k478O261r651
1273e283P913r55n207P363p840R057q665K196Q134j5128J3556n997r78N575r073
1288e332J1282q785N77P775r693M521J402l226K133j075L8K808o507O131L03q137
$$ plain form
1185 2143 2950 -5725 3696 990 -4110 4775 -4832 4517 -1185 -4562 9450 -8998 3474 2257
1199 2257 -4946 5961 -6283 5485 -1807 -3538 6576 -5290 2052 -450 1387 -349 -1947 3839
1213 3839 -3267 1007 -247 1094 -853 -1489 3763 -2999 522 911 799 -1892 329 2532 -3737 3116
1229 3116 -2458 2508 -1177 -3149 7964 -9033 4974 1067 -4954 6919 -7863 7345 -3103
1242 -3103 -4023 9176 -9016 4636 120 -2245 3334 -4727 4733 -1898 -1813 3495 -1320 -948 691
1257 691 1291 -2066 826 9 808 -1241 -279 3340 -4342 2093 368 -810 585 -1893 4368 -5283
1273 -5283 2630 1675 -3532 3831 -4009 5048 -3617 -1421 6713 -8415 5141 -856 -1834 3741 -5332
1288 -5332 5950 -2835 -2258 5517 -4176 345 1747 -1479 654 -421 -383 2425 -4082 2049 2352 -5785
1304e785J0793p149J963J461m538Q956j1743Q721m35o695Q624p350O581o440L387
1319C51L694j0196J0840p091L448j087k565Q167j1569Q182l53m948N221k874K145
1334A365k415Q82J241q51k861N354j734n890J1009r652M549L37n187J0786j4799
1349g866J1980k122q621J3680j2038Q121m190j249Q045j2339J0244l451j712K699
1363A181k608M392o529N648j086k897L087j905K487m814M266J47l532K778N85
1378A200q42k835N384m031Q35Q34j890N021r268R749l426n827J1517j1300P751
1393B872l761j387Q545j3688J1703l535m796P952o316M730l701R36L175n271K316
1408b26K341k888j135M527l743Q45L89k40J892n850P602m243j259M168m029M164
$$ plain form
1304 -5785 5008 -2141 -178 1283 -3255 5701 -6042 2679 2244 -4451 4173 -3177 3404 -3036 351
1319 351 4045 -6151 4689 -2402 1046 -41 -2606 5561 -6008 2174 1821 -3127 2094 -780 1365
1334 1365 -1050 -168 1073 222 -2639 2715 981 -4909 6100 -3552 997 1334 -3853 6933 -7866
1349 -7866 4114 1992 -6629 7051 -4987 3134 -1056 -2305 5740 -6599 3645 194 -1518 1181
1363 1181 -1427 2965 -3564 2084 998 -1899 1188 -717 1770 -3044 1222 1369 -2163 615 1200
1378 1200 358 -2477 2907 -1124 -289 545 -1345 3676 -5592 4157 731 -5096 6421 -4879 2872
1393 2872 -889 -2276 6269 -7419 4284 749 -4047 3905 -2411 2319 -1382 -446 2729 -2542 -226
1408 -226 2115 -773 -1908 2619 -1124 -279 110 -130 1762 -4088 3514 -729 -1988 2180 -1849 2315
1424B315o407P418l479l525Q659r107P484n758K685L522j1248J3912q898L67N644
1439C584p205P530p431M352J920o723N801r82k847J822K137l758K954k495K603
1454A262M84p025J1607r569J946N419q454Q693q754O997j330o568J1066r513N012
1469A273j868L98K961p854J0120p490K013K502m298N720p756P401k552m140P196
1484C626n017J554k62J27O54j866J194J726k876o11O063p839L944J560n070O669
1500C576q018P887k896n538J1932j1610N494L88l417N614q164Q348l866k684O101
1515C147m692K203k120L413k104j892M048k747P46j251L148k423j195L859k570
1530d30J45n86L248m281J436K447m427M232m694O531m590k427R684j1641P759
$$ plain form
1424 2315 -4092 3326 -153 -3678 4981 -4126 3358 -2400 285 3807 -7441 6471 -2427 -2060 3584
1439 3584 -3621 3909 -3522 830 2750 -3973 1828 846 -2001 -179 1958 -1800 1154 -1341 1262
1454 1262 1746 -5279 6328 -3241 -1295 4124 -4330 4363 -4391 2606 1276 -5292 5774 -3739 1273
1469 1273 -595 -197 2764 -5090 5030 -2460 -447 2055 -2243 3477 -4279 3122 570 -3570 3626
1484 3626 -1391 163 -99 28 682 -1184 10 1736 -1140 -1751 4312 -3527 417 1977 -3093 3576
1500 3576 -4442 3445 549 -4989 6943 -4667 827 1215 -2202 3412 -4752 3596 -270 -2954 3147
1515 3147 -1545 658 -1462 1951 -153 -2045 2003 -744 2 -1249 1899 -524 -1719 2140 -430
1530 -430 -285 -871 2377 -1904 -468 1979 -2448 1784 -2910 3621 -969 -3396 6288 -5353 2406
1545B406k316j722N329r329J0890p103q14P009p202M162k474K137q08k048L496
1560A613j351r97J48L534n649L263R81l553L694m661O247n415N15N764q029O219
1576B323m323L690j954k578Q101j0065O972k315o76L134o968J0213q795K139N067
1591C965p585O121m442K993k98l477N764l949l77K403n4l003K981q31p66J117
1607E62k800O259p377L482L517q061P863n236K894m92l896Q803r862N232Q01l897
1623b208L921m322O298n919J613L882o259M790l113K971k022j606N406n712K308
1638B8J107j413m48P18J214j922M15L4K565n376L997J319o157P044n277L501j452
1655a03k944Q776j0968P116j37m689N891n938O414n335Q07M721p052M712j603
$$ plain form
1545 2406 90 -1632 3697 -5632 5258 -1845 -2659 4350 -2852 1310 -1164 973 165 -1883 1613
1560 1613 262 -735 -587 2947 -2702 561 1542 -2011 1683 -2978 3269 -2146 -1631 4133 -3896 2323
1576 2323 -2000 1690 -264 -2842 5259 -4806 2166 -149 -825 2309 -4659 5554 -3241 -1102 3965
1591 3965 -3620 2501 -1941 1052 754 -2723 3041 -908 -1285 1118 1064 -1939 1042 211 -555 562
1607 562 -2238 4021 -3356 126 3643 -4418 3445 -1791 1103 611 -3285 5518 -4344 888 1689 -2208
1623 -2208 1713 -2609 3689 -2230 -617 3265 -2994 1796 -1317 1654 -368 -1974 3432 -2280 28
1638 28 1135 -278 -726 -8 1206 -716 -301 -267 2298 -3078 919 2238 -3919 3125 -2152 1349 -103
1655 -103 -3047 5729 -5239 1877 1740 -2949 2942 -2996 3418 -1917 -1110 3611 -3441 1271 -332
1670c32J383k101M08L198m801L026o68R84k336J051K229m553L446j371J604l072
1686a905K317J845n978O603m428K672j392j510O711j0519Q474k085l864O341o772
1701c490P150n880J328M711p718N660j824K21n56Q8J907l258K047r8O95l159L250
1718A074K03m093N012l231K030k281J104K995p188P214l333L18N16j645M571p606
1734d340O814j951k924M888m964N498n588K475L467p820P205l151m8P27j404L379
1750B263l916J479J712k316n07L018j965j073K831k906K900l599K633J865p007
1765d588Q344n126Q58J685l191N388p260N652l20m619N861m572L638l723K377
1780D04J796n881O293l642J155n98J95K711n125M042o32j733P82J043m61j998
$$ plain form
1670 -332 1051 -1050 -642 2556 -2245 781 113 1097 -1239 -188 2041 -2512 934 -437 1167 -1905
1686 -1905 412 2257 -3721 2882 -1546 1126 -266 -1776 4935 -5584 2890 805 -3059 3282 -3490
1701 -3490 3660 -2220 -892 3819 -3899 1761 -63 158 -398 -310 1597 -1661 386 288 983 -2176 1074
1718 1074 1277 -2816 2196 -1035 995 -1286 -182 2813 -4375 2839 -494 -176 340 -1305 3266 -4340
1734 -4340 2474 523 -2401 2487 -2477 3021 -2567 -92 3375 -4445 2760 -391 -439 288 -1116 2263
1750 2263 -1653 -174 1538 -778 -1285 1733 -232 -1305 1526 -1380 1520 -2079 554 2419 -4588
1765 -4588 3756 -1370 -512 1173 -2018 3370 -3890 1762 1442 -3177 2684 -1888 1750 -1973 404
1780 404 2200 -3681 2612 -1030 125 -473 -278 2433 -2692 1350 718 -1015 -233 810 349 -1649
1796a649L093k228J507k196K724K91n677Q319o407K146J410l419N762q230P322
1811B768j825m717P519o288M350l257J270K661o204O251k932K91j59O90O59l563
1827b486M572k356j31m3P70L20l051M654k974O30l59J194k6l726O245n030J817
1844B0O75j825L999o980P421l400l084P024o789M829l320J503K059n845O630l283
1860c66q53J773l91K95j897K657j320l56j94K074j483j997M745m471K034j68r4
1877a2J390m374O093m158L7K712l175L273m324N043k570k583N891n555L519k492
1893a285K228N14m802O720m662O64J681j523J525k913L388j540j112J432N71j619
1909g33l48L680m490K525p58K45J054m529P316o059J223L476n465N216m988M814
$$ plain form
1796 -1649 1444 -784 723 -1473 1251 1542 -4135 4184 -2223 -77 1333 -2086 3676 -4554 2768
1811 2768 943 -3774 3745 -2543 1807 -1450 -180 2481 -3723 2528 -404 -113 -272 418 1077 -2486
1827 -2486 2086 -270 -401 -444 326 646 -2405 2249 -725 -95 -454 740 714 -3012 3233 -1797 20
1844 20 695 -1130 2869 -4111 3310 -90 -3174 3850 -2939 1890 -1430 73 2132 -3713 2917 -366
1860 -366 -1219 554 163 458 -1439 1218 -102 -458 -652 1422 -61 -2058 2687 -1784 250 82 -12
1877 -12 1378 -2996 3097 -1061 -1024 1688 -1487 1786 -2538 2505 -65 -2648 3243 -2312 1207 -1285
1893 -1285 943 1457 -3345 3375 -1287 -623 1058 -465 1060 -1853 1535 -5 -1117 315 886 -733
1909 -733 -1081 2599 -1891 634 -124 121 1175 -3354 3962 -2097 -874 2602 -2863 2353 -2635 2179
1925B179j963l112O508o137L460j440P78R15l994O032m787J183R82q48J089k869
1941b024M269l043K03J265k86r64l42L112m053K677o29r7K76k755O220o285K281
1958a75K413m860N219n445N412k840k438O816p022L831r06j49Q52l200N371l956
1974a077N54J428j009J43j053L124l368J168Q90p35m18o12L124m107K150M80j028
1991c46P38j927M436n212K381J639l862L926l794M400l353p50N748p457M868j518
2007h3n99J993l775N652m929R68K453k577J096r57K279k675J096Q22r13k06m76
2024h31L106m610K808M38k172K249k708M271m417J625K658n108M479l003K735
2039A520k357q52M849o401M709j603P2N59k409N031n721K802J509k839J688j414
$$ plain form
1925 2179 216 -2896 3612 -2525 935 -505 273 1188 -2806 3226 -1561 -378 604 -244 845 -2024
1941 -2024 2245 -798 -595 670 384 -580 -922 2190 -1863 814 185 88 364 -2391 3829 -2456 -175
1958 -175 2238 -2622 2597 -2848 2564 -276 -2714 4102 -2920 911 5 -144 708 -2492 2879 -1077
1974 -1077 -523 905 -104 39 -1014 2110 -1258 -90 800 65 -353 -965 2159 -1948 202 682 -346
1991 -346 392 -1535 2901 -2311 70 1709 -2153 1773 -2021 2379 -974 -1724 4024 -3433 1435 -83
2007 -83 -682 1311 -2464 3188 -1741 -773 1680 -897 199 -758 1521 -1154 -58 764 -149 -355 -831
2024 -831 2275 -2335 473 911 -1261 988 -1720 2551 -1866 -241 2417 -2691 1788 -1215 1520
2039 1520 -837 -1689 3160 -3241 1468 -135 -63 496 -1913 3118 -2603 199 1708 -1131 557 -857
2055h57K469k865J138J201j604J81J12K227m461L424l21j870K258k886M375m941
2071b420K632K047n453N367l584K406j319j265M746o269M502q40j162J278j995
2086a329L816m442K484M83j941J398r51J921l236K221N36j903R17j81J600l682
2102b289L623q70j739K340k271L546m741K906J499n263N777l787K236j276j023
2117a332M590o497M707r37j990K505k243L155l770J962J242k734J646j77J098
2132A225k719K259P4j952J591n51J446l588L473m65k369K812k226K466l317K691
2148H50P41m557N424l715J949j103l92L612o278N670k140j526K903k991L584m047
2164b016K583O31l073K761r59P88k059K130k57j692J688p69J339l056L511j174
$$ plain form
2055 -857 1612 -1253 -115 1086 -518 -337 -225 2002 -2459 965 644 -1226 1032 -1854 2521 -2420
2071 -2420 212 2259 -3194 2173 -1411 995 -324 -1589 3157 -3112 1390 550 -612 666 -1329
2086 -1329 2487 -1955 529 1012 -929 469 -482 1439 -1797 424 960 -943 -26 -207 1393 -2289
2102 -2289 1334 464 -1275 1065 -1206 2340 -2401 505 2004 -3259 2518 -1269 967 -309 -1332
2117 -1332 3258 -3239 1468 531 -1459 1046 -1197 1958 -1812 150 1392 -1342 304 127 1225
2132 1225 -1494 765 839 -1113 478 -73 1373 -2215 1258 793 -1576 1236 -990 1476 -1841 850
2148 850 1591 -2966 2458 -1257 692 -411 -803 2809 -3469 2201 61 -1465 1438 -1553 2031 -2016
2164 -2016 567 1198 -1875 886 -73 715 -1344 786 529 -1163 525 -244 1095 -1961 1550 376
2180C76k227L583l009K617k915K202J193m794N533l858J560m93l55K867n448N416
2196B248k375j089K750k585L012l932L076l72k681L240j466P36j824K237m20k060
2212a505K547j229Q84k359L201j332j916L491l003K235k489K280L69m234N909
2227B849m067J294J40p57K605m749M618j994j291K854k427K135l005K845l06k474
2243a730L161j788P80j334J927q84j491K358j356Q32j869K711j447j603L773l544
2259a504K520k057J470P24l954N806m311R82J127j911K777m278M520j834j805
2274a728L634k852J622j829K128n24k058L076j870O48j086K018j354j025K823
2289A623k396J108j302K177j426j269L781l817K196j224J011J60l171N469m569
$$ plain form
2180 376 -1851 1732 -1277 1340 -1575 627 1820 -2974 2559 -1299 261 -232 -587 2280 -3168 2248
2196 2248 -127 -1216 1534 -1051 1961 -1971 1105 733 -1948 1292 -174 562 -1262 975 555 -1505
2212 -1505 1042 -187 697 -1662 1539 207 -1709 1782 -1221 1014 -1475 805 1174 -3060 2849
2227 2849 -1218 76 216 -541 2064 -2685 1933 -61 -1352 1502 -925 1210 -1795 1050 744 -1730
2243 -1730 1431 -357 423 -911 1016 132 -1359 999 -357 475 -1394 1317 -130 -1733 2040 -1504
2259 -1504 1016 -1041 429 1153 -2801 3005 -1306 -324 803 -1108 1669 -2609 1911 77 -1728
2274 -1728 1906 -946 676 -1153 975 451 -1607 1469 -401 247 -839 1179 -175 -1200 1623
2289 1623 -773 335 -967 1210 -216 -1485 2296 -1521 675 -549 462 622 -2549 2920 -1649
2304a649J699P98k156L072m488N136k817j315M037l849K429j909J927l48k188
2319a621L436k262K49k30J393j274n13K292k483J411j286J941j315j346M015m139
2335a732K455r69N50M53l042N218m827J765J132j896K055l296M436k990n29L443
2351B226l989K593k229K402p10k065L875l137R39j47Q17q18p97K723k680R64l31
2368c64J328j394p87L543m088K425q10K66K11k245M659m850J856J505k488K103
2384H70k438L503k956j25K862l218K113j257J573r83j080L182l514J848j93M87
2400F74r19n88K632l153J809m81M30o20p14K991l927K504k57o46Q07k258M194
2417B478m291J934J123k804L016k956L176k657PL128l952K532j040P88n91j065
$$ plain form
2304 -1649 50 848 -1308 1764 -2724 2412 -405 -1720 2317 -1532 897 -1012 915 567 -1621
2319 -1621 1815 -447 -198 -428 965 -309 -822 1470 -1013 398 -888 1053 -262 -1608 2407 -1732
2335 -1732 723 -246 304 757 -2285 2933 -1894 -129 1003 -893 1162 -2134 2302 -688 -1217 2226
2351 2226 -1763 830 -1399 1003 293 -1772 2103 -1034 -95 -242 575 -243 -1040 1683 -997 -33 -364
2368 -364 964 -430 -1217 2326 -1762 663 -147 119 330 -1915 2744 -2106 -250 1255 -1233 870
2384 870 -1568 1935 -1021 -1146 1716 -1502 611 -646 927 -56 -1136 2046 -1468 380 187 674
2400 674 -245 -833 1799 -1354 455 -26 404 -216 -930 2061 -1866 638 381 -265 542 -1716 2478
2417 2478 -1813 121 1244 -1560 1456 -1500 1676 -981 -974 2154 -1798 734 -306 482 -109 -1174
2433a174K906k880J279k48Q10j510K86K234l467K586j359R32n79q24L383m523
2449b148L169q63p20J254k247L951m630K566R72k927L000k769L073k904N29K830
2465B136m107L269j695P88r87j21K524l406J671L94l56o20N06J290k760K040m06
2482A60j4q02L39K175m155L584j319n31J093j773L605m472K537R81l091L097k552
2499a138K517k259M35K516m212L050j142L78m63k43K006k952K049k12n37l3J06
2516a34J564l189K517l77q19L34k77J801l334L052p28j093J296j294K493l949
2532b137K969K68l149L342k262J991k014P99J890l997L506j272n4j30q5J817l323
2549a841K748o87q38N26J25R74k511K751j120m78M67n48J763l573L697j190j393
$$ plain form
2433 -1174 1732 -1148 131 -117 693 -817 -531 1703 -1764 822 -537 395 -184 -1008 2375 -2148
2449 -2148 1021 158 -562 692 -1555 2396 -2234 332 1304 -1623 1377 -1392 1681 -1223 -694 2136
2465 2136 -1971 1298 -397 391 -596 -717 1807 -1599 72 466 110 -510 -4 1286 -1474 566 160
2482 160 146 -656 -317 1858 -2297 1287 -32 -563 530 -1243 2362 -2110 427 1408 -1683 1414 -1138
2499 -1138 1379 -880 -445 2071 -2141 909 -233 145 -318 -561 1445 -1507 542 330 -207 -240 -134
2516 -134 1430 -1759 758 381 -438 -104 -381 1420 -1914 1138 410 -683 613 -681 1812 -2137
2532 -2137 832 1100 -2049 1293 -969 1022 -992 -193 1697 -2300 1206 -66 -120 -250 -335 1482 -1841
2549 -1841 907 220 -618 -92 33 1007 -1504 1247 127 -351 116 -432 1331 -2242 1455 265 -1128
2566a128K178k058K506l189K542M92l374L618k296J298j359R27J250l499L391
2581A299j684K72j65J67J123k819K752r86l21L64P6Q45k645L074j589m49J024
2598C38o94J509l287L476j412j015K184k218K340k901K604j64k697L963l214J614
2614D26q61K68J427l289L569j625l70O31l91J106k332K518r07o30O38J7K68j822
2632a359K666j612r0P34m87J022k403L086j758q09K296k063J689k362K466m12
2648F04k543L645k657J389p07L79J069l258L818k061m28J397q27R77k296K721
2664A222j130j018J603n70l4j307K442j519k13J075q64J043k383L318k106q22
2680a263K741k674K164k258K186m18k308L814l087J281k66K42O47k466L488k471
$$ plain form
2566 -1128 1050 -1008 1498 -1691 851 1343 -2031 1587 -709 589 -770 157 1407 -2092 1299
2581 1299 -385 -113 -278 -111 1012 -1807 945 -41 -362 2 78 923 -1722 1352 -237 -686 338
2598 338 -356 1153 -2134 1342 -70 -1085 1099 -1119 1221 -1680 924 760 -1937 2026 -1188 426
2614 426 -435 -167 1260 -2029 1540 -85 -455 176 -215 891 -1441 1077 170 -460 178 195 463 -1359
2632 -1359 1307 -305 -395 339 -148 874 -1529 1557 -201 -1010 1286 -777 912 -1450 1016 604
2648 604 -1939 1706 -951 438 -269 110 1179 -2079 1739 -322 -750 647 -180 797 -1499 1222
2664 1222 92 -926 677 107 73 -1234 1208 -311 -524 551 -313 730 -1653 1665 -441 -1263
2680 -1263 1478 -1196 968 -1290 896 478 -1830 1984 -1103 178 -88 154 801 -1665 1823 -648
2696f48L29Q54o98Q53k134L139k121r3J263j015O21j497K511j789j72J640j449
2713d06R28j879K996k202m65K538k618J895j815K179j158j574L606l477J579O0
2729A87k52O05k365L454k535L45J337j231P31j142K212j928J65Q81n46J58j016
2746i40K362k468N96J534j811J426j853K572j692n62K526l058J792q71Q92k01
2762B44j485L266l101J263p4k81P14j850L118k673N22J170j173Q06j314K141j919
2779f26R7J536j668Q13q41J823j884L07J718k047J333j470K254k088P8K531l727
2796a861K806j419Q34k35j447L537l986K019L68j153J364k122L019k720O44J469
2812A117j703R15q94J581j972N96J364j760J029r52J949k009K45J696k283J848
$$ plain form
2696 -648 -319 535 -163 690 -1444 1695 -426 -519 744 -271 350 -1147 1364 -425 -597 1043 -406
2713 -406 522 -1357 1639 -563 -1028 1510 -1108 787 -1028 1151 -7 -1581 2025 -1452 127 187
2729 187 -65 540 -1825 1629 -906 -561 776 -455 276 -866 1346 -582 -417 464 -82 76 -940
2746 -940 1422 -1046 -450 1084 -727 699 -1154 1418 -274 -836 1690 -1368 424 -447 445 244
2762 244 -1241 2025 -1076 187 113 -168 546 -1304 1814 -859 -337 833 -340 466 -848 1293 -626
2779 -626 -529 1007 -661 152 -689 1134 -750 -443 1275 -772 561 -909 1345 -743 -665 1866 -1861
2796 -1861 945 -474 360 125 -1322 2215 -1771 248 616 -537 827 -1295 1724 -996 -352 1117
2812 1117 -586 329 -565 1016 -956 -360 1004 -756 273 -679 1270 -739 -494 1202 -1081 767
2828G67j427J714j751J9K089l034K311j079Q73m80j203L208l782K351j8j051R98
2845E05j532K641k928J256J167k071J392j104J759k040Q40J093j740R82n41J274
2861I53j790Q55J148k301J725r28J064j481K85K074l318K537q25j34K24q69K205
2878A424l034K023J87j343R97j093K132k386J129R60j773J271r00J237j701P31
2894a39J075k050J378n33R67j738J317P65k490K369j236P62j191O26J717l527
2910a928K907r63q1L35j141K520l149K133K58j864J559j378K139k545J237R69
2926A008k312J838q26J089j537R42N16j901J919j079Q82j348J006J005k495K521
2942A228j740R28q43J81J802l446K999j364J76K31o90K131l409K654l81j524J781
$$ plain form
2828 767 -660 1054 -697 -678 1411 -1623 688 -391 482 2 -1201 2007 -1775 576 558 -493 505
2845 505 -1027 1614 -1314 -58 1109 -962 430 -674 1085 -955 -115 978 -762 220 -321 953
2861 953 -837 18 1166 -1135 590 -338 726 -755 -470 1604 -1714 823 -2 -136 88 -781 1424
2878 1424 -1610 413 600 -743 254 -839 1293 -1093 36 996 -777 494 -406 831 -870 -139
2894 -139 936 -1114 264 -269 698 -1040 277 1042 -1448 921 -315 447 -744 -118 1599 -1928
2910 -1928 979 16 -65 270 -871 1649 -1500 633 891 -973 586 -792 1347 -1198 39 1008
2926 1008 -1304 534 -292 797 -740 202 718 -1183 736 -343 539 -809 197 1202 -1293 1228
2942 1228 -512 416 -427 -246 1556 -1890 1109 -255 -79 152 -538 1593 -1816 838 457 -1067 714
2959G14j445K012k803J863M61k207K262j067O25j197J022M97j777J738p76M36
2975C58j163J185J76k080K606j565P69q55O74R03k958L616j769m27R16r07J766
2992A245k805K378k92j567K032j307R86j765J730j27j766K049j092O74j165J091
3008B99K58j843K222j349M22m64O58M77j782K327j543K25k17K67O76k207K915
3025A341j763j85J087j108J586k551K756p92j722K539j921J564j830J393L39k227
3041a494K870j622K71m57Q71Pj803K595j498N02m78N65K26j993K858j938N22J30
3059A34m34J341k802L238j562p46J731j628J670k290K265q76j187K350j667J050
3075E87j385J477j53j950K660j816N77l25N38L44j768K223j703O79k37N23j03
$$ plain form
2959 714 -731 1281 -1522 341 802 -1405 857 -210 415 -782 240 737 -1040 698 -78 358
2975 358 -805 380 556 -1524 1082 -483 286 -569 105 1008 -1950 1666 -103 -530 386 -521 1245
2992 1245 -1560 818 526 -1041 991 -316 670 -1095 635 508 -1258 791 -301 373 -792 299
3008 299 557 -1286 936 -413 9 -455 203 680 -1102 1225 -318 -93 -310 -43 633 -1574 1341
3025 1341 -422 -607 480 -628 958 -1593 1163 371 -1351 1188 -733 831 -999 394 733 -1494
3041 -1494 1376 -246 25 -432 439 446 -1357 1238 -260 242 -236 329 555 -1438 1420 -518 4 134
3059 134 -300 1041 -1761 1477 -85 -831 900 -728 942 -1348 917 41 -1146 1204 -463 587
3075 587 -798 679 526 -1424 1236 -580 -3 -328 210 554 -1214 1009 -694 -15 -252 271 168
3092A68j355K409k014P46L0k1N43j836K932k330K39J482j638J322j948K529j207
3109E1j036K252j987J193j081J091l77j225K394j687L26j76N69l60r09K169j826
3126f19N60M8J92m2j126K413k096M88M25l77O05j635K635j877j47J409j335R28
3144D49j426J900j053q82K360k266R94l82O14j23j267K462j867O01R6j5p6r96
3162h77J959j794M44L38m7J47j234K424k267Q93N01j030Q54j234K023j750j17
3179g67K027j963J424j516J435q21o82K346k434J309n73P85o62r03K174k173J126
3196A32J14l50K64r49K050k108Q96K79o40L11o65K052k505J280L19j069J001j300
3214h88K454k451O23J528k441J778j443J587j018m86K340k645J349k40Nk61m08
$$ plain form
3092 168 -1187 1222 -792 -46 -16 -37 506 -1330 1602 -728 -489 993 -645 677 -1271 1258 51
3109 51 -985 1267 -720 473 -608 483 106 -1119 1275 -412 -86 -262 307 -53 -962 1207 -619
3126 -619 -59 -11 181 139 -987 1426 -670 -182 243 -134 471 -1164 1471 -406 -553 856 -479 449
3144 449 -977 923 -130 -1012 1348 -918 76 -306 308 185 -1082 1380 -487 114 210 195 119 -877
3162 -877 1082 -712 -268 70 23 170 -1064 1360 -907 -14 487 -543 311 -923 1100 -650 -767
3179 -767 1260 -703 721 -795 640 -181 -863 1483 -951 358 -215 570 -92 -995 1179 -994 132
3196 132 246 -104 160 -789 1261 -847 49 328 -312 -1 -666 1386 -1119 161 480 -589 412 -888
3214 -888 1566 -885 -262 1266 -1175 603 -840 747 -271 -757 1583 -1062 287 47 52 -209 -617
3231f17J721j946J006Jo7k04l83J588k220J460j69l79K27p13J798k061R79M14
3249D35j154J172j153J751j694M26J121j874J673j105J155j126j04J807k647K037
3265G20p77N4J6p08J948k265J064N18r44M41m34J218j626P44M68q63P44o42J079
3284G55j698J221K37j145J247j348J687j739P05J235k517J989r57O68m98l41J577
3301A078k251J799l64n33J94m13J396j879J525m67n43N60o61J560k027J365J92
3318E31j191J091q73J382j953J242K83j458J491r59J237j703J019Q32k314K122
3334G79r49O24n49n3J269k583K033o65J1J38m65J333j905J510j98q29K62K72O89
3353G24j730J640l22p00O53n51J185j952J472J00j649J819j382J133j067O89P79
$$ plain form
3231 -617 1104 -842 164 165 98 -106 -489 1099 -1121 339 170 -209 18 -695 1103 -958 21 435
3249 435 -719 453 -700 1051 -643 -217 904 -970 703 -402 753 -373 -477 1330 -1317 720
3265 720 -57 -3 13 -695 1253 -1012 52 570 -374 67 -367 851 -775 -31 437 -426 318 -324 755
3284 755 -943 278 515 -630 617 -731 956 -783 -78 1157 -1360 629 -328 340 -158 -499 1078
3301 1078 -1173 626 262 -271 -77 -490 906 -973 552 85 -458 102 -559 1001 -1026 339 531
3318 531 -660 431 -442 940 -1013 229 512 -946 545 -414 823 -880 139 971 -1343 779
3334 779 -170 454 -95 -148 1121 -1462 571 -94 -83 55 -410 923 -982 528 330 -499 -237 35 724
3353 724 -1006 634 312 -388 265 -286 899 -1053 419 519 -1130 689 -693 440 -627 62 841
3370H41k169K138j017K67m33K03J021j952J859p34k54M06m71J193j882J560j72
3387D04j046R36k11L13j256J482m62o23R17p24P40j310J541n19j271J894j315
3404e10R88j314J014N78k173K514j346J14K49m38J273k132K030q27n18O30k90
3421a58Q04j721J901o33r12J246p42P29j397J464k82j151J725j267O40r34J185
3438D97k89j160J924j348P55r20P13J12j492K556j985P62k25j47R20k031K529
3455A171j346k65R25q55P83j244J738p89o42J046p09O89j428J855r58q11J816
3472I76j475J008j278J608n02j266K123k030J034n89N26K72j628K421j431L14
3488H3J71k13L38j360K057j491K7R07r06P55j168J725j006m30J121j047Q24j067
$$ plain form
3370 841 -1328 810 -207 60 -373 -170 851 -1101 758 24 -230 176 -295 898 -984 576 404
3387 404 -642 294 83 396 -860 622 160 -463 454 -270 470 -840 701 182 -1089 805 -510
3404 -510 478 -836 178 756 -1417 1097 -249 -135 114 -324 949 -1183 847 20 -498 132 -158
3421 -158 646 -1075 826 193 -719 527 -215 514 -883 581 299 -852 873 -394 246 -688 497
3438 497 208 -952 972 -376 379 -541 172 284 -1208 1348 -637 125 -100 -247 673 -1358 1171
3455 1171 -175 -440 485 -370 413 -831 907 118 -524 522 -187 502 -926 929 -29 -840 976
3472 976 -499 509 -769 839 337 -929 1194 -836 198 -391 135 407 -1221 1200 -231 83
3488 83 254 41 379 -981 1076 -415 -388 519 -387 368 -800 925 -81 -511 610 -437 387 -680
3506f80J373p57o68J684j544P31n95J166r41q47K268j840R49l84K75J08j202K175
3524A271j933M22O54q07Q75j463J639j017l00J373r58M21o57J106p73l87J460
3541I26j406O35p52J258r20m66J594j619J068p91R89o31q19K066j822R19J2j14
3559A27J25j151K234k302R48M06p20Q06j497K047j677O5J428j486J127j102J145
3576E23o29k48J220j264P30n97Q53j041J44J373j739R69o04P34o42k63J624k190
3594a047J190j34lK98j388K195j815O68O31o90N02r64J715k069P08P75r67P90
3612C95r50J257j138O6J314j673R87n66O63n24n0J166j640Q74k70K22l42j73J254
3631H72j691J080j43m16L99p69J923j915P64O77j275Q10q32J191j258K95J069
$$ plain form
3506 -680 693 -64 -732 952 -592 139 -456 710 -231 -1078 1190 -650 299 -85 190 298 -904 1271
3524 1271 -662 -240 414 -393 482 -981 658 -359 -659 714 -244 177 -480 626 -147 -534 926
3541 926 -480 155 -597 661 -259 -725 869 -750 318 -473 516 -115 -934 1132 -690 229 241 127
3559 127 252 -899 1335 -967 -19 387 -333 473 -1024 1023 -654 -589 839 -647 480 -622 523
3576 523 -106 -354 866 -398 332 -265 588 -453 -309 1064 -675 294 -310 424 -218 -481 1143 -1047
3594 -1047 143 9 6 304 -1084 1111 -704 -36 595 -95 407 -557 1158 -911 -203 572 -395 395
3612 395 -555 702 -436 -370 944 -729 258 -308 355 -169 -219 947 -693 181 -89 133 -209 -382 872
3631 872 -819 261 118 -298 101 -668 1255 -660 104 781 -494 316 -516 675 -583 -288 781
3648G81j541Q30k82P89j026M10Q23j527J155k75K95r14K60J158j976J522m59l3
3666a0L9n98J799k314J347P2q34P27p79J429j846J201K53j156J057r88J403j493
3684f91M35J103j733J424p60O77q22J46J107j657J239n91J34k80J08O80j439J465
3702E45o53O4j44q1J166j989J652n85l02R36j308J595j932J214L94j267J096q60
3720d59J056r98N25N70j521J376q09P34r95N18O24j535J388k62k46J7J9Q44j739
3739h93J424k59m04K00k53J001j801J586n12m50O75m60R33j859J503J37j437J462
3757E93j089J067r85L56O63j593J617r53L83k01J45P34j768J571n80Rr0J68O29
3776F76j654J533o62j69M88m89Q38j413J402o1j086J073p52R02j354J049K32j384
$$ plain form
3648 781 -760 70 -212 577 -449 -39 784 -743 412 137 432 -482 -222 936 -1040 482 23 -10
3666 -10 29 -569 1230 -1084 263 335 -499 228 -551 878 -968 233 486 -670 387 -601 802 -691
3684 -691 -256 847 -886 538 -222 455 -367 -221 886 -771 468 -123 11 -269 -161 519 -920 545
3702 545 -108 -44 -188 -269 897 -1092 560 -25 -327 609 -699 896 -1036 178 572 -695 401 -459
3720 -459 597 -401 124 694 -827 549 -260 474 -521 -3 621 -914 474 212 -34 -17 2 846 -893
3739 -893 531 272 -132 68 -185 816 -985 601 89 -361 314 -146 787 -1072 431 568 -869 593
3757 593 -496 571 -414 -58 605 -988 629 -324 59 -142 3 737 -1031 540 -40 -31 -121 47 676
3776 676 -978 555 -107 -276 212 -277 561 -852 550 489 -597 476 -276 626 -728 321 553 -831
3794h31J485r40O95q75P32J26j368J696r99M04l11J10O42j512J730r52n5L01k14
3813a36Q63j590J674q83k63N24m11P40j574J891n67q88J265j183J089j163R43
3830C31K36j457J680j152P12p44L61O39j421J651j141J40r8M94Q0j246J888j157
3848b04J98J8M4N29j463J802r84m41P23n56R74j555J597n68p46J208j236J184
3866E24j396J307k26r10J479j425O26l32N09L10j509J923j099o6M55l49J87p48
3884g40J282o56r4M99k29K29j237J768j090R6N38l81L29j202J675q42n79J388
3902G54j148N38q05R98k95o00J415j430R45o38L88L15j101J611j639Q14J31m76
3920b23M47r93J617j077k05J013p36M63j098J380o25m16J007q80O50j018J294
$$ plain form
3794 -831 654 -286 409 -466 266 392 -976 720 -279 125 -186 -76 566 -946 784 -168 -223 78 -136
3813 -136 727 -863 811 -72 -335 189 -222 518 -1056 835 268 -620 645 -538 551 -612 331
3830 331 567 -890 790 -362 350 -394 -33 606 -815 836 -305 -165 -263 231 311 -935 953 -204
3848 -204 -6 12 56 585 -878 924 -60 -501 222 -334 640 -915 682 114 -632 576 -660 524
3866 524 -872 435 209 -701 778 -647 -21 -353 156 466 -1043 880 -219 -285 170 -179 8 -740
3884 -740 542 -114 -208 291 62 291 -946 822 -268 -172 366 -15 314 -888 787 -55 -634 754
3902 754 -394 144 -661 337 42 -558 857 -573 372 -266 122 437 -664 947 -692 122 253 -223
3920 -223 224 -769 848 -229 -434 579 -157 306 -792 588 -37 -453 554 -326 324 -694 600
3937F00p24l35J535j635Q99n83Q57n80o61J646j694Q27J5q2j5p92J462j296N22
3956c4J19j90K59p19J433j325K48M66m84O28j110J801j419K84P44j247Q56q29
3974e19J126q97k31J197j402J068n15M05j78q47J682j720J063j25q3Q3n98J368
3992H77j367K56N09k64J80n30R50q88Q0L99m47K53k90Q76j146M45O13q78N72p08
4012e08Q93n47j86J242j705J274o20M54l00n02J303j566Q55P6l08J63m80J210
4030G48j289O61L07o72K88n94J074j127M19P39r77P40n81M52n16o5J127j306R30
4049C58o03N25p06NJ128j344J033l78J78k40m80J440j684J103r9n61M37o09J167
4068F70j321P80J15n47N52p81J229j379Q27L09r59Q37q21J143j097L38N96j068
$$ plain form
3937 600 -124 -459 1076 -559 340 -243 614 34 -627 1019 -675 152 167 85 70 -722 740 -556 -34
3956 -34 85 -105 154 -565 868 -457 -209 257 -227 401 -709 1092 -327 -43 701 -546 310 -519
3974 -519 607 -290 -521 676 -726 342 -173 232 54 -793 889 -831 232 107 24 107 -491 877
3992 877 -490 -234 275 11 191 -339 611 -277 -197 202 -245 8 -282 594 -552 -107 506 -372 200 -508
4012 -508 385 -162 -348 894 -811 463 -157 297 -3 -505 798 -768 87 163 -145 18 -462 748
4030 748 -541 120 427 -245 43 -551 523 -604 -185 554 -423 317 -264 188 -328 -393 734 -572 358
4049 358 -245 280 -426 -421 707 -637 396 18 196 -44 -524 916 -768 335 236 -325 112 -497 670
4068 670 -651 129 244 -303 249 -532 697 -682 145 454 -505 332 -489 654 -443 -105 491 -577
4086e77Q61n61O08m07j46R22j626J503o28N7p0j68R48j691J344j80m02K07m35
4105d41R77j232Q18K35p18P32p40Q01r03N21L68r54Q52p19O56o69M79L27j121
4124g31J102l93J75m48K15M65j352J378k41l25K67j26O11j419J132J1p83L58M3
4143f1M42j042J010l6r27R31o23Q50j131O98J83r62J069n74K15m60M81L46j199
4162g90J163m10J20j39j41P58j309J163n45k00M10l21R01j433J117k9p40Q85p02
4181b42R16j319O51N07j206J087n89M93o74O90p9q00J016q90R11j036O56M43j234
4200f99J317r66M10Q5m20O76j162J484o79k93L97k50O05j273J382p76j70N97m36
4219a71O56j146R52J8r66J339j092P37q52O81J70j061J402q24J97k30M23j62q25
$$ plain form
4086 -577 284 -277 331 -76 -222 700 -926 577 -51 6 -64 -232 716 -975 369 189 -213 -6 -441
4105 -441 536 -696 122 357 -361 371 -369 432 -471 50 418 -536 316 -403 253 -416 63 390 -731
4124 -731 371 -22 153 -295 -80 385 -967 411 170 -155 112 -14 597 -822 310 321 -462 -104 -61
4143 -61 381 -661 349 313 -614 317 -306 544 -587 111 294 -668 401 -173 42 -418 63 409 -790
4162 -790 373 -37 83 -56 -197 561 -748 415 -130 -330 80 -241 660 -773 344 315 -425 460 -242
4181 -242 674 -645 6 513 -693 394 -195 298 -376 314 235 -565 451 -439 472 -564 92 535 -699
4200 -699 618 -348 62 147 -273 403 -759 725 46 -247 150 -100 505 -768 614 -162 -332 265 -171
4219 -171 485 -661 291 309 -657 682 -410 327 -525 156 326 -735 667 -157 40 -190 233 71 -754
4238g54J421q54L28j93K8L79j265J740r71j34P45o45N10j218J215m82k74P45l12
4257IK37o66P11k42m79Q09m88J94l30O59m50o98J504j169M74j87L5L93j011J308
4277F13j067L03K60j64K31r28J428r82J50L24m75P83j175J265p24J3O90q45L06
4296Fl84O19k32n97J079p99M42n39O93j88o61J031p61L96k32K21J01q95J408j193
4316d85L27K06k95P13j074J184q51n9P22p28O98j179J364p94m4Q76r18R49r29
4335c17P78m58n79J483j436O37k79N30l58m36J182r84M51j41R1k04k39J046j162
4354c95N24pj31L13q47J203j046K11M31p35O70p13J004o66k38J016j225P24l09
4373b16N08l71k46P19q49P23l60L10k02q38J537j194N55p2j83L52p36J171r41
$$ plain form
4238 -754 667 -187 141 -52 -24 355 -910 830 -141 -275 470 -175 335 -883 332 -150 -424 321 9
4257 9 246 -420 291 49 -430 379 -109 85 -245 414 -36 -734 770 -399 75 -112 -77 316 -695 613
4277 613 -454 -151 109 -55 176 -752 676 -306 -156 168 -307 476 -699 566 -158 -145 545 -300 6
4296 6 -378 241 9 -588 491 -308 134 -405 288 100 -561 470 -291 105 -127 94 195 -700 708 -485
4316 -485 -158 48 -247 466 -608 576 -275 -334 388 -340 358 -821 543 -251 -295 581 -337 612 -317
4335 -317 461 3 -576 907 -529 108 -171 359 1 -435 747 -237 214 73 164 -40 -279 767 -395
4354 -395 129 122 -9 304 -543 660 -386 -175 256 -479 191 -522 482 -184 -422 594 -631 93 -216
4373 -216 292 -79 -325 394 -455 268 -92 218 16 -822 715 -479 76 4 -179 173 -563 608 -333
4392c33K01M34l65M9m61R69p25O9N27o74L39l00Q53p07r7P50q58N84m43L76o1
4413A27o02J099j038M71m6J23l42k79J180j249O21L7q4j05k92J218j355P38Q4
4432C06p78P28r91J479j091J46Q64j185J002r63Q08m22k00J121j282O21k94N37
4450D06n97P5P69j322R92l45J02q4k67J037j431P84P8l40M29n97R85j307Q65K20
4470D52j017Q43n37R14j182M79M65q88Q31p07Q92p99k4J021j634J450n83N1p0
4489d3k41Q62j109Q60k29l3q4p3M94r24P32n6k61K53k71P78j327Q34j6l75N94
4510C65p62R13j026O07M57q02M87m68L65m00J56N97j042Q75m21L7J05k56R00j267
4530e80J018p9n09M19n47Q12p26L45J09n85M25k20M80q11P05O2q42R87o17L89
$$ plain form
4392 -333 -132 302 -63 -14 -475 494 -231 -162 365 -309 30 -270 583 -124 -221 529 -329 255 -188 188 127
4413 127 -475 624 -414 57 11 134 -208 -487 693 -556 65 102 18 -87 -379 839 -516 222 306
4432 306 -472 256 -735 744 -347 -201 663 -522 480 -483 325 -97 -297 824 -458 163 -131 406
4450 406 -191 -116 653 -669 323 -22 80 -4 -271 766 -665 119 197 -143 286 -311 674 -633 232 452
4470 452 -565 278 -259 655 -527 -48 417 -471 360 -347 545 -254 -278 743 -891 559 -24 27 -43
4489 -43 -284 578 -531 329 100 67 -17 -90 404 -520 212 156 -105 148 -123 655 -672 162 146 -229 365
4510 365 -397 516 -510 97 554 -248 239 -229 136 -264 -108 489 -553 322 -99 -62 43 -213 687 -580
4530 -580 438 359 -150 269 -278 534 -192 153 262 -323 102 -118 362 -449 256 318 -524 463 -154 235
4550B35o27M42O22j287R82n29K93j35k25M09p21O97M6j4k88m5M92j045J313n53
4570F2l27N13o99Q76j009R46j30n86N62o26R10r04M48K58p42R52q48Q40q58M09
4590D7J35q19J246p63L83l87P8M98j100J231n82k17K53j05M71q90J097m81m48
4609c53J12K37M16r66J045o04j54O63p37Q04j242J047M1p88P57m68M87m68J13
4628e8K38p64J294q93K60KR0J13r43J037l34j40K12l02P04j021P47o3m88P53n20
4649g6K79n33P59l62n64O81l43K59o15Q70l26m20R12q70M39l36J96L67r64J141
4669D94q46M15r9j08M23q70J012n06J2M42l78K44o08Q36k17o50O93n09N21q59
4689e58P24N1n79R09p75L97n44L78L66r44J173p97L97j25MJ05o69J058p57L71
$$ plain form
4550 235 -392 50 672 -615 367 -162 131 -4 -229 180 -541 156 202 188 -100 -145 347 -698 615 62
4570 62 -265 248 -451 425 -584 362 232 -354 208 -418 492 -412 36 294 -448 504 -344 496 -362 47
4590 47 182 -637 609 -154 229 -158 -80 418 -682 549 -33 -250 3 -102 369 -521 576 95 -353
4609 -353 -241 -4 412 -554 491 -113 -267 396 -341 463 -779 268 309 -479 278 -190 297 -171 -58
4628 -58 180 -584 710 -183 77 79 169 282 -661 376 42 -98 114 -188 516 -505 242 179 -309 444 -76
4649 -76 203 -330 429 67 -497 184 -159 100 -515 355 29 -391 521 -349 90 -246 -50 317 -647 494
4669 494 -352 63 -36 -144 279 -591 421 -85 -73 369 -9 235 -373 463 246 -404 289 -220 301 -558
4689 -558 166 217 -362 547 -228 169 -375 3 369 -575 598 -199 198 73 77 182 -487 571 -186 185
4709A85k75J03P5n20Q68p91K68M33l40M64r36R14q88J74N04n70N25p39Q68n40
4729b18j06Q95p95M99o53P09l21m12R93q48M25l03K22Rn75J042p26j8K87k65L60
4750B01n67Q20n88k01N29l93K99m31P69q31K08M84n53L45m06P33n39k47R50q72
$$ plain form
4709 185 -90 13 88 -432 436 -355 -87 346 6 470 -466 448 -440 -266 238 -332 193 -546 322 -218
4729 -218 -324 571 -224 275 -378 331 10 -402 591 -257 168 -135 87 96 -479 563 -163 -181 106 -159 201
4750 201 -366 454 -134 -335 194 -199 100 -331 438 -393 -185 299 -254 91 -315 418 -121 -368 582 -290
$$ [...]
8191h
##END NTUPLES=NMR FID
##END=
