##TITLE=1H_UK-26_11
 CD2Cl2
 64 sc, 
 25.12.2023
##JCAMPDX= 6.0         $$ Bruker NMR JCAMP-DX V2.0
##DATA TYPE= NMR FID
##DATA CLASS= NTUPLES
##ORIGIN= UXNMR, Bruker Analytische Messtechnik GmbH
##OWNER= root
$$ XWIN-NMR		Version 3.5
$$ Mon Dec 25 14:42:19 2023 Russian Standard Time (UT+4h)  she@DPX200
##.OBSERVE FREQUENCY= 200.1313
##.OBSERVE NUCLEUS= ^1H
##.DELAY= (6, 6)
##.ACQUISITION MODE= SIMULTANEOUS
##.ACQUISITION SCHEME= undefined
##.AVERAGES= 64
##.DIGITISER RES= 18
##SPECTROMETER/DATA SYSTEM= spect
##.PULSE SEQUENCE= zg30
##.SOLVENT NAME= CDCl3
##.SHIFT REFERENCE= (INTERNAL, CDCl3, 0, 15.7039)
##AUDIT TRAIL= $$ (NUMBER, WHEN, WHO, WHERE, WHAT)
$$ ##TITLE= Audit trail, XWIN-NMR		Version 3.5
$$ ##JCAMPDX= 5.01
$$ ##ORIGIN= Bruker BioSpin GmbH
$$ ##OWNER= she
$$ F:/spectra/data/she/nmr/H-F/1/audita.txt
$$ ##AUDIT TRAIL=  $$ (NUMBER, WHEN, WHO, WHERE, WHAT)
(   1,<2023-12-25 14:41:17.64 +0400>,<she>,<DPX200>,
      <continue with go, POWCHK disabled, PULCHK disabled
       configuration hash MD5:
       00 E9 B6 7A A2 85 ED C7 34 08 36 98 17 FE 4E 26
       data hash MD5: 16K
       08 5E D5 0C C6 8A 21 0A 78 9D 45 CD BE 32 32 23>)
$$ ##END=
$$ 
$$ hash MD5
$$ 24 54 F6 B1 6C 62 83 11 2F 0F 22 21 BE 5A 91 B5
##$RELAX= 
##$RELAX= 
##$RELAX= 
##$RELAX= 
##$RELAX= 
##$RELAX= 
$$ Bruker specific parameters
$$ --------------------------
##$DU= <F:/spectra>
##$EXPNO= 1
##$NAME= <H-F>
##$PROCNO= 1
##$TYPE= <nmr>
##$USER= <she>
##$AMP= (0..31)
100 100 100 100 100 100 100 100 100 100 100 100 100 100 100 100 100 100 
100 100 100 100 100 100 100 100 100 100 100 100 100 100 
##$AQSEQ= 0
##$AQ_mod= 1
##$AUNM= <au_zg>
##$AUTOPOS= <>
##$BF1= 200.13
##$BF2= 200.13
##$BF3= 200.13
##$BF4= 200.13
##$BF5= 200.13
##$BF6= 200.13
##$BF7= 200.13
##$BF8= 200.13
##$BYTORDA= 1
##$CFDGTYP= 0
##$CFRGTYP= 5
##$CHEMSTR= <none>
##$CNST= (0..31)
1 1 145 1 1 1 1 1 1 1 1 1 1 1 1 1 1 1 1 1 1 1 1 1 1 1 1 1 1 1 1 1 
##$CPDPRG= <>
##$CPDPRG1= <>
##$CPDPRG2= <>
##$CPDPRG3= <>
##$CPDPRG4= <mlev>
##$CPDPRG5= <mlev>
##$CPDPRG6= <mlev>
##$CPDPRG7= <mlev>
##$CPDPRG8= <mlev>
##$CPDPRGB= <>
##$CPDPRGT= <>
##$D= (0..31)
0 1.2 0 0 0 0 0 0 0 0.06 0 0.03 0 0 0 0 0.0002 0 0 0 0 0 0 0 0 0 0 0 0 
0 0 0 
##$DATE= 1703500650
##$DBL= (0..7)
120 120 120 120 120 120 120 120 
##$DBP= (0..7)
150 150 150 150 150 150 150 150 
##$DBP07= 0
##$DBPNAM0= <>
##$DBPNAM1= <>
##$DBPNAM2= <>
##$DBPNAM3= <>
##$DBPNAM4= <>
##$DBPNAM5= <>
##$DBPNAM6= <>
##$DBPNAM7= <>
##$DBPOAL= (0..7)
0.5 0.5 0.5 0.5 0.5 0.5 0.5 0.5 
##$DBPOFFS= (0..7)
0 0 0 0 0 0 0 0 
##$DE= 6
##$DECBNUC= <off>
##$DECIM= 32
##$DECNUC= <off>
##$DECSTAT= 4
##$DIGMOD= 1
##$DIGTYP= 9
##$DL= (0..7)
0 120 120 120 120 120 120 120 
##$DP= (0..7)
150 150 150 150 150 150 150 150 
##$DP07= 0
##$DPNAME0= <>
##$DPNAME1= <>
##$DPNAME2= <>
##$DPNAME3= <>
##$DPNAME4= <>
##$DPNAME5= <>
##$DPNAME6= <>
##$DPNAME7= <>
##$DPOAL= (0..7)
0.5 0.5 0.5 0.5 0.5 0.5 0.5 0.5 
##$DPOFFS= (0..7)
0 0 0 0 0 0 0 0 
##$DQDMODE= 0
##$DR= 18
##$DS= 0
##$DSLIST= <SSSSSSSSSSSSSSS>
$$ [...]
##$SUBNAM2= <"">
##$SUBNAM3= <"">
##$SUBNAM4= <"">
##$SUBNAM5= <"">
##$SUBNAM6= <"">
##$SUBNAM7= <"">
##$SUBNAM8= <"">
##$SUBNAM9= <"">
##$SW= 18.0517328524113
##$SWIBOX= (0..15)
0 0 2 0 0 0 0 0 0 0 0 0 0 0 0 0 
##$SW_h= 3612.71676300578
##$TD= 16384
##$TD0= 1
##$TE= 0
##$TE2= 300
##$TE3= 300
##$TEG= 300
##$TL= (0..7)
0 120 120 120 120 120 120 120 
##$TP= (0..7)
150 150 150 150 150 150 150 150 
##$TP07= 0
##$TPNAME0= <>
##$TPNAME1= <>
##$TPNAME2= <>
##$TPNAME3= <>
##$TPNAME4= <>
##$TPNAME5= <>
##$TPNAME6= <>
##$TPNAME7= <>
##$TPOAL= (0..7)
0.5 0.5 0.5 0.5 0.5 0.5 0.5 0.5 
##$TPOFFS= (0..7)
0 0 0 0 0 0 0 0 
##$TUNHIN= 0
##$TUNHOUT= 0
##$TUNXOUT= 0
##$USERA1= <user>
##$USERA2= <user>
##$USERA3= <user>
##$USERA4= <user>
##$USERA5= <user>
##$V9= 5
##$VALIST= <valist>
##$VCLIST= <CCCCCCCCCCCCCCC>
##$VD= 0
##$VDLIST= <DDDDDDDDDDDDDDD>
##$VPLIST= <PPPPPPPPPPPPPPP>
##$VTLIST= <TTTTTTTTTTTTTTT>
##$WBST= 1024
##$WBSW= 4
##$XGAIN= (0..3)
0 0 0 0 
##$XL= 0
##$YL= 0
##$YMAX_a= 399097
##$YMIN_a= -530517
##$ZGOPTNS= <>
##$ZL1= 120
##$ZL2= 120
##$ZL3= 120
##$ZL4= 120
##$ABSF1= 10
##$ABSF2= 0
##$ABSG= 5
##$ABSL= 3
##$ALPHA= 0
##$AQORDER= 0
##$ASSFAC= 0
##$ASSFACI= 0
##$ASSFACX= 0
##$ASSWID= 0
##$AUNMP= <proc_1d>
##$AZFE= 0.1
##$AZFW= 0.1
##$BCFW= 1
##$BC_mod= 2
##$BYTORDP= 1
##$COROFFS= 0
##$CY= 11.3945322036743
##$DATMOD= 1
##$DC= 2
##$DFILT= <>
##$DTYPP= 0
##$F1P= 15.7292609196834
##$F2P= 12.9074282941183
##$FCOR= 0.5
##$FTSIZE= 0
##$FT_mod= 4
##$GAMMA= 1
##$GB= 0.15
##$INTBC= 1
##$INTSCL= 1
##$ISEN= 128
##$LB= 0.24
##$LEV0= 0
##$LPBIN= 0
##$MAXI= 10000
##$MC2= 0
##$MEAN= 0
##$ME_mod= 0
##$MI= 1.114404
##$NCOEF= 0
##$NC_proc= 0
##$NLEV= 6
##$NOISF1= 3.799351
##$NOISF2= 2.8
##$NSP= 1
##$NTH_PI= 0
##$NZP= 0
##$OFFSET= 15.70392
##$PC= 1
##$PHC0= -24597.67
##$PHC1= 17.45273
##$PH_mod= 1
##$PKNL= yes
##$PPARMOD= 0
##$PSCAL= 0
##$PSIGN= 0
##$REVERSE= no
##$SF= 200.130013532006
##$SI= 16384
##$SIGF1= 3
##$SIGF2= 2
##$SINO= 400
##$SIOLD= 16384
##$SREGLST= <1H.CDCl3>
##$SSB= 0
##$STSI= 0
##$STSR= 0
##$SW_p= 3612.71676300578
##$SYMM= 0
##$S_DEV= 0
##$TDeff= 0
##$TDoff= 0
##$TI= <>
##$TILT= no
##$TM1= 0
##$TM2= 0
##$TOPLEV= 0
##$USERP1= <user>
##$USERP2= <user>
##$USERP3= <user>
##$USERP4= <user>
##$USERP5= <user>
##$WDW= 1
##$XDIM= 8192
##$YMAX_p= 0
##$YMIN_p= 0
$$ End of Bruker specific parameters
$$ ---------------------------------
##NTUPLES= NMR FID
##VAR_NAME=  TIME,          FID/REAL,        FID/IMAG
##SYMBOL=    X,             R,               I
##VAR_TYPE=  INDEPENDENT,   DEPENDENT,       DEPENDENT
##VAR_FORM=  AFFN,          ASDF,            ASDF
##VAR_DIM=   8192,          8192,            8192
##UNITS=     SECONDS,       ARBITRARY UNITS, ARBITRARY UNITS
##FACTOR=    0.0002768,     1,               1
##FIRST=     0,             0,               0
##LAST=      2.2672688,     0,               0
##MIN=       0,             -530517,         0
##MAX=       2.2672688,     399097,          0
$$ Real data points
##PAGE= N=1
##DATA TABLE= (X++(R..R)), XYDATA
$$ [...]
2586C101m451P39K517j003l880K075K598l277p39L567M38l982J701L427k429j009
2602f07L414j585m527K843K306l592r47M096K63l971K518L046k409j189K764K32
2618B655m031J53K320k543k107M169N02l645J820L446k783j270L501k22k864Q57
2634d2K556l364j757K706J73k713J341K478l213m39L713o2k938K907J820l044
2650A22j298L033j32m136J777K053k727p20L055k87l126K684K514k698j742M275
2666B647j148l250J980M47k727o44L225l32k836J684L464j461k333L068P20k696
2682a92N19J599j445k915K579M82k639J85L104j121j108J981J192k437l7K457
2698B204k208j794L219m45l374J548J460j509j741L093Rj444J222K989j938j592
$$ plain form
2586 3101 -1350 -611 1906 903 -2977 -902 1696 -1581 -2320 1247 1685 -2297 -596 2831 402 -607
2602 -607 2807 1222 -3305 -462 1844 -1748 -2695 1401 1664 -2307 211 3257 848 -341 2423 2655
2618 2655 -1376 -1223 1097 -1446 -3553 616 1118 -2527 -707 2739 -44 -1314 2187 1965 -899 -42
2634 -42 2514 -850 -2607 99 272 -2441 -1100 1378 -1835 -2274 1439 1377 -1561 1346 3166 122
2650 122 -1176 1857 1725 -2411 -634 1419 -1308 -2028 1027 740 -2386 298 2812 114 -1628 2647
2666 2647 1499 -1751 229 676 -2051 -2695 530 198 -2638 -954 2510 1049 -1284 1784 2504 -192
2682 -192 327 1926 481 -2434 145 627 -2012 -1827 1277 156 -952 1029 2221 -216 -253 2204
2698 2204 -4 -1798 1421 976 -2398 -850 610 -899 -2640 453 462 -982 240 3229 1291 -301
2714c01J351J119l146l21K481k434j402K430L55j538Q21K638j136r19K191M43
2730B632l262O29J531k358j900K481P01k767J578K105j152j910L189N24k962R67
2746B6K378k285j821K244O52k597P4K240j329j513L051J144k558N26J717p53j983
2763g87J954M54l857M93J865r38j662K096J420k265J071K271m19j829J742J352
2779B961l237l98K592j925l069K262J424k493L49L247p24k172K330J328l026L52
2795a99K898k141k665K340L94k707M62K610j212k099K607J924k787J26K317j96
2811A672k763J527O59k839K54J740p07k126J836J775k196N36M146j678k737J441
2827E40J695k831o85K121j445k286J266K247k411R1L473p90j464J449K026k959
$$ plain form
2714 -301 1050 2169 -977 -1298 1183 -1251 -2653 -223 132 -1406 -585 2053 917 -2 2189 2632
2730 2632 -630 -1 1530 -828 -2728 -247 454 -2313 -735 1370 218 -1692 1497 2021 -941 26
2746 26 2404 119 -1702 542 1194 -1403 -1329 911 -418 -1931 1120 2264 -294 232 1949 1196 -787
2763 -787 1167 1621 -2236 -1743 122 -816 -2478 -382 1038 -1227 -156 2115 1696 -133 1609 2961
2779 2961 -276 -674 1918 -7 -3076 -814 610 -1883 -1534 1713 989 -1183 1147 2475 -551 -199
2795 -199 2699 558 -2107 233 627 -2080 -1618 992 -220 -2319 288 2212 -575 -449 1868 1672
2811 1672 -1091 436 1095 -1744 -1490 250 -457 -2583 -747 1028 -1168 -632 3514 1836 -901 540
2827 540 2235 -596 -1281 840 -605 -2891 -1625 622 -1789 -1698 1775 985 -479 970 2996 37
2843C7k96J872j264k248R67J761l288N27K895M9k672J577K645j805q25K108n22
2860A518l188J448K366l281j600K646m59j256J394J815k229J08K867r49j290J657
2876A567O00k863r96K341j041k635K219J434k121n80L227J044k520K288J267l070
2892A61j050K737j400l175K083J265l082P68K049J362k448J205K300k678m63K141
2908A775n43k403J112R55j713j564K328L99j754J132K070j405j279K726k77k920
2924a361J635J588l220n84K805q24k351J310K007j982o91L292L30l026J993J768
2940B689k688n96J544l1l448J256J320j836m44L059N83k552J722K727k761l75
2956A69J076k64k148P21J018k024n01J905o16j279J810K590k458n59L274n80k940
$$ plain form
2843 37 -259 1613 349 -1899 -932 829 -2459 -1932 963 1012 -1660 -83 2562 757 -68 2040 1518
2860 1518 -1670 -222 2144 -1137 -2737 -91 -550 -1806 -412 1403 -826 -718 2149 1200 -90 1567
2876 1567 2167 -696 -1692 649 -392 -3027 -808 626 -1495 -2075 1152 2196 -324 1964 3231 161
2892 161 -889 1848 448 -2727 -644 621 -2461 -1693 356 1718 -730 475 2775 97 -366 1775
2908 1775 1232 -1171 -59 896 -817 -2381 -53 346 -1408 -276 1794 389 -890 1836 1559 -1361
2924 -1361 274 1862 -1358 -1942 863 39 -2312 -1002 1005 -977 -1668 1624 1954 -1072 921 2689
2940 2689 1 -595 949 918 -2530 -1274 46 -1790 -2234 825 1408 -1144 578 3305 544 169
2956 169 1245 981 -1167 -446 572 -1452 -1953 -48 -664 -1943 -133 2457 -1 -560 2714 2134 -806
2973h06Q63J184j721j094J456K0k271J013K194j372m14K587J8k156P86J715j881
2990A21j265J348p84j085O23R98j860m63L120J123k403J140K051j607j326J571
3006A302L45l436O07J554j434j333K064O59j314J294J991j402r13J483J92k785
3022a126J315J966k852j460J982K34k008Q88K234r74j246L099j07j840k80J883
3038A708j462j784J748k0k035J61J586p14p59K201R38j666Q50J345j686p89J869
3055A491q71k422M90K055j492j751K969J01j571J442K205j261j760J337Q37k284
3071d85l19J972k160j746K099R92k796P98K867n56j036K083R04k587n24L006k745
3088b33j383J655J08k109K59J550M41n39P82J617k526O13J717o38j205O08k58
$$ plain form
2973 -806 57 1241 -480 -1574 -118 -98 -2369 -1356 838 -534 -948 1639 1657 -499 287 2002 121
2990 121 -1144 204 -580 -1665 -1042 -44 -1904 -2367 753 1876 -527 613 2664 1057 -269 1302
3006 1302 1647 -1789 -1182 372 -1062 -2395 -331 328 -986 308 2299 897 -16 1467 1659 -1126
3022 -1126 189 2155 -697 -2157 -175 59 -1949 -1061 1173 199 -1047 2052 1945 105 -175 1708
3038 1708 246 -1538 210 190 -1845 -1684 -98 -812 -1571 630 1568 -98 752 2097 411 -378 1491
3055 1491 620 -1802 -1312 743 -749 -2500 469 570 -1001 441 2646 1385 -375 962 1799 -485
3071 -485 -804 1168 -992 -2738 -639 353 -2443 -1645 1222 666 -370 1713 2617 30 -494 2512 -233
3088 -233 -1616 39 147 -1962 -1703 -153 288 -251 531 2148 -378 235 1952 1314 109 717 459
3105D59k430R36J572q66j648K283O88j399M43K359j473j352J104R34k369n13J341
3122F9m96j764R59J531j270J26K093r75p62J247J308k254n28K303j082j881N71
3139h05P20j647K37K397j299j028K346J152j799JK127j586j968J753R23l067m80
3156b023K532j053j726J346J849j339j60J952m5j100M92J462l709J79K048j520
3172h15j883K138K223l050K81K556O55k173M17K702l061n24J092J9k715J195J468
3189E25k222M01K424k15k222K487J336k525j84K291j560j122M98N72k219j10K007
3206A62j063p60J522J817j374o60K705p16j916R52J574l681q67K349o79j726J223
3223a138K319k421M92K351O38k724J635P93j754j210J770q74k615J603J444k086
$$ plain form
3105 459 -1971 -1035 537 -329 -1977 306 994 -405 38 2397 924 -428 676 1610 -759 -1272 69
3122 69 -427 -2191 -1232 299 -971 -845 1248 273 -489 758 2066 -188 -716 1587 505 -1376 -805
3139 -805 -85 -1732 -1495 902 -397 -1425 921 2073 274 275 2402 816 -1152 601 1524 -1543 -2023
3156 -2023 509 -544 -2270 -924 925 -414 -574 1378 1333 233 725 2187 -1522 -1343 705 -815
3172 -815 -2698 -560 1663 -1387 -1106 1450 2105 -68 349 3051 -10 -534 558 577 -2138 -943 525
3189 525 -1697 -1296 1128 913 -1309 1178 2514 -11 -195 2096 536 -586 -88 484 -1735 -1845 162
3206 162 -901 -1661 -139 1678 304 -356 2349 1633 -283 669 2243 -1438 -2305 44 -635 -2361 -1138
3223 -1138 1181 -1240 -748 1603 2241 -483 1152 1945 191 -1019 751 -123 -2738 -1135 309 -1777
3239a777R32K030J69j887J172J520j939q44K271j329j875R27J206j414o89J571
3255D4K44j755J096J997n86j797K071k66j736J035Q68j838j440K049l9j775P78
3272a050J426q59l89K031M0j666Q88J507k769q84J700Q4j819R58J559k061N96
3289g08J526M89j462J100J374j557j196J809k62k689O71J556j384r76J813L58
3305D62r64P82J679j687m89J502O84k353j2J227j720j441K253k40p97J80J628
3322F94o45K30P40R17j512m0J382j959j177J299K43k129N54J508j159J36J758
3339H40K43l35p2Q34r45p54R08p3k146Q38J46m25q30K067P17j891J140J230r18
3358E74j075J921n17j466M86J395k221j01J331J16j690M95J941n83q91J551P56
$$ plain form
3239 -1777 -845 1185 1354 -533 639 2159 220 -624 1647 318 -1557 -630 576 -838 -1527 44
3255 44 288 -1467 -371 1626 1040 -757 1314 1048 -688 347 1215 -623 -2063 -14 -53 -1828 -1050
3272 -1050 376 -483 -872 1159 1199 -467 421 1928 -841 -1725 -25 59 -1760 -802 757 -1304 -708
3289 -708 818 1307 -155 945 2319 762 -434 1375 1113 -1576 -905 651 -733 -1709 104 462
3305 462 -502 280 1959 272 -217 1285 1969 -384 -396 831 -889 -2330 -77 -317 -1114 -934 694
3322 694 49 279 1019 1936 424 384 1766 -193 -1370 -71 172 -1957 -1403 105 -1054 -918 840
3339 840 1083 748 676 1510 565 -189 719 646 -1500 -662 -516 -941 -1771 296 1013 -878 262 1492 574
3358 574 -501 1420 903 -563 -77 1318 -903 -1004 327 443 -1247 -752 1189 606 -285 1266 2022
3375B022k424Q28J25m84r44M08R67j501p88J962p66j34J943P37k009P4J398n13
3393I01k627J861l04j117M79J314j124q54K054M02j145K44J656j282j341J706
3409H23P10k395N05P91j018n81M34J588j289k45J902O3q41j49J035j363r12J593
3427F51j092r17J638R8j516l97K771j056o43L55J881j171o12J698r83j517J211
3444C99J93k129o55K571j034l66Q15J020o75n59K180m12j606M7Q01j684k78J873
3462E01j200q92K23J834K71j460J827j42j592J464Q04k129m22J178m05j627J037
3479g30O65r67r6J523J173j710M25J101j057m2R00l19j914O48N59j519n90J880
3497g0l01m22O24J759j462r51K525o54j133M25K63r41o06J507j040q80N67K199
$$ plain form
3375 2022 -402 426 551 67 -877 -469 498 -1003 -1791 171 -595 -729 1214 1951 -58 16 1414 901
3393 901 -1726 135 -169 -1286 -807 507 -617 -1471 583 985 -160 84 1740 458 -883 823
3409 823 1533 -862 -357 434 -584 -1165 -731 857 -432 -677 1225 1288 447 298 1333 -30 -942 651
3427 651 -441 -1358 280 378 -1138 -1535 1236 180 -463 -108 1773 602 -10 1688 705 -812 399
3444 399 592 -1537 -2192 379 -655 -1021 -206 814 139 -420 1760 1348 -258 -211 590 -1094 -1372 501
3462 501 -699 -1591 -1368 466 737 -723 1104 962 -630 834 1638 -491 -913 265 -140 -1767 -730
3479 -730 -65 -1032 -1128 395 1568 -142 283 1384 327 285 1185 866 -1048 -400 159 -1360 -1950 -70
3497 -70 -371 -793 -169 1590 128 -823 1702 1048 -85 340 603 -338 -944 563 -477 -1357 -790 1409
3515A409j515j244K684k38p85Q0P35j100p18J425n76j205n23K118p98j360K580
3532I69M36j630K67J250r83l74J282r17q52m2R89j503m12K207Q2j353R83Q52p29
3551E22n89J778n93r11m93J159p44j311J266q8j010L59K318j237p18J500M5j023
3569B30J106j90j324q46J134N1j643K33J729l51p96L38J114q18k47J895j505r02
3587g92J677j93j824J063P41j201q75J276N7p27N32J185o89k07P16L02j204n6
3605b19J316k047m85J265k25j084N57J371n17l64J760m16p73k00Q27j034o56J234
3623C10J60n02o39O74k11o17J380K27q59K45K06p87n25P29O98j711MJ937j155
3642d36n29P07P75n86L87M58R6j917J092J010j676l72Q17k39q37J034N36r11k41
$$ plain form
3515 1409 -106 -1350 1334 1096 311 391 1126 26 -692 733 157 -1048 -1571 547 -251 -1611 969
3532 969 1405 -225 42 1292 309 -65 1217 300 -552 -594 395 -1108 -1520 687 769 -584 399 1251 522
3551 522 -67 1711 1118 207 -286 873 129 -1182 84 -4 -1014 -655 1663 426 -292 1208 1253 230
3569 230 1336 1146 -178 -1024 110 161 -1482 -1249 480 129 -667 -329 785 -33 -280 1615 110 -792
3587 -792 885 692 -1132 -69 672 -529 -1404 -128 -71 -798 -266 919 230 23 739 1041 -163 -219
3605 -219 1097 -950 -1435 -170 -395 -1479 -922 449 -68 -432 1328 912 139 -61 766 -268 -924 310
3623 310 470 -32 -671 3 -208 -825 555 782 -77 168 374 -413 -938 -209 489 -1222 -1218 719 -436
3642 -436 -965 -258 517 -69 318 776 872 -1045 47 1057 -619 -991 -174 -413 -1250 -216 320 -591 -832
3661h32J370L35p62j34J303q40k71j42j91n47M59M06j155k84J756p51j98J288
3679H10N54q96p35J218p89k98o13Q62q97o33K209p87j384J373M79k99PM04J39
3698G24r95M88O14j063k56N54J1q74N87L07m26J23J216l89j121J282R1j346J88
3717b85R40r16j244Q51J058o60m27P81L37r62J092O76o20j151J554j074r05Q48
3735a07P16j111p40Q87Q57j333Q85N99j045M8J157J66k123O21J185j175k13P13
3753a3O7j132J004Q70j715O24J027l96j72N55l80n24J91m8N95j329j97J246j129
3772h56J93J649P8j207R28J22o05n02Q03p50n86N46R55j594m79J269j30q27J025
3791C2J021j258M89M19k99o31l57P57q59K9R75m15n88O29K0k70j7J497j75p83
$$ plain form
3661 -832 538 873 111 -23 1280 440 169 27 -164 -711 -252 154 -1001 -1285 471 -280 -478 810
3679 810 1364 468 -267 951 162 -136 -749 113 -784 -1417 792 5 -1379 -6 473 174 181 585 724
3698 724 -271 217 831 -232 -488 66 77 -797 -210 97 -329 -206 1010 621 -500 782 873 -473 -285
3717 -285 655 -261 -1505 -654 404 -256 -683 98 435 -527 565 1241 621 -530 1024 -50 -955 -107
3735 -107 609 -502 -1242 -355 502 -831 54 653 -392 -344 813 979 -1144 -523 662 -513 -726 -13
3753 -13 54 -1078 -74 796 -919 -295 732 336 164 719 339 -185 6 -42 553 -776 -973 273 -856
3772 -856 -663 986 1064 -143 785 907 302 -200 603 -147 -733 -187 768 -826 -1305 -36 -166 -993 32
3791 32 1053 -205 284 703 404 -227 -584 173 -686 -657 318 -97 -685 -56 -36 -306 -323 1174 999 216
3811B16L11N55j026J66o49N25p02M52J133j559j84J082j02r37J317J29j277Q33
3829B83m53L80r44P02O52r53L17L24Nj626N84J678n77O1L74l64j421N08J318o32
3849B16j573K080j44j912R55J039p92k08J308o09n90j53J179j347J31J81j54l14
3867g07L33J269j347L2L22P20p04o02J728j138J67J93K95j117k08O12n18j6K43
3886d43J298j460J58J159p27j070J582k08q65N55l9j93p40J11J436j279J86J249
3904G10q49q69J166O87j159L94o46R08o09J9O52j261k65J919n50m83P07K78p05
3923D4M42Q85j015r11J442o89j564J285M41p78j81Q24m54J00L58R8n41l45R42
3942C83mk72l63N1n78M98j19J213j163O31Q87r45r61R36M39j336M73K80l03j76
$$ plain form
3811 216 527 1082 56 222 -427 98 -604 -152 981 -578 -762 320 218 -719 598 727 -550 283
3829 283 -170 210 -734 -32 620 -333 -16 308 313 -1313 -729 949 372 433 807 443 -978 -470 848 216
3849 216 -1357 723 579 -1333 -378 661 -131 -339 969 360 -230 -383 796 -551 -420 -239 -393 -707
3867 -707 -374 895 -452 -420 -98 622 -82 -684 1044 -94 73 266 561 -556 -764 -152 -670 -686 -443
3886 -443 855 -605 -447 712 -15 -1085 497 289 -576 -21 -60 -253 -993 -882 554 -725 -539 710
3904 710 -139 -1008 158 845 -314 80 -566 342 -267 -248 404 -857 -1122 797 247 -236 471 749 44
3923 44 486 1371 356 -555 887 198 -1366 -81 360 -418 -599 225 -229 -129 229 327 -214 -559 383
3942 383 379 107 -256 -205 -783 -285 -404 809 -354 277 1164 219 -742 194 633 -703 -230 50 -253 -429
3962d29j33M34l39l65J753r86o85R78L21o77l61P78k69j208J087Q8j5p62P35J22
3982F7j121J208M23p59L0O49q1j285P96P78j433O14M28o22m47J53R93N62j400
4001d47J235k59l00j26J254j103k86j09Nn40J71K75l56k21J765q86n44J165j34
4020E59m42M3L05M4j500j5P46o06M30K29J055j573N70M87o18j05J004k98j479
4039a164O24J071P5k19j16K26j189M75J129j300n01J492j11r98L59M41K05j25
4057C74p46O41J12o26K15J17r84J313J16j298J060N45p99o34M60L54m70Q46J69
4076G65j346N44N0M79r48O44O02q38m13P92k78q0k75L26o8J80k55N71m35r6q8
4097a67k63R14l65N46j068M81L92q34l64J85j2K03k43J027m66m93M25k24p3Q09
$$ plain form
3962 -429 -562 -128 -467 -832 921 -65 -750 228 549 -128 -489 289 20 -1188 -101 -13 -28 -790 -55 67
3982 67 -1054 154 577 -182 -152 497 416 -869 -73 705 -728 -114 314 -308 -755 -602 391 953 -447
4001 -447 788 529 229 103 1357 254 -32 -141 -136 -676 -505 -230 -586 -807 958 72 -472 693 559
4020 559 117 160 465 509 -991 -1006 -260 -866 -436 -207 848 -725 -155 332 -286 -391 613 315 -1164
4039 -1164 -540 531 606 387 271 497 -692 -217 912 -388 -889 603 492 -506 -147 294 499 374
4057 374 -372 269 381 -245 -30 87 -897 416 532 -766 294 839 40 -594 -134 220 -250 596 765
4076 765 -581 -37 13 492 -456 188 790 -48 -461 331 53 -27 -302 24 -44 136 -119 452 17 -79 -167
4097 -167 -430 484 119 665 -403 78 470 -364 -728 -543 -555 -352 -595 432 -34 -527 -102 -326 -399 410
4117D10L19k32j194J252M61j829N42K06N0q3M73l20L54j41O20p23m23O57j24n99
4137c24Q9P90k8j81n09O42p45K96M66J76l88J38J96o87n14J103q59l45J509k43
4157E82o09j8m09oK54M84J53j087R19m35K17P1K7K02j058J43K84l02k61Q36P84
4178G71j432O4R48l31K38k46L07k11k8O67M8j155K38L54l60N86m42N8p34R50m42
4199a52j79L31L08m63%R09l10j315N26O41J50n83P90N5q60P29o79J225q34o70
4219c81P93k98m92K62K69n74P53P2m35m39J615j171k14P7N73o8n95L59k39k48
4239c81P79N82j376Q59l08J171j528L41n53K27j88N19m68L17N31q49J74r6M46
4258A99J04p14L6M72Nj59L08O40j501J404q17j68OJ77k38j75L91L98j04k79m93
$$ plain form
4117 410 729 497 -697 555 1016 -813 -271 -65 -15 -98 375 55 409 268 888 165 -258 399 275 -324
4137 -324 -235 555 527 346 -163 479 -266 30 496 672 284 422 618 -69 -583 520 -339 -684 825 582
4157 582 -27 -45 -454 -460 -206 278 431 -656 263 -172 45 116 143 345 -713 -570 -286 -588 -849 -13 771
4178 771 -661 -597 351 20 258 12 319 108 80 747 795 -360 -122 232 -128 458 16 74 -660 290 -152
4199 -152 -331 0 308 -155 -155 754 444 -871 -345 296 446 -137 653 708 -152 577 -102 1123 289 -381
4219 -381 412 114 -378 -116 153 -421 332 404 -31 -470 1145 -26 -240 -163 410 342 -253 106 -133 -381
4239 -381 398 980 -396 463 155 1326 -202 139 -414 -187 -375 144 -324 -7 524 -325 -151 -247 199
4258 199 303 -411 -375 97 102 -57 251 891 -610 794 -23 -191 -185 -8 -246 -421 -30 368 264 -15 -508
4279e08Q27j37p74J230j473J198q91R16j146R58l38l38j41J251m29m29K56k12
4297a80J96l69L25K29p42L5O11L16o84J50N23j6J35J41m25j212O45M45r07N26
4317b58M71K1l61N60o55m33N78N91m17q18J202J84o87l89R32j07j160N02o3l26
4337f33J010pp75O60M26p67J74j31j84M25j23RM52p74N35J29n81R8j51N19q76
4358e65P66n79J60l32M1O05n67J215k97l65K48l73J8k59l04J188q39J77J57O16
4378G11o62J80L81k36q92J063k62m07q6m52O13K65o85j97J037o18j80J65M27l24
4398a59R30n34o82O17k50L72p23J120j102J42L79k51K71M1K91o89j83N34r21K70
4418e27P1L83o72R02l43q8l21N34O82l89n94K71J35o82N78k35j16k59J056j33
$$ plain form
4279 -508 319 182 -592 638 -835 363 -528 388 -758 200 -138 -476 -617 634 205 -224 32 -180
4297 -180 16 -353 -28 201 -541 -506 105 421 -263 -113 410 394 529 670 245 -967 -322 123 -784 -258
4317 -258 213 234 -127 433 -222 -655 -77 514 97 -721 481 665 -22 -411 521 414 -746 -244 -307 -633
4337 -633 377 370 -405 255 681 -86 88 -43 -227 198 75 84 536 -238 297 426 -155 -57 -208 311 -565
4358 -565 201 -378 -218 -550 -509 96 -471 744 447 82 330 -43 -25 -284 -588 600 -239 -62 95 711
4378 711 49 229 610 374 -518 545 283 -124 -210 -662 -49 216 -469 -666 371 -247 -427 -262 165 -159
4398 -159 771 237 -445 172 -78 294 -429 691 -411 -269 110 -141 130 171 462 -227 -410 124 -797 -527
4418 -527 -456 -73 -745 157 -186 -274 -595 -61 621 232 -362 -91 44 -638 -60 -295 -411 -670 386 253
4438B53q6m67N45q10K99Q5j42k77L54O6N15q48K68J061j408nP03r94J223n30N73
4459C78p03Q17o97k33l1N39j60O5M67q4K88n48l12P74j232K16P34J63p82J89L54
4480B02j81k99J27l95n07R84J271j107J11l16J30M85l31J75j99o3l99O3K30L89
4500C70j61n75N75O48j327L18M7M77n59N78p03O81o64J357p00n82r7R49k01k55
4520A76j96m61J63K65J29m69K94K42l34k08K17L42l4M16n46l80l84N97R68m66
4540C31j00n36L16q00J000m97Q13l14O65n74J38m52J011j34j548J31P68L5l9r6
4560A18l56N65m40n0p46O00O31j57j067Q52K62p13N8L48L27m28m62J31P66mO3
4581B98p49l94Q65M56j342m30J121J95k72P81L7m73k37K6O7n49N69M31j223P43
$$ plain form
4438 253 167 -300 245 -565 -266 -181 -323 -600 -246 -180 335 -513 -245 816 -592 -597 106 -888 335 -195 378
4459 378 -325 492 -205 -438 -469 70 -90 -25 442 358 646 98 -214 560 -672 -456 278 441 -341 -152 202
4480 202 21 -278 -151 -546 -1053 -69 1202 95 206 -110 20 505 174 349 150 87 -312 -249 -19 370
4500 370 209 -366 209 857 -470 -152 -105 372 -187 391 -312 369 -295 1062 362 -220 -317 632 431 176
4520 176 -20 -481 -318 -53 76 -393 -99 143 -191 -399 -182 160 126 542 -4 -384 -768 -171 797 331
4540 331 231 -305 11 -789 211 -286 527 213 878 304 442 -10 1001 867 -681 -550 218 253 214 118
4560 118 -238 327 -113 -163 -909 -309 322 165 -902 -50 212 -501 -443 -95 232 -196 -658 -527 239 235 298
4581 298 -451 -845 20 476 -866 -1296 -175 20 -252 529 566 93 -144 -118 -51 -600 -31 400 -823 -80
4601h0J58L03k14m94N32p63Q2Q27n61O47o13N19o15j87J039j230J777j089m80
4620d42k73J054j15q9N0j57M04n73K71k9K30j137Q07Q34j143K85m12Q90l93m85
4640d23M18K14m72O79o25K52l17K03M96p42L11N51k50q02R13n03L2m00M42r66
4660i89R62O1m3j20L87o71n9N57m57O02m95J05k41n18Q29O15l70l73q9Q4N32p97
4682d88M99P22j311J034l16K33j37j74l00M83l87M80q07L37j97P07j30p34NR61
4702D80j14J07m40k84P64n06q66Q74N25o27j063J365K77L2k91q18K61N06J8l60
4722a60j32P66L28j46j465J138k53j05K13j36n32J38l2J05O7L19J88n4q48J46
4742d55M59j93q8K47n69K88j80N95OK28Q14j442k76R90p85O9L50R2m98J49n34
$$ plain form
4601 -80 78 381 167 -327 205 -558 -476 351 -210 437 -176 343 -272 -459 580 -650 1127 38 -442
4620 -442 -715 339 224 135 185 28 432 -141 130 101 331 -806 1 835 -308 -23 -435 455 62 -423
4640 -423 -5 209 -263 416 -209 43 -274 -71 425 -317 -6 545 295 -507 406 -97 -65 -465 -23 -989
4660 -989 -27 34 -9 -129 258 -413 -472 85 -372 230 -265 -160 -401 -919 -90 525 155 -218 -307 -223 309 -488
4682 -488 11 733 -578 456 140 373 236 62 -238 245 -142 338 -469 -132 -329 378 248 -486 -481 480
4702 480 366 473 33 -251 513 7 -859 15 540 -87 -1150 215 492 524 233 -585 -324 182 200 -160
4722 -160 -292 474 802 656 -809 329 76 -29 184 48 -484 -346 -378 -273 -206 113 301 247 -601 -455
4742 -455 4 -189 -277 -30 -599 -311 -491 104 110 338 1152 -290 -566 424 -361 -292 58 150 -348 -199 -733
4763g33Q44J11l95M27m64M03R3q29m1M69P91l39q30Q21k36k96n07N80M0J96k23
4784a18k18M74P32k75p38l52R8K86J99j76M87j57m31L67J57J20L49q56J00j11
4804f3L82k61K62rL7m03p9K04m45P09m72R33r82J25j80N76o41J35K10J49q14N12
4826a15L33o29Q6R93N15j499O50K76o02n20N88j65J2Q42q74j7K69m20M58r4N1
4847A38j21l71qK15J73k25qPP4Q4j11K2l20M7N17l81R75l05o48L60K12q0J00j87
4871A59J85n32l66K30L9N60m78j59M77N44q40K85p31Q08L20j035J57J076p97O10
4891E12j165K90N53p38J1Q90r8L42p26l85L52L29O93j270L87L00j87k40q8jr2
4912c31N28j80m42N40M6n54L24m61L65J95n32P92q10K51p2M11K22J49k73L36p14
$$ plain form
4763 -733 111 222 -173 254 -210 193 286 -543 -584 -115 676 337 -493 328 92 -204 -711 -131 -91 105 -118
4784 -118 -336 138 870 595 -143 -495 -397 -111 88 -88 399 242 -189 178 335 455 804 -52 48 -63
4804 -63 319 58 320 311 348 -55 -134 70 -375 334 -138 795 -187 -62 -242 334 -307 -172 38 187 -627 -115
4826 -115 218 -411 -325 668 1183 -316 334 610 8 -512 76 -89 -77 765 -109 -126 143 -277 181 87 138
4847 138 17 -354 -362 -147 26 -199 -207 -200 -126 -42 -153 -131 -451 -404 113 -268 707 402 -246 114 326 246 346 159
4871 159 344 -188 -554 -324 -285 275 -203 -362 115 659 -181 104 -627 181 501 -534 -377 699 -98 512
4891 512 -653 -363 190 -548 -537 353 255 597 -129 -514 -162 167 860 -410 -23 277 90 -150 -238 -239 -331
4912 -331 197 17 -425 115 161 -393 -69 -530 -165 30 -502 290 -520 -269 -341 70 292 441 168 504 -210
4933b10J52L9k86M09J80k44q7J13j33l53K02J32K46p4O61l78m81R1j23L73J64
4954C93q45O91p6J66l80N17K28o92L07m90K38r1J17L0l30J69R5L32l77j03JJ28
4976B8L76R5M8q48L08J62r1k77l45M01M22j40k70K86j07j04k89M99J44k47Q9p86
4998f46Q03O24p83m57M43L60j28o24M70l36N59k98l32k40M08L02K55n18K7P51
5018F40n07k55N69n91m05n9L46P68J62n21o74N61p09J36M03P01m58m99J165j098
5038c25N14o97M28J21N3N45j93j116l41N86N97m78J38N51n08j73L10j0J61n24
5058c61N4p38J444J07n61O6J25K59k1l12J86p57N84O52p75J50k58J03J58k91J69
5079a7M54n17j10P91l12m15L18m80j69P22j54m3o84R67k20k03m64L14J97k26L56
$$ plain form
4933 -210 -58 -19 -305 104 284 40 -47 66 -67 -420 -218 -86 160 86 747 369 -112 -21 -144 229 393
4954 393 -452 239 163 329 -51 466 694 2 309 -181 57 -34 83 113 -217 -48 47 379 2 -101 -100 28
4976 28 404 499 547 -301 7 169 78 -199 -544 -143 279 139 -131 155 48 -56 -345 154 298 51 140 -646
4998 -646 157 781 -2 -459 -16 344 216 -408 62 -274 285 -13 -345 -585 -177 125 380 -138 -111 640
5018 640 133 -122 447 -144 -549 -608 -262 506 668 147 -527 34 -675 -539 -136 565 107 -392 773 -325
5038 -325 189 -508 -80 41 94 639 446 -670 -1011 -425 172 -306 -168 383 -125 -298 12 2 163 -361
5058 -361 -307 -1045 399 506 -55 11 136 395 374 62 248 -509 75 727 -48 102 -156 -53 105 -186 -17
5079 -17 437 -80 -190 601 289 -126 192 -288 -457 265 111 68 -616 351 131 -72 -536 -222 -25 -251 105
5100A05L25K28j874J667n83Q1K24m25L57J62o92P45m73J94l0L10q45O34k18M75
5120C67m63J00O43o40O85n0p09M97K15K44l19k57n98K05P9J22o5j77n91J099n95
5141b08K48k37k74M55p60R54p37K81Q8M9K16q3j82M2L57N7o02M54j66O82o86l88
5163d40Q1L74N07n47O41n54K50q09k05J38N02J11n04J14O53k52M69o36N77m77
5183gR6J38m89J61K18l76M57p29M44N58r52P96R4p10o0O42k03o39P15M2J07K03
5205E06n77p38Q29M41r44k51K39J4L86N24k04J18oj39Q2l44n49Q42m95J23K36
5226I3L36o85J16K47N75m25o10j1J115M1q57r5N63j82n16o0P31o49R98j049j32
5247d56Q63o1k27Q9r0L62p87L38N9j09n88R98k76l84Q82r03j7L68K54j008R91
$$ plain form
5100 105 430 658 -1216 451 -132 -51 173 -252 105 267 -425 320 -153 41 11 321 -524 110 -108 367
5120 367 -96 4 647 7 692 642 -67 430 645 889 570 313 -285 -80 -1 121 56 -121 -712 387 -208
5141 -208 40 -197 -471 -16 -776 178 -559 -278 -190 -141 75 -8 -190 -148 209 266 -336 118 -48 634 -52 -440
5163 -440 -359 15 522 -25 616 62 312 -497 -702 -564 -62 49 -455 -341 312 60 529 -107 470 -7
5183 -7 89 227 -262 -101 117 -259 198 -531 -87 471 -481 315 409 -301 -361 281 78 -561 154 196 303 506
5205 506 -71 -809 20 461 -483 -734 -495 -481 -95 429 225 343 337 198 280 -64 -613 229 -266 -143 93
5226 93 429 -256 -140 107 682 257 -353 -364 751 792 -65 -160 403 221 -295 -355 376 -273 725 -324 -456
5247 -456 407 346 119 208 118 480 -307 31 90 -19 -607 391 115 -269 613 -290 -307 61 315 -693 298
5268B98j78K38j161J281o15L89j49N90n84Lk05M82o49Q91n4m29k62O7j61n12K04
5289e16J025K6o23K15l50M11j086J002K67q4m71k89M82l75K86L03l25Q63o68K82
5309C75m7M7l59k64J061n67lp47Q67q38j33M95l61O26m20K95N03m66o0N59l62
5330B01J64N42j048J39M3n66P0L00k23O36l34m79M44J77j21L83k82J034q17ml23
5351f4n87J112J53j329L24NJ20O56q3L16j242m6Q49p24K19Q98p58l95O36l45J32
5372a53N28m88n39J78J273m07p87Q56n43M23k84J09l39J66R9n30O87q26J29J94
5392b54K54P6J38j42p8l69O39m54l04R05K03m9o83J12k80J34l93R06j069Q66j77
5413a9O09q85P78n89M09n17N35m52k6L01o99Q7N13l24m69N60K98K75r60O2L42
$$ plain form
5268 298 120 358 -803 478 -137 252 103 693 109 112 -93 389 -260 631 577 148 -114 -47 -208 -720 -516
5289 -516 509 535 -88 127 -223 188 -898 104 371 287 -184 -473 9 -366 -80 223 -102 761 93 375
5309 375 328 375 16 -248 813 246 243 -504 363 -475 -608 -113 -474 152 -268 27 530 64 4 563 201
5330 201 365 907 -141 -2 41 -525 -455 -155 -378 258 -76 -555 -111 66 -55 328 46 1080 263 259 -64
5351 -64 -651 461 614 -715 -391 -386 -266 390 307 623 -619 -665 184 -540 -321 577 -181 -576 60 -285 -153
5372 -153 375 -113 -652 -474 799 392 -395 461 -82 341 57 166 -173 -7 92 -438 249 -577 -448 -254
5392 -254 0 76 214 72 -6 -375 264 -190 -494 411 614 565 -118 -6 -286 -152 -545 361 -708 158 -19
5413 -19 590 -295 483 -106 303 -214 321 -131 -157 144 -555 -468 45 -279 -748 -188 110 385 -575 -513 -171
5434a71N75q18P05j53O87j243L20m61P48L36l27k48lK89j97R7k64m0K89o84M94
5455f9Q2m00Q6M38k52k04L52q8M8l53M87o00N53K14j241M83M60K54m40O45l05
5476A50l34J11o56P19l10R2M62Q9m00Mj06l24k89P89K76p63J046o55qj8O40o76
5498a61r9P97n21N94m69k69oO72j08n66J24R1K50j92J55j27J15n35l46J228L52
5519I79j214j47M80K6M87l67K07m37J11L1j42k52l47M07j40m9J78M27j70L81j05
5540C44j85J15j88l0K32j15n61L73L1j45l05J232j086J77m01J166l63m23K96l15
5560a51P50l70l03ok16k91R86m72K77N15m73o3Q3q76P74r97J897j040m52N80k57
5581a05N47o58L33L29k04n33M71k1j008R44M7M12n56j46N44j5p41L62k94N87Q1
$$ plain form
5434 -171 404 -414 291 138 825 -418 -98 -559 189 525 198 -50 -53 236 39 136 -128 -168 121 -563 -69
5455 -69 13 -387 -301 137 -115 -319 33 -55 -7 -360 127 -473 80 294 -947 -464 -4 250 -190 455 150
5476 150 -184 -73 -729 -10 -320 -228 234 323 -77 -73 -179 -503 -792 -3 273 -490 556 -99 -107 -125 515 -161
5498 -161 -260 537 16 610 141 -128 -134 538 430 -136 -12 79 329 137 292 165 280 -255 -601 627 979
5519 979 -235 -382 98 124 611 244 451 14 125 156 14 -238 -585 -178 -318 -367 -189 238 68 449 344
5540 344 159 274 86 56 288 173 -388 -15 16 -129 -434 798 -288 -111 -512 654 291 -132 164 -151
5560 -151 599 229 -74 -80 -296 -587 399 -73 204 719 246 183 266 -610 164 -833 1064 24 -428 152 -105
5581 -105 442 -216 117 446 242 -291 180 159 -849 95 142 554 -2 -148 396 381 -360 2 -292 295 376
5602C76n05K82R8l23M59k50k50M8L95l29o07O23l07J66j79R80j508R77k50N44
5622D40j78k03Q5L27n94j2m04Q45r3m94J14Mj17K0M78p24L92M83m12O2l17L81
5644H3N2m61K08k24L97o97N62N07r2j82o91n47J392K15m3o56k01k82K56n4m4J64
5666c38M79L16m05n54k01J71N30O8o8j72k46M91Lq2j95O35o30j93M86K67l41k92
5688b71j89R74l99k95J18J26L10o56J46N97p10J65M0n1K57l69O18n31J34J82k
5709A94l44LJ08j6L98j37l30M42p04k6Q91m77L31j116R66k34p16q8N87J155j126
5730b39J09k05m1N77k7k49P14r58j53M95K93k98NJ69j17k30N63l40J66k69m14
5751d49J08M89p1o43M30j68J07R9K01L77k81j15L97q87R72p40K4k96J236k52j17
$$ plain form
5602 376 -129 153 251 -72 387 137 -113 -65 330 1 -606 17 -290 -124 -303 677 -831 146 -104 440
5622 440 262 59 144 471 -123 -135 -539 306 213 -281 -167 -163 -280 -260 218 -506 -114 369 -43 19 -298 83
5644 83 135 -326 -118 -342 55 -642 -80 427 335 153 -538 -1085 307 522 479 -177 -378 -660 -404 -458 -502 -338
5666 -338 141 457 52 -502 -703 -532 -2 66 -2 -174 -420 71 74 -8 -203 432 -198 -391 95 362 21 -271
5688 -271 -460 514 115 -180 -62 64 374 -282 -136 461 -249 -84 -44 -95 162 -207 411 -120 14 196 194
5709 194 -150 -147 -39 -55 343 206 -124 318 -386 -412 479 2 333 -783 183 -51 -767 -855 -268 887 -239
5730 -239 -130 -335 -376 201 174 -75 639 -319 -472 23 316 18 23 192 75 -155 408 68 234 -35 -449
5751 -449 -341 148 77 -566 -136 -304 -197 -98 103 480 199 84 481 -406 566 -174 -150 -446 790 538 421
5772D21r06K0M10p15P51k66P82m53j82J82n41K70O15j048K83Q45j04j24K92K0
5792E52n10N5j00M08J06n2l02J42L28p69o36J38J151k04m07O44p18O44p05K20
5812a5J13l67N94k74p2q4L46j06K88l50k13j01L41n77Q83m11J60K2O01j478J036
5833C36m51O88j489P55Q14p02N2O90j151L06k2M75l42M20k55l77P02m63N7j30
5853h7k57M97M61o04L0R8p52O98N0J24N9o51N2L35j86K44l34j33Q34n98k67O83
5875B96q9P5J00k58j36K13k98j13j72n0J08J258j442L56K61l02k03M14k13q69
5895a064J081o7K71p60K64K36p4M54M2r31M10l44K95m22O20k10J12l88k0J11J23
5916b61K59J5j51m69J030l62q20M61J52J91PJ26j82K00k77L19J26K4K9k28j176
$$ plain form
5772 421 -485 -465 -55 -770 -19 -285 497 44 -138 44 -497 -227 388 -660 -377 468 364 240 532 552
5792 552 42 97 -3 405 511 459 157 299 627 -142 -778 -640 511 307 -100 544 -174 470 -235 -15
5812 -15 98 -269 325 51 -21 -105 241 135 423 73 -140 -241 100 -477 406 -5 155 177 778 -700 336
5833 336 -115 573 -916 -161 653 -49 3 693 -458 -152 -174 301 -41 379 124 -253 449 -14 43 -87
5853 -87 -344 153 614 10 40 138 -614 84 134 258 317 -334 -282 53 -133 111 -223 -356 478 -120 -387 296
5875 296 207 282 382 124 -12 201 -97 -210 -382 -432 -324 934 -508 -152 109 -193 -396 18 -195 -1064
5895 -1064 17 -50 221 -539 -275 -39 -113 341 383 -548 -138 -482 -187 -609 11 -199 -87 -475 -495 -384 -261
5916 -261 -2 13 -138 -607 423 61 -759 -298 -146 45 52 178 -4 196 -81 238 364 388 417 189 -987
5937i87J167r0n93K87K02j38L19l09lJ70n72r7L11N53l18K84r27Q07L50m71M57
5958D02j76k38k41P01l03L87n37J43m2J51p3l30J92l61M61p99M26N73O9m75M42
5979C72R0k54k78J4Q26q31m84R76l06k49J88n18N67k4J76m05J32K01j47M01m77
6000c0l80K57k37K92M2J98J93r5J2o1m15J18k24L47K93Q02r11k95N17o22j60L62
6022CQ8Q8n73J408p71m17N55m66O37l79p72L58l10Q97n14L74j45n54P93l8j92
6043G0j94l57K83Q0J40k64P56o37l42L72m3N62k49l28l45P45j15j57p3k79N3o6
6065c88M66J73n85j1n32N65N71k29n3J26J11O60m10J6J20m0n09l52j69m66J561
6086F25j459J029K8l4l13mK70k67p3j40n4N57j28l7p4n8M25o39P98l67l28N2m91
$$ plain form
5937 -987 180 90 -503 -216 -14 -152 167 -142 -145 25 -547 -644 -333 220 -98 186 -741 66 416 -55 402
5958 402 226 -12 -253 448 145 532 -5 138 96 247 174 -156 36 -325 136 -663 -237 336 405 -70 372
5979 372 462 208 -70 -56 770 -61 -545 431 125 -124 64 -454 113 89 265 -140 -8 193 46 447 -30
6000 -30 -410 -153 -390 -98 -56 142 335 240 252 191 -224 -106 -330 17 310 1112 201 -94 423 -199 -359 3
6022 3 91 179 -394 1014 243 -174 381 -85 552 173 -599 -241 -551 346 -168 206 61 -493 300 262 70
6043 70 -124 -481 -198 -118 22 -242 514 -123 -465 -93 -136 426 177 -151 -496 249 134 -23 -96 -375 -322 -388
6065 -388 78 251 -334 -345 -877 -312 259 30 -23 103 214 874 464 480 600 560 51 -301 -470 -936 625
6086 625 -834 195 223 189 -124 -128 142 -125 -198 -338 -392 165 37 0 -74 -132 293 -346 452 85 -243 -191 -682
6109f82P56p9Q2l20N3q7J34J98N5o12M04O37m62J40j221R81j8k35R68j317r3Q87
6131A69j49k2PO6N87j184K08K09k69j38J468j397O39k72J51m26k7l1J59O16R5
6152D59o96k84P42M87J56k37K5m12m07p5k78J228j571Q17m96K83L69M11p20j50
6172c49O30K77r04j41J075p53J028r92j58o5o9N07N44J00o17j23k10k14J434q98
6192A02l03K93k14L87l47j93j38j81r2J144p15M86r17Q52P54j062n0q6O9P35m47
6213G7k36j11L66k3M94o07M18j013R59o81Q39o10K32j83L22m47J73N84j02j337
6233h86J721p96n24N6K80Q54m52j75q9j01L67p77L42N75p74K21p63Q57N70m33
6253G3N09k53k83Q9k21o2k7r7Q5M13k91J31P9R5L32p30L79o95L93L41n41J045
$$ plain form
6109 -682 74 -5 77 -243 -190 -277 -143 55 110 -502 -98 539 77 217 -1004 -23 -41 -276 692 -625 -718 169
6131 169 20 -2 5 71 658 -526 -318 -109 -378 -516 952 -445 194 -78 73 -353 -380 -411 -252 364 459
6152 459 -237 -521 221 708 864 627 652 240 -167 -242 -520 708 -863 -46 -542 -259 110 521 -199 -349
6172 -349 281 558 -346 -487 588 -165 863 -129 -287 -352 -421 86 630 730 113 -10 -220 -434 1000 102
6192 102 -201 92 -122 265 -82 -275 -413 -594 -686 458 -257 229 -688 164 918 -144 -194 -280 -211 524 77
6213 77 -159 -270 96 73 567 -40 378 -635 324 -357 482 -128 104 -79 243 -204 -31 553 451 -886
6233 -886 835 39 -485 -429 -149 705 253 78 -11 -112 255 -522 -180 395 -379 -158 -921 -64 506 73
6253 73 582 329 46 135 -86 -148 -175 -272 -187 226 -65 66 145 240 572 -158 221 -474 -81 260 -281 764
6275G64k28p91L14M7j124Q47M88n48p8N00j38l60o3J65K33Q99j028j18m23j42
6295g84J123l6j12o2p09M8M41l78O8J59M15L6j050N69K2l1O06n97J73m5J9M0J7
6318f8N84l21m32O03o72N3N39j51o68L62n91N31J14l81L10k6P34r77R84l63j1
6339A53k46m46L63l75J167p39m30P35P8m52L92m74J38N0k23M09k79P62n14n9N66
6360E76j564J637o15p41Q1L46M51m84M68j51J0O03n97J35o41R4N8L26K66o61J188
6381G85n27J21k09K04n44Q04j025J50R07j18q80N3L27o49N03K61m92N84Qq59Q86
6402B90m48K01O77p69l59J57mJ5j02m04J38O19L01n56L50nl01P33J47r45j15q4
6424d64R96j36r95P88j4l41Q79n00n46J48N47m19l81K83J0j1M26n0m41K2M58j70
$$ plain form
6275 764 536 -255 59 106 -1018 -171 317 -231 -309 191 53 -307 -370 -205 28 927 -101 -219 -642 -784
6295 -784 339 303 191 129 -580 -532 -91 -469 -401 -242 173 209 -841 -272 -250 -281 325 -272 -99 -144 -125 -85 -68
6318 -68 516 195 -237 366 -306 -253 286 135 -533 -171 -762 -231 -117 -498 -188 -214 520 -457 527 164 153
6339 153 -93 -539 -176 -551 616 -123 -553 182 260 -192 200 -274 -136 -86 -309 100 -179 583 69 10 576
6360 576 -988 649 34 -707 -626 -280 171 -313 155 4 14 617 20 155 -486 -392 -334 -8 258 -403 785
6381 785 258 379 170 374 -170 634 -391 -241 666 548 -332 -279 48 -601 -98 163 -329 255 263 -596 290
6402 290 -158 43 720 -49 -408 -251 -255 -240 -342 -746 -608 11 312 -244 106 101 -200 533 680 -265 -380 -464
6424 -464 532 396 -599 189 175 -166 713 213 -333 -185 362 -57 -438 -155 -145 -156 270 220 -221 -199 259 89
6446H9K91k70l77P56o74K43l56N09l74P0M42k54j36L74M0q04L81k07m7N00N57
6467G53m12k35m70k86O63K28p96O66m71O80l8P98r43l44M22m96J88k47J124k74
6487E10j362O08p5j24K6P46j14k73K91R57j524N81n22O50R5m99P72q40p96R45
6507E2o00P68k75r35Q80J51J21p59J171r64M0m0j3l22J077m80o04O01K20K64m7
6528C06m1p02N74J86q09J32K30j00J015m77n55l48L25L20l6l1J86j72K34l28o75
6549g66O82j79j48K52J25k07K63k53Q2k25N69N78l70r4p35K77L76m79rQ08l33
6570B14p28J26P11j78j88K40Lj87j24K99L09j042O48k9n24N4K74L67p44P53m8
6591B06N38L3j108M69M7o38l85N27n67Q23K43m49M79L6n08N27o07k21J30J63L18
$$ plain form
6446 89 380 110 -267 489 -185 58 -298 211 -163 -93 349 95 -41 333 373 -431 -50 -257 -304 196 753
6467 753 341 106 -364 -650 13 241 -555 111 -360 320 282 1080 137 -207 215 -281 -93 -340 784 510
6487 510 -852 -244 -319 -443 -417 329 215 -58 233 1190 -334 247 -275 375 470 -29 743 -97 -893 52
6507 52 -548 220 -55 -990 -110 41 162 -597 574 -390 -350 -390 -403 -725 352 -128 -732 -131 89 353 306
6528 306 265 -437 137 323 -486 -354 -124 -224 791 314 -241 -589 -264 56 20 -11 175 3 237 -91 -766
6549 -766 -84 -263 -411 -159 -34 -241 22 -231 -149 -374 195 773 403 309 -426 -149 227 -252 -261 547 214
6570 214 -514 -388 323 145 -43 197 200 13 -111 188 497 -545 103 74 -450 -396 -122 245 -499 254 206
6591 206 744 777 -331 138 185 -453 -838 -311 -878 -55 188 -261 218 254 -254 273 -334 -555 -425 -262 56
6612E6k75P62o93j91K2R0L7m76M79M74o16P52p1L30r10l46J437j178N14J46o94
6633c51j6P75n88Q04q50J6J000n13m40K74n9N35l26K46o2j236P98j05j84k6J079
6654G71j413R77K94j49m22o34M41K37m81N46q31M74k07J013j226R58L70j242R88
6673D64M48o34n87O75P1l00r67Q77J24j25l3L72n59O61M89o58m78M74l29m95j08
6694f18L78Q02J26p21J136j459l27K98K36n5N62J63n19l16N25j18M84n41n76K23
6714c17M32P87n79k91J46j91P90k96p09N73j04l60j07j13K21n44N62K06n32O09
6734A83j01N20j072l33J456q33L25o7K02J57o16M46n05k43P07m4J65R9o83M48
6754B11N36m62r2k26k67K5J43N81M24j093j30N28j160P94o5K78l76l10M75K29
$$ plain form
6612 56 -219 543 -150 -341 -319 -229 -192 -668 -189 285 -331 421 350 680 -230 -576 861 -317 197 343 -351
6633 -351 -367 408 -180 624 -226 -210 790 277 -163 111 52 587 261 507 445 -791 7 -98 -282 -308 771
6654 771 -642 335 629 480 58 -576 -135 102 -379 167 -664 -190 -397 616 -610 348 718 -524 464
6673 464 912 278 -309 366 437 137 -830 47 171 46 13 385 -174 487 976 318 -160 314 -15 -510 -618
6694 -618 -240 562 688 -33 1103 -356 -683 -385 -149 -204 358 521 2 -314 211 93 577 36 -540 -317
6714 -317 115 902 323 32 178 -13 777 481 -228 345 241 -119 -226 -339 -118 -662 -100 106 -426 183
6734 183 82 602 -470 -803 653 -180 145 78 280 437 -179 267 -238 -481 226 182 347 446 -237 211
6754 211 747 285 193 -33 -300 -275 -132 449 873 -220 -350 178 -982 -188 -253 25 -351 -661 -186 43
6774D3L08n53q0l21O38m95O05m4J82n36k0N02L30n77k71j49J72Q61n36JM9Pn73
6797d57M35j68k85K69k32k60R53M9M53j029j06M87K42J37o53k16l10N79L05m0
6817A53L54k89n67K73Q0p57O36M44o96K26j06N25o2J05o08R02p74K84M70p29j48
6838b84M32P4k13J41q06N20j42N60o53J01R4k90N47k66K52n92Q04N4o06K94l82
6859c61m2K51K74k43K96O6l75L59M21p21m01L9P57l25o2J09n44N90M2j010J56
6880g24N13j98J250J99q14M22k42n41L85n63Q66n02L26n94L61m24L14k4m1m53
6900d84L19Q08o17K4j22P79o44Q3k39j80pP02o94k87L61m16J041j35m58k9l08
6921e03J96J19j68P89pm07j83N35m12J19k0l02P52p69M91R0J11m91j71o27J19
$$ plain form
6774 43 351 -202 -282 -603 35 -460 145 101 283 -253 -273 229 559 -18 -289 -438 -266 595 59 60 109 116 -457
6797 -457 -22 -190 -475 -206 -438 -698 255 304 757 -272 -378 109 351 488 -165 -381 -691 -112 193 153
6817 153 507 218 -349 -76 4 -753 -117 327 -369 -143 -249 276 214 319 -289 613 -161 123 593 -136 -284
6838 -284 148 222 9 150 -656 -136 -278 282 -371 -270 -176 -466 81 -185 67 -525 279 333 -273 21 -361
6859 -361 -403 -152 122 -121 175 241 -134 225 646 -75 -476 -437 320 -5 -67 42 -502 88 130 -880 -724
6880 -724 -211 -409 841 1040 226 648 406 -135 250 -313 553 51 377 -217 144 -280 34 10 -31 -484
6900 -484 -165 643 26 50 -72 707 63 146 -93 -273 -280 422 -272 -559 -198 -614 427 292 -166 -195 -503
6921 -503 -307 -188 -356 433 426 19 -164 371 -41 78 58 -244 508 -261 230 320 431 -60 -231 -858 -739
6942g39L25l90R69J48q3J30p10j70J074n95K5K34j66j51N3m2l65J154o49j56L47
6963B43m03P70j34q35K97N69j4j302J072m29N50j169R52k13M52n06P55k14m94
6982e3O03m87J59L03q86p3J041j47n83k88o6j57J128o97M9o51L25M70k36O21o67
7003b92N86k13j299R67K84M80j076J380l62l63j91J19L04J18q92O70O4k87K58
7022B55o41Q9Q18J00j23j52L19m77m05L78L8O86j163O68m1p28Q61k30m79J9M45
7043B37j02K66m43j63K10J39l86O47m07k25R59j424L1Q70j77l30K29J17K31P9
7063C58q2m75J46Q2M86n94j09L82k81L08o89M63o3K81Nn95L41L10Q33j056l94
7084c43M48M1L89n33j64j62L29N59j90j180J497q79M63L8n08M3M75J85k08N81
$$ plain form
6942 -739 -414 -804 165 313 230 360 -350 -520 554 -41 -16 218 52 -99 -46 -88 -453 701 52 -104 243
6963 243 -160 610 476 -359 -62 507 493 -809 263 -166 384 -785 167 -46 406 -100 655 441 -53
6982 -53 550 63 222 525 -361 -434 607 460 -123 -411 -477 -634 494 -203 -154 -805 -480 -10 -246 375 -292
7003 -292 294 81 -1218 -251 33 513 -563 817 455 92 -99 20 324 442 -450 220 284 -3 255
7022 255 -386 -297 521 621 498 346 665 188 -217 161 199 885 -278 390 349 -379 482 252 -227 -208 237
7043 237 135 401 -42 -205 5 144 -242 405 -2 -227 732 -692 -661 209 32 -298 -69 48 279 358
7063 358 276 -199 -53 29 515 -79 -188 194 -87 221 -468 -5 -68 213 218 -377 -36 274 1107 51 -343
7084 -343 105 146 535 2 -162 -324 5 564 374 -806 691 -188 275 313 -195 -152 323 508 300 881
7104H81j214J88M97p09l4M45L32q35O6j28M76O8o21L80N40J0j012M26J41k2Q70
7125G45n85p00N50n53M72p58J066o32O96r69m39J166m12N18k43O97j18N92p62
7144C31m98L30j68j11p8Q28o10l11J039r51k37J43K16j0O42q79O00l74K03j46
7164d1J25j54J33j72O73q20L17o42J300j001O93n6j033N12k23K23J76m19J48L08
7184D7k58j34J05P03m06l30L12M07q22Q63j009K15J32k01N96l01j002J843k09
7203E51n85k32j14M35N63n46Mn18J187j423O76J47l83L13l7j05n7J97J55m92L32
7224F8O35p18r5J02N69l68l5M35n71J61M7l28O08j366J139j58j74L2M03p38O3
7245b89L45k09k94L31k52J01j68R0K69J40k68M04M50o94J37L17o0m42j77O54p68
$$ plain form
7104 881 -333 -145 352 -357 -391 54 386 -449 -383 -511 -35 33 -588 -208 332 342 -670 -244 -103 -125 745
7125 745 160 -540 10 -543 -71 -829 237 -395 301 -668 -1107 59 -353 165 -78 619 501 1093 331
7144 331 -167 163 -5 -116 -194 634 24 -287 752 -199 -436 -293 -77 -87 555 -324 276 -98 105 -41
7164 -41 84 -70 63 -109 564 -256 61 -581 719 -282 411 355 -678 -166 -389 -166 10 -409 -261 47
7184 47 -211 -345 -240 463 57 -273 39 446 -376 487 -522 -307 -175 -376 220 -81 -1083 760 551
7203 551 -34 -266 -380 55 618 72 76 -442 745 -678 -2 145 -238 75 38 -67 -124 73 228 -264 68
7224 68 703 -15 -110 -8 561 193 158 593 22 183 230 -98 510 -856 283 125 -49 -17 386 -352 -289
7245 -289 56 -153 -447 -116 -368 -267 -435 -345 -76 64 -204 200 650 -44 93 410 350 -92 -269 385 -383
7266c83R6N00L26L07q33J30O2K35N8p93P72K17p78k65K83J61l07k26J294j43o60
7287E3m38J09Q00Lo81N19l72l60m8Q39p96P12p42L11Lm57Q5R64m99P74o93m52
7309c66l23J030n98Q1L42L37p04m05J089r06M06n40J002m37N7R3m49R3J20n0m28
7330e56J97M87k86r6O09p74M32M5l12N09n32J57j26j4J181j629J308j03p48K81
7350C0j78j83Q9K68K12j07l21k05P80j142N92j30K39L85j94p9P2o51O61N1k88
7371i9O29k18n84Q30m12l69Q19q24N53o42j05K9K60j60J9j25J065j278L82m31
7391f61N06M50l52M37k65L13n88P1J42l21LP7N76n3L76l79m43K07K34p34J012
7412F08q28N79L00o99K46j54Q04j216J77m54J160o85j55J72J67Q2j00p49J332
$$ plain form
7266 -383 -287 213 539 846 13 143 205 440 498 -295 477 694 -84 -349 -66 95 -212 -438 856 713 53
7287 53 -385 -276 524 527 -154 365 -7 -367 -415 424 -372 340 -402 -91 -88 -545 -460 504 5 779 86 -366
7309 -366 -689 341 -257 -176 166 503 -201 -606 483 -423 -17 -557 445 8 65 158 -291 -198 -78 -128 -556
7330 -556 -359 128 -158 -254 355 -419 13 58 -254 255 -277 -120 -246 -260 921 -708 600 497 -251 30
7350 30 -148 -331 -242 26 238 131 -190 -395 385 -757 -165 -295 -56 329 135 56 128 -523 138 189 -99
7371 -99 530 312 -272 558 146 -223 596 -228 325 -317 -422 -393 -133 -293 -274 -399 666 -612 -230 -661
7391 -661 -155 295 -57 380 115 428 -160 -89 53 -268 -265 -188 388 335 711 332 -111 96 330 -404 608
7412 608 -220 359 659 -40 206 52 856 -360 -183 -637 523 -162 -317 -145 22 104 4 -745 587
7431E87n31l43K6N92j42k3%m59O56j42J83j283J109J23o60l26J024n17K72j36
7451A0M50k62k81L79n32o7M96o0k93k21O26N1n95M19l84J033n79k19j12P44q04
7472b01M92l86L97m49J75L59r14M75m9Q72q50L66m13N6l77P08l80Q7Q2m41M30
7493C9J68J58j531R14M18r11M29n8J00L8L33k37k79M95j82q31J214j49j8k53n7
7514b00k92K04O96o02n2L07k51o61J246p3j28J61k80m26L10N76n28q8J4L63N77
7535H73j682M49M31k84J38l0p1L41J77k23o6P3k22j78O01k3r73J19O09j69n43
7556f53J22Q03o82M53J29Q2l32N20o33J75k41k27K67k33j12Q11J93p78J48N6p2
7577b04P48o92M94L26o83L16r70Q16l67N69J9K92n68j18m08R7P68J21p72l19P15
$$ plain form
7431 587 56 -287 -261 331 189 166 166 -293 363 221 404 -879 230 353 -307 -633 391 -126 146 10
7451 10 460 198 -83 296 -236 -303 193 133 -160 -381 245 296 -299 120 -264 769 190 -29 -141 603 -201
7472 -201 291 -95 302 -147 28 387 -527 -52 -101 771 -79 287 -126 -70 -447 261 -119 -32 50 -391 39
7493 39 207 365 -1166 -252 166 -745 -316 -374 -274 -236 97 -140 -419 76 -106 -937 277 128 110 -143 -200
7514 -200 -492 -288 408 -194 -246 61 -190 -851 395 322 194 355 75 -351 -41 535 7 -81 -67 296 873
7535 873 -809 -360 71 -213 -75 -105 -176 165 342 119 53 126 -96 -274 327 304 -669 -550 59 -110 -653
7556 -653 -531 272 -410 43 172 254 -78 442 -191 -16 -257 -484 -217 -450 -562 249 442 -336 -188 -132 -204
7577 -204 544 -148 346 672 -11 305 -665 151 -216 353 372 664 96 -22 -430 -333 435 556 -216 -535 180
7598A80k36K26o4r49L23O06J31r4J67n79K6R36o57k54N34m73R57n78n84P34k04
7619A48m17N12R2o88M79N96n04m03l12R9N81J28n51O39n97M51k33j92j013R23
7639b62M6K51J0N76k75j300J657j441J401q68K38L00Lj000P87K0m40P47j480J265
7659B35l56J60p4R0m10K91P55j316O20J40L28q98K99p12J089m33m06J11O11m85
7679c61K99J0j35M48j53m53J188j363Q60j34J74q87J222r49k36K40k1M25m19m20
7699f65Q25m44K08K83m06N84N4r88M84N31j049O31n35J064j293K00L87k39O72
7718C04L77o86J52j42M67r04P25k59k99L4KL65p41Q71j003N49N16J04k54N9p92
7739e55R38k93J22J8k50M15l43J48o79J17N5l67M10M28M73k36P46q19k11n7K35
$$ plain form
7598 180 -56 170 106 -843 -520 86 217 123 290 -289 -263 673 16 -238 296 -177 780 202 -382 352 148
7619 148 -269 243 335 -353 126 722 218 -185 -497 -398 183 311 -240 399 -198 253 20 -172 -1185 -262
7639 -262 -216 35 45 621 346 -954 703 -738 663 -205 33 333 336 -664 123 143 -297 450 -1030 235
7659 235 -121 39 -35 55 -355 -64 691 -625 -5 135 463 -435 -136 -848 241 -192 -598 -487 124 -361
7679 -361 -62 -52 -187 261 108 -345 843 -520 340 206 380 -507 715 -234 -470 -230 -251 174 -245 -665
7699 -665 160 -284 -76 207 -199 385 439 -549 -65 466 -583 48 -487 577 -716 -516 -129 -368 304
7718 304 681 -5 147 5 472 -432 293 34 -265 -231 -229 136 -605 266 -737 -188 328 432 178 237 -555
7739 -555 383 90 212 230 -20 395 52 200 -479 -362 -307 -674 -264 164 637 401 1147 328 117 60 295
7760B95p91K86J070p89m03M25q6L88L60j053o5J50N30K78m68N0n69J6M31O8k05
7781h2L7R2j059J005M7q7j35K16M40j617N49M65L08m11O90j006M07M26r5m91J41
7802a60P10m79j07k1O0q80R62J44N49o73k12l17j23L51p5n8K33j47N52K61q93
7823c23R8k52R31K8p48n04J125J24l53M37j89n04k16O99j69n11J47M6J14l2J65
7844A13M43p49k63Q1K90k65K55K53n67L6L30q68J127j9M1M48j335K34P91l23l17
7865b64J136r22o7Q31n42n58j88M54n48P96o76J067l06k01m51P90M67j39r31n4
7885c06R77o85l88M29J84n72J19K72L3l62M41K95o48K54M16k46n74J388j165P07
7905E69q53M04p38O9Q73q10j1L57j45l06m9R69K77j160P41l19M09l49m6M1K24
$$ plain form
7760 295 -496 -210 860 71 -332 93 7 395 755 -298 -363 -213 317 595 127 177 -392 -376 55 123 -82
7781 -82 -45 47 -1012 -7 40 -47 -182 34 474 -1143 -594 -129 179 -232 458 -548 -141 285 190 -301 -160
7802 -160 550 71 -36 -57 3 -877 85 229 778 105 -107 -424 -547 -196 -271 -329 -96 -243 309 570 -323
7823 -323 -225 -477 454 482 -266 -770 355 479 126 563 374 -130 -346 353 184 -327 -180 -134 -20 -52 113
7844 113 556 -193 -456 -375 -85 -350 -95 158 -409 -373 -43 -911 216 197 238 686 -649 -415 376 53 -264
7865 -264 872 -50 -117 714 172 -386 -574 -120 -668 128 -548 519 213 12 -439 351 818 679 -252 -306
7885 -306 671 -14 -402 27 211 -361 -242 30 63 -299 142 437 -211 43 459 213 -361 1027 -138 569
7905 569 -284 120 -618 -549 324 -486 -497 -140 -285 -591 -640 329 606 -554 187 -132 277 -72 -118 -77 147
7926A47n01N23q6n6q69J031j69n4J86l88M46n6k78J64j32J42o04N07k33J22J64
7947Fr0q8m4N81m26L48n11P58j78k79j13K93Q0o78J10N0LM55m53j75M86j97m16
7970d78J558q04o65J090q15k6L60n19p26J134m37L64r3l53Q33o99P11j96L62l91
7990B10j58j11K84j28L13p48N04m87J30M26l5P2l60K91J4q68J97K8lN97k41m0
8012a13K73M60j133O47n41P41l55j27j20J09o73L45K60N35n23O17o12j16o3M20
8032C1K77l13K12j05M42p88o66J313o46R45q33L33m85P5Q6L75n23J337r23K51
8052C95l24K65k39P5m8J89o19k69k2P37o1K12j40n98P5M51P0j157P84o17Q92P97
8074H48q26m46J39M83n85J70M59l44J81n81L87O79q40L50J28M65j087M36j34K73
$$ plain form
7926 147 -354 169 83 27 -842 189 20 -34 152 -236 210 154 -124 40 -92 50 -554 -47 -280 -158 6
7947 6 -84 -172 -216 365 -61 287 -224 534 356 77 -36 257 337 -341 -231 -181 -178 277 -176 -351 135 -62 -478
7970 -478 1080 276 -389 701 -114 -140 220 -299 -1025 109 -328 36 -57 -410 423 -276 435 239 601 210
7990 210 52 -59 225 97 410 -338 166 -321 -191 235 200 272 -88 203 217 -651 -454 -426 -429 168 -73 -113
8012 -113 160 620 -513 134 -407 334 -21 -148 -268 -159 -832 -487 -227 308 -215 402 -210 -326 -389 31
8032 31 308 -5 207 102 544 -244 -910 403 -243 702 -131 202 -283 -208 -122 253 -270 1067 144 395
8052 395 71 336 97 172 124 313 -306 -575 -597 140 79 291 151 -447 -372 79 149 -1008 -224 -841 51 848
8074 848 22 -424 -285 198 -387 -217 242 -102 79 -502 -115 564 -276 74 202 667 -420 16 -118 155
8094A55l90l56p03J179j74N84l47N20k36l30m61R46j056P92j99k7M34j36m01J66
8114d0j28p21P33J30N89m60L8qn51O88l12J24p84J163p33J95K73mp63L51O80o64
8136b04M02n53J21kJ23J58o42P18J82j56r03L10K90L67j8K10l99L20J23J49k59
8157C37K5p61j21R68Q6k2n6k37M42m98o07L10J78P4M13m69j68L49r4l91M26r7
8179H7k55j26J9N98o87R02p06N43l44r4m69P71
$$ plain form
8094 155 -235 -591 -1294 -115 -289 295 -52 468 232 -98 -559 387 -669 123 -76 -103 331 195 -206 -40
8114 -40 -168 -889 -156 -26 563 103 141 133 -418 270 -42 82 -702 461 -272 -77 196 192 -571 -220 460 -204
8136 -204 198 -355 -234 -236 -113 45 -597 121 303 147 -756 -446 -156 211 193 403 4 324 447 596 337
8157 337 362 -399 -520 448 534 512 456 219 661 163 -444 -134 44 118 531 62 -106 243 149 -242 184 87
8179 87 -168 -294 -275 323 -364 538 -168 375 31 -63 -532 239
8191B39
$$ Imaginary data points
##PAGE= N=2
##DATA TABLE= (X++(I..I)), XYDATA
0@%%%%%%%%%%%%%%%o4J28j28J28j28J29j93K56k57L21l84M48n22N86p04Q31r54
32e07J078j210J344j515J708j914K152k402K670k965L292l649M034m457M928n434
48b847N989o602P267q001Q825r733J0750j1892J3175j4648J6348j8344K0715k3591
62a2589K7173l1759L7883m6531N9773q2807J34378m92217J46280L90329o60430
73e30517K37042N63036k68646l58379N59416J10688n03438R6938M53333l32927
83B6546k82046L98961J01027m52753R1874L68154k36704k75781L46167J16144
93B01589l78567K9681L67909j85814k81023K97951J56998l73824Q897L77690j55451
104F6036k88328L20212J78899l73098O161L76586j88566l12168K96040J37832
$$ plain form
0 0 0 0 0 0 0 0 0 0 0 0 0 0 0 0 0 -64 64 -64 64 -64 65 -128 128 -129 192 -192 256 -266 320 -384 447 -507
32 -507 571 -639 705 -810 898 -1016 1136 -1266 1404 -1561 1731 -1918 2116 -2341 2587 -2847
48 -2847 3142 -3460 3807 -4194 4631 -5102 5648 -6244 6931 -7717 8631 -9713 11002 -12589
62 -12589 14584 -17175 20708 -25823 33950 -48857 85521 -406696 -260416 129913 -530517
73 -530517 -293475 269561 915 -357464 201952 312640 -190798 -93860 359473 26546
83 26546 -255500 143461 244488 -208265 -116391 251763 15059 -260722 85445 201589
93 201589 -176978 -147297 220612 34798 -246225 51726 208724 -165100 -156203 221487 66036
104 66036 -222292 97920 276819 -96279 -90118 286468 97902 -214266 81774 219606
114B19606l95939Q959L59876j85240k73966L09844J46837l36530M1495L41437
124B36379j63932k42232K65062R9983l35430J097K77285j65721k30963K44043
134a4429J25127k66005L4918K99396j05719j95182K32449J20299k71859q760K46591
145A96826j38715k33057J87260R5401k72842m030K56206j09427j90098K19577
155G101J25312k34259J6028K53555j04738j86081J91946R7837k38619l057K23145
166A48170j07740j82867J76541R9146k16859j629K17231r1568j78741J60827R5333
177A17844k17135k2017K03603q4996j74351J60588J14836j86318M443K26041o2798
188G9740j60038J61670R9320k10951k9979J83451r6159j83102J37419R2558j86311
$$ plain form
114 219606 -176333 -167374 192502 7262 -266704 43140 189977 -146553 -105058 236379
124 236379 72447 -169785 95277 195260 -140170 -139073 138212 -27509 -258472 -14429
134 -14429 110698 -155307 -120389 179007 73288 -121894 110555 230854 -41005 -49765 196826
145 196826 58111 -174946 12314 107715 -165127 -169157 87049 -22378 -212476 7101
155 7101 132413 -101846 -85818 167737 62999 -123082 68864 166701 -71918 -74975 148170
166 148170 40430 -142437 34104 133250 -83609 -85238 131993 40425 -138316 22511 117844
177 117844 -99291 -121308 82295 -2701 -177052 -16464 98372 -87946 -83503 142538 79740
188 79740 -80298 81372 180692 -30259 -60238 123213 27054 -156048 -18629 73929 -112382
199a12382l923J99733n8309j42231J46351R7633j69167j3943J72167o7877j51254
210a03202J17137Q1858j66574k6118J62793n0219j41754J15199J05584j37211
220d2507j9454J71070l0994j42423R6330R0924j56653n1875J46664m1265j50231
231a30414R7232J07265j33916k7850J69351k2678j39837R5206J02037j41827m7544
242g2975J45617l2488j42627Q1948R7023j25241l6697J49863j4571j23063Q6420
253A3209J00946j18668m5960J28347k5452j40235N8401Q8024j14576n0370J33977
264B7643K703j14950P0112J07314r3780m6920J26516l867j25959M8851R2412j07954
276a7879o4644J16699k586j26993N1540J05608q8679n0550J30237J3779j16270
$$ plain form
199 -112382 -116305 83428 25119 -117112 29239 126872 -42295 -56238 115929 48052 -103202
210 -103202 13935 95793 -70781 -96899 65894 15675 -126079 -10880 94704 -42507
220 -42507 -61961 109109 78115 -64308 32022 122946 -33707 -85582 61082 19817 -130414
231 -130414 -33182 74083 -59833 -87683 81668 58990 -80847 14359 116396 -25431 -72975
242 -72975 72642 40154 -102473 -20525 76498 -48743 -85440 64423 49852 -73211 13209
253 13209 114155 -4513 -50473 77874 52422 -87813 -29412 58612 -55964 -106334 27643
264 27643 30346 -84604 -14492 92822 -958 -47878 78638 74771 -51188 -2337 90075 -17879
276 -17879 -82523 34176 31590 -95403 -43863 61745 -26934 -77484 52753 66532 -49738
287d9738M9480R9463r5469o7345J07318j359j27361M2556R8884q6301n5411J25416
299D0133J9819j12532M6497J05335q5453o7944J03633O536j26112K6542R3977
310E0431q1116o4106J10833K6595j04160M1478J07539p0127o4415J03038J8668
321G4658j20229K0503R4227p5927p5308R4824K5428j09821K3724J03890o1381
332e412o3579J02967L5591j05250K1198J01599o9373q1289Q8833K2306j17606
343g0015J4353J04063n7998o9098J04222M4784j01987J5883J03661o2406q2662
354e7200Q3967K7086j15934O415J00968n5626p6726R6280M5915j01272J2738J10360
366G6971m8813p9440Q5532M0915j09154m558R6320n3345q6308P9620M4550r7989
$$ plain form
287 -49738 -258 99205 3736 -63609 43709 42350 -85011 -42455 56429 -29872 -85283 40133
299 40133 59952 -52580 -6083 99252 13799 -54145 49488 56024 -70088 -43546 50431
310 50431 -30685 -94791 16042 42637 -61523 -20045 87494 17367 -47048 55990 74658
321 74658 -45571 -25068 69159 -6768 -82076 12748 38176 -71645 -47921 55969 -5412
332 -5412 -68991 33976 69567 -35683 -14485 87114 17741 -63548 25285 47591 -70015
343 -70015 -55662 48401 -9597 -78695 25527 70311 -31676 -15793 87868 25462 -57200
354 -57200 26767 53853 -62081 -55666 45302 -10324 -87050 9230 55145 -46127 -33389 76971
366 76971 28158 -51282 34250 75165 -33989 -38547 57773 4428 -81880 -2260 42290 -55699
378e5699O358J08145l8307p5029Q4234M9627j01644p804R5809m7568q9512P0224
390a166M4420j00019n531J01391l2652p5981Q1068N6827q8765m341R9957l5975
402C9233q7423O5738M5155j01998j8929R4078l2382q4553P1789O2782q4263q420
414c9193J02654k4356q5558O2299N0532r6512k3814R2289k8326q5955O4286O1979
426E0325q2465j3735J01839j7432q2704N9358N8983q6127k5660Q6359k3251q8270
438f2780M9792N4908q2751k1832R2670j2136p7496N7834O6691p3309k4168R0021
450E7444j4206q6967M1680N5447q0091l3968Q5179q424q0672N0399O9978o5259
462i460k5249R1119p381q5947L9767N7155p8966m0523P9584n415q3594M2909O9688
$$ plain form
378 -55699 -49341 58804 20497 -54532 29702 79329 -22315 -30119 65690 18122 -71390 -1166
390 -1166 43254 -56765 -62296 39095 6443 -69538 11530 68357 -20408 -24749 75208 39233
402 39233 -48190 17548 62703 -39295 -58224 35854 3472 -81081 -9292 53490 -30773 -39193
414 -39193 63461 39105 -46453 15846 66378 -30134 -53948 38341 10015 -75940 -11654 50325
426 50325 -32140 -45875 55964 38532 -44172 15186 74169 -11958 -37618 48741 25490 -62780
438 -62780 -12988 41920 -40831 -62663 30007 17871 -59625 -1791 64900 -8409 -32577 57444
450 57444 43238 -43729 -2049 53398 -26693 -60661 24518 16094 -64578 -14179 55799 -9460
462 -9460 -34709 56410 49029 -36918 2849 60004 -18962 -59485 20099 14684 -68910 -26001 43687
475D3687o1796k9480Q9320L174p9555L6970O4897o8036m0971P7522k936q5381
487e2585L1873O4564o4390m0207Q3244R615p8271L4790P2943n6361m0067P5409
499D0557L548q6589K3756O1528o4131m3493P7331J0804p5742L3567P4084n2366
511B854l8041P8479R131q0499K0979O2343n9527m8838O7543R594p8395K3485O9139
524C8247m6352m0009P5402J8902p5585J8866O7968n1220n4183O4408J6067q2352
536d9841J4183P4636m2663m8026P3056K7509p4515J3448P3344m6652n5784O5526
548B4221J8058q3568R516P0610m7426n6239O8964K5432p5827J6950P7281l8306
560I666m7375O9516K3673p6490P693O4966m8127n6737N9376K0326p5515J4552
$$ plain form
475 43687 -18109 -47589 41731 44905 -34650 2320 67217 -819 -41790 35732 32796 -52585
487 -52585 -20712 43852 -20538 -60745 22499 32114 -46157 -11367 61576 5215 -34852 40557
499 40557 44105 -42484 -18728 42800 -21331 -64824 12507 23311 -52431 -18864 55220 2854
511 2854 -35187 43292 52423 -28076 -7097 55246 -4281 -53119 14424 24018 -54377 -30892 38247
524 38247 -8105 -48114 27288 46190 -29395 -10529 57439 6219 -47964 16444 32511 -49841
536 -49841 -35658 38978 -3685 -51711 21345 48854 -25661 -12213 61131 14479 -41305 24221
548 24221 42279 -41289 -31773 38837 -8589 -64828 4136 29568 -46259 -29309 47972 9666
560 9666 -37709 31807 55480 -21010 -13317 51649 3522 -53215 6161 26487 -49028 -34476
572c4476P3601l5684m7303O7738K8906p2344M155O6756l8992o1121N3967K6370
584C1573p3872J540P3953l0834n3223O2594L5420p0922K003P5487l4816o2233
596d3330N8834L1429p8649k722P4608l5310o1129O1443L4553p3304N203P7204
608D8830l3226n7601O2502K9849p8293j594P1404l9759o1307N8856L1635p2073
620d0777M349P8540k7000n2901O1495L4449p1224m120O7316l5482o3177N0887
632B355K9179p2745l290P4305k6146n5355N8506L9303o6199l139P3628k7844o2113
645c9555N1818L2896p3440p962P0897k6437o0840N5431M0212o8090l962P5251
657D6219k5654o2105N2283L7086p2900j0484P0938k6483o2665N1834L8802o6621
$$ plain form
572 -34476 39125 3441 -43862 23876 52782 -19562 -15407 51349 12357 -48764 5203 31573
584 31573 -42299 -40759 33194 2360 -50863 11731 47151 -23771 -21768 53719 18903 -43330
596 -43330 15504 46933 -31716 -34438 40170 4860 -56269 5174 39727 -33577 -28374 48830
608 48830 15604 -41997 20505 50354 -27939 -29533 41871 2112 -59195 -339 31296 -40777
620 -40777 -36428 42112 15112 -37789 23706 58155 -13069 -17189 50127 14645 -48532 2355
632 2355 31534 -41211 -44501 29804 3658 -51697 6809 46112 -20087 -23226 50402 22558 -39555
645 -39555 12263 45159 -28281 -36243 34654 8217 -52623 2808 43020 -25070 -29032 46219
657 46219 20565 -41540 10743 47829 -25071 -35555 35383 8900 -53765 -1931 36871 -29750
669b9750n517P4914k2152n8744N5200L8747o9060p759O9798k8268o4584M7824
681F49L4407p1105o551P2162k0860n4717N4553M0688o2867n897O6828k6172o1733
694d0615M3974L1471o5871j0210O6910j8559n3892M7692M1249n8530q767O6814
706D1666j7775n8663M1467L6836o1374j4060O2362j6749o0398M2086L8969n9976
718b5609j0568O7824j2548n7073M4432M1017n8540j4339O2147k0026n9060L8128
730d215L5553n8636r142O3181j3487n0423M3680L7309n4016j0866N7923j7479
742A9382n5227L4288L2208n3246j4970N7134j0071m7808L6477L7810m5473j1842
754b1338N4974r866n1918L0980L3748n0876j7791N3983j0095n2612L2787L8350
$$ plain form
669 -29750 -35267 39647 17495 -41249 13951 52698 -16362 -24121 45677 17409 -47175 649
681 649 35056 -36049 -42600 29562 8702 -46015 8538 49226 -13641 -19538 47290 21118 -40615
694 -40615 3359 34830 -31041 -41251 25659 7100 -46792 900 42149 -16381 -25148 41666
706 41666 23891 -34772 6695 43531 -17843 -31903 30459 13710 -46688 -4602 34367 -25609
718 -25609 -36177 31647 19099 -37974 6458 47475 -11065 -25404 36743 16717 -42343 -4215
730 -4215 31338 -27298 -36440 26741 13254 -37169 6511 43820 -10196 -21062 36861 19382
742 19382 -35845 -1557 30651 -22595 -37565 19569 9498 -38310 -1833 35977 -9496 -21338
754 -21338 33636 23770 -28148 2832 36580 -14296 -32087 21896 11801 -40811 -8024 30326
766C0326m5382j5281N7022m967n0189L1281L5436m6837j6224N1109j1146m9687
778c4539K9112L3810m4974j4278N2088n096m5451K9233L5367m0284j5860M6543
790B5671p556m6504K2055L0639m0081j6621M4962k127m0448K6210L6204l4216
802a812j4769M5627k179m6850J7755L1074l8492k1771M1494p40m1714K1500L6558
815B5681l3248j6702M4838k10m1880J8343L3153l5244j7710L9878J08m1914J6933
828g974L3544l2027j9234L8888L123l8714J6954L3432k8182j8477L7067P28l9810
841b0682J1078K9631k9605k0470L6713N654l4939J4782L4422k3278j9839L4400
853A7867M816l8951P756K9872k6522k1241L3007O786l3858J0991L3646k2111k1277
$$ plain form
766 30326 -15056 -30337 26685 21718 -28471 2810 38246 -8591 -24815 26294 15148 -34539
778 -34539 -5427 28383 -16591 -30869 21219 16123 -29328 -95 35272 -5012 -20872 25671
790 25671 18115 -28389 -6334 24305 -15776 -32397 12565 10438 -30010 -3800 32404 -1812
802 -1812 -16581 29046 26867 -19983 -2228 28846 -9646 -31417 10077 9337 -32377 -10877 25681
815 25681 -7567 -24269 20569 20359 -21521 -3178 29975 -5269 -22979 16899 17007 -24907 -7974
828 -7974 25570 -6457 -25691 13197 16320 -22394 -5440 27992 -190 -18667 18400 19128 -20682
841 -20682 -9604 20027 -9578 -30048 6665 12319 -22620 -7838 26584 3306 -16533 17867
853 17867 22683 -16268 -8512 21360 -5162 -26403 6604 13390 -20468 -9477 24169 2058 -19219
866a9219L3894O195l5270O689L0412k2807k4460L0827P056l5514O813L2287j9696
879b793k1040L1641J2174l3353P209L2800j9378k4953K9493R799l6744K094L0755
892A7704j8128k5206K8809J0801l1616M345L2473j5459k2786K8081J1803l1931
904a1110N71K9493j7454k4380K5952J2693l1660L174L2702j3325k2633K5012J3162
917B2197l1425k571K9339j6818k5361K3913J2991l0223O87L4074j2401k3317K6418
930G503J5235l1063j531L1450j2973k7567K3083J5261l0395m111L1565j1991k6747
943b2281K2114J6481k9301k306L2101r061k5740K3068J7011l0239m275K8157j0359
956E370k8441J9975J8029k8221l389L2477o181k5043K1636J7587k8925p280K8545
$$ plain form
866 -19219 14675 20870 -14400 -7711 22701 -106 -24566 6261 13317 -22197 -15384 16903 -2793
879 -2793 -23833 7808 19982 -13371 -6162 26638 7260 -17693 11800 21599 -15145 -13051 17704
892 17704 -424 -25630 3179 13980 -17636 -13291 19182 3723 -19063 9018 20821 -11110
904 -11110 -10539 18954 1500 -22880 3072 15765 -15895 -12721 19981 6656 -15977 9035 22197
917 22197 -9228 -11799 17540 722 -24639 -726 12265 -17958 -17271 16803 4402 -18915 7503
930 7503 22738 -8325 -9856 21594 8621 -18946 4137 19398 -10997 -15108 16457 4466 -22281
943 -22281 -167 16314 -12987 -15293 16808 7747 -17993 5075 22086 -8153 -12428 15729 5370
956 5370 -23071 -3096 14933 -13288 -16677 15800 9619 -15424 6212 23799 -5126 -12406 16139
969A6139r688k9712K0163K0267k8694n218L2367n138k8315J9610J9716k8745q245
982a5493L0021p406k7197J8935J9784k8334p241L2185o873k8341K0012K0892k7011
995f067q327L1668m334k8286J6250K0365k7353j0725K7781m184k8372J5678K1436
1008A5530k4522p941L0162k185k7137J6224K1564k5015j0925K8287k542k8924
1020a7424J2819K2154k3679j2258K9236N06k8148J4183K2531k3109j2352K9518
1032A3977k461l0266J3845K1597k3767j1897L0159R33k8096J3900K2315k2118
1044a879j3176K6858p15k7824J1931K1589k1459j2574K7610J61k8076J2987K2371
1057A7804k1618j3444K7200K172k6831J0437K3714j8781j4053K3952J566k8388
$$ plain form
969 16139 6451 -23261 -3098 17169 -11525 -16743 15624 10486 -17829 1781 21497 -7248 -15493
982 -15493 14528 7122 -20075 -1140 18644 -9690 -16931 15254 8381 -19960 52 20944 -6067
995 -6067 -14394 17274 12940 -15346 904 21269 -6084 -16809 10972 6788 -21584 -5906 15530
1008 15530 -8992 -16933 13229 11044 -16093 131 21695 -3320 -14245 14042 11500 -17424
1020 -17424 -4605 17549 -6130 -18388 10848 11354 -16794 -2611 19920 -3189 -15541 13977
1032 13977 11516 -18750 -4905 16692 -7075 -18972 11187 12120 -15976 -2076 20239 -1879
1044 -1879 -15055 11803 11088 -16736 -4805 16784 -4675 -17249 10361 10522 -17554 -4567 17804
1057 17804 -3814 -17258 9942 12114 -14717 -4280 19434 653 -13400 10552 12118 -16270
1069a6270Q110K2916j9285j4023K5508M998k5552R496K4141j7579j5692K3328
1081A0096L097k8425O953K2780j6973j4967K4758N624k5688P249K2503j7287j5654
1094a5934K3105M372k5650O151K3316j5582j5718K3403O694k5996N427K2889j7016
1107e39j6510K3068O207k4968N856K3512j5525j6017K2497M983k6246M977K3290
1120A4585j5016j5789K1571P303k2792L833K2353j2834j7388J9811P307k3630
1132a0686K259K1373j2393j6415J9715Q627k2680K436K2081j1469j7710J9093
1144D231Q767k2691j61K3118j1191j7968J9421R805k2414M51K2892j0645j8417
1157a4802J8705J0109k4974J206K3038j1268j7510J9452J0434k3664J310K2524
$$ plain form
1069 -16270 -8160 14756 -4529 -18552 6956 11954 -13598 -4102 20039 2460 -13232 10096
1081 10096 13193 -15232 -8279 14501 -2472 -17439 7319 12943 -12745 -5496 17007 -280 -15934
1094 -15934 7171 11543 -14107 -7956 15360 -222 -15940 7463 14157 -11839 -6412 16477 -539
1107 -539 -17049 6019 12226 -12742 -6886 16626 1101 -14916 7581 12564 -13682 -8705 14585
1120 14585 -431 -16220 5351 12654 -10138 -6305 16048 3214 -14174 5637 12944 -10686
1132 -10686 -8427 12946 553 -15862 3853 12480 -10200 -7764 14317 2848 -14862 4231
1144 4231 12998 -9693 -9854 13264 2073 -15895 3526 13331 -9083 -8632 14260 3615 -14802
1157 -14802 3903 14012 -10962 -9756 13282 2014 -15496 3956 14390 -9274 -7964 14560
1169A4560j1417j7827J6399R979k1176k41K2390q380j7184J7376R525k1571j803
1182i370K0871r096j7977J5879J2121k0412j927K2175n568j9253J4776J1113k0485
1195g153l912K2131p551j8714J6348J3868k1561l149K3508q211k0327J5561J2126
1208A2964k2641k133K3577o890j9340J7753J2302k0745l299K1255p973j9201J5432
1221A061J1281k1659k368K2664p108j8867J6812J1931k1112k541K0424o675j8149
1234a4306J4705J2994j9141k683K1995o732j8400J3760J2582k1014m744K1806
1246A0822o287j9498J3982J3733k0033n038K2480n203j9589J3729J4444k0337
1258f795l589K2553n164j9480J5066J3736k0693n283K2575o850k0560J4407J2386
$$ plain form
1169 14560 3143 -14684 1715 11694 -9482 -9723 12667 4287 -12897 4479 14004 -7567 -9370
1182 -9370 11501 2405 -15572 307 12428 -7984 -9911 12264 6696 -12557 2219 13332 -7153
1195 -7153 -11065 11066 3515 -15199 1149 15017 -6544 -9693 13815 5604 -14723 838 12964
1208 12964 -9677 -11810 11767 4877 -14463 3290 15592 -5153 -8452 12803 4830 -14371 1061
1221 1061 12342 -9317 -11685 10979 3871 -14996 1816 13747 -7365 -9906 10518 3843 -14306
1234 -14306 399 13393 -5748 -8431 13564 6832 -11568 2192 14774 -6240 -10984 10822
1246 10822 4535 -14963 -981 12752 -7281 -12319 10161 4958 -14631 -902 13542 -6795
1258 -6795 -10384 12169 7005 -12475 2591 16327 -4366 -9649 12926 6076 -14484 -77 12309
1271A2309k0797m711K3231o078j8458J3713J4760j9693m053K2482o032j9116J3938
1284A495J1730j9866m549K0445m352j9422J3713J4332j8918m772K1537m591j9005
1297a2223J1706J2688j7012n565K0443l361j8623J1601J3376j9050n760K0555
1309H775m162j9513J2989J4024j7215m651K0333k941j9175J1392J3076j7797o073
1322a0938K0761l353j7879J3140J3755j8598o104K0377n361k0710J0746J3638
1334I474j8392n921K0081j402j5761J1655J4440j6435n071J9173l182j7476R866
1347A049J3275j6814o111J7007j808j8112Q502J3119j6065o790J7852r00j6641
1360a2437R539J3552j3030o797J7484j919j7010R139J2961j5002o980J8164r56
$$ plain form
1271 12309 -8488 -13199 10032 3954 -14504 -791 13969 -5724 -9777 12705 6673 -12443 1495
1284 1495 13225 -6641 -11190 9255 4903 -14519 -806 13526 -5392 -10164 11373 6782 -12223
1297 -12223 -517 12171 -4841 -10406 10037 6676 -11947 -346 13030 -6020 -11780 8775
1309 8775 4613 -14900 -1911 12113 -5102 -9753 10580 7639 -11536 -144 12932 -4865 -10938
1322 -10938 9823 6470 -11409 1731 15486 -3112 -9216 11161 5800 -14910 -4164 9474
1334 9474 -8918 -14839 5242 3840 -11921 -266 14174 -2261 -7332 11841 8659 -8817 1049
1347 1049 14324 -2490 -8601 8406 6598 -11514 -3012 10107 -5958 -12748 5104 4204 -12437
1360 -12437 -2898 10654 -2376 -9173 8311 6392 -10618 -1479 11482 -3520 -10500 7664 6708
1373F708j6620R747J2890j4029o824J6611j593j7424P378J2467j3685p128J6302
1386D800o96j4776Q874J2768j2845o470J6191q01j5939O805J2035j2951o740J5288
1400E543m88j3992P129J1450j0376o474J5263r5j4712N345J1009j1005p710J3636
1414D523Q71j4946L934J2929j0813p429J3908K992j3570N561J2984j0105o465
1427e626J3441Q65j4540M814J0446j0887p961J2218J099j3340N373J2650r034
1440d82p727J3535J666j3198K722R575q059p347J2369K122j2102N278J1629p704
1454B277p619J1321K483j2854J284R805q145p281J0740K630j0965J359R996o457
1468a426p585J0679L400j1472L379J1673o526p976J0692L995j4128K003J0794
$$ plain form
1373 6708 -9912 -165 12725 -1304 -8128 8483 6890 -10534 -3156 9311 -4374 -11502 4800
1386 4800 4104 -10672 -1798 10970 -1875 -8345 7846 7045 -8894 -2089 9946 -3005 -9745 5543
1400 5543 5055 -8937 -1808 9642 -734 -7208 8055 7960 -6752 -1407 9602 -1403 -9113 4523
1414 4523 5394 -9552 -5618 7311 -3502 -10931 2977 5969 -7601 -2040 10944 839 -5626
1427 -5626 7815 8680 -5860 -1046 9400 -1487 -9448 2770 3869 -9471 -4098 8552 -482
1440 -482 -8209 5326 6992 -6206 -3484 6091 -1968 -9315 3054 5176 -6926 -1648 9981 2277
1454 2277 -5342 5979 8462 -4392 -3108 6697 -1448 -8729 2011 4641 -6324 -4965 5031 -1426
1468 -1426 -9011 1668 5068 -6404 -3025 8648 2122 -5854 4838 8833 -5295 -3292 7502
1481G502p980p956R344M831j0845K062J0660m754q160Q994L310j1635l98R819
1495D794n571q884R628M351j0415J174J2232m302q331Q948L940r959l64R768m520
1510B489j0352R079L318j0529O00J0800m441p990Q706N705j0807p68J1636m760
1524B686q687P586M295r709j511R699l615q765Q687N272r026j67J0287l111q548
1539d627P538N174j0907j439Q787m100j0320Q492M686q469n86J0596j449q275
1553d899P667O265r820k640R807m545j0285P694N573j0488r53J1916l084p791
1567e583O822O456r543j909J0347l309j0771O200P133r922j830J0834k235r684
1581f994O796P364r971k370J1339j729j0013O651O594r622k818R155l348r702
$$ plain form
1481 7502 -478 -8434 910 5741 -5104 -3042 7618 2864 -5296 3698 7008 -4627 -5025 4794
1495 4794 -777 -9661 -33 4318 -6097 -4923 7309 3007 -5324 3624 7564 -2395 -2759 7009 2489
1510 2489 -7863 1216 4534 -5995 -5395 5405 964 -7026 1680 7385 -3422 -4190 7446 2686
1524 2686 -6001 1585 5880 -3829 -5340 4359 744 -8021 666 5938 -3088 -3255 7032 3921 -4627
1539 -4627 2911 8085 -2822 -4261 4526 426 -9894 -1402 3284 -5185 -5771 4825 3376 -4899
1553 -4899 2768 9033 -787 -3427 6380 1835 -8450 -756 4817 -5671 -6624 5292 2208 -5583
1567 -5583 1239 7695 -1848 -3757 6590 3281 -7490 -1290 5843 -4079 -5909 4925 2690 -6994
1581 -6994 -198 7166 -2805 -5175 6164 4435 -5578 1073 7667 -1955 -4773 4382 1034 -8668
1595h668O204N919q716j684J2814k200q787P687O817r954l290J0099l863j0178
1609g800N970P106q728k281J0606o73r247O057P680j0497k907J0285k796j0957
1623h182O356O770q820l473J0293K91r943O851Q037q466m111J1215k69j0954N179
1638G74P316r817m632J0360q32j2038N534Q553q643m295J2287r46r196N475P817
1653G717q330m377J0051j119j0328M893O419p278l125J0329o79r553N592Q058
1667H270p685m854R389j261r956K762P648p860l989R496O50p688M909Q045p679
1682A97m549R599l22j0278L895O679o503o334J0121J353r564L244Q504n588o466
1697f012J1141j98r257M070P735p803m825R623k156r891L695Q005p236m890J0452
$$ plain form
1595 -8668 -2464 3455 -5261 -6945 5869 3669 -5118 2569 9386 -568 -3858 6241 2378 -7800
1609 -7800 -1830 5276 -3452 -5733 4873 4200 -5047 1010 8690 -1807 -4714 5571 2775 -8182
1623 -8182 -1826 4944 -3876 -7349 2944 3235 -6708 143 8180 -286 -4397 6818 6549 -4405 774
1638 774 8090 -1727 -6359 4001 3169 -8869 -3335 5218 -3425 -7720 4567 3621 -5575 -100 7717
1653 7717 -613 -4990 5061 3942 -6386 -1493 4926 -2352 -5477 4852 4173 -5380 212 8270
1667 8270 585 -4269 5120 3859 -6097 -3335 4313 -3547 -7536 1960 2610 -5078 -169 7876 197
1682 197 -4352 5247 4925 -5353 -1458 5221 -1282 -7616 2505 3858 -5706 -2462 6042 454 -6012
1697 -6012 5129 4931 -4326 -256 7479 -324 -5149 4474 2318 -7573 -3878 4127 -3109 -7999 2453
1712B453J456q343M913Q179n633n313P935n39r014R86P031o698n016R876J064
1727C337q424K048R120n865o115P774J749q019R50P976m406n122P331J775p504
1742c395K147Q308n715n212P888J900r037K013P221p068n291O988J528q267M33
1757e559Q515m379m375Q313K375o709J034Q895m899p124P169J411r363R18O519
1772B741m331n301P480L517p498J972P626l823n051O019K258p381j842P344m976
1787a246n583O842K912p919R65P902l595n068O415L583q085Q49P363m021n907
1802d593O993K500p763N48P592l661o453P304J439p983R46Q122m737o443P350
1817A161J873q078L78Q214m225m976O768L620o913J630Q342m625n366O040J368
$$ plain form
1712 2453 3909 -4434 479 8658 3025 -2288 5647 5108 -3906 -2920 4111 -2587 -7603 2273 3337
1727 3337 -5087 -3039 6081 216 -5899 1875 3624 -4395 -3445 4531 125 -4997 2334 4109 -3395
1742 -3395 -1248 7060 1345 -3867 4021 5921 -3116 -1103 6118 -950 -6241 747 2275 -5992 -5559
1757 -5559 2956 -1423 -5798 2515 4890 -1819 -785 8110 3211 -3913 3256 4667 -4696 -3778 2741
1772 2741 -1590 -6891 589 4106 -3392 -1420 6206 2383 -2668 3351 5609 -1772 -3614 3730 -1246
1787 -1246 -6829 13 2925 -4994 -4029 3873 278 -4790 1625 5208 -2877 -2028 5335 1314 -4593
1802 -4593 2400 4900 -2863 -2315 5277 1616 -4837 2467 3906 -4077 -3131 4991 254 -6189 1161
1817 1161 3034 -5044 -4666 3548 -677 -5653 1115 4735 -2178 -548 7794 3169 -2197 3843 5211
1832E211q642k00N725m157n572N925L681n914J60Q591j942o149N716L109o676
1847a134o90O395l760n440N138M181p503m14O458k651n888O177L345p661N26P694
1863D773k395o607N723K513p402J4P029l561o693O704L463o784O25P947l465n794
1879c910N387K470p580L96O862l967n175M963N026o595J580N215k319n678N330
1894B005K566p094r64O845l520o660N477M257o800m87Q403k377n345N560M063
1909E929p255m45P543m018p066O209L470q359r52Q388k952o726N779M588p846
1924c713P86P011l213n113O005L138p530m54P276m173n218N653K988o461N34P631
1940E147l436m845N356L173p181k029O732l134o147N266L504n691L92P021j721
$$ plain form
1832 5211 -3431 -3631 2094 -2063 -7635 -1710 1971 -3943 -3783 4808 2866 -3283 2433 5542 -1134
1847 -1134 -1824 4571 811 -4629 509 4690 -2813 -3227 3231 580 -5308 869 4214 -3447 -2921 4773
1863 4773 2378 -4229 1494 4007 -3395 -3381 3648 87 -6606 98 3561 -3223 -2598 5349 1884 -3910
1879 -3910 1477 3947 -3633 -3237 3625 -342 -5517 -554 4472 -2123 -543 4672 2353 -3325 2005
1894 2005 4571 -2523 -3487 3358 -162 -6822 -1345 2912 -3888 -4375 4028 1651 -3694 1866 5929
1909 5929 -1326 -1771 5772 1754 -5312 897 4367 -3992 -4944 3444 492 -6234 -455 4133 -3713
1924 -3713 -2927 4084 871 -4242 1763 4901 -2629 -3083 4193 20 -5198 455 3443 -3018 -2484 5147
1940 5147 1711 -3134 2222 5395 -1786 -3815 2917 -217 -6364 -1098 2406 -3285 -2893 4128 2407
1955B407n276N355K553p362o23O754k940n858M796K996n520l09P766l885n508
1970d654N820L123o615r1O499l134m857N199L585p196o82O088l478n548N443M000
1986C502n420j040O608j234n026M002L835o715j712O724l567n470N070L796n828
2001b475K51O203k241m515L620L794n857j743N146n53n785M016K996n224o25N952
2017B960j329m613M010L468n166q65N072j682n044L125L483n549j838N994p67
2032A259n399L761L535m727j191N881m70n140L665L413n546j391M966r81n522
2047c887K954M014n547q59N078l79m345L583K727m017k230N194p08n335L170L369
2063B782l925j909N650L24m413K304L289m689j238M220j089m961K591L396l482
$$ plain form
1955 2407 -2869 2486 5039 -2323 -2946 3808 868 -4990 -194 2802 -2718 -3027 4739 854 -4654
1970 -4654 1166 4289 -2326 -2417 4082 948 -3909 1290 4875 -2321 -3003 3085 -393 -5941 -498 3502
1986 3502 -1918 -2958 3650 2416 -2610 1392 5227 -1488 -3200 3524 -43 -5513 -443 3353 -2475
2001 -2475 -2224 3979 1738 -2777 843 4637 -1220 -2963 2183 1630 -4155 -139 2857 -2367 -2992 2960
2017 2960 1631 -2982 1028 4496 -670 -1535 3537 1855 -3189 -64 3419 -2130 -3968 2026 1259
2032 1259 -4140 -379 3156 -1571 -2762 3119 2649 -2491 1174 4587 -959 -2350 2616 1635 -3887
2047 -3887 -933 3081 -2466 -3325 1753 1374 -2971 612 3339 -678 -2908 2286 1578 -3757 -587 2782
2063 2782 -1143 -3052 2598 2922 -1491 813 4102 -587 -1825 2395 1306 -3655 -1064 2332 -1150
2078a150l435O710p99l936K105L831m644q39M609O2m027K034L537l681k129L870
2094B118n82n141K144K863k781k052M944J11k752J134M229m301j924L225Q0m906
2110c591J813M237l872r05M445J133m996J861L427l923k038M874j022l832J600
2125g89L913l830k123M349P9m534J879L798l613j594L811N52m338J171M080k791
2141B0k446M371j51l801J539L241k114k585M416O26l310K64L695l446l070M515
2157A764q89l634Q49L441l160j650L435J592l716Q61M458l210k414M408P55m850
2173a960Q74L871l158k343L725J185m108J591L153l036k316M102j33n154J707
2188b000M378k509l136N271L48m583J622L808l284k209M270N86m446J330L538
$$ plain form
2078 -1150 -4585 2125 1326 -2610 -505 3326 -1318 -2157 2452 2514 -1513 521 4058 377 -1752 2118
2094 2118 1536 -3605 -1461 1402 -1379 -3431 1513 1624 -1128 6 4235 -66 -1990 1235 1315 -3591
2110 -3591 -1778 2459 -1413 -2318 2127 3260 -1736 125 3552 -371 -2409 2465 1443 -2389 -789
2125 -789 3124 -706 -2829 1520 1599 -2935 -1056 2742 -871 -2465 1346 1898 -2440 -1269 2811 20
2141 20 -2426 1945 1794 -2007 -468 2773 659 -1926 2490 3116 -194 70 3765 319 -2751 1764
2157 1764 875 -2759 -1910 1531 -1629 -3279 156 1748 -1968 -1107 3351 141 -2273 2135 2890 -1960
2173 -1960 -1086 2785 -373 -2716 1009 2194 -1914 -323 2830 -206 -2522 1580 1447 -3707 -2000
2188 -2000 2378 -131 -3267 2004 2352 -2231 -609 3199 -85 -2294 1976 2562 -1884 -554 2984
2203B984k229k669K823J395m804R55L342k089l011L837J087l861L58M608k570
2218A56k403K908J181l920J98M602k758k677N343M55m726Q46L764k090l123L513
2234A269J103n311M25N043k958l098M931J74l677O30M200l774l183M388J633m511
2250b716J407M151k227k619L282J748n007M82M767l037l551M553J836n452J058
2265a325L768j627l561L730O50m123N40M057k604l750N536J464m253Q92M411l444
2281C61l016L932J585m468O10M275l057k722L583J007m124L69M457k508l879M371
2297G76Q66m145L3N087k313k968M190J685m268R99L095k396l531L722J964n610
2313b814J204L372j030k896K893K359m179k98L908j957l655L612J651l654J98
$$ plain form
2203 2984 755 -1914 909 2304 -2500 -1545 1797 -292 -3303 534 1621 -2240 -1882 2726 156
2218 156 -2247 661 1842 -2078 -1880 2722 -36 -2713 2630 3085 -1641 -795 2969 879 -2244 1269
2234 1269 2372 -2939 -2514 2529 -429 -3527 1404 1578 -2099 -1469 2731 -1043 -4226 162 1795 -2716
2250 -2716 -1309 2842 615 -2004 1278 3026 -1981 -1499 3268 231 -3320 1233 3069 -2383 -1325
2265 -1325 2443 816 -2745 985 1635 -2488 -1948 2109 -495 -4245 1291 2755 -1498 -606 3805 361
2281 361 -2655 1277 2862 -1606 -996 3279 222 -2500 1083 2090 -2034 -1665 2792 284 -3595 776
2297 776 1642 -2503 -2470 2617 304 -2664 1526 3211 -1057 -58 3037 641 -2890 832 2796 -2814
2313 -2814 -1610 1762 732 -2164 729 3088 -1091 -1389 2519 562 -3093 519 2170 -1484 -1286
2328a286L487j496l141L255K379l961p78M426k486l249L167K007l549J58M089
2343C022k285l695K894J746l792KM889l129k010L338J483l138j008M422k450l524
2359c235L217K168m237n1M456j056m095L522K304l563n9L290k274k297J835J695
2375A620l080k49L323j200l022K742J606k535j384L918o36k993K330K547l120
2390a33j488L196p14l416K775K199k943q89L481k27m211L223J977l831o99M018
2406B318j045l218J301K687k696j596M054j512k142J870L243l187j841M149j025
2421A360l851K515J463k418j666L841j387k665L167K319l003n13J938N65l503
2436a838J228L067l557p24K832k37k913J886K974l705q30L178K57l357J668K284
$$ plain form
2328 -1286 2201 705 -2436 819 3198 -763 -1541 2885 399 -2850 317 2324 -1225 -1067 3022
2343 3022 737 -2958 -64 1682 -2110 -2108 2781 -348 -2358 980 2463 -675 -1683 2739 289 -3235
2359 -3235 -18 2150 -2087 -2138 2318 1262 -2833 689 2993 -570 -629 2661 387 -1910 -75 1620
2375 1620 -1460 -1709 1614 414 -2608 134 1740 -795 -2179 1739 1103 -1890 440 2987 -133
2390 -133 -1621 1575 861 -2555 220 2419 -524 -1413 2068 1841 -2370 853 2830 -1001 -1700 2318
2406 2318 1273 -1945 -644 2043 -653 -2249 1805 293 -1849 21 3264 77 -1764 2385 1360
2421 1360 -2491 24 1487 -931 -2597 1244 -143 -2808 359 2678 -325 -838 1100 1665 -1838
2436 -1838 -610 2457 -1100 -1824 1008 771 -2142 -256 2718 -987 -1817 1361 1618 -1739 -71 2213
2452B213k549j323L303l69l328J432K790l596r92L896n98k876J932L138l075j612
2468a614L983p18l353M54L027l657n82M491j184k960J724L428l040j336K853N59
2484B075m147J367L055l823n50L131J19l124J297K088j765j446L092L51m124J776
2500f28K991k362j631L450o22l640J675L164l587j442L828J43l300J802K994k290
2516E45j785L345l09m395J685K348l243o69L096Q30l901K251L177k934j064L406
2532B383o98l340J317K290l359j464L559Q9l195J428L405k914p60L919p74l178
2548a292J298L225l438k627L871K13k987P10K846l013o30L389k78l167K117K138
2564B375k136j216K674n7l834J623L118m812j173M630k56l390J934K623k315m35
$$ plain form
2452 2213 -336 -1659 1644 1275 -2053 -621 2169 -1427 -2419 1477 879 -1997 -65 3073 -2 -1614
2468 -1614 2369 1651 -1702 -1248 1779 -1878 -2460 2031 847 -2113 -389 3039 -1 -1337 1516 2075
2484 2075 -2072 -705 2350 -1473 -2023 1108 1227 -1897 -600 1488 -277 -1723 1369 1720 -2404 -628
2500 -628 2363 1 -1630 1820 1198 -2442 -767 2397 -1190 -2632 1196 1339 -1961 -159 2835 545
2516 545 -1240 2105 1796 -2599 -914 1434 -1809 -2478 618 1448 -2453 -202 2975 41 -1023 2383
2532 2383 1685 -1655 -338 1952 -1407 -2871 688 777 -2418 -990 2415 -499 -1259 2660 1886 -1292
2548 -1292 6 3231 -207 -2834 1037 1250 -1737 -1027 1819 -1194 -1824 1565 1287 -1880 237 2375
2564 2375 239 -977 1697 1640 -2194 -571 2547 -2265 -3438 1192 936 -2454 -520 2103 -212 -647
2580f47K578m50k826N38L493l833k300L666j79k375J942K632r40k667L574M2m003
2597a755J538J832k447j920K939M75l920K588K660k271j438L759n8l462J287K983
2613B790k189k159K490L35l834J714K321j721k134K715K56k404K210K316j735
2628I71k830L448M54k940k00K736k697j869L378P19k920J145K340q97j754L048
2644B132L23l148J88J740k070q58J336J550m452J672L418j602j533K983j5k464
2660h00K98L173k129k354K032P60l589R64K687j627j525K430J327j917L65K532
2676B627j799k074K822l61l112J167J976k356j790K824J141k435L27K853m14k358
2692i62K170J159k079p82K433k634j160J805K96k319M24K717l26j649K125J636
$$ plain form
2580 -647 1931 1481 -1345 -807 2686 -1147 -3447 219 40 -2335 -393 2239 1299 -1368 2206 2248 -1755
2597 -1755 -217 1615 -832 -2752 187 662 -3258 -670 1990 -281 -1719 2040 1982 -1480 -193 2790
2613 2790 601 -1558 932 1267 -2567 -853 1468 -253 -2387 328 584 -1820 390 2706 971
2628 971 -1859 1589 2043 -897 -1097 1639 -1058 -2927 451 1170 -1750 -605 1735 838 -916 2132
2644 2132 2455 -693 -505 1235 -835 -1693 -357 1193 -3259 -1587 1831 229 -1304 1679 1664 -800
2660 -800 -502 2671 542 -1812 220 980 -2609 -1645 1042 -585 -2110 320 1647 -270 95 2627
2676 2627 828 -1246 1576 1215 -1897 -730 1246 -1110 -2900 -76 1065 -1370 -1043 1810 1396 -962
2692 -962 1208 2367 288 -494 1939 -695 -1855 -50 246 -2073 -1649 1068 742 -907 1218 2854
2708B854l525J178J620j913k622K290J029k643k83K880o79j093J867J385k759
2723d14J11K632r92k546K572k02k369r43K277o79k470K402J288j166k73L155j023
2740A360j719J966Q20k343r52J529r96k261J602J113k397J330K323J43k390J603
2756G31K309l046m92J873p35k832J631J347l255N96K761k49j934K277J095k182
2772a05m13K458k6k694J075J094k709m20J949M8k787K245J861k079j69K445J68
2789A941l191K385P03l068k70L064j615k140J017K563k676l71L867Ok525J531
2805A221K158l614j093L112p61l388J611J060k058L9K386K50k426K354K551l343
2821E9o93K946r12k904J125J339k525o27L419q11k414J411K774k780m61K448N19
$$ plain form
2708 2854 -671 507 2127 214 -2408 -118 911 -1732 -2015 865 186 -907 960 2345 -414
2723 -414 -303 2329 1337 -1209 1363 1161 -1208 -2151 126 -553 -3023 -621 667 -499 -772 2383 1360
2740 1360 -359 1607 2427 84 -868 661 -335 -2596 -994 119 -2278 -948 1375 1518 -872 731
2756 731 3040 -6 -498 1375 640 -2192 -561 786 -2469 -1873 888 639 -1295 982 2077 -105
2772 -105 -518 1940 1914 -780 295 1389 -1320 -1740 209 257 -2530 -285 1576 -503 -672 1773 1941
2789 1941 -1250 1135 1838 -1230 -1500 1564 -51 -2191 -1174 1389 -1287 -1658 2209 2215 -310 1221
2805 1221 3379 -235 -1328 1784 1023 -2365 -754 306 -1752 -1713 673 923 -1503 851 3402 59
2821 59 -634 2312 1400 -1504 -379 960 -1565 -2192 1227 416 -1998 -587 2187 -593 -1054 1394 1913
2838A913k842J839J137k912q30K277J31l504J839J524j294r67L036m96j356Q33
2854C28K728k603q70J435p50k943K103Q44j455j034K935P71k962K255K382k326
2870H38j004K338j037k330K38J989k562j504K740J176l012K271K404k486j317
2885a258K957M6k390L03K358k181j296K401r73k348J086K448j580q31L496j83
2901B055l151K033J104j629j266J671l89k134N65J801j849j110L089M09j552J159
2917H06K136k068j722K839q55k553R34J564k119k572L761J028k467J164K343j406
2933H13j359L025n12k878Q46K159k708j690K269K81k596J395L067k036j706L791
2949B161J26k509J114J063j558j849K161m35k019J30J971j482r70L208P96k183
$$ plain form
2838 1913 -929 910 2047 -865 -1695 582 713 -2791 -952 572 -722 -1689 1347 851 -505 328
2854 328 3056 453 -417 1018 268 -2675 -572 272 -1183 -2217 718 1489 -1473 782 3164 838
2870 838 -166 2172 1135 -1195 -957 1032 -1530 -3034 -294 882 -2130 141 2545 59 -1258
2885 -1258 1699 1745 -645 -342 2016 -165 -1461 940 -33 -2381 -1295 1153 -427 -1258 2238 2055
2901 2055 -1096 937 2041 412 -854 817 428 -1706 -1141 660 -1189 -2299 790 1199 -353 806
2917 806 2942 874 -848 1991 1136 -1417 -483 1081 -1038 -3610 151 1179 -1288 -124 2219 813
2933 813 -546 2479 1967 -911 -65 2094 -614 -2304 -35 246 -2350 -955 2112 76 -1630 2161
2949 2161 2287 -222 892 1955 397 -1452 709 274 -1745 -1615 356 -1126 -2096 1112 1908 -275
2965b75P3L018j334k085J393M18k978l28K409j248j128J294J736j387P40K712
2981C030j656j251J893M75l168l94K036j864j753K380M60k049L45L394j540j425
2997a087K485R56k375j4K340k477j427J530K88j989o94K951j771j003J803K728
3013B244j991k17K102j109j959J149Q49k615p2J073k59j928K847R97j730O77J480
3030A538j11k154K807l31k307m53J940j439k316K268J628l299J034K433p43n64
3046f9R90J570k717j33K088j381j654Q11O33j981L14J743p53o66J849J758j591
3063H11n21J126q0j945J542j75k111k37J397r76n07J771P90j773R88K175q44j552
3081a21L37Q15j711n11J465j012k440K611J350j614j32K767o64j293J388J132
$$ plain form
2965 -275 -202 2816 1482 -603 790 1208 -1770 -2098 311 -937 -2065 -771 965 -422 318 3030
2981 3030 1374 123 2016 2491 -677 -1071 965 -899 -2652 -272 188 -1861 -1516 1878 338 -1087
2997 -1087 1398 2354 -21 -35 2305 -172 -1599 -69 219 -1770 -2464 487 -1284 -2287 -484 2244
3013 2244 253 36 2138 1029 -930 219 1068 -1547 -1619 -546 -805 -2733 114 1111 -619 58 1538
3030 1538 1427 -727 2080 1749 -558 -1011 929 -510 -2826 -558 1070 -2229 -1195 1238 495 -69
3046 -69 921 2491 -226 -359 1729 348 -1306 -495 138 -1843 -1529 214 -539 -1205 644 2402 811
3063 811 290 1416 1336 -609 933 758 -1353 -1590 -193 -1169 -1676 95 885 -888 100 2275 1431 -121
3081 -121 216 1031 -680 -1191 274 -738 -3178 -567 783 -831 -963 1804 1140 -153 1235 2367
3097B367k734m19J799r44k119J687Q01k054K29K090P29j985J598N22n37p77J694
3114A947n76k514J113N99j822k09J183J80j672J092K065j520j97L216j383j558
3130e6L95J515k810j294K241o36j888J078K144j364J63K558q70j515J357J155
3146B173k533p38J814p09j781P06Q50k22q32J485N59k074K012J295j746j005J686
3163I40J41k939J436J003j957r19J958O33j893J302J712j101j64J948n26k620
3179a046J491J620k390j667K086nj807O58K032j834J76J370Q03j656J018O83j519
3196A3o02R96q39j763J478J104r50j033K538P24k499J306J879k025r40J916o48
3213F55k119Q29P71j423l91K139K41k394J624K049j265p23J567p15j709Q73R13
$$ plain form
3097 2367 -367 -786 1013 69 -2050 -363 438 -1616 -1387 703 1432 -553 1045 1567 1030 253 1947
3114 1947 1371 -1143 -30 569 -1253 -1462 -279 -99 -1771 -679 1386 -134 -331 2885 1502 -56
3130 -56 339 1854 -956 -2250 -9 -645 -2533 -1455 689 -675 -512 2046 1176 -339 1018 2173
3146 2173 -360 -1098 716 7 -1774 -1068 -218 -440 -1272 213 772 -1302 710 2005 259 -746 940
3163 940 1081 -1858 -422 581 -1376 -2295 -337 296 -1597 -295 1417 316 152 2100 1574 -1046
3179 -1046 445 2065 -325 -1992 94 89 -1718 -1060 972 -862 -686 684 1487 -169 849 1532 13
3196 13 -589 407 -432 -2195 -717 387 -563 -1596 942 1666 -833 473 2352 327 -613 1303 655
3213 655 -1464 -635 136 -1287 -1678 461 702 -1692 -68 1981 716 -7 1560 845 -864 9 922
3230I22j526r55J537L9k111O62K035o25l35J833K72j486k84J853k006p72J061
3247A14M55k592O81K203j600o71J972K95p10L84J779j177k193J409K35j939j68
3264a523K326k267j11J356J271j259O70J129r38j778K490M92k645j70K493k286
3280g50j106J949K07j493q4K315n18q00J654L95j560J76J591j954j180O80R88
3297E10k535J159J567o81j394J881J102j545J000N72j225r44J097L78k905O54
3313a309Q92l38p75J062J165j010M66J018J65j456Q02J154k966M20O75R5k432
3330b372K606j7j483P42J517k37j228R75J271k427J40J417r52j082J436J59j950
3347a485K51J145l50k36J581l83o8J88J201j103j319M57J095k676J99J515k11
$$ plain form
3230 922 -604 -1559 -22 17 -2094 -1432 603 -22 -357 1476 1748 262 -22 1831 -175 -947 114
3247 114 569 -2023 -1342 861 -739 -1410 562 857 147 531 2310 1133 -1060 349 584 -1355 -1523
3264 -1523 803 -1464 -1575 -219 1052 -207 463 1592 654 -1124 1366 1858 -787 -957 1536 -750
3280 -750 -1856 93 300 -1193 -1277 1038 520 -280 1374 1769 209 385 1976 22 -1158 -478 510
3297 510 -2025 -866 701 20 -1374 507 1609 64 1064 1636 411 -533 564 942 -1963 -1309
3313 -1309 -417 -755 -1530 -468 697 -313 153 1171 1336 -120 682 1836 -1130 -710 -35 60 -2372
3330 -2372 234 217 -1266 -524 993 756 -472 503 1774 -653 -513 904 -48 -1130 306 465 -1485
3347 -1485 -1234 -89 -439 -675 906 523 455 643 1844 741 -578 -121 974 -1702 -1503 12 -199
3364a99r57J154R21p33M02Q00k65j430J332K88j167j291J816k126J09P08J268
3381F30r38j9J465oj630J685o0j728O17P50n87j179K1N35l62P0J023K11j263J119
3401C54J677k032l16Q51k96r94N50P70j538r19J912p33n64J525M69m64n62K092
3419A782m10j905O04J674k486o64J392n96p91k34K563j276l71J878M09j835O84
3436D18J427j040j402J429o19j728P05P37o19l87J604P58j474M22J414j616n53
3453e24J377l94j566P78N09j043p64J691L45j323J104O17o37n01J670m15j833
3470i09J481N2j065j037J689r01m63Q25J178j05j107J803K33j671R93m9o10j559
3488a222J081M70k084J392Q99j333J89J471J98j412P78R31j245j1O19j63j864
$$ plain form
3364 -199 -1156 -2 919 186 588 1388 1123 -307 1025 1313 146 -1145 671 -1455 -1346 -638 630
3381 630 -308 -327 1138 1132 -498 1187 1127 -601 16 766 179 -1000 -979 -444 -806 -736 287 498 -765 354
3401 354 2031 -1 -317 534 238 -756 -206 564 -974 -1893 19 -714 -1278 247 716 252 -310 1782
3419 1782 1372 -533 71 1745 -741 -1405 -13 -609 -1400 -1634 929 -347 -718 1160 1569 -266 418
3436 418 1845 805 -597 832 213 -1515 -810 -73 -692 -1079 525 1283 -191 231 1645 29 -524
3453 -524 853 459 -1107 -329 180 -863 -1627 64 409 -914 190 807 170 -331 1339 924 -909
3470 -909 572 624 -441 -1478 211 -690 -1153 -328 850 745 -362 1441 1674 3 996 947 337 -1222
3488 -1222 -141 329 -1755 -363 536 -797 -608 863 1061 -351 427 1358 113 102 721 558 -1306
3505a306Q46J651k168%Q30R78j399J148P03p62j041K105l20k016O14J660k253
3522g30n77J329l13j316Q67K532k242r0J548M36k062J471N74j934q57J392O5j550
3540a457J293P08p76j402K518M03j636J348J86p44j304J001N24k150M28J930j321
3557d51j208J708R08r05n81K123j137j094J956n96j656N75J262j308j864K252
3573a6k92n71r2J969j182m03J428K67r06l62J700j580j621J558l31p73r0K152
3591H55j210j66J360R07j831Q61J391j819j193J57J497k197j43J630m10m35P86
3608D0J157j652P8J642n60j007N89L48j332K39Q52k94j749J333M46j137k1J909
3626H81P0o32J03J171j791k55J451j016j084R73L62j329P39J117l97l68Q9J373
$$ plain form
3505 -1306 -460 1191 -977 -977 -147 831 -568 580 1283 521 -520 1585 1265 -751 -137 1523 -730
3522 -730 -1307 22 -291 -1607 -740 1792 -450 -540 1008 1444 -618 853 1427 -507 -1364 28 93 -1457
3540 -1457 -164 544 -232 -1634 884 1287 -349 999 1185 441 -863 138 662 -1488 -1060 870 -451
3557 -451 -1659 49 957 52 -529 1594 457 -637 1319 723 -933 -358 904 -404 -2268 -16
3573 -16 -308 -879 -971 998 -184 -587 841 1108 202 -160 1540 -40 -1661 -103 -434 -1207 -1297 855
3591 855 -355 -521 839 1746 -85 776 2167 348 -845 -688 809 -1388 -1531 99 -311 -746 40
3608 40 1197 -455 -377 1265 705 -302 287 635 -697 -458 394 100 -1649 -316 130 -1007 -1028 881
3626 881 951 319 422 1593 -198 -453 998 -18 -1102 -129 233 -1096 -357 760 363 -5 84 1457
3644A457p95p41J134j310k76O7J222r35j024J044J10o89N03J093j016j48Q00N45
3662A041j549J180k30p53k71O7M95p27Q08R54j770O4K196q18j040O5J939r75j968
3681a292J791o98k13k90J243q99K82j94J57l04L35J191o69m5M26k4j028p7P8m63
3701f93j35R46l91r60J322J461j543j82K033j363j035J27J033j726L94P09o94
3718f97j83O66R74j16n64P6L53j17n27R15o78j279J159M85j553J038k2k32j76
3737d78R06o06o2Q29J61n58o39N17N58j228PO19m66n0L65R70j270K01J776n28
3757A024j403J079m39q04oJ579j849n2R1J59r2O56O35m96p78J204K76p49K0P47
3777H02q40j074L07Q40o77M76r3m65J613j192J219j209P06O55j386o1Q51n95j235
$$ plain form
3644 1457 662 -79 1055 -255 -531 -464 758 -177 -1201 -157 -47 -736 -233 860 -156 -304 496 1041
3662 1041 -508 672 442 -311 -582 -515 -20 -747 61 1015 -755 -691 1505 687 -353 -288 1651 676 -1292
3681 -1292 499 -199 -412 -702 541 -358 -76 -270 -113 -417 -82 1109 440 395 821 797 -231 -308 -230 -693
3701 -693 -828 118 -273 -1233 89 1550 7 -175 1858 495 -540 -413 620 -1106 -712 -3 -697
3718 -697 -880 -214 760 644 80 156 509 392 -135 780 102 -1177 -18 467 -1086 -48 -70 -302 -478
3737 -478 428 -178 -240 589 750 192 -447 70 628 -600 -593 26 -440 -490 -125 845 -425 -224 1552 1024
3757 1024 -379 700 261 -543 -549 1030 -819 -871 -780 -621 -713 -57 578 82 -696 508 784 35 55 802
3777 802 -38 -1112 -805 35 -642 -166 -259 -724 889 -303 916 -293 413 1068 -318 -379 472 -123 -1358
3796a358P48Q41j162n84J058J297p55k10P67m37l10R11k85p78l95J613q23j589
3814a451K095j47j071N88O08j290q9J913K45j911R34P56j256q93J353m18M8j070
3832a056J740j661L53J066J46j344Q92P94n29j207J639m45p23n23R25l59m78J096
3850C26L18j093N81P85j001m07O28L59q12L84M73l71j072O76J23l36J77J173o25
3869B86p70L22J296j066n86P78k82j424J802o6r93L89J173j054M62J091j201l97
3887b40J003o94k28l32J41N51j047M04J435j286m61J346n98j47L37Q93j033j40
3905i6N6O13j223J84Q77o84p35K51J611j819J05J104J81l19J80M95p39q43R14
3924A13L96r53L30k01o07N81J077l55q89P95L62q59J27M52j2j220N63M88j242
$$ plain form
3796 -1358 -610 231 -931 -1515 -457 840 85 -125 642 205 -105 806 521 -257 -652 961 138 -1451
3814 -1451 644 497 -574 14 622 -668 -757 1156 1401 -510 424 1180 -76 -969 384 -34 14 -1056
3832 -1056 684 -977 -624 442 588 -756 136 930 401 -806 833 388 -335 -858 67 -292 -770 326
3850 326 644 -449 132 917 -84 -491 137 496 -316 68 541 170 -902 -226 -103 -439 -262 911 286
3869 286 -484 -162 1134 68 -518 260 -22 -1446 356 290 -703 -314 859 -195 267 1358 157 -240
3887 -240 763 69 -159 -491 -350 201 -846 -442 993 -293 -754 592 -6 -153 184 1077 44 -96
3905 -96 -40 573 -650 -466 411 -273 -1008 -757 854 -965 -860 244 425 106 286 781 42 -801 113
3924 113 509 -444 -114 -315 -922 -341 736 381 -508 287 649 -210 -83 369 357 -863 -300 188 -1054
3943a054J040q53J502j157P82K49m51N68Jj97p21L46n9k38j329J681R88j153p22
3962g77J382p20L32O19k96j222N32P21m28o40Q85N5j009m0R60p88P87M22o69m26
3982c20Q56Q15j073p90P25J6m90r4M27n52o9R25l37n00k18O78M72j185J285M7
4002F18j044N00O25j393j13J261j000K01K04J046j081l64M37M48l66J18L39L5
4020D71r44J33O38j365N61J329o99o40J048q66J197p09K28K0p61L39J67K2p17
4039e48J112o35l70O18j7k5l96P96k84p40R73j302O44O6Q1R44j195Q58q71O7P4
4060a50K77l48j59J146r5j148m42J081L92q43J279J1j789Q94N9J26q70M37N30
4079C88o7l4K00k78j078J161p33N94j015J530m77p70j46P94q16J296m0r6l95K33
$$ plain form
3943 -1054 -14 -867 635 -522 260 509 58 626 627 430 -291 55 -4 -242 -1571 110 1098 -55 -777
3962 -777 605 -115 217 836 540 -682 -150 571 143 -497 388 443 -566 -606 354 -434 353 775 106 -320
3982 -320 536 1351 278 -512 213 229 -261 -355 72 -480 -549 376 39 -461 -679 -1 471 -714 571 618
4002 618 -426 74 699 -694 -807 454 -546 -345 -141 905 -176 -540 -103 345 -21 97 436 471
4020 471 -473 -340 298 -1067 -506 823 124 -516 532 -334 863 154 382 402 -359 -20 147 169 -548
4039 -548 564 -71 -441 177 160 135 -261 535 251 -489 484 -818 -174 -108 -27 917 -278 580 -291 -224 -150
4060 -150 127 -221 -380 766 671 -477 -919 162 554 -289 990 1001 -788 106 165 291 -579 -142 388
4079 388 321 287 487 209 -869 292 -441 153 -862 668 191 -579 -725 69 -747 549 509 413 18 251
4099B51L49j052J46M99o13j28R58l07m06N52o46Q58r70J030l68l32M99N85k92
4118F13q40J093k66n86k10M05m96l03J265q92L59k15R07o73o86O30lm3l29K72
4138BJ1m02L90j26K74p34J016k43k7j7N0p85j3J026k79p04J96J132m09k78P63
4159H43m26j310Q42O65k87l66K67J64o21N02K29j050J96j52O39n29R72k50o85
4178c57K99J86k80k32J104p96p01R81K48j45K2j10Q0J60p44Q73q68R1P17j61m45
4199g8J45J34K45o00r61J718j652M62J322p5j660J224j19j89L44O55p94j69N86
4218E38P2j39r21Q42l31k22N68k55n93Q8q8K90k59Q04J52J01j048R17r89k3J04
4239c92O25q19O81O61q94n36J80L51K83q68J046n60n13M61O13n54r5P82n39M1
$$ plain form
4099 251 600 -452 -306 193 -420 -548 410 103 -303 249 -397 461 -509 521 153 -179 320 905 613
4118 613 -227 866 600 14 -196 209 -287 -590 675 -217 142 -73 834 161 -525 105 102 59 -270 2
4138 2 13 -389 1 -125 149 -585 431 188 161 144 194 -591 -604 422 143 -561 -365 767 358 80 843
4159 843 417 -893 -51 614 327 -39 228 392 -229 273 502 -548 -352 -504 135 -394 578 328 -357
4178 -357 -58 128 -152 -384 720 -76 -777 204 452 307 329 219 299 459 -285 588 -280 -189 528 367 -78
4199 -78 67 201 446 -154 -1115 603 -1049 -587 735 660 -1000 224 105 -84 260 915 121 -48 538
4218 538 610 471 -450 392 61 -161 407 152 -441 -353 -441 -151 -410 394 546 647 -401 516 -473 -496 -392
4239 -392 233 -586 95 756 -138 -674 -494 -143 140 -728 318 -242 -755 -294 319 -235 -330 452 -87 -46
4259d6N57n2o18J68M21o88n63R06L56J2n84L0k45L67L00N30j157R62l57m31k1
4280a53J07L54p72N4O82m95J33m88J129j46j026Q81L70j388J216J02o71K50J89
4299C28m20k17J26P4L87j95P1j48K49L94k38m01n80J156K37p49J29o69J50N6N99
4320C39l01L55n80n7J037j082Q63l53k82m97J356q69K31k51M94k96q4N50o54J93
4340A12R7p21J83R37k31j06q36J291o35n19N81m7J168j473N49K37o88RK57M63
4360F28q06N27p92k53O92J48L84o41J067j055l86N72O64j121j62K52P62m0l70
4379G0n0m21j48Q79j06l31l94J408l81o41J15R5n03J82P90n50J47r92J346q31
4399c16k14R63k56k45l26k7J91Q4O54r3q93N24L48j018P84n61J49R3n09R28n40
$$ plain form
4259 -46 511 459 -159 9 430 -258 -821 85 441 453 -131 -101 -346 21 321 851 -306 656 299 -132 -153
4280 -153 -46 308 -464 -410 272 -223 -90 -578 551 405 -621 260 630 -758 458 560 -111 139 328
4299 328 -92 -309 -183 -109 278 83 154 6 255 649 411 10 -570 586 823 74 203 -466 -316 -260 339
4320 339 38 393 -187 -244 793 -289 574 221 -61 -558 798 -71 160 -91 403 107 23 573 -81 112
4340 112 209 -512 -329 608 377 271 -565 726 91 -428 153 106 1274 -199 350 587 -101 -92 165 628
4360 628 -178 349 -443 -696 -4 144 528 -113 954 -101 -487 85 749 -372 -534 -282 480 440 70
4379 70 20 -401 -549 330 224 -107 -501 907 526 -115 0 95 -408 -226 564 14 161 -831 515 -316
4399 -316 -530 433 177 -68 -394 -421 -230 -146 508 415 -478 46 394 -624 160 -401 -252 -159 -668 260 -280
4420b80k51O70M1P0j24N7p64N60p3n55L14M34R59n49q79j64R45J38n2o38p94P19
4442b16L45O9m65J01L74l23L5KK03k33L17O1j708J670M18j20n00j62M54j39K6
$$ plain form
4420 -280 -531 139 180 250 126 183 -581 -21 -94 -649 -335 99 1058 509 -370 -534 411 549 497 -141 -935 -216
4442 -216 129 198 -267 -166 208 -115 -80 -78 125 -108 209 270 -1438 232 650 530 30 -132 322 183 209
$$ [...]
8191I6
##END NTUPLES=NMR FID
##END=
