##TITLE=1H_UK-26_10
 CD2Cl2
 64 sc, 
 20.12.2023
##JCAMPDX= 6.0         $$ Bruker NMR JCAMP-DX V2.0
##DATA TYPE= NMR FID
##DATA CLASS= NTUPLES
##ORIGIN= UXNMR, Bruker Analytische Messtechnik GmbH
##OWNER= root
$$ XWIN-NMR		Version 3.5
$$ Wed Dec 20 13:51:09 2023 Russian Standard Time (UT+4h)  she@DPX200
##.OBSERVE FREQUENCY= 200.1313
##.OBSERVE NUCLEUS= ^1H
##.DELAY= (6, 6)
##.ACQUISITION MODE= SIMULTANEOUS
##.ACQUISITION SCHEME= undefined
##.AVERAGES= 64
##.DIGITISER RES= 18
##SPECTROMETER/DATA SYSTEM= spect
##.PULSE SEQUENCE= zg30
##.SOLVENT NAME= CDCl3
##.SHIFT REFERENCE= (INTERNAL, CDCl3, 0, 15.7039)
##AUDIT TRAIL= $$ (NUMBER, WHEN, WHO, WHERE, WHAT)
$$ ##TITLE= Audit trail, XWIN-NMR		Version 3.5
$$ ##JCAMPDX= 5.01
$$ ##ORIGIN= Bruker BioSpin GmbH
$$ ##OWNER= she
$$ F:/spectra/data/she/nmr/H-F/1/audita.txt
$$ ##AUDIT TRAIL=  $$ (NUMBER, WHEN, WHO, WHERE, WHAT)
(   1,<2023-12-20 13:49:42.37 +0400>,<she>,<DPX200>,
      <continue with go, POWCHK disabled, PULCHK disabled
       configuration hash MD5:
       00 E9 B6 7A A2 85 ED C7 34 08 36 98 17 FE 4E 26
       data hash MD5: 16K
       7F E1 E8 ED A1 49 82 16 53 67 F7 04 D7 30 45 33>)
$$ ##END=
$$ 
$$ hash MD5
$$ EB AD D0 F3 02 1C E6 DC 0A B2 05 E2 51 AB 9E 4C
##$RELAX= 
##$RELAX= 
##$RELAX= 
##$RELAX= 
##$RELAX= 
##$RELAX= 
$$ Bruker specific parameters
$$ --------------------------
##$DU= <F:/spectra>
##$EXPNO= 1
##$NAME= <H-F>
##$PROCNO= 1
##$TYPE= <nmr>
##$USER= <she>
##$AMP= (0..31)
100 100 100 100 100 100 100 100 100 100 100 100 100 100 100 100 100 100 
100 100 100 100 100 100 100 100 100 100 100 100 100 100 
##$AQSEQ= 0
##$AQ_mod= 1
##$AUNM= <au_zg>
##$AUTOPOS= <>
##$BF1= 200.13
##$BF2= 200.13
##$BF3= 200.13
##$BF4= 200.13
##$BF5= 200.13
##$BF6= 200.13
##$BF7= 200.13
##$BF8= 200.13
##$BYTORDA= 1
##$CFDGTYP= 0
##$CFRGTYP= 5
##$CHEMSTR= <none>
##$CNST= (0..31)
1 1 145 1 1 1 1 1 1 1 1 1 1 1 1 1 1 1 1 1 1 1 1 1 1 1 1 1 1 1 1 1 
##$CPDPRG= <>
##$CPDPRG1= <>
##$CPDPRG2= <>
##$CPDPRG3= <>
##$CPDPRG4= <mlev>
##$CPDPRG5= <mlev>
##$CPDPRG6= <mlev>
##$CPDPRG7= <mlev>
##$CPDPRG8= <mlev>
##$CPDPRGB= <>
##$CPDPRGT= <>
##$D= (0..31)
0 1.2 0 0 0 0 0 0 0 0.06 0 0.03 0 0 0 0 0.0002 0 0 0 0 0 0 0 0 0 0 0 0 
0 0 0 
##$DATE= 1703065536
##$DBL= (0..7)
120 120 120 120 120 120 120 120 
##$DBP= (0..7)
150 150 150 150 150 150 150 150 
##$DBP07= 0
##$DBPNAM0= <>
##$DBPNAM1= <>
##$DBPNAM2= <>
##$DBPNAM3= <>
##$DBPNAM4= <>
##$DBPNAM5= <>
##$DBPNAM6= <>
##$DBPNAM7= <>
##$DBPOAL= (0..7)
0.5 0.5 0.5 0.5 0.5 0.5 0.5 0.5 
##$DBPOFFS= (0..7)
0 0 0 0 0 0 0 0 
##$DE= 6
##$DECBNUC= <off>
##$DECIM= 32
##$DECNUC= <off>
##$DECSTAT= 4
##$DIGMOD= 1
##$DIGTYP= 9
##$DL= (0..7)
0 120 120 120 120 120 120 120 
##$DP= (0..7)
150 150 150 150 150 150 150 150 
##$DP07= 0
##$DPNAME0= <>
##$DPNAME1= <>
##$DPNAME2= <>
##$DPNAME3= <>
##$DPNAME4= <>
##$DPNAME5= <>
##$DPNAME6= <>
##$DPNAME7= <>
##$DPOAL= (0..7)
0.5 0.5 0.5 0.5 0.5 0.5 0.5 0.5 
##$DPOFFS= (0..7)
0 0 0 0 0 0 0 0 
##$DQDMODE= 0
##$DR= 18
##$DS= 0
##$DSLIST= <SSSSSSSSSSSSSSS>
$$ [...]
##$SUBNAM2= <"">
##$SUBNAM3= <"">
##$SUBNAM4= <"">
##$SUBNAM5= <"">
##$SUBNAM6= <"">
##$SUBNAM7= <"">
##$SUBNAM8= <"">
##$SUBNAM9= <"">
##$SW= 18.0517328524113
##$SWIBOX= (0..15)
0 0 2 0 0 0 0 0 0 0 0 0 0 0 0 0 
##$SW_h= 3612.71676300578
##$TD= 16384
##$TD0= 1
##$TE= 0
##$TE2= 300
##$TE3= 300
##$TEG= 300
##$TL= (0..7)
0 120 120 120 120 120 120 120 
##$TP= (0..7)
150 150 150 150 150 150 150 150 
##$TP07= 0
##$TPNAME0= <>
##$TPNAME1= <>
##$TPNAME2= <>
##$TPNAME3= <>
##$TPNAME4= <>
##$TPNAME5= <>
##$TPNAME6= <>
##$TPNAME7= <>
##$TPOAL= (0..7)
0.5 0.5 0.5 0.5 0.5 0.5 0.5 0.5 
##$TPOFFS= (0..7)
0 0 0 0 0 0 0 0 
##$TUNHIN= 0
##$TUNHOUT= 0
##$TUNXOUT= 0
##$USERA1= <user>
##$USERA2= <user>
##$USERA3= <user>
##$USERA4= <user>
##$USERA5= <user>
##$V9= 5
##$VALIST= <valist>
##$VCLIST= <CCCCCCCCCCCCCCC>
##$VD= 0
##$VDLIST= <DDDDDDDDDDDDDDD>
##$VPLIST= <PPPPPPPPPPPPPPP>
##$VTLIST= <TTTTTTTTTTTTTTT>
##$WBST= 1024
##$WBSW= 4
##$XGAIN= (0..3)
0 0 0 0 
##$XL= 0
##$YL= 0
##$YMAX_a= 417577
##$YMIN_a= -434246
##$ZGOPTNS= <>
##$ZL1= 120
##$ZL2= 120
##$ZL3= 120
##$ZL4= 120
##$ABSF1= 10
##$ABSF2= 0
##$ABSG= 5
##$ABSL= 3
##$ALPHA= 0
##$AQORDER= 0
##$ASSFAC= 0
##$ASSFACI= 0
##$ASSFACX= 0
##$ASSWID= 0
##$AUNMP= <proc_1d>
##$AZFE= 0.1
##$AZFW= 0.1
##$BCFW= 1
##$BC_mod= 2
##$BYTORDP= 1
##$COROFFS= 0
##$CY= 11.3945322036743
##$DATMOD= 1
##$DC= 2
##$DFILT= <>
##$DTYPP= 0
##$F1P= 15.7292609196834
##$F2P= 12.9074282941183
##$FCOR= 0.5
##$FTSIZE= 0
##$FT_mod= 4
##$GAMMA= 1
##$GB= 0.15
##$INTBC= 1
##$INTSCL= 1
##$ISEN= 128
##$LB= 0.24
##$LEV0= 0
##$LPBIN= 0
##$MAXI= 10000
##$MC2= 0
##$MEAN= 0
##$ME_mod= 0
##$MI= 1.114404
##$NCOEF= 0
##$NC_proc= 0
##$NLEV= 6
##$NOISF1= 3.799351
##$NOISF2= 2.8
##$NSP= 1
##$NTH_PI= 0
##$NZP= 0
##$OFFSET= 15.70392
##$PC= 1
##$PHC0= -24597.69
##$PHC1= 19.05272
##$PH_mod= 1
##$PKNL= yes
##$PPARMOD= 0
##$PSCAL= 0
##$PSIGN= 0
##$REVERSE= no
##$SF= 200.130013532006
##$SI= 16384
##$SIGF1= 3
##$SIGF2= 2
##$SINO= 400
##$SIOLD= 16384
##$SREGLST= <1H.CDCl3>
##$SSB= 0
##$STSI= 0
##$STSR= 0
##$SW_p= 3612.71676300578
##$SYMM= 0
##$S_DEV= 0
##$TDeff= 0
##$TDoff= 0
##$TI= <>
##$TILT= no
##$TM1= 0
##$TM2= 0
##$TOPLEV= 0
##$USERP1= <user>
##$USERP2= <user>
##$USERP3= <user>
##$USERP4= <user>
##$USERP5= <user>
##$WDW= 1
##$XDIM= 8192
##$YMAX_p= 0
##$YMIN_p= 0
$$ End of Bruker specific parameters
$$ ---------------------------------
##NTUPLES= NMR FID
##VAR_NAME=  TIME,          FID/REAL,        FID/IMAG
##SYMBOL=    X,             R,               I
##VAR_TYPE=  INDEPENDENT,   DEPENDENT,       DEPENDENT
##VAR_FORM=  AFFN,          ASDF,            ASDF
##VAR_DIM=   8192,          8192,            8192
##UNITS=     SECONDS,       ARBITRARY UNITS, ARBITRARY UNITS
##FACTOR=    0.0002768,     1,               1
##FIRST=     0,             0,               0
##LAST=      2.2672688,     0,               0
##MIN=       0,             -434246,         0
##MAX=       2.2672688,     417577,          0
$$ Real data points
##PAGE= N=1
##DATA TABLE= (X++(R..R)), XYDATA
0@%%%%%%%%%%%%%%%%%%%%%%Kl9J00j27J28j28J28j28J45j91K35k53K66l05L53
37A86l88M33m85N33n92O57p32Q14q87R79j086J196j320J449j590J761j948K152
55A132k385K649k957L316l747M267m915N745o834Q357j0629J4322k1332L8954
69B5943j48922k37937N58804N6781m56397K14799M04506l53267j86626M34803
79C12487l147m16784J75086K77411l39603j94816L17975m5671l69627J24399K63236
90A00946k38258j30640L33373N9899k81734J21441K80712k03621j82643K74511
100A33986L5771l34030O1689K62365k19957j94893K97622O9515l04257J08302
110h3887L01965j98532j70205L02874M2443l23866Q5898K49829k30410j76124
$$ y = [0, 0, 0, 0, 0, 0, 0, 0, 0, 0, 0, 0, 0, 0, 0, 0, 0, 0, 0, 0, 0, 0, 0, 2, -37, 63, -64, 64, -64, 64, -64, 81, -110, 125, -128, 138, -167, 186, -202, 231, -254, 279, -313, 344, -388, 426, -461, 518, -568, 628, -692, 757, -833, 928, -1020, 1132, -1253, 1396, -1561, 1755, -1992, 2275, -2640, 3105, -3729, 4628, -6001, 8321, -13011, 25943, -122979, -360916, 197888, 254669, -201728, 13071, 417577, 64310, -122316, 312487, 309340, -107444, 67642, 345053, 5450, -189366, 128609, 82938, -286689, -162290, 100946, -137312, -267952, 65421, 125320, -156414, -34973, 245739, 42118, -140525, 133986, 169757, -164273, -102584, 159781, -60176, -255069, 42553, 112068, -192189, -83887, 218078, 19546, -150659, 152215, 194658, -129208, -43310, 206519, -23891, -200015]
120b00015K71010K7466k87939J00061K42799j84445j30261K64164L7671k50373
130a09862Q5638K10745j76610j42025K17367K5113k43381O4307J99400j55681
140b4989j29810K15657M6034k19869O3744J98435j48403j37916J92559K8314k27690
151a43934N1473J89785j37356j11899K10583N4998j88926P2906J90141j30636
161E7135j16971J75499J8101k14872K9181J46387j42789j27609J62524L7309j74005
172a50110N8116J81113r2451r2528J73002N1896j73907L2480J52800j13316j23254
183i6159J44218L7287j78654K8414J56126j02116j10523J55234N0788j63187L7958
194d0614J57061r5798j08431J37488L1790j68854J9206J35225r3047r6341J40260
$$ y = [-200015, 70995, 98461, -189478, -89417, 153382, -31063, -161324, 102840, 140511, -109862, -24224, 186521, 9911, -132114, 85253, 110366, -133015, -68708, 130692, -24989, -154799, 60858, 106892, -112977, -49233, 149202, 799, -137117, 55442, 83756, -143934, -92461, 97324, -40032, -151931, 58652, 113650, -75276, -2370, 187771, 57135, -59836, 115663, 133764, -81108, -51927, 94460, -48329, -175938, -13414, 23895, -150110, -91994, 89119, -3332, -95860, 77142, 129038, -44869, -12389, 140411, 27095, -96159, 48059, 85346, -93308, -64894, 91232, -10884, -121407, 33827, 84615, -78572, -40614, 116447, 20649, -87782, 49706, 81496, -87358, -68152, 67073, -25974, -122315, 17945]
205A7945N1741j32083L8066J41928p6634r7056J13153L4305j49249J834J18913
216F2863p3097r9703J10099N6359j21893J2981J35073n1207r5832J05648N6163
227I7454j31342p593J19121o4353j13251R2747N4151j26515L23J33924m0775r0844
239g6953J07607O8099j14292k899J16957n3351j07791P8510M6392j22633j5600
250g5954J12300m1423r1594Q7360O8406r6841m654J17585k8743r1234P0583N6994
262H2785j06103k9511R6396l3771r6764O6632O6647q5882j3740J13053j4357q8078
274d2693O3779O3707r6037l4822R2320k6258j00214N4979O5778q5613k3465J06963
286C8424o344q4536O2900P3653q3495l0718R5314k0095j01425M4882O1941q9326
$$ y = [17945, 69686, -62397, -24331, 117597, 40963, -56093, 57060, 91365, -57884, -56050, 62863, -10234, -109937, 162, 56521, -65372, -52391, 82682, 31475, -64357, 41291, 97454, -33888, -41481, 77640, 13287, -99964, -7217, 46934, -79581, -79258, 54666, 13891, -76953, 30654, 98753, -15539, -18438, 98519, 45168, -62623, 15887, 62279, -60354, -75954, 36346, -5077, -96671, -9311, 59095, -37746, -42400, 75185, 46442, -44792, 25791, 82785, -23318, -52829, 43567, 9796, -86968, -20336, 46311, -39571, -53311, 59742, 45385, -42693, 21086, 84793, -11244, -46066, 46254, 19996, -80218, -25239, 40539, -45074, -68539, 38424, 32080, -52456, 10444, 84097, 602, -30116, 65198, 45103, -56322, -11440, 50501, -38825]
298c8825l6840R7214o524q6285N5842P7287p1456k9480R7948l533r1085M1322
310E585O4159q2482m5270Q2881q046r2611M2187P5882o4463l0403R8762R016q4838
323b9641L5924O9863p4694n1486P6013m237r1937L1900P5865o0748l7196R3063
335C2689J3534q2675L5094P5731o4872m9164Q1567N164r5032K2491P0797o6119
347b0795n2492Q1916J5491q3044L3654Q4801n1537m4740Q5505J4128r0980J6186
359a1907P0465o6092o0444P5338J6192q4984K2918Q5630m6375m7906Q1486K5784
371F0105q4411J6069P4939n4645o2521O7122J6277q8429J0440P8326m4102n1755
383f2585P7323L3784p5553J5056P9616m4718o0809O2069K1477q6804J032P3930
$$ y = [-38825, -75665, 21549, 15025, -71260, -15418, 61869, -9587, -39067, 58881, 55348, -35737, 5585, 69744, -12738, -58008, 24873, 16827, -75784, -33597, 42285, -22178, -52581, 46181, 55197, -29641, 6283, 76146, 1452, -50034, 25979, 21742, -70195, -38295, 37570, -23178, -60374, 32689, 46223, -36452, -1358, 74373, 9501, -39663, 41904, 47068, -47964, -25473, 45324, -20795, -73287, 8629, 24120, -58924, -25270, 59531, 7994, -36746, 48759, 62887, -28093, -11907, 58558, -7534, -67978, 7360, 23552, -61432, -38514, 47116, 741, -47165, 34321, 60105, -24306, -8237, 66702, 12057, -50464, 16658, 32935, -55494, -45054, 33272, -10830, -62585, 14738, 48522, -27031, -11975, 67641, 22923, -37886, 24183, 45660, -41144, -40112, 33818]
395C3818m1866n6783O9344L4190p2811J0531Q1832l6602n8850O4465K9799q2478
407b5411l232P1045m0663o5559N8318L3506p5160L031Q3179k5302n5251O4873
419B3374M0260p4620m185P1528l6269o9274N1442L1311p6474o176P6799k3636
431D080n7733O1127M4402o5700k957P2273k7699o6176M5491L1674p3979j3572
443d8769O9715j9734n8473N4204M6731o0468o835P3406j7515o2762M4334L8576
455E2410o6881j9015O5360k0869o5990M2764M1747o2284j2280P3560r017n6398
467c6893M6622M7533n9918j9256O4334j8580o8472L2823M1090o0653j8649P1694
479B1675n220n5407M3319M9984n3266k2365O4159j1021o8262K9815M3315n8885
$$ y = [33818, -8048, -64831, 4513, 38703, -34108, -23577, 58255, 21653, -37197, 27268, 57067, -25411, -28643, 42402, 1739, -63820, -5502, 28004, -47156, -44125, 39054, 13752, -41499, 23374, 63634, -10986, -15171, 56357, 20088, -49186, 2256, 33567, -42907, -49083, 27716, 4080, -53653, 7474, 51876, -13824, -16781, 55492, 27793, -38383, 7108, 38782, -35197, -48769, 20946, 1212, -57261, -3057, 43674, -16794, -23629, 49777, 32262, -30500, 13834, 52410, -14471, -33486, 31874, 11005, -54985, -12221, 29526, -32758, -45038, 28522, 19505, -36893, 9729, 57262, -2656, -21912, 42422, 23842, -44630, -11807, 29283, -31370, -50019, 21675, 16455, -38952, 4367, 54351, 1085, -21280, 42879, 31858, -36404, -6589, 36726, -22159]
491b2159k6266O3110l589o0341L5908N1711m7929j9812O7033j616o2250K9267
503C067M4838n5987l0309N8558m605o2827K9691N1105m6577k1244O3956K795n7850
516b5389K7179M6876m9705l0529N5255l904o3494K0571M8271m5213k8223O0241
528A1936J0368n4300K5922N7579l9398l1028N6230N000o6371J2527M5806m7608
540a3337l8437N6270J0504n9309K3049N8859l7932l1007N9564J0472o2622J4631
552i295M9249m3844l7702N4320Q927o0283J8753N4982l7175l1511N8352J1364
564C6137n7385J7173M8213m1531l7216N1054O817o0660J1612N1415l5021l4354
576d3746N3120J6710n2535J5361N4208k9820l7255M8282J3138o1915K987N0421
$$ y = [-22159, -48425, 14685, 11096, -49245, -13337, 38374, -9555, -29367, 37666, 36050, -26200, 3067, 47905, -8082, -38391, 20167, 15562, -47265, -17574, 33531, -13046, -34290, 29666, 32461, -25389, 1790, 48666, -1039, -31568, 23687, 19783, -43711, -23140, 25131, -20082, -48305, 11936, 22304, -31996, -6074, 51505, 12107, -18921, 37309, 42309, -24062, -11535, 34271, -13337, -51774, 4496, 15000, -44309, -21260, 37599, -333, -31340, 28224, 38696, -23926, -9295, 39954, -3890, -41592, 12728, 21655, -38628, -19875, 35107, -2068, -33579, 24773, 36137, -21248, -4075, 44138, 2607, -34609, 16445, 23262, -37398, -25786, 25629, -9392, -43746, 9374, 26084, -26451, -11090, 43118, 13298, -23957, 24325, 37463, -24452, -21465, 28956]
588B8956l7342m1420N1335K0418n3736J3284O0754k8476l8295N0439J6976o2732
600a9839K973N0682l7592m3843N0468J7355n9336J2357N8237l0917l6635N4743
612A8653J8746n5240R754N2920l3898m0728M5550J3426n9027M558N0248l0662
624e700l6698N0631K0060n1241Q644N3482k8686m0180M3845J6047n6583K173N0731
637B6525k7068l9868M5497K2804n2207O615N5410k4212l8766M5463J9550n7264
649a7521p26M8987l1366m4797M3129K1318n3363O525N6893k0871l7429M6735K3205
662D0719n2993l66N0424k8899m4136M0159J9871n3677J757N2964k3121l9487M5342
675H557K2924n0765M422N1974k5294l9927M0102J9363n4715j23M7066k4942l8555
$$ y = [28956, -8386, -49806, 1529, 21947, -31789, -18505, 42249, 13773, -24522, 25917, 42893, -19839, -16866, 33816, -3776, -47619, 2849, 20204, -39132, -26775, 31462, 545, -36090, 18653, 37399, -17841, -8087, 44833, 10935, -29793, 15757, 29183, -29844, -25286, 24962, -5700, -42398, 8233, 28293, -22948, -14304, 39178, 10492, -29688, 14157, 30204, -26379, -24206, 26525, -543, -40411, 5086, 27890, -24317, -17702, 37708, 13496, -25270, 20193, 39743, -17521, -18247, 30740, -626, -45423, -2294, 19024, -34339, -27814, 29079, 8208, -29221, 17514, 40719, -12274, -12640, 37784, 8885, -35251, 4908, 24779, -28898, -27141, 25823, 2702, -36785, 8557, 31481, -19284, -14862, 37112, 11818, -28109, 11993, 31356, -23359, -23482, 23584, -1358, -39913]
688c9913M0951K2453m6116M046N1719j8928l7372L8446K0285m9992l617M3836
700B5798k2274m1334L5107K3190m5052Q2N0484j3909l5953L5881K4195m5610o868
713a6263M4421k0075m2935L2472K4497m4884l397M8259j4319l7656L6780K4463
725C1363m3068l253M5576j7949l8170L1039K1378m5237n014M1892j7526l5343
737c4312L2668K3992l7724j972M3557j1043l3943K8359J9753l8837r322L7202
749A8378j4414l5193K6915K3431l4649m731M1254p336l3463K5465K3770l5609
761f182r533L6652j0655l7433K2494K2529l5581o498L9566o510l2117K7248K5202
774B9182l3946p797L6756j0709l5508K0394K0574l2731r514L5395p236k9161K1598
$$ y = [-39913, 1038, 23491, -22625, -18579, 33140, 14212, -23160, 15286, 35571, -14421, -18038, 25798, 3524, -37810, -2703, 20487, -24565, -24483, 26001, 12092, -23861, 12020, 36215, -9395, -16263, 28158, 8083, -34852, -2380, 22117, -22767, -26164, 22095, 7776, -29880, 6900, 31363, -11705, -14958, 30618, 12669, -25501, 5538, 26916, -18321, -23335, 18557, 1031, -34312, -1644, 22348, -15376, -17348, 26209, 15166, -18777, 9582, 29335, -9502, -18824, 18378, 3964, -31229, -4314, 19117, -15532, -20263, 20991, 13655, -19808, 5657, 29427, -6182, -15715, 20937, 10282, -27151, -4657, 17872, -17709, -24207, 15359, 8849, -23268, 3980, 29182, -4764, -12561, 24195, 13486, -22022, -1628, 18946, -13785, -23299, 12096, 4860, -24301, -2703]
787b703K3702k8045o303L2368m413l0014J8833K0485k9167j0670K9898o249l0792
800b3070J4699K2657k4120j0292L2937n6k6883J5964K2842k5849j3081K6759k312
813A0195l1782J3344K2698k4495j0395L1324J899k6389J3605K3684k2858j3160
825a2330K6226j597k9134R864K0221k1401j1642K6299K515k5741J2010K2705j8733
838g38j1982K5283K548k6170Q087K0845j8774j5063K2382J516k5008P515K0918
851A1359j5075j2546K5325M957k2397P346K1578j6594j6682J9833L188k5556L918
864a1346K1700j4296j4269K2766P960k1712M873K1773j3583j5232J8579N260k3648
877a1175K275K0579j2726j6290K0338Q218k1930L136K2680j0180j6064J8866O911
$$ y = [-2703, 20999, -7046, -13349, 19019, 14606, -15408, 3425, 23910, -5257, -15927, 13971, 7722, -23070, -8371, 14286, -9834, -20126, 12811, 12755, -14128, 1836, 24678, -1171, -14252, 12507, 10195, -21587, -8243, 14455, -10040, -20435, 10889, 12788, -13601, 4, 23688, 830, -12330, 13896, 12299, -16835, -6971, 13250, -8151, -19793, 6506, 9021, -16720, -4710, 17995, -738, -12720, 12563, 15111, -11059, -2972, 17873, -901, -15964, 6418, 7934, -17074, -9559, 11359, -3716, -16262, 9063, 14020, -8377, -1031, 20547, 3953, -12729, 7104, 10292, -15264, -11346, 10354, -3942, -18211, 4555, 12515, -9197, -4324, 17449, 3866, -11366, 7213, 12473, -11175, -8900, 11679, -1047, -17337, 3001, 11219, -10711, -7575, 15105, 4925, -11139, 7727, 14638]
890A4638k1800J73J9294j1754j7315J7364Q205k0325J237K1388p387j5860J8388
903F246Q592k0293j551K1224q602j8295J5475Q746k1424k241J9864q031j7081
916a7371J7237J2576j8209p05K2073p023j6850J2854Q783k1489l116J8669o887
929E42j7770J4779J3453j7136k063K1385o634j7850J3258J0724j9609m333K0570
942I316m346j8105J2691J3445j8987m055K0249m537j8375J3344J3665j7715o047
955i457K0806m738j9237J0800J3162j9499n933K0836l146j7143J2513J5386j5854
968a504n820K1343k837k0543R657J2541j9785p464K0599l662j8716J2686J5443
981A1938j6502n247K0741j549j9692J0544J3996j8165p701J9630m10j9346R557
$$ y = [14638, -7162, -6989, 12305, 551, -16764, 600, 8805, -11520, -10283, 11105, 3718, -12142, 6246, 14838, -5455, -7006, 14218, 5616, -12679, 2796, 11542, -9882, -12123, 7741, -290, -17371, -134, 12442, -5767, -6472, 15601, 8578, -8272, 4582, 13365, -8124, -11240, 7429, 542, -17228, -2449, 11004, -6132, -8195, 13190, 6556, -11294, 1964, 12688, -6921, -11254, 9316, 4970, -13135, -444, 13001, -5986, -10041, 10208, 5671, -12704, 640, 14305, -3410, -9457, 11349, 6611, -12626, -1826, 11336, -8163, -14096, 6740, 3594, -13549, -1036, 14350, -1504, -7324, 14019, 11182, -9361, 296, 12837, -6948, -14412, 6187, 2525, -16191, -3505, 11938, -4564, -9811, 10930, 9381, -10311, 233, 14229, -3936, -11637, 7993, 7583, -11763, -2206]
994b206J5047j6398p757J9533q22j8988R446J5134j5210p862J8941p52j9741P730
1008c905J5414j5151r865J9511J521j8598Q639J5978j3417r768J7921J451j9659
1021i928O361J6131j4822j0927J9401J166j9627P500J6179j2920r131J8918J997
1034A0298j8914O678J5392j5534j0535J7110Q57j8576O917J6765j2145q832J8525
1047H006K268j8319O185J5150j3559j0585J6219K888j8154M575J7237j2638j1064
1060a1791J6302K968j8114L319J7203j0406j0431J6325N072j7117K672J6571j0621
1073A952j3386J4906N150j7754K576J7380r863j0462J5594M626j7943J631J5819
1086A0226j0135j2892J3978N492j6162K367J7924r107j1653J5027N645j6316J119
$$ y = [-2206, 12841, -3557, -11314, 8219, 7397, -11591, -2145, 12989, -2221, -10083, 8858, 8106, -11635, -3905, 11509, -3642, -13507, 6004, 7525, -11073, -2434, 13544, 127, -9641, 8280, 9731, -9928, -3567, 12564, -2258, -13185, 6216, 7382, -12245, -4745, 11434, -1486, -10617, 8301, 10298, -8616, -1938, 13454, -2080, -12615, 4495, 5352, -13224, -6307, 10458, -1687, -10519, 8006, 10274, -8045, -1860, 13290, -269, -10854, 5365, 8253, -9901, -5326, 11911, -727, -11791, 4511, 7479, -10635, -7316, 9887, -519, -10950, 5375, 10447, -6670, -3998, 12573, 1952, -11434, 3472, 8622, -9132, -6556, 10824, 961, -9501, 6093, 10719, -7224, -5593, 10226, 91, -12801, 1177, 6669, -9493, -7126, 10798, 1691, -9962, 5065, 10710, -5606, -4487]
1099d487J5529r216j2079J3851N525j6898J847J5623p840j2301J2667O535j6227
1112g471Q76J5675p133j1390J2443P533j6116O3J5360o944j3012J2225O277j5698
1126g312N47J5558o616j1420J2361O064j4644j212J5652o050j2924J0217P876
1139H097j4256j314J6106n006j3285J1382P978j4060k390J5613n231j3437J0807
1152A004P995j5001k146J5737m344j3667J0694R739j4965j470J4306m669j3289
1165a0076J0336Q278j3491j862J4527l026j2752R687P271j2937l627J3974k689
1178C613j3008Q297R734j1690k705J2632k104j3804Q320Q106j3088k473J3833
1191E663k062j2657Q979J1093j3442m693J4699k595j4547R224Q686j1933m097
$$ y = [-4487, 11042, 1826, -10253, 3598, 9123, -7775, -5928, 9695, 1855, -10446, 2221, 8756, -7471, -6595, 9080, 1947, -9443, 3000, 10533, -5583, -5520, 9840, 2896, -10116, 2109, 8386, -7312, -6765, 8793, 2177, -9243, 3118, 9182, -5462, -6674, 8978, 2928, -9996, 221, 8097, -6159, -7473, 8633, 3627, -9658, 1724, 9702, -4358, -6748, 8865, 3634, -9803, 1004, 8999, -6002, -8148, 7589, 3245, -10422, 272, 10011, -4954, -6424, 7882, 3213, -10076, 260, 8538, -4953, -6815, 7712, 4686, -8066, 1621, 8892, -4045, -7672, 6302, 3613, -9395, -1098, 8636, -3054, -5759, 6873, 4769, -9035, -715, 7391, -5697, -8170, 5663, 3601, -9056, -77, 11016, -2426, -7119, 7580, 4985, -9562, -338, 8348, -3585, -7682]
1204g682J5014j368j3975Q466R510j3333m992J3907l077j2936Q506R937j1821
1217c844l651J4408j327j3074P378Q523j1643l501J3401j686j2461P564R806j1710
1231a817m396J3491j515j3922O182R349j1538n337J3368n91j2443O481J0977j0557
1245b268m914J3002m88j2608O916J0628j1480m329J3282j334j3342P252R285j2189
1259b587n983J3164r83j3036O424J0153j0884m944J4150p91j1677P326Q123j0539
1273b084m602J2717q42j2715O000J0085r446n270J1920J26j2015N354R629j1168
1287b311n174J1699j033j1664N524R841q866n933J2082J168j3003O327R820r584
1301a107n550J1438M63j2685O372J0075r115n513J1401p80j1800M716J0101r956
$$ y = [-7682, 7332, 5964, -8011, 455, 9965, -3368, -8360, 5547, 2470, -10466, -1960, 7977, -3844, -7495, 6913, 5586, -7488, -110, 8413, -3230, -6731, 6670, 4984, -7477, 87, 9893, -1817, -6213, 7278, 5763, -8159, -1977, 7372, -4166, -9503, 3865, 3274, -9169, -2688, 8289, -2268, -7182, 5820, 5332, -7276, -360, 10268, -1212, -5541, 7741, 6407, -6935, 317, 9602, -2587, -8570, 4594, 3611, -9425, -3001, 7152, -3732, -8676, 5474, 4683, -6994, 332, 8455, -2084, -6686, 6031, 5189, -7526, -1526, 8559, -887, -6157, 5763, 5889, -6126, -772, 8857, -2311, -7485, 4214, 3181, -8483, -2959, 6882, -1984, -7917, 4165, 5333, -7670, -1343, 8477, -1107, -6657, 4781, 5244, -7441, -1069, 9006, -109, -5622, 5779, 4999, -6801, -2085, 8016, -1940]
1315a940n012J1902M71j2235N378R169r625p241J1525k01j1352N222J0503p679
1329a115m985J2701P43j0720L937R443r715o672J0567l05j0873L095J0185p961
1343a675n458R772O80r618K889R256p917n319J1196L54r807L648Q983p027n888
1358e931J0464J008j0400L186R460o101o237R237K071j1726K157Q173o771o497
1372g907Q171K952j0295K877R723n987m969R402K454j0405K985Q242o016o657
1386e430P705K024r605K650P233n285m149Q501J642q595J668P781n816n870O638
1401A092K947r254J328P729n466m522O701M410q566J345Q714m899n570O264L236
1416E489q626N83Q408m650o806P066K692q522N32P763l745n198O688L431p610
$$ y = [-1940, -6952, 4950, 5421, -6814, -1436, 7733, -1892, -9133, 2392, 2191, -9161, -3939, 6564, -1115, -6100, 6601, 7344, -3376, 561, 10004, 289, -6383, 4184, 3879, -6994, -3899, 6286, -1675, -7133, 2639, 3319, -6299, -3410, 5846, -2071, -7390, 3806, 4160, -5647, -1999, 6984, -43, -5931, 4533, 5541, -4859, -1673, 7787, 1686, -4551, 4686, 6757, -4969, -2812, 5361, -1410, -7907, 264, 3216, -7079, -4202, 5521, -466, -5435, 3967, 6421, -3984, -999, 7243, 1227, -5430, 2275, 4299, -5306, -2656, 4577, -708, -4857, 3644, 5286, -3309, -1641, 6140, 324, -5546, 1092, 4039, -5215, -3887, 3842, -1624, -6146, 555, 4965, -3601, -2256, 6458, 1559, -4011, 2253, 5489, -3137, -2554, 5854, 1204, -5602, 1464, 4156, -4366, -3834, 3929, 184, -5014, 1674, 5105, -2505]
1431b505P20P214l718p095N134K583o483O71O615k561m206N650M253o598q42O908
1447E740k567o925L720K279o150j672P309j112o095N458M517o941L5N911j818
1462A689n399M343M390o622k41N680j664o091L722M185o030k141O905j467m463
1477c204M641L700n394k627N875j831n893K424L957n693o80O473N01o218N163
1492A194M455m507j613M535n27o358K213M413o387k676N998N82n972L346N547
1507D243m851j884O537j175n383K728L965n524k517N953q33n536L066M371m724
1522a564j878N830M17o445L571M884l775l400M801m61o113K299M300m079k995
1537d608O161K2m407K256M866l513k525O205l12o739J117M487n091m024N525J736
$$ y = [-2505, -1785, 5429, 1711, -5384, -250, 2333, -4150, -3479, 3136, 575, -3631, 2019, 6272, -326, -1168, 5740, 3173, -3752, -32, 2247, -3903, -5575, 1734, 622, -5473, -15, 4502, -2439, -2404, 3507, 1689, -3710, 633, 5023, -1599, -1840, 3840, 2176, -3915, -193, 3992, -2038, -4179, 2726, 1259, -3204, 1437, 5137, -257, -2884, 2991, 1160, -4733, -2309, 1648, -4045, -4725, 1748, 2249, -3969, 1194, 5649, 1142, -471, 4064, 3537, -2821, -608, 3805, -2582, -5258, 740, 1322, -4650, -1304, 4243, -608, -2492, 4045, 2870, -2513, 215, 4180, -1344, -3861, 2092, 1259, -4277, -1211, 3160, -1564, -3442, 2388, 2805, -3640, -69, 4815, 1040, -2360, 2441, 1980, -4133, -1834, 2466, -1613, -4608, 1553, 1575, -2832, -576, 4290, 777, -1748, 4457, 4145, -2594, -1477, 3010, -2081, -6105, -580, 1156]
1553A156n414K623O347l601k321N112J019o795J284M353n536l441N552Q95n173
1568c940J445O314l739l662O695J230o974K067N353m573l089N258J435p659J956
1583a883N397m849l258N980N46n716L079N023k968l579O284o83o045M61N175m976
1599b012l767N841J904m631K114N868l130l603N172N24q189J318N431m133m379
1614e672N239J761n387M46P066k849m049N415K921o626K368M953l935m692N089
1629B048J048o526N32N340l867l801N769J949o057J062O596k583m010M766J784
1644D050o823P53M782l986l335O572N47n485K067N928l579m058N044J713o062
1659a872l03N857m001n255M879J703l877O65N930j981m204M691K732o199l09M377
$$ y = [1156, -4258, -1635, 4712, 1111, -1210, 3902, 4921, -1874, -590, 3763, -1773, -5214, 338, 1233, -3940, -2495, 3819, 80, -3582, 3113, 4343, -2631, -564, 4789, 216, -2873, 2385, 3820, -3839, -1883, 3514, -1335, -4593, 1387, 1933, -3783, -704, 4319, 1351, -2228, 4056, 3373, -2672, -2211, 2964, -2012, -5779, 62, 1966, -2665, -551, 5317, 2187, -1416, 3756, 4280, -3909, -2591, 2840, -1293, -5672, -433, 1328, -4059, -3613, 3453, 604, -3445, 1970, 4891, -1735, 633, 5586, 1651, -3041, 2048, 3096, -3430, -2898, 2442, -1425, -5226, 543, 2492, -3565, -2503, 4093, 1510, -2500, 2266, 4050, -2773, -2020, 2762, -1224, -4559, 2013, 2560, -2925, -858, 5070, 1491, -2567, 2477, 4190, -1872, -2175, 3682, -319, -5574, -695, 1008, -2869, -2204, 3726, 1745, -2459, 2232, 4964, -1235, -1544, 2833]
1675B833k682n938N212K764m984o61N941k043m148N587K241m204o51N780l036
1690B011m813M445J442o417L35M899l444m353M576K113m493J678N441j307m241
1705b128N705J975n954p38M835k885n126L932K096m706N1N782k052m213L824K042
1721B440n396o15N714l062l591L788K705l931n95O991j902m010L895K634m532
1736E33j071M436j940n282M101Q21n109j075N403k376l688L998L686m220O13N223
1752D053r96n002M749J557n626q32M232k287m160L020K744l677n88N642r55l241
1768a367K899L424m696j023L504j748m264K045L049n293o92M335N33m453M078
1783C31K984m510o21N100j584m479L301L433m718r53M482p15m299K926K743m355
$$ y = [2833, 151, -5787, -575, 2189, -2795, -3456, 2485, 442, -3706, 1881, 4122, -82, -733, 5047, 2011, -2802, 1643, 3085, -3332, -2997, 1902, -1542, -5895, -1319, 794, -3699, -2021, 3420, 2113, -2128, 3577, 5552, -402, -1140, 3695, 810, -4316, -384, 1712, -2994, -2943, 2839, 787, -3426, 398, 2440, -2956, -3571, 2143, -919, -4510, -722, 1983, -1948, -2543, 4448, 2546, -1464, 2431, 5065, 533, -538, 3898, 1958, -3324, 777, 1598, -3511, -4586, 817, -1559, -5247, -1249, 2437, -1783, -1170, 4053, 3057, -1945, 2804, 4361, -1265, -2097, 2135, -152, -4312, -1292, 1452, -2225, -2813, 2829, 1874, -1367, 1532, 4956, 260, -763, 2741, 993, -3271, -1226, 1823, -3470, -4162, 173, 706, -3747, 331, 3315, -1195, -1816, 3284, 1700, -2779, 522, 3955, -763, -1716, 2766, 2051, -2248, 678, 3421, -934]
1799i34j587M304n64m566J956L497m673j086M758j537m869M549L320l371r04N416
1815C709j66l664L247K333m793j074K828j913m720J469K028l138J30M135L63k994
1831b220K644L571l844j370M587r59n218L435K304l370k110M167j2l786J772L175
1847B766l966j257M775j154l389K919K434m680q44L485l24m534K458L975m305
1862a641j219N577j74m586L264K728m925r67L452q62m744L605K030l784l02M290
1878A742O20l959L282K370l870k337M342j627m121K173K257l107j268M538n84
1893D51l259L922K702l769N7K673O01m879J771K435l556k115M085l43m187J728
1909a683K689k286j070M204o88l229K410K900l922j039L951r07l872J703L831
$$ y = [-934, -2521, 1783, 1219, -3347, -1391, 2106, -2567, -3653, 1105, -432, -5301, -752, 2568, -803, -1707, 3709, 3543, -121, 3126, 5459, 666, -408, 2420, 507, -4213, -2744, -716, -3854, -3724, 411, 774, -2220, 424, 3995, 151, -1219, 3368, 2409, -2809, 626, 2930, -440, -2550, 1617, 1605, -2181, -409, 2766, -1200, -2457, 2318, 1164, -2225, 694, 3128, -1552, -2396, 1089, 765, -3769, -1311, 2664, -1641, -2860, 2717, 2543, -2043, 1221, 3949, -976, -1943, 1509, 647, -4097, -492, 1538, -2246, -2548, 1742, 2362, -1597, 1685, 4055, 185, -2152, 2190, 563, -3558, -1385, 872, -2235, -3503, 1035, 451, -2808, 1114, 3816, 47, 104, 2777, 3378, -1501, 270, 2705, -851, -2966, 1119, 776, -3411, -1683, 1006, -1280, -2350, 1854, 1166, -2063, 347, 3247, -675, -1714, 2237, 1330, -2542, -839, 2992]
1924B992m742k04L557K39m432L723J921l721j202L466j622l806K320K594l682
1939b599r2L901r2k950K459L697l070k133L745j474l724J758K344l334j296M541
1955A681r70l682K750K594l110j603M412q2l870J819L638l624j668L635n21l647
1971b248P45L438m301o26M972J75l677J853L296l290k010L061j78m635K443J782
1987H00k533q29L970k32l016J701L153k683k315M137l59m888K128K682k514k054
2003b852M077p4l785K043L568l344j435M394j33m273J136L549l075k379L625K5
2019A067l515K131K748l004j321L471M93m014J427L589k679k372L425J43l507
2034a918M78K731k946j152L564J623m341J658K756j357k275K645O13m128N63K992
$$ y = [2992, -1750, -1954, 1603, 1842, -2590, 1133, 3054, -667, -1869, 1597, -25, -3831, -1511, 1083, -2599, -2691, 1210, 1118, -1832, 627, 4324, 1254, -879, 2866, 1392, -2332, -574, 1770, -1564, -2860, 1681, 711, -2971, -221, 2373, -737, -2340, 2072, 1990, -1880, -61, 3577, -47, -1715, 1920, 1399, -2248, -1503, 1935, -2366, -2992, 1980, 2155, -1522, 331, 3627, 337, -1673, 1388, 1210, -3425, -982, 800, -1733, -2562, 1408, 1176, -1840, -139, 3014, 331, -1984, 2153, 1794, -3094, -966, 1716, -798, -2852, 1225, 1151, -2634, -591, 2977, -367, -1802, 2592, 2459, -1814, -678, 2871, -204, -2583, 1042, 1067, -2448, -317, 2431, -573, -1894, 1577, 2070, -1944, -517, 3072, 393, -1979, 1446, 1589, -1918, -1440, 1291, -1655, -2807, 757, 2380, -1961, -303, 2453, 1096, -1179, 1466, 2079, -2049, -1486, 1506]
2050A506k188j506K980J22j721L35K716j292j988K310N63l792N39L099j441k140
2066a898K666K40l119Q47L019j704k136K972O16k589N62L206k640j723L239J42
2082A700l296o63L146k264j640L104J775k575L53K947j392k321K672J54l312k67
2098a879L140k493j014L116P14k861J204K612k072j018O61K110k989k43K826j716
2114I8k410K540Q58k762N14L580k483j464K014J014j920o41L243j923k072K045
2130B31N94j898j88K289j140j918K884O84k022o0K077k93k422K513O92l281m53
2147a711L416j465j874J487J225j619o87K801l15k592K187J428l431n47K603n73
2163C33j994J852J251j997o51K768o05j855J494J422k488p34K644p33k887J791
$$ y = [1506, -682, -2188, 792, 914, -807, -472, 2244, 952, -1036, 1274, 1837, -1955, -1416, 1683, 242, -1898, 768, 1008, -2111, -1264, 1755, 51, -2085, 887, 1503, -1086, -524, 2682, 42, -1681, 1558, 1700, -1596, -2259, 887, -1377, -3017, 87, 1862, -713, -360, 2587, 1195, -1126, 1546, 1700, -1612, -1879, 1261, -1232, -2246, 870, 1584, -1277, -73, 2539, 467, -551, 110, 2220, -769, -1012, 1814, 98, -2312, 228, 1086, -1676, -1162, 2418, -65, -1529, 485, 1499, -421, -1062, 2181, 258, -1814, 231, 825, -1073, -1261, 1028, -112, -2030, 854, 1538, -484, -544, 1533, 1240, -1182, 1331, 2023, -1258, -1711, 1705, 240, -1634, -147, 1078, -541, -1228, 1573, 1258, -1334, 853, 2281, -1150, -1697, 906, 333, -1661, 191, 1442, -555, -1206, 1562, 957, -898, 596, 2018, -470, -1204, 1440, 707, -2180, -389]
2179c89J658k108m70L521j841k578J385J945k294o75M499j298k898K051J373l120
2195a239l01K638j618j510J028K278j996o4K037m3k551J277J717k313j034K338
2211F44l87k491J561K121k204j54L469j426k906J840R47k452K42K620o28k267
2227a471J685K154k916m01J698Q46l428J318J729k558K67K909j206k634K753J226
2243A971k725k24J935Pl414K407J632k836J030K646j635k244J588J885k788k95
2259a060K106l66k763J664K147k847n74K742K18l277J312J453j486n76K754M26
2275A873l399R44L549k824j439L096n71l080J622J777k811m58J952J103l136J161
2291f41K572k524j051L171m07k552P19K481k799j066M272j556k198J547K801l011
$$ y = [-389, 1269, -839, -1309, 2212, 371, -2207, -822, 1123, -1171, -1846, 2653, 1355, -1543, 508, 1881, -1239, -1540, 1098, -520, -2030, -1002, 1276, -720, -784, 1253, 1210, -1341, -64, 1653, -660, -1694, 644, 257, -2234, -673, 1448, -756, -910, 2559, 1133, -1773, 67, 1014, -1438, -1196, 1424, 796, -1471, 214, 2368, -548, -949, 749, 1595, -1833, -515, 1214, -1344, -1077, 1832, 626, -2008, 745, 1971, -754, -978, 957, 964, -2450, -43, 1589, -1247, -217, 2429, 794, -1450, 138, 2023, -765, -1060, 1046, 680, -2083, -419, 1728, -1119, -1693, 1049, 1267, -2010, -698, 755, -731, -1307, 1447, 1873, -1526, -582, 2967, 143, -1296, 1800, 1229, -1851, -229, 1548, -1263, -1721, 231, 1334, -1802, -641, 1931, -593, -1644, 1527, 1120, -1432, -713, 1768, -1031, -2097, 2175, 619, -1579, -32, 2769, -242]
2307b42j343L008o22k524J156J851j866j082L103L27k595Q31J968k646j083K453
2323F94K33l383J915K560k215j388L273M57m393J431K138k133j480L884q01k903
2339b111K715J352k768o43K491M5l412J030K391k101j453L278j20j979Q18K620
2355B153k333n41K021k09k392J094J651j242r80J981j82k397J037J821k017j636
2371b171L155J07k290M64L451k108j926J898M21j411m35J934j898r76K305P42
2387A262k420M30K195l02k686K002Q05l284P39K245r65k343K762O28k253m36M131
2404B510k676j334K590L95k168o57K958k279j203K334J402k830J7L134j957j646
2420a410K698o5k039K06J442q26j684K362P48k765q9K159j140j231J608R62j942
$$ y = [-242, -1585, 1423, 801, -1723, -567, 1284, -582, -1664, 1439, 1766, -829, 2, 1970, -676, -1759, 694, 927, -2456, -541, 2019, -196, -1584, 1689, 2146, -2247, -816, 1322, -811, -2291, 1593, 792, -2111, 604, 1956, -812, -1455, 1036, 1081, -2331, -1301, 1090, -1011, -2464, 814, 694, -1285, -467, 2153, -180, -721, 1300, 1091, -1301, -207, 1444, 202, -778, 1203, 1021, -1376, -339, 1482, -535, -2171, 984, 1091, -1199, -735, 2716, 608, -1318, 580, 1001, -410, -845, 1089, -809, -1785, 520, 1262, -1158, -728, 1467, 1165, -1521, 481, 1286, -1998, -1259, 986, 21, -2322, 440, 1068, -1185, -1621, 2510, -166, -1500, 1090, 1485, -683, -1340, 1618, -661, -1864, 470, 1872, -958, -941, 2193, 236, -1410, 1288, 1223, -816, -610, 832, 6, -1678, 684, 1432, -1333, -1422, 737, -403, -1634, -26, 936, -1006]
2437a006Q7L181j801j178J701J035k958m33K618j070k762K574J429k964N64K634
2453A651q51j431J921J375l450J4K149j427j892J340J007j353M8K996j198k417
2469a518J875O65j573p50K594j315j613K132K93j638j86J742l80k409K615J086
2485A620k262K76K573j524j335J525R83l189l10L026j847j754J775J720j848j59
2501g30K504q68k006J706J839l035M3J822r74k558K457N70k041l69L558j737j275
2518a094K846R9j645r47K460j541k108K019O38k422m02L593j383j564K145J294
2534A988j912r40L198j278k743L247M24l352k01K316o42k293J863J468k834M45
2550a246L266j606q30J079J535k811j143L199k058k373K616J581k805Q2L428J6
$$ y = [-1006, -919, 2262, 461, -717, 984, 2019, -939, -1372, 1246, 176, -2586, -12, 1417, -1547, -983, 1651, 800, -631, 1290, 2665, -785, -771, 1378, -49, -1941, -601, 406, -947, -899, 2097, 899, -1518, 357, 1022, -551, -1301, 1293, -22, -1635, 497, 790, -848, -1034, 708, 328, -2081, 534, 1620, -642, -366, 2207, 683, -652, 873, 1856, -1333, -1643, 1383, -464, -2218, -443, 1277, -571, -730, 1774, 906, -1100, 606, 2445, -590, -547, 1275, 301, -2257, 200, 770, -1271, -1640, 1918, 181, -1094, 1752, 1851, 206, -741, 1719, 178, -1930, 89, 727, -1695, -2097, 1496, 113, -1451, 694, 1988, 76, -864, 2334, 1056, -1687, 1560, 1984, -1368, -1569, 747, 105, -2188, -325, 1143, -1691, -1246, 2020, 414, -416, 663, 2198, -613, -1756, 1443, -615, -2988, -372, 1209, -1596, -1514, 1914, 1930]
2566A930k581R18K571k655q53J918n27k466j04K882k818M45K626j634m17J153
2582C88K169k886l86K065j67k457N62J662j926p66K355o98j791J168J750j899
2598h57n06L324p46k113K021N90j794j310J836j323k358K415J490j947O50K066
2614A438L87k949K352J424j667j681J912m51k046P7N25o34k34K925o10k192J540
2631A16K046k136o39K153N7l413J410J350k450M4P37J105j927R01K025j163j353
2648a137K565J063l656J022O61m74j594J250L83k202J709J330j329j626K307R66
2664A238j559O98K578k039j025P18N1k465K54K158j333j247K948J14k093J753
2680G49K070k563j296K272m74k122N77J380k138j06J218J051j991Q71K302j846
$$ y = [1930, -651, 267, 2838, 183, -670, 1248, 721, -1745, -1849, 1033, -1785, -1340, 1286, -348, -765, 388, 2557, -329, -715, 1350, 1183, -1274, -712, 950, -976, -1742, 613, -85, -1876, -708, 1042, -857, -1363, 1961, 1215, -898, 1123, 1713, -81, -1391, 445, -878, -3236, -821, 669, -1278, -628, 1438, 1825, -1124, 1228, 2652, 985, -696, 1216, 765, -1281, -1204, -679, -1313, -1547, 1378, 768, -1424, 116, 2162, 26, -613, 1540, 1597, -1816, -406, 944, -1506, -1462, -725, 380, -1547, -646, 1379, 216, -1137, 1428, 2491, -1165, -143, 518, 44, -1550, -300, 83, -2119, -410, 920, -409, -2035, 272, 1238, -321, 377, 2955, 916, -109, 609, 660, -1805, -1551, 607, -726, -1973, 975, 1089, -1004, 749, 2819, 256, -1040, 1232, 758, -1364, -787, 593, -1545, -1651, -433, 618, -1373, -502, 1800, -46]
2696d6j216K853pk459P11J873j891j841J789Q91j658j005K894r62j578K212Q56
2713A416j322p0J308p3k430J273Q91k561l85K107k68j860K537Q24j281P22K056
2730B884j423j217Q31K94k849N72J214q49j243Q00J315j206J05J965J25j691J263
2747H90J398k064n60J793j400j492J517L61j564j05J369J40j361K268Q12j210
2763G92r38K186p2l046J032N3k092K03K097j038r71K037J701j235j090K769o31
2780A757k060O11K42k085l03J961j08j807M80K098r23l20K689J33k815J159R27
2797A636j831m19J134n11k784K201P48j157o71J829J292k392J670K267k306j361
2813f55K214o78j914L06J000j466j629K378M28j595J553K237j768l77K339r62
$$ y = [-46, -1262, 1591, 1584, -875, -164, 1709, -182, -2023, -234, 657, -1001, -2006, 888, -74, -1652, 560, 1416, 94, 24, 1332, 1259, -1171, 102, 993, -1568, -1953, 154, -114, -1974, 563, 1387, 106, 828, 2884, 1461, 244, 1075, 1369, -1480, -908, 306, -543, -1786, -986, 329, -877, -772, 1193, 1318, -373, 890, 2288, 224, -336, 1457, 57, -1435, 82, 443, -1121, -1226, 143, 283, -1078, 1190, 2002, 792, -146, 2040, 1968, -1078, -46, 7, -2085, -1882, 215, -823, -1794, 243, 1944, 709, -381, 2388, 1757, -303, 308, 550, -1535, -1838, 123, 15, -1792, -1312, 786, -137, -457, 2232, 2365, -450, 709, 1636, -195, -614, 520, 9, -2775, -574, 174, -983, -1654, 175, 1467, -925, 745, 3012, 706, -655, 1559, 881, -1033, -727, 273, -1193, -2822, -444, -16, -1611, -58, 2179, 411, 34, 2373, 1411]
2829A411j774N77Q00j917j764K444l27j632J428J853r97j403L293K21k616Q25
2845D22J375j921j258J056O66k508P97J831j259q45K607j50j411J634J166k063
2861A39n06J523j29k238Q43M56j536l93J222K86n47J194J140l49j595J727N43
2878A780k691M82J994k566j021J787K7k373K011J619k48j079K847o02k307R30
2894E90M68k066j641K294J57k057R04J530n80r93J998P47j511J092Q43r77r20
2911a22M05L34j627k17J518j675l24J513J3n05J067J227l83n95M51R60k258O07
2929C89j21j182k255K821M48k239P96K649j92j903K566J00j908M38Q05j376j209
2946a373J259l05j585J20K006J79j059J613J284j922k35J939j998q13J057J25
$$ y = [1411, -363, 214, 1014, -903, -2667, -223, -550, -2182, -754, 1099, 102, -1301, 1992, 2213, -403, 422, 1797, -124, -1382, -326, 340, -2168, -1371, 460, -799, -1644, 963, 813, -598, 1036, 2202, 139, -367, 1156, 1027, -1211, -368, 88, -1448, -1841, -619, -333, -880, 314, 1454, 1105, -490, 1237, 1780, -911, -429, 1565, -1001, -2022, -235, -208, -2581, -570, 1049, 801, -278, 2569, 1967, -340, 590, 1058, -1008, -2649, -355, -198, -2255, -1351, 179, -401, -1394, 604, 1351, -160, 932, 1775, 798, -122, 283, 617, -1010, -1227, 291, -1384, -1708, -195, -182, -687, 380, 1607, 1224, 629, 1080, 2040, -218, 389, 268, -914, -3169, -348, 100, -2139, -1343, 1306, 1114, -789, 1777, 1877, -31, 407, 1212, -164, -1373, -114, -419, -2004, -1884, 122, 301, -758, 855, 2139, 217, -18, 1921, -77, -890, 167, 292]
2962B92j441k43J805j369j006K185J123j464J34J403j42j646J176L68j462k80
2978e67J401j637q36J376N07j220p3K626p37m92J363J8j489J28N67j585j205N99
2996a256O55o02r41K311J10p92K585l24j590P10J019j116j235R84o90j213l31
3013a716J480k63j265K148J025j326K09J552k00k086R74N81k099j14P17r98l65
3030a746R0K098p59j73J622N0j208J185N00j625q1Q89j129j415N88J101j307J54
3048a166J341P59j851K309J069j659Q0L43r30j660J98J240j867p89J613P58m81
3065f93N83J866j286l06J422l0k466J164J083j809j364J605l04j007O20J155o85
3082d52q8J712J140j673n67J890k023j176J177jj997O66J516j985l17K552J159
$$ y = [292, -1149, -1392, 413, -956, -1962, 223, 1346, -118, 16, 1419, 1277, -369, 807, 1175, -287, -567, 834, -803, -1639, -263, 244, -976, -1049, 1577, 840, 348, 1711, 1729, 240, 368, 935, -650, -1855, -1256, -601, -1203, -2144, 167, 277, -515, 2070, 1746, 156, 866, 1885, 769, -466, 518, -172, -1385, -1716, -236, -499, -1764, 384, 1409, 83, 292, 1844, 1644, -442, 532, 1113, -986, -1100, -383, -1381, -1746, -1656, 442, -317, -490, 1132, 1182, -26, 1159, 1659, 34, -47, 842, -287, -1702, -1114, -13, -1320, -1166, 175, 934, -917, 1392, 2461, 802, 882, 1225, 295, -1365, -1167, 73, -1794, -2583, -970, -212, -693, -110, 1756, 470, 164, 1586, 1556, -910, 254, 1337, -472, -1836, -231, -535, -1542, -922, 233, -452, -540, 1172, 2312, 639, 72, 1962, -61, -1237, -60, -61, -2058, -1392, 124, -1861, -2178, 374, 1533]
3099A533j835N63J886j127m78J0L36j945m37J331j641n06J759N21j577K126J545
3116B064j345m39J565l08j410p69J915k000q68J369J74j540M88J678j72n84J598
3133A416P64k450N27K575k141j495Q62l3j044l34J891k443P97J883M67j332J016
3150I26Q05o81j308J227j42k016j77Q93r99k10J323K64m60O43J719j31j281O12
3168A007N70k067K11L02j229m14R65N83q93N09J437r39l04J664N84j693L36J227
3186A856j780j043P10M50k929K289N07j018m48K432J055j743j42J715r57j693
3202g39J829K48k960JJ228j280K51J699M94j232P31J128J88j895J553N95j844
3219ep55P34o80j703J934Q78j291O83J519J43j334J441j25j705L28J487j398j713
$$ y = [1533, -302, 261, 2147, 1020, 542, 552, 888, -1057, -1494, -163, -1804, -2310, -551, -30, -1607, 519, 2064, 719, 280, 1845, 1537, 127, -642, 1273, -727, -1595, -226, -52, -1592, -1104, 574, 402, -182, 1416, 2180, -270, 257, 2832, 691, -804, 58, 25, -1019, -1353, 538, -1905, -1108, 775, 1242, -90, 926, 1731, 1050, -258, 969, 827, -1189, -1366, -473, -1472, -1682, -359, -95, -555, 88, 1807, 1676, 395, 1007, 1577, -490, -279, 23, -1206, -1620, -655, -72, -965, -456, 981, 42, -262, 1402, 1986, 293, 629, 1856, 76, -967, -257, 193, -2736, -447, 60, -958, -1406, 1026, 2081, 338, 196, 1911, 954, -739, 1090, 1338, -1622, -1621, -393, -1673, -1422, 277, 771, -461, 270, 1398, 1586, -309, 1244, 1839, -5, -760, -26, -706, -2409, -475, 403, -888, -205, 1314, 1457, 123, 1564, 1439, -266, 62, 1549, 151, -1562]
3237a562J774l59q04m15K235j217o01J882M26j341R90O96j127j496P69J59j561
3254a552m78J740l93r27J092J673j680R22J919n15j581P44L09j780q17J207j281
3271a398l72J177Q55j251L67J616P61j616J258M35j206j224J109j40j463K6R73
3288i3j349j27R88J183q13J030Q24j156lJ370o94k060K11L72q36n91R69K67j082
3307a590J193J247q99J033O50J5j529K26L76q40j164J101N3k365J550P82n7p1
3325b89J480j20n29O75K05q02j211L24M64k085K29J302n04j159K560N65j116J210
3343A199J82l24k51M94k44j383k83O55j080p04P50N83r30J159J666o45p44J226
3361A326k88j194K68J589k244j415J478j14j418J107J793j039k60J617K06j029
$$ y = [-1562, 212, -147, -951, -1366, 869, -348, -949, 933, 1359, 18, 1008, 1704, 577, -919, -150, 9, -1552, -2030, -290, -683, -1610, -518, 1155, -525, 397, 2316, 1801, 220, 964, 1273, -507, -1324, -117, -1398, -1770, -593, 262, -989, -622, 994, 1755, 139, 1397, 1832, 626, -598, 511, 371, -1092, -1066, -93, -1442, -1569, -581, 602, -211, 819, 1643, 487, 484, 1854, 1160, -900, -689, -317, -1153, -1744, -775, -508, -1590, -397, 850, -49, 984, 1634, 1649, 120, 346, 722, -118, -1282, -181, -128, -2493, -943, -161, -218, -289, 1191, 1071, 542, 1217, 1422, 620, -591, -267, 197, -1888, -1659, -357, -861, -2020, 540, 1105, -11, 1199, 1381, 1057, 806, 1300, 1056, -327, -610, 45, -1035, -1739, -989, -406, -1336, -177, 1489, 844, 100, 1326, 1038, -156, 112, 1701, -543, -1958, -480, -594, -2012, -905, 888, -151, -411, 1206, 1412, 383]
3377C83Q6J022j847n03M33N24j310o34J381m25p59K350O04r19j99J454n85j683
3395f27J666l13j457K2P14q23m24J040J76l53l2J205P23j304O66O52j233k77P63
3414G84j188j710R42Q19j933J168J360N6m63J512j91k00o46J348j082j715L02
3431h37J12n95P7J291p24l28J606J333j197l27J335k93j402K36L72j753j69L65
3449h98M37o86J255O85o36J08J254o48o95R92M76k203K48J65l84j568J044N30
3467e24j141M02J827K08q28O65Q57m21j149J580j045j499R74l62j081NJ807P5
3485C50p51Q84Q48o13J26J439p27j332k41k83o95j207J882l82j255Q65J761r26
3503b57N00J242n40q78M50N07j247k22N24o83q13M33J052r23M0J880l59j170J332
$$ y = [383, 469, 1491, -356, -859, -426, 98, -1212, -1846, -465, -890, -1649, 701, 1305, 386, 187, 1641, 1056, -627, 1039, 726, -731, -709, 5, -818, -1242, -202, -26, -379, -411, 794, 1517, 213, 879, 1531, 298, 21, 784, -404, -2114, -1172, -353, -2286, -1118, 242, 298, -165, 1347, 1156, 956, 310, 1658, 576, -1139, -837, -725, -1320, -1243, 48, -676, -1004, 602, 1935, 738, 411, 1746, 1453, 51, 287, 659, -1094, -1263, -898, -461, -1147, 108, 793, 157, 265, 1519, 871, 176, 1168, 1644, -559, -311, -146, -530, -2098, -1054, -524, -1665, -1263, 564, 772, -56, 609, 1466, 1045, -104, 1476, 431, -1068, -94, -456, -1537, -1532, 275, 350, -401, 483, 1331, 718, 844, 2283, 1556, 224, -17, -300, -995, -2202, -320, -702, -1957, -1092, 669, -257, 243, 1485, 945, 67, 517, 1024, -223, -445, 79, -604, -1417, -984, 68, -855, -815, 1065, 706, -464, 868]
3522H68N19l14j685J368o37r75K75Q27j205k75K071j41p00P63M93o94k94J070
3540A334k25j499M93l62r21p60J968n27q44J200N36n72M70M81J36j238M65Q12
3558I47j732m12J067n56j175N81J074r29N66J232Q54j879R33J174j162l61K97
3575E19j35j799J078R2j042L75O74K35m2O52P60o08n1j6L31j216k60L82j323k25
3595a619R23po94J206O69K08p29R27L28j458j93J081p04q58J85J5l20j75J178
3614c7M51q78J268l41n19R64R5n89j175R05J81j625J34J557j725K86P47P59l1
3633D27P3N73K27j665J389K24j356j242J711j088j151J471M12o37M42J412p86
3650D36r8J351m1j247j173J299m99q09J009o03j662R74J533k16o66J114P29r87
$$ y = [868, 1387, 1073, -612, 756, 119, -856, -581, 246, -959, -1234, 837, 696, -4, 759, 1252, 558, 264, 1334, 1109, -390, 103, -259, -1180, -1940, 28, -499, -1343, -143, 393, -179, 291, 772, 908, -330, 135, 947, -785, -1197, -130, -686, -1861, -1280, -206, -1135, -569, 663, 1517, -362, 571, 1745, 583, 222, 519, 384, -1415, -337, -245, -1287, -912, -238, -3, -45, 607, 1367, 759, 708, 692, 1023, -193, -453, -71, -1394, -1619, -696, -703, -1397, -191, 478, 686, -43, 884, 1212, -246, -439, 642, -62, -920, -735, -720, -1040, -1215, -37, 414, -464, 804, 463, -56, 908, 1003, 414, -761, 144, 325, -1300, -1166, 391, -1334, -1048, -301, 458, 427, 500, 1073, 1300, -365, 1024, 1248, -108, -1350, 361, -727, -1878, -407, 5, -632, -190, 1222, 436, 338, 1689, 1648, 401, -772, 527, 28, -781, 228, -375, -2037, -1063, 470, 254, -412, 702, 1431, 444]
3668D44J92Q21o64j448M30o01L5n57J489o8r59R58O49j014K41J308r85o69P60
3687C62J6k90j081R45l59r41J475M78m25m72J427J22q16J26O78l92k086J038j022
3706a217L4L35L60n93P73O43P4n12J157L99q75J03L79j118n19k17L58p17k7R97
3726a83k18JJ088p6n09J31L31O40j186N33m36p13l04J26M50j161Q69Q35j15n40
3746d37J878l07j019L47N23k98r00K04J16j259L98Q81k26o45J076K37jQ2R16p01
3766H65j791J740m05q30m68J353j773N89P04m57K32R04J96j10l24J402k055J48
3784h0J60L69j149q78J638k08j571R63J737r17p9R65k65P1j268R24L23j238N9
3803d44M85j092N62O48l46m12Q89N25j170R01R13j026j226J207K60j521K94L43
$$ y = [444, 636, 1457, 793, -655, -225, -826, -791, -1348, 141, 73, -886, 72, 721, -293, -52, 1256, 271, -398, 362, 378, 88, -993, -48, -407, -1348, 127, 605, 180, -292, 1135, 1257, 441, 567, 1245, 853, -1233, -195, -1217, -1183, -848, -488, -1081, -308, 335, 409, -103, 1054, 1453, 578, 681, 1060, -58, -577, -794, -436, -1153, -1180, -183, -401, -400, 688, 612, 103, 234, 565, 1205, 19, 552, 116, -597, -901, -775, -325, -1486, -617, 218, 103, -437, 1441, 1134, 115, 462, 985, 687, -213, -9, 107, -1152, -754, 127, -99, -744, 332, 569, 568, 650, 1566, 865, -926, 814, 409, -421, -889, 464, -1309, -720, -16, -473, -241, 663, 859, 749, 425, 1827, -228, -80, 80, 449, -700, -1578, 60, -148, -1719, -756, 981, 64, -15, 950, 685, 756, -512, 412, 735, -503, -444, 41, -1051, -489, 159, -187, -599, 290, 815, -355, 546, 1459, 433, -793, 414, 674, -847, -553, -210]
3821b10m33K29J064Q9r36M96J002q59o12R29K79k285K73J257j052q00J252n8J22
3840b53J57M07j76J25p3R65o98j37O97j336n17J259p83q34O92M68m26J85N78M68
3860G68k66m31J489j210o30P08m26q84l39J270r58M19Q68j2n96J44J041o4j110
3879b19P49j5j467N95k4m12P08n29J553j371M26Q05o20k57J382M44j062p55K02
3898A33m39o31L06pJ43o31J853p72L44J61k5LM6Q82j156r41J077L4j410L46P15
3919C1j1n25M72Q25r16Q16N4J59l91r80O18r80k87O35n37J69M61J038o52j60R48
3940G87j082P44K34L54j307k67J505j235l98Q33q75o52L00J664n70m39P75K56
3958F27m45J10N67q56P4p26J454j506m27J765r00k19L04P07o80j98J622l89p92
$$ y = [-210, -643, -414, 650, 739, -197, 299, 1301, 442, -170, 759, 1038, -1247, -974, 283, -769, -1569, -317, -375, -253, -96, 311, 135, 260, 187, 1152, 454, 317, 1014, -322, -839, 420, -363, -1197, -505, -37, -463, -278, 300, 768, 502, 71, 1560, 350, -280, 428, 2, -882, -1221, 49, -909, -490, 378, 366, -230, -86, 955, 891, -219, 530, 515, -952, -357, -381, -793, -85, -614, 939, -432, -6, 799, 179, -78, 1304, 1748, 686, -69, 133, -306, -937, -631, -638, -495, -1126, 727, -45, 299, 460, 435, 438, 484, 1366, 210, -731, 346, 380, -1030, -684, 31, 20, -505, -33, 792, -124, 692, 746, 905, 514, -466, 152, -828, -1115, -480, -1017, -848, -387, 651, -1, -161, 787, -295, 449, 683, 1037, -270, -537, 968, -267, -665, 168, -707, -1359, -1059, 605, 35, -404, 371, 627, 182, 292, 859, 3, 77, -649, 805, -701, -1128, 637, -263, -482, -178, 529, -151, -349, 1273, 884, 92]
3977I2J02m7k38j52K83K80n43M08l50j88J24M18J101p46n92L20K8j305N12O57
3997A64q01k07Q12j31L59nm31L20P86j94j78j65J60M59o75Q1q16O90j215Q30P8
4018g9p10P16J356r21J02O38r17o42L47N72q95K4O48k77k50M6Q3O07r25R22Po58
4040b06L17O17n88j350J330O09j586N56M02j96M4j07L13n24L01M38R8j285K009
4059A192o85o09p11P21j89l73J385q98q6p2N61j82L8J3J02j28l4N39o10l87m97
4080i10J346n5q13L97j63m6N35M28l28J18k20k38q88J093rj07o48L01l40L18J68
4101f1j05P71m62P72o26o8J9M14J9j248l82O74l8l51M90n53N75M1l01K56L97p06
4123d73J26kL40k65l40k99Q89n90O06M57p30N02L97l51m56R03o71j25k24j68O17
$$ y = [92, 194, 147, -91, -243, 40, 320, -223, 185, -165, -353, -229, 189, 1290, 544, -48, 272, 300, -1005, -493, 164, -637, -844, -32, -163, 196, 191, -240, 80, 866, 672, 494, 329, 489, 948, 273, 354, -462, 228, -987, -157, -79, -789, -73, 1283, 362, 464, 1102, 185, -457, -110, 462, -433, -409, 239, -38, -288, -242, -159, 448, -477, 445, 452, -206, 111, 728, 140, -1210, 120, 729, -857, -301, 101, -95, -51, -158, 155, -369, -68, 370, 468, -817, 1192, 507, -102, -813, -92, -281, -654, 731, -167, -253, -325, 236, 54, 92, 105, 207, 79, 45, 584, -26, -413, -910, 436, 381, -432, -35, -198, -244, 291, 719, 391, 509, 289, 51, -837, 256, 247, 140, -508, -207, -547, -229, -61, -166, 605, 143, 915, 289, 221, 240, 654, 673, -575, -957, -283, -321, -672, -182, -735, -160, -119, -420, -164, 233, -473, -347, -349, -9, -274, -614, -913, -24, -614, -8, 449, -281, 221, 618, 267, -189, 714, 43, -82, -306, -474, 143]
4144A43m18o40J709o82q26J105M83j139M8P48o30l74M20N8K5p86N44o2L36J70
4164B32j46m91j4O04M30l32n36R00o53k37k89J1k29j47J173j026n8J682o9q94
4184h9j33Q34n42N5J93m26o53N8Q15k96Q9K89o3J03q3O08p30m00J140Nn37j032
4206g95J007m83r29O75K2L39k82M93k44J89P89m06q54J105j00m32j077P33K44
4225fl89q0J284q55k63N46J96o24K10R3L09k83J13n7o90K97l5P0l64J048k83k23
4247A4L69O3n50O17o51K12j63j04Q05j783Q53L64L67j628J266M4q0J65J71k18
4267A33l27j5M50m77N19K72m53k07n3K00J192r98R9K73R1n78k26O5L49m40J29
4288bo60R12o95j27K35L64J101k135J436K81m86j42j8m6J48o27J025m78o27J2
$$ y = [143, -275, -915, 794, 112, -714, 391, 874, -265, -217, 531, -99, -473, -53, 5, 30, -756, -212, -274, 62, 232, 86, -405, -419, 185, 615, 283, -253, 647, -6, -243, -532, -521, -750, -897, 276, -750, -808, 874, 805, -89, -222, 612, 70, 125, 318, -108, -761, -703, 112, -184, -95, 194, 131, 234, 151, 759, 29, -371, 769, 774, 237, -795, 212, -271, -1200, -525, -503, -164, -446, 47, -197, -8, 781, 375, -479, 626, 526, 94, -983, -250, -6, -395, -475, 809, -46, -309, 237, 433, -191, 19, 112, 421, 138, 251, 194, -496, -199, -234, -164, -528, 520, 237, 14, 383, 446, -104, 513, -138, 74, -89, -193, 612, -1171, -318, 46, 413, -1215, 51, 95, 15, 180, 351, 133, -194, -209, 241, -236, 283, 555, 102, -105, -158, 42, 1234, 236, 335, 608, 699, 121, -105, -40, 309, -131, -2, -662, 250, -445, -572, -337, 27, 1128, -1007, 429, 710, 224, 82, 64, 18, 166, -461, 564, 86, -541, -529]
4308e29J402j039J89J63k3j32Q29p24m56q6J05p3N9J167P2j508j49J129m58L40
4328B78l35Q98j306Q1J154n64q73L90O60l36o55R22M5m18K85j30J55q58O47j88
4348a48p2N74r89O82q04P86m28o5M11l67J90KQ86j90j077N37N35j404P99K56j30
4369a6k95O92L94j342L53O32l35m68n5k2J079n18p5O40q81L95L53n22M17j19k35
4390G2O50q10K93j150Q59j6N39p11m34R94J37r05P06p67l61Q25K14m51OP72J78
4411F40m62k84k51O7J2O50j127M87M14K43k85K01l55O03j235P03m91K17j23M84
4431A08J67p66Q64l82K41k80k12L4k20n3J360l43n37j55K51M7m59M87M68q18p6
4452b74O62j345L67J302o19M02n47K85o13Q56o86J61rk38O65n41J79N69p34k70
$$ y = [-529, 873, -166, 23, 186, 163, 31, 860, 136, -320, -406, -301, -374, -315, 852, 924, -584, -733, 396, -62, 278, -57, 841, -465, -384, 770, 206, -667, -277, 383, 47, -608, 314, 359, -59, 226, 96, 251, -607, 40, -148, -220, 354, -635, 47, -757, 29, -399, -464, -53, -420, -230, -228, 658, 468, -609, -72, 463, -941, -142, 114, -16, -311, 381, 775, -567, -214, 418, 83, -385, -440, -462, 617, 99, 24, 664, -217, 178, 531, 9, 426, 307, 72, 722, -88, 205, -945, -86, -102, 437, -274, -708, 286, 423, -482, 224, -543, -904, -79, 135, -316, -310, 462, 640, 178, -106, -357, -290, -278, 372, -755, -268, 146, 389, 104, 305, -50, 553, -682, 21, -470, -253, -376, 108, 275, -491, 373, -9, 232, -48, -260, -226, -446, -499, 861, 518, -19, -174, 77, 124, -335, 152, 620, -198, -274, 388, -957, -590, 712, 93, 495, -52, 233, -380, 476, -210, -49, -58, -296, 369, -172, 7, 576, -158, -428]
4472d28Q75m11m26k16P48l76Q0j25J217j114Q4n2J99L27l63o56P36L18j038K9
4492e92O90O2o9k75m2N25k23n01J354q07j06O13j26p20k14r2P58l82j12M00j191
4513a050J063k82Q7M64K6j42N77p04N5M39n74M43M34r59k14Q25n86J32M1O71m43
4534C03k41k16M8O82r81P82k73j3k06K56J95n78N19n59q6J187m71m13K80L54j204
4555f35N24M7mn2O75m27k02n07P19R3l82L7L80k40J099j255P71j250J533p36n36
4576c48rJ47M1L63Q2o38M58l63N58L15p20r35R12O1O55j123N81j58q8O24k34l26
4598a45j18P68q67M53O31j01q96p1m37J057j78p4k45L4q0P53p71J62N87o42k48
4619d28L26P2p54P31O22l02r11J440n25o99K21L38m64k45N83R2J87q80K93N27
$$ y = [-428, 447, 36, -390, -606, 142, -234, -154, -279, 938, -176, -92, -144, 55, 382, 19, -637, 99, 417, -621, -592, 98, 160, 91, -184, -226, 299, 76, -425, 929, 122, 16, 629, 503, -217, -431, -523, 235, -147, -259, 141, -1050, 13, -269, -182, 282, 308, 166, 743, 39, 94, 533, -41, 402, 836, -123, -337, 488, -98, 34, 75, 746, 303, 62, -154, -106, 576, -405, 377, 104, 91, -115, 141, 336, -242, 277, -282, -368, 819, 348, -65, 215, 569, -635, -111, -64, -68, -120, 555, 128, -74, -581, 138, 231, -151, -114, 266, 26, 1125, -130, 641, -609, 924, 188, -348, -357, -210, -169, 194, 276, -362, 96, -267, 291, 606, -114, -1049, -137, -76, 579, -544, 37, -121, -209, 415, 181, -145, -263, 505, -362, 91, 722, 621, -275, -346, -783, 274, 96, 22, -223, -189, -269, 484, -287, -125, 462, -180, -428, -102, -30, -784, -53, 569, 267, -644, 796, 271, -428, -207, 131, -333, -578, 5, 97, 284, -596, -303, 224]
4639B24p41P94m50L35K79ql80o26O55o21K86j56N42p55Q40l28O68r20K66k37O09
4660B76n95J133L0r72L55l41k70O98k88k66L72N3n59N7K23J37Q10q66k64O3L29
4681A15p27O56J82l56P10k62L59p79O46r19L18l54J016k60l13L21j449N11J116
4700E31j30p14o7L06K20p28N02j17L53L53j71k16O06j71q08K33k82Q9J6K25n2
4721b2m83O06K2N79p70q99K57M1N58l74J010o88P55l13m31N04pQ1q1K38o42P14
4743F55j287N43L69m42J32q2j56q29J051n1k39L02p1L90j0r4o60M1O61l50L4n27
4765f20j5N63j98j0L83M97n83m96K75O06m89n40J171q69L17L4M74j45j92N5o16
4786c98O60J09o39R35k92o73M42M7l77J37j04m33J038j395J313p35L48j5k27L16
$$ y = [224, -517, 277, -173, 162, 441, 433, 53, -573, 82, -539, -253, -409, 133, -622, 218, -110, 558, -362, -96, -333, 276, -319, 814, 844, -128, 227, -114, -384, 314, 26, -240, 132, 185, -374, -317, -94, 43, 853, -13, -277, -214, 115, -612, 44, 226, -130, 580, 318, 677, -102, 544, -375, -57, -411, 605, 345, 32, 353, -1096, -585, 531, 401, -313, -380, -74, 146, -582, -80, -197, 156, 509, 338, 122, 728, 557, -251, -18, -300, -211, -195, 30, -22, -505, 101, 123, 702, -68, -967, -710, -669, -111, -485, 525, -163, 592, 279, -152, 352, 345, 426, 345, 583, -59, 655, -632, -89, 280, -162, -30, -112, -268, -1097, -46, -97, -336, -34, -105, 285, 275, 181, -479, -438, 223, -127, -93, -620, -635, -72, -270, -280, 103, 600, 17, -479, -204, 402, -87, -627, 544, -325, -8, 26, 500, 355, 163, 218, -398, 262, 371, -268, 667, 375, -298, 144, 191, -186, -49, -153, -586, 452, -943, 370, -365, -17, -32, -259, 57]
4806E7L46l51N0m73O18j36R54j425K23k35J29L80q70J352l98o45P58o77j64K89
4826b18K26j29o9K32l69K20M37p17j60Q7N46J45l3Q6r2R2k89n6O6j04k65L06j92
4849b50N23n66J85k41O51m18k2L2L33k17O49l66k69j134J419n01q61R74J02L49
4869C72l46J90l69j77K96O1K16M28m87J78j55q87R75N47q88j30M24K26j297J767
4889I44r72l41K46J41M42j426R80j77M83p54J084q03P6J47qM84j008Q34k54J3
4909A31o3M91o56L29J37p68R05o41k21J09N20k55M04q75P43j48J07K96o39l2l4
4930a60L55n00O81n32k4PJ86L26L93o86J52o93P26q75J131o67r5l9N57J3K9n22
4952b37oj58K37K36j34K19L07J47o40r6q27N43N34m1K01K27o13l56R32k56j137
$$ y = [57, 403, 52, 102, -371, 247, 111, 1065, -360, -137, -372, -243, 137, -733, 619, 221, -424, 334, -343, -507, -218, 8, -121, -190, 42, -327, -107, 330, -387, -547, -460, 86, 231, 198, 284, 192, 284, -5, -61, 5, -99, -364, -58, -250, 273, -293, -108, -349, 302, -116, -138, -106, 227, 10, 659, 293, 24, -1110, 309, -192, -1053, -79, 23, 372, 26, 216, -153, -330, -34, 27, 243, 671, 184, 362, 207, -680, 295, 842, -46, -176, 248, 474, -823, 944, -28, -369, -123, 18, 460, -966, 14, -163, 320, -434, 650, -153, -77, 70, 62, 546, -462, 372, 118, 131, 68, 559, -97, 232, 369, -399, 506, -135, -356, -247, 273, 18, 422, -453, 290, 142, 249, 545, -94, -126, -160, 195, -305, 376, -156, -180, -173, 13, 339, 732, 46, 198, -495, 231, -644, 487, -180, -275, -314, 243, 256, 285, -237, -243, -401, -164, 72, -62, 157, 464, 611, -29, -125, -952, -409, 125, 84, 285, 512, -101, -457, 475, 219, -918]
4973i18L17M84L94q8O3K69j009Q01K35n01J205l76k4q31K61k22p47M61m5k62J086
4994E53l18j54l54J47L17p9J38n7p69O43J24Q0p90N09o9k17J054j051M7o2K93
5015a5J73l66J93l41K03M91j045O4j98J216q96J103K25j205R44m40n95O72O93
5034H76j198P36m59K74l41k54J15n58J240L16n73L3m62M33k79k9k09K02K05J0
5054G8N90n72K50o13L82l81R56r34l95O86J030r63m2l0R5k49L50N53j52r20k22
5075e03Q65m35K89n20Q15o18M55n65K07J91l17J75q54Q41q48K20M00L25J72k63
5095C2N62p44O90n89k84q86J287j39K04L2j52P8m56R89p51m22R66j581J094n51
5115f21L79J26j0m17M60K31p24j96J207M35q78P0r9k88L76k23K58j10J93m72M04
$$ y = [-918, -601, -117, 277, 189, 252, 521, -488, 313, 548, 47, 1252, 876, 852, 21, 282, 60, -687, -226, -271, -533, 553, 235, 81, -273, -126, 191, 112, 250, 193, -576, 67, 191, 271, -519, -10, -79, -296, 758, -293, -246, -308, -15, 158, -208, -15, -356, -153, 338, -707, -643, -841, 375, -521, 582, 807, -398, 546, 106, -489, 183, 876, -322, 414, -45, 229, -112, -366, -251, -809, 431, 747, 174, 207, -255, 178, -101, -130, -339, -137, 68, 78, 668, 96, 346, -267, 115, -266, 690, -244, -639, 47, 1077, 114, 72, 42, 137, -112, 238, 791, 639, -281, -503, 362, -73, 216, -304, 511, -107, 348, -217, -10, 181, -136, 39, -815, 26, -822, -602, -202, 123, 295, 32, 594, -150, 540, -49, -333, -1219, 68, -71, 133, 165, 13, 91, -365, 624, -127, -549, 417, -1164, -70, -621, -242, -116, -126, -543, -83, 148, -576, -772, 435, 870, -8, 62, -37, -325, 51, -172, 86, -24, 169, -303, 101]
5136A01r93O88P9j60J376q43j54l96R26J4p21n46M36R15j279K3O84p83K52N24
5156A43pL23j669R40J73j68j45j22J495q24l98K83p3N40n11m62n0Q28m12p61J255
5177C78n61M25L35K65n80l10K31l0r4m72K02K3m04J432q86l0J79pj27P98n86k01
5199b0L8j03K94k28q7O15n2k0n75O12k39K0l21m28P72o19N54p96Q37q09M41l07
5221d21L87J55kn16L97n79O13j01k23k05J000r25K16J48O8n7M8j61O21o30K06
5242C9n82Q79m16l99J069j535M56J115n87o56K38K7K03n1O03n20M30q34Q33m56
5262a44K6P9L63l13o83O24M87k45n79O30l23o8O6O69p32N50n79mM95q77M42o2
5284a78J73N29q74K85j91J96k51J91M33l93J51J96k89o05P58L12m32p05O15p9
$$ y = [101, -892, -204, -125, -285, 1091, 248, 94, -302, 624, 638, -83, -629, -193, 722, -557, -534, 150, -633, -381, 143, 136, 459, -1210, -270, -97, -265, -410, -532, 963, 139, -259, 24, -49, 491, -20, -482, -532, 296, -116, -877, 378, -183, 242, 577, 842, 262, -48, 183, 153, 59, -413, -211, -188, -592, 840, -46, -76, 103, 96, -31, 767, 181, -20, 18, -85, 209, -19, -106, 509, 457, 437, -138, 474, 235, 255, -66, -494, 278, -341, 213, -583, 254, -555, -114, -421, -34, 121, 119, -397, 0, -579, 34, -67, -290, -495, 505, -420, -204, -56, 12, -45, 3, -158, 463, -167, 39, -543, 336, -80, -479, 590, -945, -489, 626, 39, -617, -379, -352, -149, -200, 403, -117, 313, -521, 312, -144, -118, -39, 324, 11, -672, -48, 439, 194, -385, 245, -78, -146, -80, 589, -143, 407, -172, -176, 319, -558, -116, -178, -5, 524, -350, -65, -256, -60, -311, -120, 313, -80, 71, 267, -22, -627, 131, 443, 11, -694, -79, -158]
5304a58N91k34q7q59O62N06p3q4p03M53j97l64K2O16n23J2J531j349K03l64Q94
5325D95l38j2k42K17N4r77O98L0o4J84j03K75Qmk93k72l3l29J200j115K48J42
5347b31M04j40l9O25q23P19r22O51j18L67m43N70n8k75n39k30N94K9n90Q81l68
5368F4r67J350O8n34J71r9O6l01L87k37o78Q00m40N17Qj98N97r92Q96j026J06
5389d42K83j63K94p7N60j011R59m92M60K69r88M70o41L14k58R07k98l50M53L08
5409E57n15K32N49j420M83J43m54L07j77j67m00P60Qj25j98J8R92q48J83n01Q81
5430C08r93M44K41l84M57N68k8q41k98L84J12l2P58m95j48m02p5N07l14M34l64
5451a61L95k70K43p18O71N61o98M71m63K53J05j91k55k13K3M73K26p11l16J359
$$ y = [-158, 433, 199, 112, -747, -85, 421, 348, 264, -439, 14, -183, -547, -525, 91, -432, -420, 1111, -238, -35, -399, 495, 157, 145, -97, 120, 174, -803, -105, -75, -139, 45, -58, 217, 225, 221, -72, -344, -377, -706, 494, -621, -373, -231, 173, 33, -6, 619, -204, 515, -407, 244, 126, 493, 50, 620, 562, 287, -252, -482, 112, 141, -449, 432, 64, -903, 447, 515, -19, 152, 53, 119, -182, 205, -32, -710, 90, -350, 167, 175, -23, 574, -418, 478, -548, -442, -159, -322, -28, -105, 455, -556, 403, -89, 371, 640, -348, 122, -519, -205, -463, 444, 146, -204, 249, 557, 42, 274, 823, -597, -114, 29, -425, -118, -295, -462, -862, -102, -94, -219, -417, -399, 593, -255, -72, -573, 308, -685, -241, 0, -384, 73, 641, 613, -228, -526, -142, -30, -62, 696, 201, 53, -349, -424, 83, -231, 203, -161, 234, -36, 207, -511, 160, 721, 23, 494, 31, 284, 389, 198, -57, -270, -247, 226, 452, -259, -575, 784]
5471G84o48l93J62L77p09K76J09M32k00j23o50Q50p96N41k37l61J172j094L11
5490a97o15P23j78M35M50k1p55J57l4m42J019q4m8k14r34N55r5O57j001M77L39
5511A94m03L54m14m81J028L49p36r66P41K41n05N67M74Pk79j13rJ30L48n56K66
5532B37M34j100O90l98M41k15m72M88L56n66j51l48R55m85m5L79k99j40l10N24
5552b5m79j46L85r4O64L66j045N61k30K99l20L08n84R9k59K86N67j54n97L07K57
5573A66p67L54L94N39p26Q60o68k77J70l63K15N8L07J6k19n48L31Q84p43m33N33
5594H3K46q05Q23j86l38Q9J273j587M4M50j11l17K84m79O86m0k81N28p88N06o47
5615e67J08L70K18M01k69p40P68p46p6L90l3L92j05o1k91J62R6K3l32o2O55k03
$$ y = [784, 136, -257, -95, 282, -427, -151, -42, 390, 190, 67, -583, 267, -529, 12, -225, -586, 586, -508, -197, -812, -89, -267, 168, 618, 597, -158, -1, -35, -477, 542, 458, 410, 196, -738, -183, -278, 379, -622, -145, 194, -209, 145, -269, -750, 278, 627, -109, -1075, -334, -93, -598, -31, 443, 450, 171, 58, 49, 179, 527, -29, 237, 671, -429, 261, -137, 304, 89, -383, 105, 461, -105, -256, -604, 351, -134, -179, 200, -99, -239, -549, -25, -504, -650, -265, -359, 305, 671, -374, 187, -43, 256, -64, 244, -340, -241, -500, -214, 353, 199, -398, -91, 166, -601, -247, 147, 686, -40, 820, 152, -125, 45, -318, -103, -45, 262, 278, 59, -489, -158, 726, -17, -450, 83, 329, -476, 347, 161, -177, -88, 1185, -402, -358, 92, -19, -336, -52, -531, 155, 115, -166, 362, -426, 80, -567, -459, -89, 129, 530, 261, -479, 289, -457, -533, -143, -176, 216, 111, 50, -241, -79, 17, 40, -292, -354, 301, 98]
5637I8j11j51L8%L2J79K49m54N66j051M01k92L30J01q7j25Q55l00n74O18n06K78
5659I4o88Q1J65L99q25O70K87l89M76q73L18L86k6j52m06O36M1N35o37k50L70
5680B12n03O50n78L9J68j25m49O95M00n81J01K89r9Q73j056K3q48M88k1j3J336
5701A001m77j16m55m05J04nN25k29l26L56n97Q31L1q2n44Q00n25k40j95R19N5
5722D26j55k19m20J817j297k36p01j76J403m35n02R22r35J075n32p45J056L71
5740G17p47M98m60M14j073o4Q80j10M30n03m13Q82r44M2N49j48K57p60L46J79
5760b8J65l72k65P81k79M12p9M32j283L20R4o73R87o59k79J18Q72l47m08M94K58
5781B61L10p48r5O67m37O93j047J46k40M45l2l85R30K29k62k91M30n55j28O34
$$ y = [98, -13, -164, -126, -126, -94, 85, 334, -120, 446, -605, -204, -496, -166, -65, -152, -277, 578, 278, -296, 322, -184, 94, -594, -513, -348, 51, -774, -104, 183, -206, 270, -603, -285, 101, 75, -77, -483, 153, 194, 729, 92, -158, 212, -291, 359, -219, -180, -12, -137, -586, 109, 509, -72, 29, 318, 219, 1092, 36, 59, -789, -301, -322, -335, 1001, 524, 408, -47, -452, -348, -353, 172, -57, -383, -27, -624, 207, 238, 156, -388, 412, -113, -353, -548, 371, 426, 271, 52, -368, 1449, 152, -84, -785, -961, 442, 7, -495, 427, -508, 567, 35, -710, 346, 717, -30, 468, 8, 422, -651, -715, 165, 55, 485, -18, -431, 451, -493, -451, 98, -50, 207, -553, -207, -28, 137, -235, -500, 281, 2, 414, 335, 767, -516, -196, -102, -775, 212, -447, -726, -608, 264, -83, -491, 3, 261, 571, -177, -272, 395, -42, 651, -396, -250, -490, -45, -77, -462, 468, 697, 435, 144, 574, 19, -109, 525]
5801E25m86Q31p05K90J5k35q7K5p31M25L12R7n4k21J6l90O97o28J4J66N96m41
5823C1J4n35J053r35P4Q58J19k97p25N97k64l42J64j77L80p09Q54J61l25l86M07
5844A7M57p07R49q49L90k33P27p26K57o5m32m19N59M07k11J49m22L97k49j20O87
5865E63p40J026j072M24n79m36J502l26n37L82l95M32K80k63q63K90R26p74k07
5884c67N98J33p87N3N05K37l42J12J71l64q70N07P75j196N04Q39p61L51m18K83
5904c7q60P11L18n45J16J34J60k23L47j52N87q20R06m44r7r2M6L80q23N24q18
5925f82J532j63q90Q9M83j49P8k95k92Q31j233P05J96q5m88N68o8J26n57j75L72
5946i7l79n7Q84M67p24l53M08q09J054ll36o59P93J1k13r7K54K59m53Q2L17n42
$$ y = [525, 39, 870, 165, 455, 470, 235, 148, 173, -558, -133, 179, 276, 222, 1, 17, -373, 324, -304, -290, -124, 472, 31, 45, -490, 563, -372, -298, 560, 679, 382, -343, 254, -10, -352, -188, -365, 15, -694, 160, 321, -4, -390, 17, 474, -233, 716, -133, 257, 24, 751, 25, 282, 217, -215, -634, -75, 332, 121, 270, -152, 245, -4, -124, 563, -177, 849, -223, 201, -378, -814, 688, 362, -175, 207, -188, 244, 524, 261, -602, -312, 614, -160, -367, 231, 364, -423, -370, 135, 372, 30, 142, 313, -51, -921, -414, 361, -835, -331, 508, -253, 98, -320, -37, -897, -186, 132, -413, -297, -163, -3, -226, 121, -31, 556, -264, 642, 198, 101, 9, 55, 435, -388, 136, -682, 850, 687, -203, -114, 369, 220, 298, 3, -289, 542, -691, 14, 210, 125, -363, 205, 137, 263, -294, -469, -97, -476, -533, 351, 818, 94, -259, 149, -660, 394, 391, 55, -604, 189, 200, -13, -110, 144, 403, -50, 32, 349, -193]
5968a93K1M32qp15Q72m0k45m30Q14q63N43L89j76l53q5LK96l40K76k6J79r06k9
5991e84M07L35k77M1k19q8N3k7j51O09l09k55M50j46m1J85J39n16O61N6J2o29
6013b94p52O34J40P6M28r24O69J43m37M06m65J9j3K76O0J4M71n25M63K3n84M71
6035B99Q3m59n65N44o68N47Q9M57m47Kk70k87L06O35P8o27K93N2j35k10r2N03
6057A28j25j74Q15m50J38q88N31j017N83m0KP71Pl14M06q7p30M12J47K6K76l98
6079A9K2n8J35k50j20P28o76j12M88m98J11j35N2lJ169j017n5j29j94K10J58N79
6101D24l11M27k62n84L10r6k51O84O1n77j120J270Q6k28L95m13J13J98q8l09O60
6122C89l02k17Q14q08O15p00k5j06L81m14O13n26N41k31Q38j559R96o08O50j24
$$ y = [-193, -172, 260, 252, -463, 409, 369, 124, -306, 508, -355, 188, 577, 401, 48, -37, -34, 262, -78, 198, 172, 351, -555, -584, -177, 158, -119, -78, -297, -385, -332, -359, -510, 99, -210, -465, -15, -161, -202, -17, 122, -394, 267, 323, 335, -294, -1046, -412, -272, -196, 232, -692, -23, 120, -317, 89, -376, -357, -370, -94, -34, -20, 451, -74, 389, 412, -172, 299, 382, -77, -642, -98, -766, -219, -130, 327, -120, -118, -388, -675, -369, 266, 344, -283, 10, 62, -73, -283, -375, 128, 3, -171, 644, 194, 332, -556, -25, -1042, -459, -499, -497, 274, 281, -33, 373, 286, -444, -32, 115, 141, 417, 19, 41, -17, 118, -132, -252, 476, -200, -312, 176, -322, -211, -346, -294, -297, 872, -145, -200, -329, -523, -313, -155, 424, 113, 540, 278, -306, 4, -92, -343, 341, 402, -175, -1295, -25, 61, -167, 228, -185, -72, 126, 38, -271, 389, 87, -130, 684, -124, 491, -209, -234, -340, 41, -373, 240, -286, 255, 24, 862, -697, 299, -309, 341, 217]
6142B17l38L47m03M15k91J51q08L82j61O60n0m94J07N36o59J26R82j18k61l63
6162b3l3l1j29R2J34l85R53r49K03N7m34Q50k22L87l89m02J53J23J11m71M97R9
6184A91r2r2O8K4m47J079l10r29QJ33P7l81L54k2J35M77q2j23l22J11Q8K30k96
6207a21L61J93j28o87K83N21q25P56q6J29l55o03Q73k01M98k33m45N88q33J57
6227a58k64O44M6o19L74R0o2j58P75l44l9m80L27k97K76J13K34n46n89J160j6
6248D67j009P37k26J55k17m02O99k65L3N89k4m14o3k79M68n89N53J13n44K23J96
6269B01j43M95n49m41L11Q01m65q8l45K43l59N15L17m69R2p28Q33m16L4P8o38
6290g21J262o12k26P83k13o28l62J185p04N5M16O75j319K59l5K26r95O48J99k2
$$ y = [217, -121, 226, -177, 238, -53, 98, -710, -328, -489, 171, 121, -373, -266, 270, -389, -263, 719, 601, 340, -23, -56, -87, -216, -124, 10, -375, 578, -371, -168, -111, -545, 305, 83, 470, 81, -321, -168, -45, 66, -405, 92, 191, 99, 7, 75, 99, -348, 731, 421, -508, -500, -367, -290, -671, -317, -339, -204, 273, 191, 68, -254, -143, -55, 175, -121, 240, 433, 305, -382, -99, 422, -403, 353, 267, 396, 41, -562, 311, 110, 608, 375, -70, 518, -315, -158, -422, 222, 268, -351, 23, 113, 51, -107, 668, 324, 285, -195, 132, -165, 111, 224, 458, -88, -677, 483, 467, -542, 195, -31, 124, -93, -495, 204, -61, -28, 561, 537, 123, 60, -219, 249, -340, 213, 326, -218, 5, 201, 58, 553, 4, -437, -126, 675, 210, 122, -223, 20, -339, 176, 493, 24, 116, -612, 221, -195, -161, -83, -721, 541, -71, -297, 486, 273, -355, -717, 468, -236, -181, 235, 910, -409, -150, -185, 41, -954, -306, -107, -129]
6310a29j03O44j222O63j7J67j65r9J49P68k92j6J97j635N69O63m51l5P13n17k51
6331c99N93l7j45J58l72Q16j177K79J82R4o79J177j088K20R6l72P21l10P52k10
6351B99Q2J07o00j95K31N93o70l53J50L05j08j36N89o22O35O78j105o71J329r55
6371d17L46m82O15l2r70R93J99k35J04j56L66m24K77p11J203n05L16k54P6m08
6391i9J61p27O64j40n4O69o17n9P84o15O44l48l02Q57j180P5J2M31K06o91L25
6412dn90O29l47N47J52m81m1j3m62M63k23L06O33l07j49R3l19%o8L81j73l38J94
6435a17P52o92m4N2M07o35Q14n51o94R07j91J120j023K09p41K99P74j130N18J59
6455A93m2j00J69l72P03o71J27M61j99P2p78K45O55m32n66j53J50N2p3P25k99
$$ y = [-129, -232, 412, -810, -147, -164, 3, -162, -261, -112, 656, 364, 348, 545, -1090, -521, 142, -309, -344, 369, -148, -399, 194, 157, 12, 170, -202, 614, -563, -284, -102, -8, -687, 490, -598, -378, -282, -654, 67, -243, 509, 299, 381, 488, -112, -307, -76, 517, -153, -506, -356, -51, -159, -295, 294, -328, 307, 985, -120, -791, 538, -417, -71, -553, 62, 30, -940, 53, 252, 17, 121, -35, 331, -93, 184, -527, 676, 171, 487, 233, 309, -99, 62, -665, -1, -141, -195, 474, -143, -202, 582, -33, 611, 263, -39, 818, -362, -287, -275, 156, 362, -329, -4, -594, 35, -312, 235, 387, -94, -135, -148, -610, -147, -370, -64, 569, 262, 113, 206, -113, -113, -181, 200, 27, -311, -117, 635, -57, -101, -49, 358, -277, 537, -14, -708, 199, 8, 1128, 105, 314, -427, -128, 646, -484, 34, 193, 151, 51, 220, -152, 551, -120, 7, 468, 269, 341, -437, -192, 463, 31, -535, -688, -538, -486, -559, 166, -133]
6476a33m6L24k98J32P51k43L5n57j5m19j38L23L89J31r6K74O21o79r4p50J4j03
6498e77R29K94j09p30O25j112L31L21j79P97n93k48K15j43m67N65j78O47l49M83
6518E22K1j44l4j60P6K95j15n30Nj70Q56n64K63k4n11j17L97k91N44l67k16M63
6540A99K19o10m57O94P4j35p12K80R46j33r52N02J06R0K18J27r51J017j384J094
6560B32j42j92K03P9k49N72j48k41l33P56k28l32J57K24p32mN80n52O44J29l18
6581A05l79O01m66O15q72K55J38o36l1N31O70o50j21M94j25j75l73M69o86O63
6601B7Jp72N22K35M15p44P2M02l22M91l03k91o12R62K10o7o35K43M48q82J36J359
6623H95o44o5J56m00M97L64q29k27J00P21l37n22L79K35l46k87j62J59L32O47
$$ y = [-133, -179, 145, -153, -21, 730, 487, 522, -35, -50, -469, -607, -284, 105, 236, 140, 414, 1035, 356, 262, -488, -474, -577, 352, 646, 537, -193, 432, -680, -349, -28, -207, 590, -3, -251, -36, -179, -646, -81, -259, 388, 39, 522, 543, 399, 365, 205, 281, 576, 461, -69, -64, -234, 622, 58, 321, 297, -214, -331, 66, -225, 319, -48, -264, 199, 418, -192, -649, 45, 119, -16, -728, -448, 498, 365, -587, -85, 21, 111, 329, 456, -495, 522, -862, 232, 90, -102, 101, 180, -69, 503, 355, 114, -219, 537, 309, -23, 134, 358, -374, -378, 202, -350, 294, 423, 105, -274, 327, -139, 476, -396, -141, -3, -639, -670, -139, 531, -119, -240, 254, 129, -46, -419, 50, -636, 27, 28, -744, -222, 13, 428, -316, -244, 158, -164, 327, 24, -267, -879, 83, 293, 226, -409, -166, 282, -600, -464, 895, 251, 186, 342, -58, 439, 803, -26, -253, -153, 568, 231, -291, 88, 323, -23, -310, -472, -313, 19, 666]
6643F66m03m81Q73q50k96N72l8M07pk12m46M70J36l14L7O1K90r71R11n72j59O47
6665C21n88O37m09j2k43N16n49M30K27o97K77R19j032M23m61J44m73l1n5M98J90
6686C2l72M20Q62r56O35o49l85P40j48m7l61L74r12J106j0j41l7k53L17L17n28
6707Dk47K76Qn16K67R63j62p20M36J64n15L17L9j153J340r33M87Q6L7P79j408
6728d51P97q97K26Q10l31R5q3K42m02J23J05q79O27J81J71J19m51L93j54rm7k91
6750a06J66k63O8N56l67K21r81J096l77L82o77O36j268J286l80j54O68m37j024
6769i55N61N59Q5M4k88j11N1K45Q4m39q2m07J028r50K89O73o7j83k26M23l05q
6791B1J35n58k54O74m95lK81j17J68pR02l42n3L65r3o39J75q2o95P16N24n02j33
$$ y = [666, 263, -218, 655, -195, -491, 81, 43, 450, 443, 231, -215, 255, 391, 77, 114, 175, 465, -506, 405, -167, -326, 321, -267, 370, -39, -51, -294, 222, -327, 103, 330, -367, -90, 829, -203, 220, -241, -97, -570, -601, -656, -158, 32, -340, 80, 942, -14, 621, -28, -413, 327, 179, 132, -229, 145, -767, 339, 329, 188, 151, -102, 215, 532, 4, -243, 33, 41, -475, -208, 755, 593, -127, 309, 473, -42, 275, 314, -839, 501, -432, 55, 141, 178, 957, -451, 346, -551, -325, 485, 154, 249, 166, 408, 6, 129, 234, -645, -18, 163, 334, 453, 2, 395, 241, 232, 185, -106, 60, -203, -135, 421, 54, 275, -706, 390, 13, 395, -282, 354, -914, 372, -8, -162, 506, 69, -955, -394, 165, 250, 294, 6, -105, -54, 191, 275, -164, -246, -653, 375, -575, -286, 387, 320, 137, -89, 334, 29, 21, 156, -402, -656, 18, -477, -480, -199, -316, -148, -155, 747, 405, 352, 717, 624, -15, 160, 78, -617, 99, 623, 121, -12]
6814a2k10p90R46q0R38p41M0J11n01K84k8j1k55m69O61m59O29m11R80n43k82P
6836a96M05L8k33j21N05r63O53m21L01M9r4L57l0l63R36o40l11O21o99k44O79
6857B29K86n18l32Q2L53k83l43j20Q15K45k47k5l9l12L25J65n00M61j80n60N76
6878G8m45J25l9o0P21j61J55o19l11M33Q9L22l70K61J0k17J94j04n08L96k73L35
6900A2m37M83j16n43J211n81K60ql42J205j196K25j99M02q49J78N36K6o79Q16
6920D04K47j280J011J21o55N7L01p54O97J5m97j94L42K41K88l09k42L75l11r1
6940b34L9J7l05Q92q90L23j7p18J213l25P5j4L46k38L05n65J10N4l56P9K97K76
6962C64n58q6J070o96J88n78M32N5j75l65K39J77o0M27j86k76n43L26L23k22K08
$$ y = [-12, -222, -1012, -66, -146, 792, 51, 91, 202, -299, -15, -43, -54, -309, -778, -117, -576, 53, -358, 622, 79, -203, -196, 209, 247, 14, -107, 398, -565, 88, -333, -32, 17, -77, 280, 250, -113, 823, 183, -128, 493, -206, -450, 229, 515, -3, -335, -253, 100, -183, -526, -646, 169, 414, 167, 142, 103, -209, 116, 281, -219, 242, 62, -498, 78, -367, -242, -281, -341, 380, 219, 374, -245, -556, -123, -34, 288, -82, 179, 189, -28, 166, 62, -446, -50, -323, 12, -425, 58, -58, -601, 610, 29, 289, 281, -61, 1144, -52, 173, -26, 376, -473, -295, 241, 267, -412, 404, 651, -629, 382, 503, -152, -95, 206, -548, 149, 164, -333, -527, -185, 56, 344, 35, -207, 168, -143, -234, -195, -178, -483, 409, -481, -158, -175, -893, 320, -5, 70, 56, 402, 164, 469, -96, 14, 68, -288, -209, 88, 364, -194, -280, 790, 94, 282, -296, 136, 191, 16, -349, -110, 67, 7, 434, 248, -28, -571, -245, 78, -144, 64]
6983F4m03l82R21m3J03k83k3L02l31N90l27m53J93J26N30q81Q50p16k50O33r65
7004g45L95l32O55J72l77l78L41K85M40N66m32j3k51k22J26r8L25n67j90l12Q46
7025B34o85M49L58k08l46N76j07l50L40J89n88R1L98o6m92l43M24K44n60M59K72
7046B89K00j066M29j83Q9J42l51J62K59M83l78N3l58J15j44N52l83k44N07K09
7066C82n09l72O03j21k66J33l34J007o01O6M07p0k48J13K11M52m53Jl79l03N69
7087B88l03k5j95J59j4j89J241j584M01P84p26M8k58K27M0Q63o34M45n43L83o58
7108b50k04Q70j81l20j94M45M83q43J44K96q81J20q4M91j9M34r1l31J28j7M12
7129D08r96N08J92M4J4k02L97p83Q1N94l56r83J001N18n21j27L89k11j68M74p37
$$ y = [64, -339, -721, 200, 157, 260, -23, -46, 256, -75, 515, 188, -265, -72, 54, 584, -297, 553, -163, -413, 220, -745, -350, -682, -27, 145, -232, -610, -269, 16, 456, 1022, 590, 577, 326, 104, 230, 132, 457, -110, -300, -612, 234, -451, -2, 356, 148, -198, 378, 271, -79, 261, 450, -138, -47, 351, 285, -207, -550, -126, 118, -442, 17, 289, 489, -577, -148, -331, -242, -100, -451, -289, -30, 453, 75, 128, -230, -115, -259, 293, -90, -334, 173, 382, -127, -499, 104, -17, -283, -150, -484, 523, -78, -12, 395, 325, 77, 190, 401, 853, 400, 401, 22, -281, 288, -15, -40, -235, -76, -90, -279, 962, -622, -221, 563, -163, -115, -373, -146, -106, 757, 123, 568, 25, 408, -250, -454, 416, 235, -85, -279, 166, 649, -194, -50, 246, -635, -515, -599, -108, -127, 307, 216, -115, 13, -4, 408, -588, -80, 112, 156, 170, -32, 365, -418, -337, 257, -99, -1082, -81, 437, -84, -211, 178, -33, -201, 273, -464]
7150d64O40o39J073p09j7n32J084L5K9n21r92J167l58L5J79l49K51k44L64N38
7170E70o90L83p0P68j713Q13m85Q73k03p75N74o43R27J6o17m33J020k26M00R1
7190E80m31JM28l42l93p9K76k0M4j28L85n75k1l11N0J805j071k75M62l28K10r43
7212f76O38Q7K18m31O33j393N59j82J55R38p94N10o25J34M36m87K28K22L23n13
7232b0M06K7J39q78M10k51L88k40J62M14l46j15J54l51J28n84J84P20n36Q69j169
7253d89R15n4n33q13R45p6q1K92p44O10M24q79O29M72m55K90j075K63j3P68o49
7274b53L52q2l6l73L57K03n92j80Q89n60l49J61l09P57m00J325j482J159l94j19
7294G4l46J32L41N9l60k04M67l81m41J266p34N37j80K28P7k90Lk51O8J99J25l63
$$ y = [-464, 176, -463, 610, -99, -116, -648, 436, 471, 500, -21, -1013, 154, -204, -169, 10, -339, -88, -332, 32, 570, -120, 263, 193, 961, -752, 61, -424, 449, 246, -529, 45, -598, 329, 345, -272, -705, 315, 89, 489, 580, 149, 150, 578, 236, -157, -236, 40, 20, 64, -64, 321, -254, -275, -586, -536, 1269, 198, -77, 385, 57, 267, -676, -38, 49, 267, -164, 469, -924, -365, -547, -392, 546, -248, 262, -363, -229, 207, -280, -52, 170, 493, -20, 386, 413, 552, -326, 84, -167, 221, -19, 143, 557, 211, 96, 250, -101, 27, -557, -373, 347, -189, 680, -489, 426, 372, -161, -974, -29, -105, -186, 106, -638, -28, 396, -483, 146, 618, 163, 453, -622, -359, -372, 396, -253, 99, 17, -19, -392, -35, 168, -424, -604, 285, -275, -624, -463, -772, -15, -415, 910, -572, 587, 193, 74, -272, -140, 201, 260, -100, -304, 163, -218, -659, 607, -127, 410, 230, 458, 535, 245, 248, -3, 65, 264, 389, 26]
7316B6j85k21M0k28R46j071O97J5Q5K38n45N76l51j33L31m83k51N85K61J2n16
7337a72O06l16l9k64q4Q49q82Jq4k15Q70k97M09j72J11p68k34P58K3M55l06p27
7359d78Q75k36k6k28n2n12J96N95o51J227l98Lk06ql01L73P74j576K41O77m36
7380a47O61k20m62p5J56n39Q75q24M09N22j77k76K61l52O20j20l34N97l19k97
7400d1J40K65m96P45q75M5L02J14n35P3R77n35o25K09L14O91n22j13O4J69N0m75
7422e9J61O12k92k38p17Q27n0M6j16l29l5P33k68k90J95j012M06N19Q72o48k6
7443B91K98l89l67K68K67J09r39O92p31O32k8l07O85m85L61j308O52k77N64K32
7463B20k35o11M0O52n13J039o04L15N7j73R4n98Q6k61J395r77L40n35M41O3k35
$$ y = [26, -159, -380, -340, -568, 378, -693, 4, 19, 104, 342, -203, 373, 22, -111, 220, -263, -514, 71, 332, 344, -172, 434, 118, 79, -185, -269, 580, -302, -301, -385, -600, 270, -27, 382, 210, 321, -447, -681, 77, 100, 555, 249, -478, 397, 161, 135, -93, -145, -657, -461, 134, -517, 710, 312, 315, 109, 101, -200, 173, 947, -629, -388, 289, -147, 514, 294, -168, -243, -87, -626, 249, -575, -166, 356, 179, -97, 164, -188, 432, 312, -22, 575, 256, -41, 99, 364, -132, 613, -262, -217, 85, 199, -336, -263, 714, 179, -446, -237, 77, 768, 246, 133, 197, 366, 416, -59, 102, 714, 422, 184, -533, 294, 244, 290, 174, -155, -190, 543, 275, -15, 180, -832, -426, 93, 965, 317, 291, 589, 200, -167, 101, 368, 477, -462, 230, -501, 131, 103, -204, 481, -4, 357, -951, -299, -576, -12, 220, -15, -626, -586, 66, -447, 592, -12, 303, 360, 187, 281, -317, -231, -492, 903, -74, 266, -269, 172, 235, 0]
7484@k76M35M86j36n78l50P26j85L1q1j72K00o9K23n02p14R57k86l30M24l85M78
7506a04P14o82m80P48J79n88M55k3O6k73K89O1l53N42J08p91P1j97q7n39P55L98
7528B69l97K65J39L73n33n51L60l2L18n53O40j27J21m67j57J44N4R47j202O44
7548B55j28J9q85P32J03K76l36K92Q5k42j06m5j013RJ023p89K51R79j90p16K37
7569a89K7M5k14O76r35J158n95K8l43N41k07J12r8N0R48q82n79J091o22Q34p18
7590A28J57N08r64k70l11J327r15P26l25L38j18l82j14K34k42p3ON04m72k5K44
7611c9j03m0N93l03J00n62K64O84j172K39R80k16p43P78k78l32j27J23JL19O3
7632B29p1k50K6K02l84M46j22J1L86p17O18n26K94m51O67k97n90mK43P70j51o1
$$ y = [0, -276, 159, 645, 509, -69, -419, 307, 122, 153, 72, -100, 100, 31, 254, -248, -962, -5, -291, -621, -197, -582, -104, 610, -72, -552, 196, 375, -213, 242, 219, 285, 12, 301, 362, 9, 551, 659, -132, -61, -258, -345, -884, -129, 269, -128, 137, 276, 649, 116, -435, -75, -107, 211, -342, 298, 171, 292, -175, -332, -188, -134, 813, -389, 255, 127, 146, -739, -7, 96, 372, 36, 328, 413, 171, 65, 20, -993, -984, 39, -750, -499, 480, 290, -426, -189, -162, -117, -331, 345, -590, 568, -27, 1, -342, 199, -8, 104, 6, 56, 1004, 122, -457, 634, 12, 846, 128, 285, 793, -171, -441, -752, 575, -340, 386, 61, 399, 281, -101, -215, 19, -223, -296, -290, 214, -258, -283, -39, -142, -182, 411, 108, 208, -354, -90, 594, -578, -339, 641, 425, -318, 460, 182, -150, -277, -154, -153, 166, 229, 158, -92, -66, 136, -248, 198, 76, 87, 473, -244, 374, -152, 142, -309, 358, 61, -529, -533, -290, 480, 329, 268]
7654B68j38J82j40q09M41N7k65L44J73J87p84O14n0l27J18M45m57J60r8j95O68
7675C94o53O31l86j70k87J67L09n92L40L47J89r8L7j98K34K89o58J65LL00n49
7696a86N67n65L78n67k70J228q31L30l3j86K05K1O2k40J99p07K69L53K66M34r74
7717b47O5j0P59n92m48J059j075J078n45k62L45k07j52K91P01j418M29M38K94
7736E03o39K69Rn03P1K98r12O86j7l8M61l2l98j43O51o30j67P01Q2j17o27R46
7758D54j256Q19L79Q6K82m69l13N0r1l7L5q24J101J29j154J322l79N71q57K15
7778F3O2j1n6k65N39n22P76n29J96o68L27Q64m13k86l05l34R19n93M62l37j25
7799b36J141J75j541L04R2k99O09k18K83L05n81N53q46O11o72J20N25k03n27L13
$$ y = [268, 130, 312, 172, -637, -196, -139, -404, -60, 113, 300, -484, 130, 80, -247, -129, 316, -141, 19, -79, -274, 394, -259, 372, -14, -184, -471, -304, 5, -587, -247, 100, 289, 191, 228, 30, 264, 553, -105, 60, 63, 363, -186, 381, -184, 194, -373, -643, 585, -246, 84, 51, -135, 70, 91, 153, -87, 112, -595, -326, 27, 293, 727, -247, -182, -192, 567, -25, -473, 586, -489, 589, 44, -218, 127, -80, -232, 59, 760, -658, -229, 209, 503, -136, 133, 142, -361, -290, 8, -904, -218, -235, -273, 188, 156, -242, -385, 266, -364, -531, 170, 252, 135, -492, 454, -802, 17, 396, 482, 764, 295, -18, 32, -59, -96, -61, -885, 216, 345, -809, 513, 134, 705, -152, 63, 125, 114, 58, -207, 332, -190, 586, 57, 253, -415, -88, 776, 363, 77, -228, -562, 357, -236, 226, -111, -236, 905, 1080, -461, -157, -65, -364, 245, 27, 310, 615, 34, 587, -259, 352, -320, -200, 325, 122, -405, -92]
7819i2k25N52j05K3N67n60o07J44J85m7P52n23l53Q9N64n51M04j00r70m09R44
7840c18O13n55M07j17l94M13k83q8L87j05JL88L91n76j93n07M69J09j13M12j67
7861A74n67K62L34p1l77m18J111m30K6q4m84P04j31K37K70j205K68O92J80k60
7881B31K64r68P82o33N22m82l30J71q1J0M66J4R9m04K96j29O1M06q74j29J185
7902D77j40r20m07J152o31N49N22j178J014j181J105l34j82Q11j017Q1p7P82q23
7921c97J68K58P32p78p62P86q47J059n71R63o71l34J014k91p95J40p3J80m42Q77
7941B16k37Kj52M44q2p14J93P14j94m69P20j127O41m60P1L97M2l53M30m71P28
7962C39l00n25M12O64p50J19N05m36j29l6K80j17L62l69M34m58q3M26j68j92n72
$$ y = [-92, -317, 235, 130, 153, 720, 160, -447, -303, -118, -165, 587, 64, -289, -200, 364, -187, 217, 117, -853, -1262, -318, 295, -260, 147, 30, -364, 49, -234, -322, 65, -40, -39, 349, 740, 164, -29, -536, -67, 42, -71, 341, 174, -393, -131, 203, 132, -245, -663, 448, 18, 44, -40, -524, 180, 49, 286, 556, -649, -381, 311, 491, 231, 495, -473, 309, -324, 198, -284, -614, -443, -524, -514, -48, -34, 65, -339, -43, -172, -111, 295, -579, -708, 477, 337, -583, -990, 162, -469, 80, 602, -576, 438, -743, 362, 28, -154, 657, -360, -279, -356, 426, -397, -229, 29, 761, -17, -779, 7, -840, 219, -352, 611, -60, -394, 620, 329, -466, -326, -399, -219, -661, 216, -21, -19, -171, 273, 191, -523, -330, 384, 190, -279, 441, -686, -45, -505, -434, -37, 5, -348, 82, -389, 339, 39, -486, -74, 590, -160, -41, 464, 28, -101, -137, 143, 26, 388, 19, 453, -5, -88, 338, 170, -22, -594]
7983e94P05n04P47k40J20m82L76M51j53m15O98r50P1N35o11M3P9M27J13j59n2
8004B05j067O44O09o34Q26j201M42l40J217m33r89M83K90o09L58L03O3m05O14
8023C76l96m40M60k16L24k14j00J43l63N56j30L04p71J34J158j165Q74Q3m70j82
8043c5J34q69Q38J55q08OO84J16N4p70O85m97p6K13P66n15l02n6J12R02j008K5
8065b46N77J92p62N61O6n8j02N84j308J69Q80n06M27K4P7k76j16o59K5L45n39
8086f45K71K61l72J42O09q3j03k79k8n5N03K31j42m09M3r2l6P20o03N33k9k44
8108A93l64k07P62o71O00k23L30l81J95l13K99o27J238j000j27O22n07K66j15
8127c0k40p1L5L98K62m87L31l39k64K52N37k33m01J089j206K91J0J02l64L09N26
$$ y = [-594, 111, -393, 354, 114, 234, -248, 128, 579, 426, 11, 709, -241, -170, 365, -246, -203, -124, 303, 416, 257, 205, -862, -218, 391, -243, 583, -618, -176, -516, 701, 268, -721, -238, 52, -557, -199, 104, 167, -238, 376, -20, -460, 0, -216, 108, -106, -206, -63, -426, 130, 0, 304, -467, -333, 825, -340, 534, 617, 147, -35, 99, -770, 68, 223, -585, -579, 105, 221, 275, -495, 190, -307, -383, -170, 596, 81, -221, -277, -165, 737, -271, -246, 331, 523, -239, 322, 388, 330, 228, 812, -496, -327, 553, 47, 474, 498, 575, 299, 183, -476, -451, -106, -645, -374, -113, -485, -343, 266, 183, 80, -199, -227, -282, 221, 452, 310, -99, -56, -148, -184, 536, -67, 466, 437, 193, -171, -378, 384, -287, 313, 90, 420, 39, 234, -79, 220, -407, 831, -169, -296, 326, -181, 85, -30, -270, -341, -306, 92, 354, -133, 198, -141, -405, -153, 384, 151, -250, 839, -367, -76, -66, 36, -328, -19, 507]
8148E07j158J007r68O57N75p64O00q95Q42j40p37J151n54J70l63m66J153o61M32
8167C88n20L0M53l59O51j112N19J74r13J86K72L64N40n88j27p4k98J37nJ011p26
8188Cl37P07r76
$$ y = [507, -651, 356, -612, 45, 620, -144, 456, -439, 403, 263, -474, 677, 123, 293, -70, -536, 617, -44, 388, -132, -102, 351, -8, 643, -469, 50, 224, -689, -503, -231, 133, 673, 85, -42, -116, -414, -277, -282, 729, 3, -334, 373, -603]
8191f03
$$ Imaginary data points
##PAGE= N=2
##DATA TABLE= (X++(I..I)), XYDATA
0@%%%%%%%%%%%%%%%%O4j28J28j28J28j32J96k56K57l21L85m49N14n78O95p86Q66
33D55r73J111j275J442j605J796k014K247k498K769l067L395l755M148m574N045
49B647n561O121o741P430q197R055j0013J1095j2334J3769j5447J7440j9855K2866
63A2275k6726L1869l9140N0280o9657J13085m16490J22434L26473n38649J97653
74b36593M61222k16580k86556M63739R1353m09176Q3769L69582k75262k24826
84a79328L27997P9228l70880Q1222K98503j96613k20392K83997Q4907l16841K5374
95a02826K90811j68625k32884K42952J16049l14497J5628L07969j36453k30992
105b12868K72482J39467l06154J8180L08901j62890k49091K49874J01487l28371
$$ y = [0, 0, 0, 0, 0, 0, 0, 0, 0, 0, 0, 0, 0, 0, 0, 0, 0, 64, -64, 64, -64, 64, -68, 128, -128, 129, -192, 193, -256, 258, -320, 375, -411, 455, -518, 593, -682, 760, -845, 951, -1063, 1184, -1314, 1455, -1612, 1783, -1972, 2176, -2398, 2647, -2914, 3207, -3534, 3896, -4301, 4754, -5259, 5836, -6498, 7271, -8176, 9264, -10591, 12275, -14451, 17418, -21722, 28558, -41099, 71986, -344504, -222070, 104403, -434246, -236593, 224629, 8049, -278507, 185232, 276585, -132591, -48822, 320760, 45498, -179328, 148669, 227897, -142983, -61761, 236742, 40129, -180263, 103734, 188641, -128200, -102826, 187985, 19360, -213524, 29428, 145477, -169020, -153392, 154577, 18124, -212868, 59614, 199081, -107073, -88893, 220008, 57118, -191973, 57901, 159388, -168983]
115a68983J9999K94282j60474k13375K68855J15535k74579M9146K82067j44152
125F8321j93782K22476P3259k81454Q538K22758j46039j85612K05060R4439k21095
136a33131L9295K47696r4738j53520J97478R1560k29687j374J99407j25746j88527
147a51287J58645P1226k26132N258K11353r4411j49185J87504R8192j91847K2865
158e7819K05990r4550j50400J60118P0173k01115K992J80968r2483j45050J52323
169C1147P7867j76815M880J76730q0055j44109J34987P1374j81212j2539J64138
180F6393p5557j41403J34988R0363j52771J0782J88659n2486j28495J34655P6323
191A51451j75760k3204J45227q4323j46953J15245P3160j51549K384J64740n1030
$$ y = [-168983, -148984, 145298, -15176, -228551, 40304, 155839, -118740, -69594, 212473, 68321, -125461, 97015, 170274, -111180, -102642, 120116, -25923, -211535, -6475, 87964, -133131, -93836, 153860, 59122, -94398, 103080, 194640, -35047, -36421, 162986, 37240, -151287, 7358, 78584, -147548, -142290, 69063, -25348, -174533, 12971, 111163, -80684, -57819, 148171, 53621, -96779, 63339, 133512, -67603, -64611, 116357, 23874, -121176, 31147, 109014, -67801, -62921, 113809, 33754, -110355, 24632, 96006, -85206, -97745, 66393, -9164, -150567, -15579, 74784, -77987, -67205, 121454, 68968, -59527, 75128, 151451, -24309, -47513, 97714, 13391, -133562, -18317, 54843, -96706, -94322, 70418, 19388]
202A9388j14060J23855P5982j38497p027J41447n8659j21974R4795O1694j40153
213f3209k2607J31490m2163j11989R9209Q7640j08414j1947J40053k9484j18963
224e0384P6895P1356j30118m1935J21111l4924j21685Q0984Q7492j08016k2241
235g1465J39030j7030j11773P7960Q2288j15298l9323J15623k9547j18786O6639
246b1682P7907j01889k8817J24697q292r8647O9874Q2612r4181m1111J02597k0756
258D2312j14605M4390P3092r0697m2572J08965K275r2983N7391Q8670p4626l8055
270c6443J03503J98j04535L6651P3972q8937n6277R1434Oj02264M2194Q8405o7268
283a9361l9837J05535J4247r4539L7648P8851p7991n7685Q5807O18j04301L0611
$$ y = [19388, -94672, 29183, 105165, -33332, -40359, 101088, 42429, -79545, 15250, 76944, -63209, -85816, 45674, 3511, -108478, -9269, 78371, -30043, -41990, 98063, 68579, -50384, 26511, 97867, -32251, -74186, 46925, 12001, -109684, -28700, 58792, -49224, -71465, 67565, 50535, -61238, 16722, 99010, -16288, -55611, 60012, 30465, -88321, -21682, 56225, -45664, -74481, 50216, 41924, -56723, 13151, 95763, 1582, -39529, 63068, 42312, -72293, -27903, 45189, -45508, -88080, 20885, 23160, -69823, -12432, 76238, 1612, -36443, 67060, 67258, -37277, -626, 73346, -15591, -71868, 19566, 19572, -82692, -40498, 47907, -19361, -59198, 46337, 60584, -33955, 3693, 82544, 4553, -53132, 32675, 33293, -71008, -40397]
295d0397Q2750o7165m6434J00949K0113q8376L5836Q6621o5869n8985Q1935N629
307D6607j05095J8242P7565o4615n2284R0241K5324q3461K9803Q9361n4509n4624
319c7445Q1191J9396r5928J1318P7056n9095o4635P4520K0969q9018J7056Q6060
331D1445m3746n1891Q6939L2029q4614J2064Q0788n6710p1508O7449K1354r4862
343f1263Q817Q7599l9540n7344Q2049M0389q2823R239Q4128m7233p0829O6439
355A9628K6117r3337M32Q2692m1992o5877P3227M2114p8623N816R1684l3311o6203
368c7633O5975L6434q7604j1197P6374l9661p3283O1748M1503p6494P93Q9855
380D6810k4790o4690O5240M4076q0072j0726P6752l3251p5371N1515L8517p9759
$$ y = [-40397, 42353, -24812, -71246, 29703, 49816, -38560, -2724, 83897, 18028, -40957, 40978, 46607, -58488, -40246, 37319, -27296, -79580, 10661, 35985, -47476, -17673, 71688, 17179, -37445, 43746, 63142, -32786, -21468, 55588, -3507, -68142, 6378, 27347, -61671, -44615, 41445, -2301, -54192, 32747, 64776, -19838, -7774, 73014, 16304, -55204, 12245, 33599, -61263, -52446, 35153, -4387, -61731, 20318, 60707, -22116, -12877, 71251, 24018, -46811, 19628, 45745, -47592, -47160, 35532, -6460, -72337, 890, 43004, -35619, -29803, 61881, 28570, -37633, 28342, 64776, -22828, -34025, 42349, 2688, -70595, -8847, 32656, -43838, -43045, 46810, 22020, -42670, 22570, 66646, -13426, -24152, 52600, 19349, -56022, -4507, 34010, -45749]
392d5749j0471Q2900k0132o2363O1930N1875o7547q292Q0332k4695p5720M5865
404G933L9089q0302k0711P6907j7924o8332N5068N6549o6527j2742Q2132j3455
416C7685p2702M4023M5659p3802k5000P1885j6790p3623M6320N3398o2798j6074
428d1819Q1503n992o5872M4347N0796o5587k6774O8704j4612p4672L4217M8213
440C2452o2929k4472P3581k022o3141M1216N8237n4390k3245P0698o842p2823
452c3680K7673M6530o1817l3525O7359Q24o2314L6894O1159m9025k5487O9890
464D4481l80p2241K3889M8775n8228l6116O2713K232o7283K8817N7428m6397k8837
477d1147O8716R802o3262K6039N5973m9934l7566N8300K132p0440J6046N5132
$$ y = [-45749, -56220, 26680, 6548, -55815, 6115, 57990, -9557, -17849, 62483, 37788, -37932, 7933, 47022, -33280, -53991, 22916, 4992, -63340, -8272, 48277, -18250, -30992, 51140, 37685, -35017, 9006, 54665, -19137, -44137, 27748, 10958, -62665, -16345, 37053, -25745, -41819, 39684, 33692, -32180, 12167, 62963, -2624, -29398, 39306, 24694, -49978, -15761, 32452, -30477, -54949, 18632, 16610, -46531, -5315, 52922, -1468, -24713, 45985, 39143, -33680, -6007, 40523, -21294, -54819, 12540, 13364, -48950, -12056, 49103, 78, -25409, 44481, 44101, -28140, -4251, 44524, -13704, -49820, 12893, 15125, -52158, -23341, 34087, -12310, -41147, 27569, 37371, -25891, 148, 56121, 6187, -31379, 26921, 29053, -41387, -25341, 29791]
489B9791m6334l5141O5020J4838n9087K3988O0112m2845l6981N7478N285o9329
501c3205J1134N3156m6491l8754N8938J3585n8630K1249O0941l5571l3195N9079
513C2236J4245o2594J1072M9220m3433m3394M9254J1758o1515J3064N9396l0773
525a464l6469N7510K0148n9885P317N4363l4653m6313M8954J8117o2354N390N9551
538C0212k9587m1520N4022K5189n7213O630O0266l0446m7426M8467J8585o5962
550b8783j140N5526l3662m6488N1356K4106n4283R617O3447k4807l9870N0835
562B5854K1773o1529P39N0450l3752m7901M3313K1698n6538L892O0287k0278l9793
575c1785M7808K7701n5399k446N2012k6008m9552L8417K5103n7124l137N8223
$$ y = [29791, -16543, -51684, 13336, 28174, -30913, -6925, 53187, 10342, -26639, 30839, 36124, -33205, -22071, 31085, -15406, -54160, 4778, 18363, -40267, -19018, 41923, 6352, -26843, 32236, 46481, -16113, -5041, 44179, 746, -42648, 6606, 18364, -43151, -30087, 29309, -1464, -37933, 19577, 39725, -20160, -12843, 41520, 6867, -39446, 9508, 27625, -34729, -29339, 30212, 625, -40895, 13127, 38316, -18897, -12267, 47999, 17553, -29873, 18594, 37179, -28783, -29923, 25603, -8059, -54547, -3191, 20915, -33368, -23751, 39696, 14889, -24981, 25854, 47627, -13902, -13163, 37287, 3535, -44366, -1053, 20645, -35893, -32001, 28286, 8008, -31785, 16023, 43724, -11675, -14121, 37891, 11883, -37669, 748, 25851, -31273, -34410, 23813]
587B3813j9148m5174M5122L2334n3709l046O0183k0232n0625M1479K8989n9688
599a9702p707N4876k3303n0062M3802L0692n4398P60O3116j9853m6613M2181K7576
612D1365o0489p255N3518k5654m8393M1950L0038n1256m75N8610j5112m3654M1721
625A4914L0120n3119p484N1085k1982n1068L4120K6983n3239p966N6000j3769
637D595m3860M1607L5378m7628o258N5136j6807m8955L3122K8060n3629j1156
649c0395N3932j5601m7869L7236L4535m9428q008N5914j2359m8040L6501L1017
661C7435n0683j1913N1475j6982n0326L4141L2416m8888o605N7839r652m4760
673b6503L7012L3010n0122j2889N0472j8163m9653L1010K9150m7983q947N5090
$$ y = [23813, 4665, -40509, 4613, 36947, -16762, -19808, 40375, 20143, -30482, 10997, 39986, -19702, -27409, 27467, 4164, -45898, -2096, 28596, -25802, -25042, 38074, 18221, -28392, 13789, 41365, -19124, -26379, 27139, 1485, -46908, -4958, 25080, -26176, -26651, 31959, 16847, -26807, 14914, 45034, -8085, -15569, 35516, 13534, -37534, -3414, 23569, -29670, -37636, 18364, 4595, -39265, 2342, 37720, -9908, -16166, 38970, 22163, -26792, 6330, 34390, -19239, -30395, 23537, 7936, -39933, -2697, 31838, -17590, -25598, 30316, 17957, -30083, 6418, 37435, -13248, -25161, 26314, 9332, -40994, -6853, 25563, -23325, -29930, 27909, 18257, -26503, 10509, 43519, -6603, -19492, 30980, 12817, -36836, -5826, 23324, -24659, -33606, 21484]
685B1484j0688m2038L6568L2999m5498r948M9321j4182m7783K8034K8412m4659
697a7978j3097M7834q201m1973L0087L3576m0929j0238M8829o425m3630K5579
709C434L0775m2537j7426M5459q857m6844K5438L4108m0211j2422N0536l655m1220
722b3422K8358L2991m1207j5942M2611j0630m5692K3674L0197l8789j1539M8324
734A8934m803l7693K6227L0426l6067j4290M0302o892m0396J9288K7043l4671
746a2592j4461L9108k114l7104K1745L1209k9850j4307L9618R35l9138J6352K8385
759B7786l3968j8546L5871j970l7898J8194L1390k7790j5011L9943K01l5601J7232
772a67K9090l1258j6574L5274j922l7563J3990K6677k8511j4496L4948K777l0467
$$ y = [21484, 10796, -31242, 5326, 38325, -7173, -17121, 32200, 18018, -29765, -1731, 26681, -17978, -31075, 16759, 8558, -33415, -3328, 30248, -10681, -20919, 27910, 21485, -22145, 3434, 34209, -8328, -25754, 19705, 10848, -35996, -10558, 23550, -16661, -29083, 21453, 17798, -23422, 4936, 37927, -3280, -19222, 23389, 12759, -32933, -9259, 20938, -17851, -29390, 18934, 14131, -23562, 2665, 33091, -2976, -17266, 23036, 16144, -24252, -4964, 22079, -12592, -27053, 12055, 9941, -27163, -5418, 25791, -4059, -18366, 21252, 22187, -16951, -599, 27786, -6182, -24728, 11143, 9173, -28725, -10531, 20859, -6931, -21942, 18001, 18202, -17399, -167, 28923, -2335, -18909, 16365, 14443, -23120, -9130, 17547, -10964, -25460, 9488, 12265, -18202]
785a8202J6772K8257k4478j5473K9304p37l4057R141K4245k3894j6854L2027N287
798A1338k8360J2484K7868k0166j7045K8550L522l1587P414K4423k1484j9530
810b2573K7386O328l1500Q682K7460j7972j7404L0699N624k7996P605K6802j8974
823D167j9686K4471L906k8776M479K3169j6191j6403K4990R586k4799O918K4806
836B0637j4881j8062K1533N891k8127J056K3061j4115j7584K1612J1258k2133
848i854L315K5146j1513j8616J9203Q166k5384O44K1160j1149j9608J9128J1032
861A1670k3540P74K4223r301j7720J9026J1614k1837j248K3128j0298k1559J5561
874D93R488k2933j822K3108q356j7314J8192J4455k0575q75K2881o842k0633J3754
$$ y = [-18202, -1430, 26827, 2349, -13124, 16180, 15443, -18614, -9473, 14772, -9122, -25976, 6051, 11338, -17022, -4538, 23330, 3164, -13881, 14669, 18191, -13396, -5982, 18441, -3043, -22573, 4813, 11141, -20359, -11677, 15783, -2189, -19593, 11106, 16730, -11266, -3661, 23141, 4167, -15519, 8952, 12858, -15918, -11439, 11730, -4461, -20864, 4126, 13712, -11087, -4169, 20637, 5756, -12306, 9227, 15118, -13009, -11953, 11108, -3007, -20591, 1021, 12279, -9854, -6539, 18607, 7094, -11522, 7681, 15847, -9537, -8893, 12267, 1118, -18490, 638, 11670, -11870, -11096, 13127, 3826, -13894, 5132, 16746, -5091, -6339, 16789, 6491, -15068, 493, 9981, -12952, -14774, 8334, -22, -17336, 856, 15311, -5264, -6139, 16742, 9900, -10733, 3021]
888C021J1961k2506n633K2018p083j9131J4643J3903j7991l716K3165l814j8794
901i957J3023J3617k0984n905J8822m973j9797J3236J3751j7538m030K1525k036
914H754j9007J1489J4254j9718o782K0640m170j9107J0641J4541j6900o983K1091
927H743j931j9345R982J7257j7166o511K1005j232k0393Q409J4972j8652r870
940a4732J9368j358k0320J0587J7692j3552p678K1531J532k0601P709J5377j7525
953a970j0608J7881P92k0607Q828J6882j5230p581J9031K273j9368P023J6923
966A4269j5181j1217J9199J542k0093O990J8092j4860j0628J9291K389k0896P316
979c787J7428j4308j0611J9655J521k0563N616J7258j5172j2203J8803L220k0052
$$ y = [3021, 14982, -7524, -13157, 8861, 1778, -17353, -2710, 11193, -6798, -10514, 12651, 8837, -9957, 3066, 16683, -4301, -10206, 8616, 3643, -16154, -2918, 10833, -6705, -10735, 10790, 8754, -10253, 1236, 15490, -4228, -11010, 9630, 5460, -13647, -3006, 11535, -5365, -12348, 8743, 6812, -12533, -2551, 14706, -2460, -8971, 12034, 10802, -9591, -1182, 13790, -4862, -14732, 4636, 3278, -17042, -6455, 11237, -2315, -9993, 11538, 13070, -7531, 178, 15555, -1970, -12578, 5303, 6095, -14512, -5684, 11198, -4032, -11613, 7418, 9691, -9677, -2654, 14269, -912, -12129, 7070, 8612, -11481, -4491, 13601, -1259, -11887, 7404, 9793, -11103, -3787, 13641, -667, -11278, 8377, 9898, -10665, -5049, 12209, -2963, -15166, 3637, 6857, -13195]
992a3195P044J9242j2937j0382J9931L273k0038M141J6071j3310j3394J7056L754
1005G256j9977M337J9248j1812j1131J7540N695j9518M238J8064j2480j1923J5039
1018D576N454k0121J707J8100j0550j2247J7584O340j9546K716J9947j1328j4327
1031a1695J6555O102j9214J449J8790j0628j4131J6210O393j9162J541J7988j0027
1044A71j3167J6282P300j8478J824J8872j0329j4221J4059P829j9216P30J7665
1057I321p178j2961J5661P473j6887K00J6573r707j4801J2836P061j6731p02J8441
1071H599o174j4106J3912R138j6425j383J6934o537j4572J3403Q256j6753q47
1084f555J6659n827j5346J1968R023j7414j768J7511n400j4884J3150J0231j5420
$$ y = [-13195, -6151, 13091, 154, -10228, 9703, 12976, -7062, -2921, 13150, -160, -13554, 3502, 7256, -12721, -8384, 10864, -948, -12079, 5461, 11156, -8362, -4124, 13940, 1460, -10463, 4576, 10030, -10091, -8384, 9716, -834, -13081, 4503, 10843, -8703, -5987, 13960, 2632, -11695, 4860, 10962, -8252, -6803, 11987, 1359, -12772, 3438, 9831, -9331, -7790, 10198, 171, -12996, 3286, 10586, -7892, -6068, 12804, 2475, -11746, 2313, 10142, -9074, -8344, 9321, 2143, -10818, 4843, 12316, -4571, -4371, 12202, 2495, -12306, 530, 7591, -9140, -9842, 8599, 2425, -11681, 2231, 11369, -5056, -6439, 10495, 3958, -10614, 2789, 11045, -5708, -6555, 10104, 4277, -11069, 899, 9922, -7492, -9260, 8251, 2851, -12033, 1117, 11348, -4072]
1097d072j902J5243m587j4552J0670Q945j5958j638J6145m728j3320J1084J0408
1110A1738j5885k825J5005m279j4199R631R466j4854l252J6708l228j4100J0426
1123C52J0222j3271m733J5753l154j4272Q733J0287j3652m697J5943k368j4649
1136i506Q259J0822j3243n345J5245p29j4567Q459J0485j3455m756J5480k076
1149E073j4544Q669J0966j3015m810J4419j918j4295Q286J1234j4036l605J4784
1162G208j639j4203P412J0749j3916m467J4498j488j3198P135J1769j1315m752
1175f207J3530k84j4587N953J0045j1778n341J3220P07j2177N011J2192j1070
1188g86o983J2941o25j3784N217J1811r909o799J4686R30j3299M545J1068j1315
$$ y = [-4072, -5974, 9269, 4682, -9870, 800, 9745, -6213, -7851, 8294, 3566, -9754, 1330, 11738, -4147, -6972, 8033, 3754, -10445, -814, 8652, -6202, -9454, 7254, 4026, -10074, 352, 10574, -2697, -7430, 8323, 5169, -9103, -370, 9917, -3735, -8432, 7511, 5143, -9506, -1247, 9575, -3668, -9013, 6232, 5503, -9064, -605, 9880, -3575, -8331, 7149, 5073, -9471, -802, 10164, -2851, -7661, 6758, 4840, -9455, -1169, 10065, -3971, -7576, 7208, 5569, -8634, -1222, 9527, -4389, -8856, 5642, 4154, -9044, -1909, 9860, -1455, -6207, 7323, 7039, -7548, -1595, 8450, -3328, -8669, 4551, 5258, -6919, -1908, 10284, -786, -7769, 5172, 4547, -9237, -4020, 7791, -2118, -8917, 5769, 6699, -6600, -2055, 9013, -2302]
1202b302p017J3714P45j4344N937J2484r835o187J4146L31j4956N475J1284j1982
1216b507p250J4103O57j3485N552J1060r744o930J1990J949j3441M078J2668r483
1230g83o749J3346J945j2336L105J1818j0067p706J1596J529j3317K876J1491
1243F748q164p640J1650L227j3437L898J1846q806q340J2484K635j3205M266J2419
1257I581q824p467J3146J445j3740L849J0951r057q545J1688K516j4231M286J1897
1271G495r388p828J3366J877j2919M357J2304q878p518J2157J981j2464K945J1121
1285H608q083q004J1695J932j3124L436J0743p165q572J2214K121j1758K782J1566
1299H391p322r732J0831K835j3000K156J1343o483o973J2451L012j1815K552J1935
$$ y = [-2302, -9319, 4395, 5140, -9204, -3267, 9217, -618, -6805, 7341, 7672, -7284, -1809, 9475, -2507, -9757, 4346, 5003, -8482, -2930, 8130, -1614, -8544, 3446, 5395, -8046, -3968, 8700, -783, -7532, 5814, 7759, -4577, -1472, 10346, 279, -7427, 4169, 5698, -7619, -4743, 6748, -1416, -9056, 2594, 5821, -7616, -3718, 8128, -678, -9018, 3466, 6101, -7104, -2838, 9581, 757, -6710, 6436, 7881, -5859, -2010, 8941, -116, -8661, 3027, 5543, -8688, -4402, 7495, -1893, -9721, 3645, 5522, -7397, -3040, 9264, 386, -7132, 5025, 7006, -5458, -2513, 8608, 525, -7479, 4216, 6148, -6976, -3540, 7203, 38, -8534, 3680, 5801, -5957, -3175, 8391, 1069, -8663, 2168, 5003, -7997, -5841, 5502, -981, -7954, 4497, 7509, -4306, -1754, 10181]
1313A0181p733r052J0582K641j3031K518J1034o641p605J0010L030j2026J342
1326d750J0540o170q338J0508K717r888J411J1454o087p912R503L696j1401J632
1340c085J0077n168o988R305M255j1206R68R773p746p361P239L191j0858J286
1354f318J0329m479o860Q919N005j0163K091R388n186p859P565L976r590l17R774
1369F275m534p769Q058L794r500k70R836m592p522P402M602r893N2Q742m410o872
1385f601O492N177q905j04Q864l990n448P253L647q561n31R108m611p028O404
1400A166L539q865q25Q371k581o978O334N017o709q73O702j974p682O250L750
1415D642q437r25P482k127o599O801N080p344n19P891j751p792M258M252q150
$$ y = [10181, 2448, -6604, 3978, 6619, -6412, -3894, 7140, 499, -7106, 2904, 5934, -6092, -4750, 5790, -380, -8718, 1790, 4507, -5381, -3970, 7484, 1397, -6515, 2988, 6684, -4717, -3085, 6992, 1824, -5164, 4141, 8396, -2810, -1842, 7931, 185, -7176, 63, 3254, -7604, -6318, 4011, -468, -7328, 1591, 6596, -3567, -1476, 7912, 2726, -5133, 2432, 6408, -3182, -3499, 6275, 1741, -6028, 2030, 5824, -3676, -3946, 5890, 1298, -6224, 1178, 5780, -4113, -4061, 4681, 271, -6601, -109, 5068, -3837, -3941, 4923, 933, -4515, 2738, 6385, -2176, -2707, 6401, 1790, -5238, 1166, 4705, -4160, -4985, 3386, 805, -6173, 161, 5178, -1531, -2404, 4298, 2324, -5358, 892, 4642, -3795, -4720, 2762, 635, -5964, 837, 5917, -1427, -1946, 5945, 4194, -3598, 660, 4912, -3238]
1430c238k006Q302k503o801M982M969o095j345P541k255o480M829N118n988k230
1445c200P140o72o728L741M011n982k692O815k12o823M418M876m675k147O467
1460D337j328o734K501M048o430l483P008M68m450L138O437l973l344O404J49
1475D748o594K303L998n057k760M804P18p040K968N676n095k134M761J300n120
1490b524R49N921m853l142N870M43o186K037M909n003k967O021J555n227K085
1505a12N627l677m729N848P83p008J244M609l541m645N820R08n211L069N376l301
$$ y = [-3238, -5244, 3058, 555, -6246, -1264, 3705, -2390, -3735, 3806, 1551, -4929, -100, 5018, -970, -3200, 3940, 3268, -3460, 281, 4292, -1690, -4382, 2433, 2221, -4602, -184, 4692, 17, -2130, 4337, 3009, -3725, -1224, 2824, -3606, -7089, -81, 387, -4063, -925, 5512, 1539, -1805, 4599, 4748, -1846, 457, 4455, -602, -3362, 1442, 2160, -4880, -1912, 3764, -1331, -3465, 1296, 2596, -2524, -1575, 4346, -507, -3649, 2221, 2664, -3522, -1485, 3424, -1579, -4546, 1475, 3030, -2197, -112, 5515, 1838, -2891, 2957, 3740, -3268, -2024, 2585, -956, -5601, 219, 1127, -4084, -1015, 4361, 1060]
$$ [...]
8191C52
##END NTUPLES=NMR FID
##END=
