##TITLE=1H_UK-26
 CD2Cl2
 8 sc, 
 17.03.2022
##JCAMPDX= 6.0         $$ Bruker NMR JCAMP-DX V2.0
##DATA TYPE= NMR FID
##DATA CLASS= NTUPLES
##ORIGIN= UXNMR, Bruker Analytische Messtechnik GmbH
##OWNER= root
$$ XWIN-NMR		Version 3.5
$$ Thu Mar 17 10:43:34 2022 Russian Standard Time (UT+4h)  she@DPX200
##.OBSERVE FREQUENCY= 200.131346
##.OBSERVE NUCLEUS= ^1H
##.DELAY= (6, 6)
##.ACQUISITION MODE= SIMULTANEOUS
##.ACQUISITION SCHEME= undefined
##.AVERAGES= 8
##.DIGITISER RES= 18
##SPECTROMETER/DATA SYSTEM= spect
##.PULSE SEQUENCE= zg30
##.SOLVENT NAME= CD2Cl2
##.SHIFT REFERENCE= (INTERNAL, CD2Cl2, 0, 15.7039)
##AUDIT TRAIL= $$ (NUMBER, WHEN, WHO, WHERE, WHAT)
$$ ##TITLE= Audit trail, XWIN-NMR		Version 3.5
$$ ##JCAMPDX= 5.01
$$ ##ORIGIN= Bruker BioSpin GmbH
$$ ##OWNER= she
$$ F:/spectra/data/she/nmr/H-F/1/audita.txt
$$ ##AUDIT TRAIL=  $$ (NUMBER, WHEN, WHO, WHERE, WHAT)
(   1,<2022-03-17 10:42:35.26 +0400>,<she>,<DPX200>,
      <created by zg, POWCHK disabled, PULCHK disabled
       configuration hash MD5:
       00 E9 B6 7A A2 85 ED C7 34 08 36 98 17 FE 4E 26
       data hash MD5: 16K
       0F 07 72 54 19 62 36 ED 99 A0 38 79 E9 5C C5 C5>)
$$ ##END=
$$ 
$$ hash MD5
$$ 22 DB 60 7D 8E F9 6A 6F 66 6A 08 A5 D5 54 D2 99
##$RELAX= 
##$RELAX= 
##$RELAX= 
##$RELAX= 
##$RELAX= 
##$RELAX= 
$$ Bruker specific parameters
$$ --------------------------
##$DU= <F:/spectra>
##$EXPNO= 1
##$NAME= <H-F>
##$PROCNO= 1
##$TYPE= <nmr>
##$USER= <she>
##$AMP= (0..31)
100 100 100 100 100 100 100 100 100 100 100 100 100 100 100 100 100 100 
100 100 100 100 100 100 100 100 100 100 100 100 100 100 
##$AQSEQ= 0
##$AQ_mod= 1
##$AUNM= <au_zg>
##$AUTOPOS= <>
##$BF1= 200.13
##$BF2= 200.13
##$BF3= 200.13
##$BF4= 200.13
##$BF5= 200.13
##$BF6= 200.13
##$BF7= 200.13
##$BF8= 200.13
##$BYTORDA= 1
##$CFDGTYP= 0
##$CFRGTYP= 5
##$CHEMSTR= <none>
##$CNST= (0..31)
1 1 145 1 1 1 1 1 1 1 1 1 1 1 1 1 1 1 1 1 1 1 1 1 1 1 1 1 1 1 1 1 
##$CPDPRG= <>
##$CPDPRG1= <>
##$CPDPRG2= <>
##$CPDPRG3= <>
##$CPDPRG4= <mlev>
##$CPDPRG5= <mlev>
##$CPDPRG6= <mlev>
##$CPDPRG7= <mlev>
##$CPDPRG8= <mlev>
##$CPDPRGB= <>
##$CPDPRGT= <>
##$D= (0..31)
0 1.2 0 0 0 0 0 0 0 0.06 0 0.03 0 0 0 0 0.0002 0 0 0 0 0 0 0 0 0 0 0 0 
0 0 0 
##$DATE= 1647499354
##$DBL= (0..7)
120 120 120 120 120 120 120 120 
##$DBP= (0..7)
150 150 150 150 150 150 150 150 
##$DBP07= 0
##$DBPNAM0= <>
##$DBPNAM1= <>
##$DBPNAM2= <>
##$DBPNAM3= <>
##$DBPNAM4= <>
##$DBPNAM5= <>
##$DBPNAM6= <>
##$DBPNAM7= <>
##$DBPOAL= (0..7)
0.5 0.5 0.5 0.5 0.5 0.5 0.5 0.5 
##$DBPOFFS= (0..7)
0 0 0 0 0 0 0 0 
##$DE= 6
##$DECBNUC= <off>
##$DECIM= 32
##$DECNUC= <off>
##$DECSTAT= 4
##$DIGMOD= 1
##$DIGTYP= 9
##$DL= (0..7)
0 120 120 120 120 120 120 120 
##$DP= (0..7)
150 150 150 150 150 150 150 150 
##$DP07= 0
##$DPNAME0= <>
##$DPNAME1= <>
##$DPNAME2= <>
##$DPNAME3= <>
##$DPNAME4= <>
##$DPNAME5= <>
##$DPNAME6= <>
##$DPNAME7= <>
##$DPOAL= (0..7)
0.5 0.5 0.5 0.5 0.5 0.5 0.5 0.5 
##$DPOFFS= (0..7)
0 0 0 0 0 0 0 0 
##$DQDMODE= 0
##$DR= 18
##$DS= 0
##$DSLIST= <SSSSSSSSSSSSSSS>
$$ [...]
##$SUBNAM2= <"">
##$SUBNAM3= <"">
##$SUBNAM4= <"">
##$SUBNAM5= <"">
##$SUBNAM6= <"">
##$SUBNAM7= <"">
##$SUBNAM8= <"">
##$SUBNAM9= <"">
##$SW= 18.0517287032376
##$SWIBOX= (0..15)
0 0 2 0 0 0 0 0 0 0 0 0 0 0 0 0 
##$SW_h= 3612.71676300578
##$TD= 16384
##$TD0= 1
##$TE= 0
##$TE2= 300
##$TE3= 300
##$TEG= 300
##$TL= (0..7)
0 120 120 120 120 120 120 120 
##$TP= (0..7)
150 150 150 150 150 150 150 150 
##$TP07= 0
##$TPNAME0= <>
##$TPNAME1= <>
##$TPNAME2= <>
##$TPNAME3= <>
##$TPNAME4= <>
##$TPNAME5= <>
##$TPNAME6= <>
##$TPNAME7= <>
##$TPOAL= (0..7)
0.5 0.5 0.5 0.5 0.5 0.5 0.5 0.5 
##$TPOFFS= (0..7)
0 0 0 0 0 0 0 0 
##$TUNHIN= 0
##$TUNHOUT= 0
##$TUNXOUT= 0
##$USERA1= <user>
##$USERA2= <user>
##$USERA3= <user>
##$USERA4= <user>
##$USERA5= <user>
##$V9= 5
##$VALIST= <valist>
##$VCLIST= <CCCCCCCCCCCCCCC>
##$VD= 0
##$VDLIST= <DDDDDDDDDDDDDDD>
##$VPLIST= <PPPPPPPPPPPPPPP>
##$VTLIST= <TTTTTTTTTTTTTTT>
##$WBST= 1024
##$WBSW= 4
##$XGAIN= (0..3)
0 0 0 0 
##$XL= 0
##$YL= 0
##$YMAX_a= 47713
##$YMIN_a= -46474
##$ZGOPTNS= <>
##$ZL1= 120
##$ZL2= 120
##$ZL3= 120
##$ZL4= 120
##$ABSF1= 10
##$ABSF2= 0
##$ABSG= 5
##$ABSL= 3
##$ALPHA= 0
##$AQORDER= 0
##$ASSFAC= 0
##$ASSFACI= 0
##$ASSFACX= 0
##$ASSWID= 0
##$AUNMP= <proc_1d>
##$AZFE= 0.1
##$AZFW= 0.1
##$BCFW= 1
##$BC_mod= 2
##$BYTORDP= 1
##$COROFFS= 0
##$CY= 11.3945322036743
##$DATMOD= 1
##$DC= 2
##$DFILT= <>
##$DTYPP= 0
##$F1P= 2.36226072786647
##$F2P= -0.459571619588291
##$FCOR= 0.5
##$FTSIZE= 0
##$FT_mod= 4
##$GAMMA= 1
##$GB= 0.15
##$INTBC= 1
##$INTSCL= 1
##$ISEN= 128
##$LB= 0.24
##$LEV0= 0
##$LPBIN= 0
##$MAXI= 10000
##$MC2= 0
##$MEAN= 0
##$ME_mod= 0
##$MI= 1.114404
##$NCOEF= 0
##$NC_proc= 0
##$NLEV= 6
##$NOISF1= 3.799351
##$NOISF2= 2.8
##$NSP= 1
##$NTH_PI= 0
##$NZP= 0
##$OFFSET= 15.70392
##$PC= 1
##$PHC0= -16948.97
##$PHC1= 8.000776
##$PH_mod= 1
##$PKNL= yes
##$PPARMOD= 0
##$PSCAL= 0
##$PSIGN= 0
##$REVERSE= no
##$SF= 200.130013532006
##$SI= 16384
##$SIGF1= 3
##$SIGF2= 2
##$SINO= 400
##$SIOLD= 16384
##$SREGLST= <1H.CDCl3>
##$SSB= 0
##$STSI= 0
##$STSR= 0
##$SW_p= 3612.71676300578
##$SYMM= 0
##$S_DEV= 0
##$TDeff= 0
##$TDoff= 0
##$TI= <>
##$TILT= no
##$TM1= 0
##$TM2= 0
##$TOPLEV= 0
##$USERP1= <user>
##$USERP2= <user>
##$USERP3= <user>
##$USERP4= <user>
##$USERP5= <user>
##$WDW= 1
##$XDIM= 8192
##$YMAX_p= 0
##$YMIN_p= 0
$$ End of Bruker specific parameters
$$ ---------------------------------
##NTUPLES= NMR FID
##VAR_NAME=  TIME,          FID/REAL,        FID/IMAG
##SYMBOL=    X,             R,               I
##VAR_TYPE=  INDEPENDENT,   DEPENDENT,       DEPENDENT
##VAR_FORM=  AFFN,          ASDF,            ASDF
##VAR_DIM=   8192,          8192,            8192
##UNITS=     SECONDS,       ARBITRARY UNITS, ARBITRARY UNITS
##FACTOR=    0.0002768,     1,               1
##FIRST=     0,             0,               0
##LAST=      2.2672688,     0,               0
##MIN=       0,             -46474,          0
##MAX=       2.2672688,     47713,           0
$$ Real data points
##PAGE= N=1
##DATA TABLE= (X++(R..R)), XYDATA
0@%%%%%%%%%%%%%%%%%Qj6J6j6J6j7K5l2L2m0M8n6O4p2Q2r1J05j20J36j53J70j91
39a02K15k40K65k92L25l62M01m41M87n37N91o51P18p93Q73r63J065j181J312j463
59g73J641j852K109k426K831l369M125n275P252j1601M2527k8366k4232O5122
73D7713l7888l5986M3800O752n0746K6255K5787l8390j237M1399k5384k6417L2528
86H186K071l9635J4817K4768k5823o095L3384q401k0676K4184Q194k8253J1191
99b088K2795k6281j1100L0899p783k4825K5037J4562k8465O020K4024k4086j3528
112a4819K8072p404k6361K0511J2231k7441N849K5597j7112r976K6204m618k4381
125a3648J4893J0591k4353J427K2639j2606j2998K1923K870j9867J0036J4297
$$ y = [0, 0, 0, 0, 0, 0, 0, 0, 0, 0, 0, 0, 0, 0, 0, 0, 0, 0, 8, -8, 8, -8, 8, -9, 16, -16, 16, -24, 24, -32, 32, -40, 42, -49, 56, -64, 72, -81, 89, -102, 113, -127, 138, -154, 171, -191, 210, -231, 256, -281, 310, -341, 377, -416, 457, -506, 559, -622, 690, -773, 868, -984, 1125, -1301, 1530, -1839, 2286, -2989, 4263, -7338, 35189, 6823, -17409, 47713, 9825, -26161, 17639, 24391, -26355, -100, 25687, -12703, -13940, 27459, 2075, -24342, 8186, 10257, -29378, -14561, 10207, -15616, -21711, 11673, 3272, -17404, 6780, 14974, -13279, -2088, 20707, -5574, -16674, 14225, 6442, -18383, 6654, 21216, -7249, -1229, 22795, -1291, -14819, 13253, 5849, -20512, -1, 12230, -15211, -9362, 16235, -877, -10853, 15351, 10733, -13648, 1245, 11836, -12517, -11090, 11549, -1057, -14055, 7868, 10738, -9129, 907, 15204]
137A5204j7780n189J5982j0496j4390J6520L810j7795R898J6950j5429n114J9295
150A1466n349j5020J2974M130j7804N001J3098j3298k455J8732m437j2330J4009
163H717M005j8370L078J2393j3317p540J4423k882j2348J1053P379j2403L592
176b220J2989j0890q867J2928j592j4148Q173Q931j2009M29J4568n804p717J3355
190H126J449j3997N224P460j3032k755J2568n382q211J2066L540j1456M823Q921
204I344j0321l224R905n482r671Q921L044j0082M175J0145o571l267R569k589
218C896q939O604L029j0537J221Q778o197m555J0496N59q110N961N371r712j115
233c250P701n990o120Q404J060p657N388O762p396o18R174m339p333O140Q74q566
$$ y = [15204, -2576, -7765, 8217, -2279, -16669, -149, 3661, -14134, -4236, 12714, -2715, -7829, 11466, 6117, -8903, 4071, 8201, -9603, -4602, 8496, -4802, -7257, 11475, 7038, -5292, 8717, 12722, -5648, -2570, 9823, -3494, -11034, 3389, 507, -11841, -788, 6591, -5812, -2220, 10769, -121, -8988, 3940, 2348, -11800, -3627, 5304, -6705, -6276, 8292, 2488, -5229, 8126, 9575, -4422, 802, 8262, -4770, -7525, 5043, -339, -8550, 3516, 7056, -4400, 423, 9344, -977, -4201, 5704, 222, -9449, -528, 2516, -7566, -3391, 6754, 183, -3084, 6485, 3896, -5043, 1561, 4590, -5947, -4726, 4052, -2145, -6700, 3796, 4355, -3755, 2206, 7577, -2135, -3250, 4451, -1539, -7659, 745, 1805, -5852, -464, 6298, -1098, -1716, 7458, 3119, -4214, 1926, 2800, -5766]
249e766K531O060n910p20Q797k233n680O559J963q105Q28N131o301l385O849j022
265d04n244O124M194n757J404N474m941l816N370j687o443L699M040n512R44O692
281D137k284l044N664l02o244K164L044o366j197N510k099l356N847J704m699
296a521K781M169n318k236M431k693m514L668J518m049K562M705l252j036N253
311D468j602m720K628J040n042M19M023l037j236N301K37l446K941J995m517l92
327i40K928l364k894M065K97l622K962L328k784m9L639k384l106L083m78m403
343c722J650L137k841k10M500o91k180K952P39m158K89K230l452j382L302p14
359e51k195L617J835l157Q29L112k707k386K073p82k959J469J813k364J154L581
$$ y = [-5766, -3235, 2825, -3085, -3805, 4992, 2759, -2921, 3638, 5601, -2504, -1676, 3455, -2846, -6231, 618, -404, -5648, 476, 4670, -1087, 317, 5791, 850, -2966, 2404, 717, -5726, -2027, 2013, -3499, -2555, 4137, 1853, -1191, 4473, 4171, -2073, 91, 3135, -3231, -4428, 1082, -1017, -4373, 1474, 3178, -1521, 1260, 5429, 111, -2125, 2306, -387, -4901, -1233, 285, -3764, -1202, 3503, 251, -785, 4468, 2866, -1854, 774, 1814, -3228, -2809, 1214, -1823, -3059, 2242, 2479, -967, 1974, 3969, -548, -940, 1988, -1376, -4270, -205, 92, -3530, -568, 2760, -24, -73, 3566, 1182, -1924, 1159, 681, -3722, -2072, 1065, -1776, -1986, 2514, 1823, -357, 2595, 3334, -824, -535, 1695, -1757, -3139, 163, -551, -2746, 871, 2706, -451, 378, 3490, 783, -1603, 470, -312, -3271, -1802, 11, -2353, -1199, 2382]
375B382j120j761L104n7l490O31J247l003p46K793o10j607L125J297j941J156
391A400J587k552j237J925j710k713K010J572k133R25K878q44p06K090o14k375
407d97P05N00l013j07K554j180o95K655O31j884J301J397k208j004J474j531j844
424b746J854L00j560J796K428j465o95K383n88k288P57K67k030L72J575j452o9
441a161K953O8j787J289J092k292j045J248j351j258J664K69j333J561J361j341
457f3N7K271j326k370J373J14k271L93J868n92M5J826m66q15J752J54k565L38
475b77J583k202j573J932M63r50J350J495q74k31J094j355j302J215m70k106R26
492a282J678j833K01K864rj331J362k2k186k1N84j702j37J856n74j309J953J178
$$ y = [2382, 1262, -499, 2605, 2548, -942, -311, 936, -2067, -2813, -20, -630, -2237, 888, 2185, 244, 1400, 2987, 435, -802, 1123, -587, -3300, -1290, 282, -1851, -926, 1952, 1108, 402, 2492, 1878, -497, 208, 708, -2305, -2412, 142, -1038, -1733, 922, 1553, -331, 970, 2367, 159, -845, 629, -902, -2746, -892, -592, -2152, -356, 2072, 607, -88, 2295, 1707, -581, 176, 443, -1587, -1215, 360, -1092, -1161, 1792, 1860, 73, 1362, 2454, 162, -883, 365, -986, -2244, -580, -311, -1644, -83, 1278, -63, -6, 2265, 939, -1431, -58, 56, -2215, -1822, 46, -546, -501, 1325, 859, 44, 1796, 1950, -615, -277, 1306, -896, -2469, -537, -74, -1024, 326, 1821, 947, 716, 1810, 455, -847, 368, -102, -2208, -1282, 396, -1437, -1236, 1628, 1619, 288, 1650, 1628, -558, -579, 5, -1697, -1834, 22, -552, -1861, 92, 1270]
510A270j039N65J198j601j096J217j318j664J815J151j463O13K010p39q10J510
526A619O2j695M63J11j988PJ674r72m59K368M15k024Q82J315j777j385J508l65
544b41j346P81J18r40J470J614j427j62J997r29k357J409O44k008K19J662o44
561a40n98J708l7q01J330K55k095P5J042j888j197K455M95j413P27J377j104J1
579B02R98q36r22J027n87j936R71J333r95L25J970n69j242J159L49j894K81R10
597E44j428n80J558p21p39K108J007j839O44J121j684r16J346p08j165J326O17
614D91j680P36J816o60p70J609k59j846M78K36j615K72J587q75n08J679J22j421
632f08J059R32j528m99J354j281j450J714K79j018J387J007j350J50J574j428
$$ y = [1270, 231, 796, 1994, 393, -703, 514, -804, -2468, -653, 498, -965, -352, 1658, 919, 109, 1619, 1681, -14, 449, 560, -1428, -1421, 253, -719, -1178, 1190, 1605, -419, 463, 1778, 1, -1384, 124, -241, -1587, -806, -688, -1628, -158, 1456, 29, -133, 1864, 935, -1422, -13, 631, -1377, -1158, 504, -140, -738, 970, 933, 132, 1462, 1717, -378, -303, 739, -1149, -2346, 109, 604, -809, -82, 1295, 191, 202, 1200, 364, -558, 469, -118, -2054, -1083, 250, -745, -420, 1550, 981, -261, 898, 1247, -647, -366, 544, -884, -1464, 94, -627, -1366, 742, 1749, -90, 554, 1675, -9, -925, 421, -287, -1452, -126, 491, -1189, -453, 1363, 703, -67, 1542, 1283, -563, -85, 151, -1464, -1192, 395, -480, -988, 691, 813, -608, 451, 1383, -145, -644, 710, -571, -2021, -307, -28, -1046, 341, 1348, -2, 148, 1722, 294]
648B94j224J537J84k181L65J154j122J64J925l12r49J291P4j927J39J047j244
665g85m79J658l72j393J557J066j435K67J538j296j292J354p08j359J329J110
681G60j587K65J962j020q38J497j76j627P26P34k018K5J793o68m20J561K01j527
699c57J078M71j487m28J415j000j121J381K77j207Q45J500j272k13J505o83j699
716i95R83K36j406K66J331j147k37K014k19j329J112P79j717k34J040j226n95
733a344J654j56j084J153J025j450K74J400j162r01J120m72j437R63R40j395K03
750f69J742q24o70J340j17j309N03Q63j443m16J345n19p31J545J58j131P63O51
768A081j085o53J167m74j113J271K66j158M42J301j009m11J344l57j361O23K61
$$ y = [294, -930, 607, 791, -1390, -1025, 129, -993, -829, 1096, 784, -165, 1126, 1200, -727, -588, 459, -785, -1264, 394, 22, -1371, 186, 1252, -183, 84, 1622, 326, -966, 388, -320, -1679, -350, 760, -827, -562, 1400, 380, -458, 1039, 863, -764, -38, 696, -1322, -1297, 496, -172, -592, 969, 1170, -357, 721, 1192, -295, -723, 692, -308, -1429, -48, 229, -978, -133, 1367, 95, -118, 1387, 704, -995, -12, 224, -1182, -916, 415, -732, -969, 1045, 826, -503, 609, 1388, -329, -563, 477, -749, -1344, 310, 154, -930, 223, 1248, -202, 72, 1472, 310, -591, 529, 57, -1380, -417, 523, -872, -669, 1073, 249, -421, 919, 802, -507, -4, 859, -584, -1000, 345, -174, -905, 640, 798, -333, 430, 1081, -4, -657, 510, 36, -1077, 194, 460, -698, -256, 1045, 36, -375, 969, 612, -749, -126, 135]
785A35j076L66J126q76m33J636k60j220R82O93j415p9Q78r36o76J419K2j068J034
804B52O70r38N7J106q42q64Q10j70j127O87P64q59R2J129l89p51J119o9j414M60
824b77O29j165j46J155k35p84J172K87r54M94R09r21o96Q22j92r86P99L42p13
843d60K61J148o88m94J009k10j118O24J52j000J73Q67n51m44J194k9p92O27N69
862H38r34k04R13p81p54R81L07r33M13P62q02K42P30o17p12Q50q4j011L82P35
882C21o36j71Q71k56l48N38L72j015K14M14o20k83P93Q2p98Q72K92o41p8O65m15
903A73o01P41l95n79P07K42r09L87R35o05m87O24J57r66M86L66p78q9J047m59
923cl39Q17J68o33N3N87q10j35Q44o17m57N95K35q14N26N08m43l48Q98k86q96
$$ y = [135, -941, -575, 551, -325, -758, 878, 618, -602, 380, 1073, -342, -421, 457, -479, -1155, 264, 286, -782, 252, 922, -16, 41, 1147, 305, -559, 251, 81, -1046, -359, 405, -454, -362, 767, 378, -373, 746, 677, -737, -277, 352, -813, -959, 196, -39, -823, 349, 636, -318, 176, 1085, 164, -532, 290, 98, -888, -89, 253, -460, -199, 949, 261, -233, 776, 566, -552, 72, 224, -776, -603, 264, -287, -731, 463, 434, -358, 269, 838, -96, -300, 613, -168, -922, 59, 366, -567, -154, 608, -194, 48, 778, 161, -551, 299, 215, -796, -414, 321, -315, -486, 385, 129, -219, 319, 691, -324, -110, 304, -316, -599, 194, 276, -522, 350, 642, 1, -77, 588, 173, -428, 313, -82, -661, 46, 288, -621, -234, 701, 96, -391, 233, 390, -576, -90, 276, -502, -591, 456, -3, -342, 475, 643, 10, 63, 650, -160, -295, 549, -68, -525, 70, 305, -509, 17, 525, 82, -266, 632, 346, -550]
944e50L92L05o02Q2N03j88k02N03J06o32N15K42o27P4L11m62m74P89M5m30K56
965d4N61n58k4L56k58l03O13j95p42N00L76n21q7O11L1l56J48m6j90J34K61m13
987a46j61M38j35m39M85J81o17K64O09m04n49N72l31o4J47K90k72m1M23l73j26
1008b49O78oo07M9M10o77o3O15J07k29L45n3m64J12K67j89k31L59q4l58K35J39
1030A06m70M61K60k61l10N09j96m85L54R4k37j77M22q3k41M28J65l51L70p1m72
1051a85l63Q36l40k98M37N3p6j34J99l00K6N05j33l07N5p9k03K35L63m68q0L54
1073I7L7l06J4M26k70j4K19l26j20K44k8l09K97M17m55k01L18j32j61L92o1j83
1095a05J45K20m28m1N08j83l11M03J06n08J72K85l63j99N21o4m63M91j09l43L08
$$ y = [-550, -158, 147, -455, -373, 130, -58, -260, 243, 349, -283, 232, 474, -153, -79, 232, -230, -704, 85, 130, -300, -44, 517, -41, -65, 291, 33, -270, 343, 148, -594, -94, 282, -239, -326, 285, 316, -40, 108, 62, -128, 6, 267, -146, -307, 131, -4, -443, 42, 223, -394, -130, 479, 75, -474, 98, -233, -297, -150, 140, -132, -173, 250, -123, -249, 429, 423, -184, -135, 275, -402, -465, 150, 257, 28, 373, 320, -144, -32, 235, 46, -185, 174, 90, -268, -33, 106, -364, 97, 357, 96, -214, 295, 99, -386, -32, 62, -175, -352, 70, -13, -254, 174, 339, -12, 358, 287, -185, -548, 288, -52, -350, 87, 140, 64, -70, 129, -171, -145, 360, 227, -80, -25, -104, -307, -72, 291, -177, -257, 97, 134, -172, -158, 268, -2, -16, 203, -123, -243, 1, -27, -336, -39, 378, -77, -278, 40, -92, -253, 139, 78, -105, 40, 260, -168, -209, 299, 116, -195, 208, 314, -194, -22, 263, -100, -299, 222, 158, -305, 186, 77, -266, 42]
1116D2M16m33l09L18O2o60M83K84k14l9K84k35k28L04kk78J45K38k85m5L31j50
1138B9k65N05K7k70k27K63j68R8N6N5l72K94K87n99J59L71n1k59K68j45l28K30
1160d2J07k57P0K71k88j46L67J58m20J60M55m75j98M02q7l14L51J13l38M4K38
1181A71m56m6N27j78k46M12M4l39j9K66l50J20K77l6m87L64J31k79K24L67n19
1202e2r9M04j52l65K35M26n54ON30l79j94N13k22l49L32J92m22m1L62j67l47O06
1224B63j08m51K60K22k08k13N34k63k43L59N7n05J99M87n64m0M83j71m31L55K52
1245B74l92R5J69l73j38M85p8k93K42j4j97L09J29k00j17K01J74o72L27L41m34
1266a62kM77m16j81N17j9m16K12J58k99J93M9q5k88M16j26l67K93L11l25j19K60
$$ y = [42, 458, 25, -284, 34, 96, -564, -81, 203, -11, -50, 234, -1, -229, 75, 73, -205, -60, 178, -107, -152, 179, 29, -236, 269, 296, 26, -201, 62, -106, -8, 48, 103, -269, 25, 312, -287, -128, 243, 192, -67, 201, 56, -272, -42, 65, -192, -122, 149, -139, -285, 82, 240, -180, -20, 435, -40, -238, 164, 77, -237, 114, 227, -111, -67, 171, -285, -331, 196, 18, -228, 184, 228, -111, -130, 136, -214, -94, 183, 147, -340, 24, 155, -124, 100, 467, -52, -151, 253, 101, -264, -29, 397, -157, -151, 379, 0, -194, 319, 97, -252, 80, 272, -150, -191, 171, 4, -343, 263, 155, -296, -36, 186, -22, -235, 299, 36, -207, 152, 209, -296, -97, 390, -174, -214, 269, 98, -333, 22, 274, -118, -23, 146, -227, -365, 120, 42, -251, -9, -23, -220, 89, 218, 18, -99, 102, 276, -396, -69, 272, -162, -164, 313, -103, -284, 233, 214, -202, 10, 168, -131, 62, 111, 26, -262, 154, 28, -339, -46, 265, -60, -179, 81]
1288H1j12j64L41K11m31P6L22l73o2J64J0j77K37l9l93J84M12m85J46J80ok45
1310a23J61K19o31K16L55k26k38K84J90n55M48J02l86K43L58k96k87L78j25l13
1330b26J77J90j58j6K42j53k16J90J00m12J40M96o74P0L98j25p2N9R1k10M2L66
1352B99j25l59L48j08l28K39K27n17L67K09l34k43N81o4n28J91J07k04o3O04j65
1373A34l55N14j33m68K74J49k25K6J05Om35N08o3q7K73P6k76j59K27j94k06L40
1395C1m8j13J72K12k80k8M49m12k14K62P3k77n7L45k21k72O22k94p8L38J80o88
1417b98K62K36j99j33J58k6k95L31Oj49K25J5Mk10J91k0l62K06J52l29J51K74
1439A90j90j67L51J3k96J21J68l54M7K54k57j94L18j7l03M42P2k32p1K64j66k66
$$ y = [81, -31, -195, 146, 357, -74, 2, 324, -49, -111, 53, 63, -114, 123, 84, -309, -125, 287, -198, -52, 128, 122, -123, 38, 257, -374, -158, 197, -29, -267, 17, 207, -348, 100, 202, -184, 59, 417, 121, -166, 212, 87, -226, -49, 141, -17, -33, 209, 56, -160, 30, 130, -282, -142, 354, -320, -250, 148, 23, -49, 10, 101, -109, -67, 299, 174, -185, 163, 55, -273, -34, 193, -324, 43, 252, -82, -325, 256, 192, -336, -145, -38, -242, -305, 299, 134, -221, 293, 160, -308, -34, 115, -110, -84, 21, 27, -408, 100, 37, -50, 223, 299, 23, -136, 91, -103, -309, 31, -17, -130, 42, 254, -26, -54, 395, -17, -231, 31, 104, -173, -230, 115, -106, -378, 244, -50, -128, 210, 390, -298, -36, 200, 1, -132, 26, 0, -295, 36, 42, -107, 118, 133, 137, -73, 118, 98, -264, -58, 94, -235, -84, 190, 0, -167, 184, 197, -99, 22, 190, -164, -117, 137, -120, -314, 4, -13, -316, 126, 198, -34, -105, 159, -7, -273]
1461b73K93K3l35Q6L80k82M8K20P9l00J91l9l41K81J53j65j30Q0K70l58Q4K15
1483A80k42l1L89l67j4J12N4l31Q1K55j99L7J36l5p1J84R4l21Q1O4k28R4K21j51
1507hj55K69qk40J52ql8r4J01J26k10K13L8m45K81L10k42j18R5P1j81o2K15j23
1531f1K25j74l3jL32k44j82J67k4m7k07K77j17m0K41j41J6p8J87o2m0K24k89k0
1555i1M1p2j71J33K68o7L7M1M4j54J97k04l4p1J79k56k1K97j39o0J27L28n17L10
1579A45K11l00k10J62j1j07J53J17k29m4Q0k3Q4OJ07k31j07J32J52j11J68j31
1601A3k17J88K2P1N3L9j74j77J83j03j22J40P1r1K24j14L5j20J61p5q5n6J12j01
1625a23M4K33k73R7J65Pj93J04J43j93r1M4O8j49l0N7K2K63k79J48j05O9j06r4
$$ y = [-273, 20, 43, -292, -206, 174, -108, -60, 160, 239, -61, 130, 91, -250, 31, 184, 19, -111, -31, 239, -119, -35, 180, -62, -93, 296, -71, -85, 27, 81, -250, -169, 86, -113, -76, 60, 25, -46, 138, 232, -89, -8, 56, -172, -78, 143, -8, -163, 106, 98, -142, 10, 2, -36, -130, -29, 97, -113, 100, 138, -307, -26, 284, 42, -76, 19, 90, -91, -153, 62, -61, 164, -10, -43, -44, 288, 44, -138, 29, 5, -42, -249, 28, -89, -129, 112, -29, -13, -91, 96, 34, -6, 218, -71, -91, -50, -122, -293, -160, 108, 41, 78, 119, 163, 9, 206, 2, -32, -103, 76, -180, -201, 96, -43, -103, 24, 352, -165, 145, 356, 56, -154, 8, -3, -110, 43, 160, -69, -113, -33, -56, 28, 34, 141, -90, -197, -65, 87, -24, 144, 13, -204, -16, 6, 77, 130, 169, -5, -182, 1, -102, -224, -84, -13, -104, 120, 6, 41, -79, 82, 7, -78, -134, -22, -123, -79, 154, -119, -22, 143, 150, -43, 61, 204, 11, -80, -36, 32, -117, -147, -90, -68, 195, -84, 64, -41, 28, -78, -172]
1649a72J27L1k61K53J12p7n9J03J14j54J44p8j97l5K59k99o3M05nj86K33l9j76
1672b0Q8q6J44k15O1n0l0Qp5K17l8Q6L0j75J38K6k43N4K75k87o3J22P1j42K5K49
1698A70j59J00P1j64p0m8M3L9O0p6j12J57j5N9k05L67L4k48L3qk44J30L65k91
1722a2J18O5J2k12J60o1j84M4K6J20j67J07K3p8J3q0J5J81m0j21M2L6l0q0P3K14
1748A84j79LJ84m8n3J6j41j41Q4J02j61J31O9J09k73J55J48k4k34O1n2j60K33
1771A3l1k02J05J93j93P7K17l4k61M3O2jN3%Mq9J33o7j86J63J4j27O0J10N4l45
1797b35L39j73p7J53N8j80K15n3j0N9O6j65j11J53k8j10JL4J76j21K49j60l39
1820b59M63j64m2m5p6J23j83J06L24k44j0K31k57l2J82j84l3K32k9j26j64K48
$$ y = [-172, -45, -14, -275, -22, 90, 13, -46, 57, 171, 17, 161, 83, -114, -149, 110, -189, -252, 153, 148, -38, 195, 156, -20, 68, -18, 126, -89, -28, -78, -108, -100, -175, 42, 4, 90, 120, -55, 83, 109, -134, -80, 195, -92, -155, -33, 38, -104, -79, 170, 11, 111, 182, 18, -52, -100, -57, -18, 42, -34, -146, 11, -4, 55, -150, 217, 251, 3, 36, 28, -216, -86, 279, -12, 106, 171, 183, -29, 131, 70, -114, -70, -44, 76, -91, 16, 39, -39, -26, -106, -91, 90, 50, -71, -29, 7, -23, -103, -30, 184, 5, 8, 192, 144, 91, 107, -34, -175, -91, 11, -150, -19, 50, 159, -114, 41, 189, 165, -69, -8, -60, -220, 13, -18, -220, -115, 78, -115, -38, 179, 145, -116, -73, -11, -12, 41, 41, 45, -44, 89, 22, -164, -1, 13, -114, -54, 56, 110, -235, 104, -69, -146, 7, 65, -115, 100, 47, 37, 96, 162, -3, -114, 39, 11, -99, -98, -64, 112, -9, 240, 80, -259, 204, 40, -2, -47, -123, 0, -183, -77, 247, 3, -7, 224, -33, -65, 117, -67, -100, 132, 103, -23, -187, 61]
1842F1p4j02J91L7k21J88J33l52J52K9p4j65K07om9Q7M6k30K76p2m2j43K13n5
1866C5p8J57K4r0n8L16k41m3k4pj77J55L6j93J91k0O7k02L88k40L5N7n7l8N9P2
1892A24k24j1K36j97q2J20K39l13J94Q6l3l36N3J75j49K18j57J31l21L44O0j99
1914d2K00j87M0q6J16j77J75O8k15R2P7J77j92p2J13o9j5l4o0P1RJ43l49L88r2
1939G9r3J6M2j26N9K0N9j57L4N1j7q0J06J74l30J31J3J57j66L9l4j3R9Ql2Qj5
1966C2j2K5J1o2q8qK7k6J34J91m29J06K86p8j3n0j4k4p5ll6J04J8J06k04M6K46
1993B10k21k23M63j75j36J52p3J14r1J26o9j26R4J23k88L25l08J14P4j62P8J2
2015A3rJ58k20J18j3k63J86J73j54k41J96J42k53L72k77K27p3k3K3j61qJ22j05
$$ y = [61, -13, -115, 76, 113, -108, 80, 213, -139, 13, 42, -32, -197, 10, 4, -45, 42, 88, -142, 134, 62, 20, -123, 90, 35, -43, 114, 138, 48, -10, 306, 65, 22, -2, -9, -186, -31, 5, -188, 3, -17, 50, -152, 236, -4, 31, 88, 31, -7, 52, 124, -100, -111, 125, -72, -154, -34, 205, -108, 86, 172, 139, -197, -144, 31, -118, 100, -57, 74, -247, 97, 157, -42, 158, -29, 11, -75, 41, -136, 39, 107, -108, -16, 61, 238, 46, -26, 87, 18, 3, -31, -91, -20, -11, 132, -217, 171, 79, -14, 2, 44, -82, -23, -3, 56, -101, -67, -16, -33, -113, -7, 167, -163, -32, -19, 138, -28, 11, -23, -36, 63, 71, 39, 47, 32, 20, 45, 56, -6, -94, -102, -75, -101, 33, 224, -205, -99, 187, 109, 96, 46, 32, 8, -67, -70, -106, -2, 16, 122, -82, -36, 210, -11, -234, 229, 54, -82, 70, -3, 111, 20, 146, 77, -49, 45, 168, -120, 205, -103, 11, 85, -77, 1, 13, 4, 162, -58, 60, 47, -216, -30, 143, -11, -252, -56, 86, -167, 205, -72, 155, 82, 59, 82, -79, -87, 35, -70]
2038g0k27L41j76J36m9J88p1j19q8R2M1R9j18k3J48j86j13M4L36l15L5J63j01
2061c3r9J27J4j01J15o9r8l0L55k74R8R2p9J2J3k42K19M4J00l9j67K02j85O7j2
2086C0L4k8p3K47k02j00l0J82k86L49j11P1q4J17j15q2J93Jr8p4n4J30Ql4K8O4
2112H3p6j1j36J97P1j06j73Q2M4P5N5o5q4K9R5j2k8k0Q4k28m0J85l1j23L74m16
2138a75K94k26J36p0KN7qk9m2L0lJ76k83K2K10j22o5Q9K60k85JQ5pj99L05o9q6
2165bo7O4m5O0K19l25R7N5o7n8J11N9k11K38p7j24k2K1J32k98J94J75q5j88Q7
2190e7P2o5p1M8JJ27j7j23J78l1j75J27Q7j29J01kR1j63K9R7k43J32Q2J1K3j13
2216A7J11m9PK6r1L6k09J06j5J40j08J40l27J49n1J15K6j8k8q9J37l0k3l6J13
$$ y = [-70, -297, 44, -132, 4, -45, 143, 72, -47, -135, -43, -2, 97, -21, -44, 104, -82, -195, -151, 185, -130, -95, 68, -33, -132, -5, 9, -92, 23, -46, -144, -174, 181, -93, 5, 97, 18, 30, 43, -199, 20, 64, 164, 125, -42, 160, -25, 42, 30, 64, 36, -37, 210, 8, -92, -122, 60, -226, 123, 12, 83, -1, 116, 1, -81, 112, 113, 15, -59, -113, 17, 25, -9, 19, 83, 7, -4, -140, 57, 128, 22, -151, -69, -25, 50, 105, 40, -44, -15, 80, 68, 40, 20, 104, -124, -164, 21, -10, -133, 241, -175, 119, -107, 29, -41, -39, 18, 10, -19, -61, -31, -34, 142, -141, -119, 91, -31, -96, -7, 253, -32, -31, 54, 47, -152, 153, 84, -2, -69, -5, -50, 10, 229, -96, 1, 56, -11, -69, 42, 101, -110, 128, 51, -73, -95, -74, 58, -240, -46, 129, 44, -144, -57, 15, -50, -121, -73, -72, 55, 38, -85, 93, 62, -113, 14, 101, -28, 73, 71, 162, -1, 28, 125, -118, 14, 96, 107, 130, 17, 128, 79, 86, 112, 21, 57, -152, -46, -61, 79, -29, 111, -216, -67, -118, -3, 23, 5, -23, -112, 25, -5, -28, -64, 49]
2241D9l18K96n2J09j82J30J2L7j24K03j42q2K13P3r0j08P6r6r0J86o6j03K13j05
2265C9rj72R0Q6k1l6J47p9j56J72n3M8o7l2P5j6M2j8M5j07Jr9J86j4m8J4j00Q8
2293Fo1J45k9n9j16J68J2l5O0j50l3O6k0j9O4KN2q5N8P0q3m9J40j97M0l1Q6J32
2321A34j40N1n1Q9p4l0P4r3J32j55K15j94j5J13P5j42j4l9k8M5O2j15J93n6q6
2346d9O6k3J28r5k59K34M6p6J21Q3r1j71P0j53K98O6k11j9Q2n6p6O4J8j11o2M06
2372B30l79j0J20K5N8Q5Ll66R5J19r9K27n1P2j17L3J9j11N4K2j11N6l9Q0j01m8
2398a34K30j67J68lk18J38j10K3J07r6J01K3j51M7RrJ25j09Q3Ok6q6R6j1j06J27
2424E7m1j03Q5J03l0p4K7O8j72L7M7J0q9J94p3r6j41J69R0m7mJr3K8J01q9r7J25
$$ y = [49, -269, 27, -25, 84, -98, 32, 44, 81, -43, 160, 18, -64, 149, 222, 132, 24, 100, 4, -86, 100, 34, -69, 144, 39, 30, -142, -52, 34, 13, -23, 124, 45, -111, 61, 8, 56, -11, -43, 32, 16, 58, 40, 85, -22, -21, -120, 66, 52, 4, 18, -82, 6, -55, 90, 61, 2, -114, 54, 66, 31, 91, -59, -92, -26, -46, -65, -1, 1, 53, -32, 26, 96, 13, -36, 104, -93, -53, -84, 2, 134, -6, 45, -6, 83, 9, -21, 53, -40, 92, -63, 152, -42, -57, 56, 131, -11, -25, -64, -92, -47, 15, -100, 93, 37, -49, 17, -6, 122, 27, -232, 2, 48, -28, 93, 176, 85, -86, -16, -169, 129, 195, -16, -35, 47, -9, -85, -21, -3, -114, -176, 230, -149, -159, -39, -14, 44, 129, 132, -234, -139, -20, -119, 108, 57, 129, 12, 45, 64, -47, 7, 29, -82, -26, -65, 15, -86, -134, 96, -71, 97, 94, -124, 14, -96, -73, 34, -62, 39, 62, -89, -42, -33, -42, 83, -26, 57, 63, 37, -49, 47, 36, -70, 57, 16, -87, -2, 101, 71, -3, 24, 92, -80, -43, 4, 14, -75, 119, 46, -50, -191, -22, 68, 21, 17, 18, -75, -47, 54, -35, -132, -7]
2452gor1K01K9j71p9J41k0r9J53k16J45j9L3J39o4o1R1r9K02n4j94r5J42q2J02
2478B1J43lj66K5J2p6K7J16j3p2j17P7J14O7r6j8P4m4l3j65Q5N0K1k67L52p6n4
2505a6Jj5Q2K4M9k69J73n6o5M5L20l21rj2J65j41J34j5Q3j31n8O3q5J05p7j7m
2532d7J92n9j90J91j96J1K99r7N6k76J15o5m5R2Nm0NJ79o7j2j36J35k42K53n5
2557Fp3M2J54k18l1K76j74m7Q6K0k45J19R4k9NJ52r4qQj29Q0J25j16k9N8j54J59
2584C7j39K11l2J02j55mK7p2J40j37o4J6O1k9q5K54r9o9J55k30O5J14p0j14R7
2609b0P2k0q9NO5Q7k2j20m1L8J27j30NL3K1m3K1k7n4O3L8O8p3O0r5j31R0p7K91
2638A42j16ol4J8N9j13O6p4O5Q9k99J56J36j27R1j7rl0J01k0j76%K17j73q6P7
$$ y = [-7, -13, -104, 97, 126, -45, -124, 17, -3, -102, 51, -165, -20, -39, -6, 133, 69, 8, 99, 0, 202, 148, -46, -141, 1, -81, 21, 164, 161, -5, 20, 32, -44, -17, 99, 86, 14, -103, -26, 88, 155, 59, 41, 115, 71, 38, -127, -42, 8, 29, -238, 114, 38, -16, -15, -30, 52, 76, 125, -144, 29, -27, -92, -47, 273, -48, -57, -69, 96, -45, 89, 74, 157, 26, -32, 31, -54, 51, -26, -43, -47, 145, 86, -104, 87, -109, -98, 201, 104, 160, -116, -1, -66, -111, -19, -14, -54, -49, 130, 63, 51, -85, 50, -192, 61, 6, -67, -25, 129, -89, -120, 156, -18, -65, 21, 41, -204, -85, 9, -20, -15, 137, 43, 35, 43, -86, -6, 119, 3, -26, 32, -122, 37, -102, 109, 77, 179, 24, 20, 47, -25, 115, -22, -86, -70, -9, -38, -123, 131, 32, -37, 118, -112, -47, 67, -3, -117, -20, 52, 32, -57, -52, 13, 100, 78, -42, -83, -45, 82, -48, -43, -10, 11, -32, -11, -38, -92, -29, 9, 77, 4, 64, -31, -162, -72, -149, 142, 26, 20, -14, 4, 63, -50, 16, -58, 7, 96, -203, -47, 89, -38, 53, 36, 27, -3, 98, 78, -98, -98, 119, -54, -140, -63]
2664f3R8j88J04M9J2p1N8K4l6r5k4J15J9o3Q6R0j7j7j03O5j03J95n2j01l1Q8n8
2691a9jj28K91j07j30rN5o7J54j4q7n6J32K5q3J15M7p0r5J1R7j15Q0j27J76J2
2717H7k31K02k73L16j2l3R5o9Kn0j14O1J07k4mp0O5j21J31j30J48j16K14k77k6
2742a22Q2Q6k4nk6j72K36l9m8J64j41P7m4J9J24k53Q8l5Q3o1M0j17J39K8j00N
2768a6n9J19p0l7q5K70j38J56q4M6j19k6M7K9j56J50r5J3k1J67j27M9J0j9l3N1
2794B2q2J7N1lQ9k66L42k62J25J18p4k01J61j9pj29J31jJ16j87M7j60R2J69j62
2819g3m1J08K2o5k3J41j07K1p0M4q5J27J07j51mQ9J7o6J31k49J96j43J08k02P1
2844i7J00k2p7kQJ37j0k1q8J21oq6Q0j22J34j1j55L25k81rJ23O5o5n4m0J90j9
$$ y = [-63, 35, -153, -49, 0, 12, -59, -1, 23, -13, -108, -132, -17, 2, -61, 25, 115, 98, 81, -22, 43, -60, 135, 83, -18, -49, 39, -19, -20, -148, 143, 36, -94, -103, -48, -115, 39, 25, -62, -118, 14, 39, -44, 71, 118, 48, -47, -36, 61, -54, 26, -101, 75, 87, -144, 58, -215, 101, 89, 56, 151, 82, 84, 34, -80, -19, 88, 64, 60, -10, 55, -66, 65, -65, 83, -33, 181, -96, -122, -40, 46, 22, 17, -9, -181, 55, 16, -32, 132, -9, 68, 24, 43, 167, -86, 2, -33, 50, -11, 29, -88, 51, 79, -21, -16, -75, 44, -26, -63, -148, 122, -16, 140, 56, 102, -17, -43, 4, 33, -123, 27, -68, -55, -76, 91, -36, 13, 23, 4, -29, 22, -60, -43, 8, 5, 94, -172, 170, -92, 33, 151, 77, -124, 37, 18, 11, -118, 13, 12, 128, -59, -12, -172, -80, 89, -73, -114, -6, 16, -49, -72, 69, -38, -17, -87, -43, -128, -1, 106, -45, -49, 40, 57, -9, 122, -127, 69, -74, 34, -168, -97, 3, -19, -96, -98, -90, 47, 37, 16, -72, 49, 43, -43, 37, -85, 49, 38, -117, 208, -73, -82, 41, 106, 41, -13, -53, 137, 118]
2871A18k13M7J84k46J72o2N9j56N0mN8K4j78L56l34J12p0J14j03J02j47Q7kJ29
2895I7j05K5PJ5j00N7k6j9j13J52o2J97J24k54qn8Q0J11k64K16j45J9M9L5k36
2920b06J98J7O0J40k17K3k1rj10J89j43J13jqm6kJ3L5j4n1J5k1M3l4P4k08l8K10
2948Aq5k9J46Q4j0o5j18J70k08k0R0l7N2K9p4KK14k0k57J53k3Pl6R4Jm4J5K7J16
2977A75j06j7l4j38J49p9M6k1R8l5m8K36k79R1n6k8o2J70o2j5M4j37J62P2o6j02
3003d2q7J17j6j0PN5O7k9k2k1k29K05oj11K02j79K76l07K59m2p4k32P3J70j18
3028i4K18p2M2k25J96j86P4mK0R7j94R2J56l4j06J56j34j9O8j76j50K39q0J1K9
3053g6L5m5L21j12p3N3M6j09r8O7J3j25M4J66l02J95P0O3m0K8n6j28P5q1r8J04
$$ y = [118, -95, -48, 136, -110, 62, 0, 59, -97, -47, -51, 7, 31, -147, 209, -125, -13, -83, 31, -72, 30, -117, -30, -32, 97, -8, 17, 24, 39, -61, -4, -30, -49, -162, -10, -72, 125, 249, -5, -13, -71, 9, 120, -144, 72, -73, -54, -5, 30, -206, -8, 9, 69, 209, -8, 15, -6, -15, -125, 64, -79, 34, 33, 25, -21, -23, -10, 25, 11, -40, -25, -46, -3, -37, 37, -171, -209, 1, -84, -113, 33, 117, 107, 42, -76, 94, -114, -134, -44, -81, -29, 0, -74, -72, 142, 122, -135, 18, -5, 2, -34, 60, 61, 17, 32, 59, 175, 69, 52, 18, -120, 29, -50, -4, -25, 73, 38, -10, 226, -53, 38, -18, -46, -108, 62, 0, -15, 29, -108, 54, 126, 60, -42, -129, -12, -28, -38, -31, 24, 91, 62, 40, 19, -210, -5, -11, -122, 80, -99, 177, -130, 129, 87, 13, -219, -146, 24, -94, 124, 52, 94, -131, 65, -121, -47, -51, -31, 66, -128, -36, 120, 86, -20, 136, 2, -17, 51, -125, -275, -36, -116, -105, -76, -41, -86, 235, 123, 50, 103, 149, 40, -58, 9, 22, -103, -59, 107, -195, 0, 70, 133, 93, 121, 65, -63, 12, -69, -167, -63]
3079f3M6m5J82j33JO1L6r4m9N0J06k43L5J31j19R2j8K9K5j02o1J34N3j17L7Q8
3105F2j21j5j00J69J5O4p4J69j61n5L5K4N5j31J22M5L1k20L07j29kq2Pq8K33j39
3131B1k21K97Qk04l2J27K2JMJ21o3rj12P2K0o4M7j53O2M0J45r2j23j4J08j95K19
3158C2m7r7l4J39m6m6J30m0j03J09L7N7j30m3R6j4j20J07j01O3K11j41N6n6K3
3183D2j9r6K57j91K9J02j91R6m4K5M6j01R8l0kj05J90j53p0P8p6Q3nn1m1O0R2
3210B3o8oj26J58j34J80or8K4O1p8J41k80K31q3N9r7j5P6J06k7j57P4Q6j77O4
3236f9J63j58O0j5P1q4J33j21K0j4J74k15O9p3N8j35R5j17N8P0oN0p5j3J33k2
3262C7j21j26L17j38o4K47k64Q3N6j17J20J3P6j12nm6P8j36J06K4j65N6Q3P4j29
$$ y = [-63, -17, -62, 120, -13, -12, 49, 85, -9, -58, -8, 98, -145, -110, 21, -98, -6, -24, 5, 30, -72, -133, 1, 54, -63, -26, 62, -59, -74, -174, -5, 10, 74, 0, 169, 8, -47, -12, 12, 67, -64, 58, 103, 134, -86, 221, 92, 90, 8, 15, -73, 160, 21, -200, 97, 105, -99, -131, -4, 18, 19, 23, 144, 81, 72, -40, 32, 52, -12, 35, -118, -56, -16, 129, 37, -86, -100, 8, -187, 32, -15, -112, -146, -7, -53, -99, 31, -9, -112, -3, 34, 91, -39, -82, 14, 0, -120, -13, -114, -51, 160, 19, 75, 19, 42, 23, -73, 184, -7, 22, 124, -67, 29, -15, 10, 56, -45, 53, 23, 21, -84, 106, -47, -117, -39, -115, -32, -37, -88, -129, -69, 23, -45, -51, -177, -19, -153, 27, 21, -77, -53, 8, -70, 71, -209, 22, -61, -2, -99, -114, -38, 68, 41, -116, -42, 44, -133, -69, 94, -64, -4, -19, 52, -32, 101, -20, 0, -14, 160, -55, 14, -59, -1, -136, -41, -158, -100, -30, -36, 14, -61, -74, 59, 37, -84, -210, 107, -31, -95, 152, -112, -29, 27, -90, 30, 43, 119, 7, 2, -44, 34, -102, 4, 28, -137, -81, 2, 76, -53]
3287e3J6P4m4o4m5J39k2O7j12J67k87J58P1r8l2J20K5p7p9J61r8j12o2J21K8j55
3313a93K90j23O5PM5k21J8K65k22J13Kj31K05j85P7r5R0j80J07j25J40PM6Q7j67
3338g8K0J34n0j36L6M7j22K39j64j81K47P8n5PJ7o2P2O0k9n0O6j32L2L1k25J73
3364b5j28K28j04O7R2p4k22Q4M8J41j47j05R7L1L9P0j73J41M5n4r0J36j37l6k
3389g8L0j3J2M7N9P0j36J9l9O9k3k1P3l7k7r1J03O8l4J2j18J63r2o3k2LJ80j72
3417e8j01J43P7o5j03%j6J35Po8K04j37j2J91j11J43k35N1j0J7p1j17J00O0p0
3442d6qL6P2l3j26J60j08k3J51k2j81N6J99j37m9m2R3J78j60N8j95K22k12J06
3466a1r9%K11o3k6l2J05j66K3Q0o0j09K70p1j81kR1j74J88n6Q0J14P7j39j65J93
$$ y = [-53, -37, 37, -7, -71, -116, 23, 1, 68, -44, 123, -164, -6, 65, -33, -65, 55, 80, 3, -76, 85, -13, -125, -187, -66, -38, -193, 97, -26, 39, 46, 91, -130, -112, 153, -69, 44, 46, -85, 120, -65, 12, -83, 7, -173, -66, -191, -51, -44, 2, 89, -78, -58, 76, 26, -110, -74, -27, -149, 90, -74, -255, -8, 70, 15, 22, 39, -23, 49, 109, 80, 30, 96, -36, -4, 27, -198, -25, -153, 75, -29, 38, 130, 56, -166, -82, -34, 107, -40, -145, -48, -17, 22, 92, -81, 60, 105, 51, -39, 97, -40, -76, -78, -48, -61, -49, -2, 57, 127, -9, 10, -29, 40, 17, -4, 69, 32, 5, -86, 17, 85, 51, 63, -55, 108, 16, -47, -69, -66, 114, -58, -159, -16, 61, -4, -107, -107, -123, 12, 19, -49, 155, 18, 6, 197, 86, 229, -6, 45, 35, 52, -19, -136, -36, 24, -46, -54, -18, 54, 21, -105, 55, -53, -76, 75, 53, -128, -72, 127, -10, -59, -101, -8, 170, 10, 68, -127, 95, -117, -11, -110, -110, 101, 38, 12, -20, 85, -81, -58, 22, -38, -147, 123, 52, -129, -131, -40, -214, -26, -82, -2, 112, 189, 50, -115, 78]
3492G8mJ9j15R3joJ13j79JP0k6p9n4JK12j83mm5M1J48k20K08o1J54j38P3j09j03
3520a16Q5L1o9M7J16k0j92K0J72l2Pq0On0M8j7j09j2K79m2k4j27M3k1k3L9J75
3547A34l17J76Q3j13K2R5j05M1mO1j6j65J34K6j42m0J13o3J08n3j2L6j3J32p5
3572D3O8j3j41j9L%O2R7o5L4o5K9r5L2Q2j55oJ17M6o3Q5n0NJ7n7OJ36j27k7j18
3602a39J19j81J45MK20l01P0K64j48j05j29J90n6M0m4P0j04N5J09n8l1P2j7k49
3626b04J85R0j12n7qr8K60Nj73J59r1j5L3J59o1m4l9Lj98J07J67j80O5j7J45k4
3652E7p8o6R8K0k1m2J5L7r4P1q6J58r0j60K21m7K9m1J1M1R8j1j58j03J53l8K1
3679eL5j08j34J64N5j18J89k37J64o7J06p2j00K24j08o0K49j42j43O2o1M8M8m9
$$ y = [78, 74, 93, -22, 71, 70, 64, 177, -2, -1, 69, 43, -36, -90, -89, 123, -60, -64, -109, -68, 80, -140, 68, 7, 161, 23, 96, -13, -116, -31, 0, -69, -22, 94, 74, -118, -98, 74, 42, 49, -31, -25, -75, -27, -44, -153, -165, 114, 72, 48, -79, -36, -57, -80, -41, 134, -183, -7, 76, -37, -15, 80, -25, 16, 12, 73, 57, -108, 26, 52, -90, -130, -17, -80, 28, -25, -37, -1, -14, 118, 43, 111, 98, -43, -62, -59, -59, 3, 100, 35, 69, 4, 33, -62, -30, 52, -103, -109, 8, 54, -9, 76, 26, 31, 48, -9, -3, 133, 6, -21, -139, -20, -201, -56, -52, 168, -133, -63, 201, 53, -52, -181, 9, -47, -7, -51, 19, -85, -30, 79, 21, -10, 62, 45, -204, -19, 71, -41, -98, -106, -204, 56, 61, -112, 47, -44, -59, -26, 133, 72, 28, -11, -8, -206, -99, 68, -112, -47, -64, 81, 57, -21, -87, 11, 31, 10, -32, -17, 20, -74, -3, -89, 69, -21, -181, 40, -7, 22, -19, -8, 33, 131, 120, -38, -141, 12, -26, -5, 30, -78, -212, -48, 7, -111, 78, -159, 5, -62, 44, -28, -128, 96, -12, -72, 177, 35, -108, -46, -107, -59, -11, -60]
3703f0pO6q2L2P4n2R6p0J09j50o2K74j45Q1L2M5j23q4J26j61j69J54P2p2Q4J02
3729A10m1m1P1j39J56mj06Lj28N8P6Q0N2j44Pr8K12j35j06R5L9l7qJ49j64Q2j9
3756B0mK4l5l2r8M5mJ55j16L4J99k29q7R6nJ06j07J4Q5j52L9J8M8L0L2J2l06J78
3784d0R1K0n0O2j21j01L2Q3J81k22R2O3p8O6p3q8k9J28p6M4J97j89R2j76Q6K6
3810B0j03J83k24J36P9j00J68j13j21L6q7K7Q5O2O5p0m3j5l4q1J85p5q6Q3J14
3835I1j90n7L76k60J12q2j80K7j7K6K15j31Q9j11P7K5k6m7K76j40q1J5Kk8M4l5
3861a0l1J20j71l5P5P8r0M6j07J53j36P4J72j60J1p3J62j24J28k2K7k7k1j83K51
3886A07j14N3l4p8Q0Q5k65K37p0j03J90k63K72k24J27J69j07K7k67K23P2o7o7
$$ y = [-60, -67, -1, -83, -51, 23, -29, 67, -3, 106, -44, -106, 168, 23, 104, 136, 181, 58, -26, 100, -61, -230, -76, -4, -76, 8, 110, 69, 28, 99, -40, 116, 112, 6, 9, -119, -61, 15, 95, 147, 3, 10, -88, 124, -11, -117, -22, 17, -20, -28, 121, -43, 39, 20, 16, 40, 5, -27, -125, -80, -84, 71, -45, -11, 188, -41, -128, -32, -37, 69, -38, -24, 61, -91, -52, -34, 14, 44, 76, 88, -218, -40, 51, 71, 21, 83, -38, -139, -107, -24, 157, -65, 27, 90, 12, 78, 5, -83, -112, 16, -60, -16, 181, -8, 84, -92, -6, 20, -83, 100, -124, 12, 91, -9, 159, 46, -75, -39, -126, -99, -14, 48, 113, 43, 0, -15, -49, -130, 55, -20, -106, -23, 91, -99, -156, 220, -40, 72, -10, -190, -163, -180, -154, 61, -70, 19, -92, -15, 10, -16, -63, 213, 73, -8, 7, 9, -19, 25, -10, -41, 79, -92, -127, -52, 26, -64, -18, -125, 28, -108, -34, 138, -22, -11, -84, 78, -46, 82, 60, 87, 60, 39, -144, 107, -7, 46, 12, -66, 14, 99, -166, 71, 1, -102, 88, -175, 97, -127, 0, 169, 62, 89, -178, 45, 117, 50, -17]
3909a7p2O3K7K9O8j91O8M7j8P4j25R4N0q0K1oj27n0J34L1QN0j45j32L02K3l1l9
3937E6J19j89l7P8Q6j52J24j60J26j05N7k6%J4K5l6Q1L6j89Q0j14J83l6Q1k9j9
3963E4j0n6J28j64J59j17j75K59q9J55j60O6p7J42j73O6L8k6j15J62j79M5k4J32
3987D1p6o3J96k4j59J02PL1O5n8rm6q7j52K61j26J37N2q7n4J26r2Kl1J05L1j25
4014c3J48j46Kjo0qJ48n6K8J43L6j54J83l05p9Q7K2r2J13lP1j4k74K75K6o4O7
4041F0L7J4j53Mm4L5J51j61J06k7l1J19p4O2j62j2qK05q9j0j20K32k55J52O7j49
4067e1m7J86k69Q3K58k50J56j39J94r1JL5j49L9J59lj27j9J10j10K8P0Oj7p6j00
4093a23J25O3M2o6m8k3J49j99J48j69N9O2k0j58K26n0PO0p2m3K18k78r1J38j7
$$ y = [-17, -89, -26, 1, 30, 98, -93, -25, 22, 4, 78, -47, 47, 97, 17, 38, 32, -95, -145, -11, 20, 28, 78, -67, -199, 103, 126, 95, 56, 175, -14, -51, 27, 113, -39, 85, -75, 51, -54, 3, -23, -23, -9, 16, -20, 61, 97, -92, -12, -126, 57, 21, 102, 73, 54, 44, -12, 116, -48, 111, -6, -181, 78, -11, 144, -16, 50, -27, 115, -58, 8, 46, 20, -95, 67, -112, -67, -91, 41, -35, -98, 98, 74, -85, 17, 24, 55, 120, 62, 53, 7, -80, -232, 29, -97, 40, 92, 5, -49, 77, -15, -13, -44, 61, 92, -33, 115, -31, -29, -30, -90, -98, 50, -6, 22, 165, 201, 47, 230, -75, -154, -67, -45, -137, -24, -27, 44, 30, -244, 31, 57, -7, 60, 97, 111, -42, -38, -82, -47, 104, -57, 49, 22, -9, 110, 36, 98, -64, -76, -84, 121, 32, 22, -98, 134, -121, 31, 98, -51, -98, 88, -181, -98, 160, -90, 66, -73, 121, 30, 31, 66, -83, -44, 115, 112, -15, -34, 76, -34, -6, 64, 70, 53, -23, -123, 2, 65, 107, 41, -7, -30, 119, -80, 68, -101, -42, 20, 0, -158, 68, 18, 25, 85, 13, -30, 188, -90, -181, -43, -60]
4118f0J17j45K1L1L6qN2p8J6J08j28J30j55m0J81j38J12j44j8J19k8L2K44l17
4142f0Q1N7n4M1j18K01j9l33K34r2K1O5O8m3k0J4j6l9k1M7Rm8J8o8J02N8Kj09
4170b2J23m0j12L5J11l0K9q6N7n0m9L1N6j09o8J38J19l5k05Q0P2l8Qn1oo7J75
4197F6q6n3J33j51L3J07j57rJ83J9j1Lk8Q2j01N3M3j41nQ9j9j39n6J84P5j20o0
4224f6o6J68o1j10J97j17MM8m2O5J81j20o5n1J15j08J47j39J00Pr5r3M7n5J12
4249CP5j19j2O7J04P0j06J00j89j6L6O6p6Q2k25J45m5J18j88J22n2O0K0P8O3j40
4275D1N5j11l6K43k16Q9P6j52N6q0J16j46r9J13O9j89L20j42Q3j13N4p5Q0j60
4299a24J56R3r5K7p0J41l38K20j68P3J07m1j34J72j51j18K17r3L49k71N2rK49
$$ y = [-60, 57, -88, -67, -36, 0, -8, 44, -34, -18, 90, -38, 92, -63, -103, 78, -60, 52, -92, -110, 9, -19, 13, 257, -60, 21, 78, 24, 65, -53, 148, 129, -204, 30, -62, -41, 24, 92, 49, 29, 43, 27, -12, -33, 14, 23, -25, -7, -75, 27, 85, 87, -22, 101, 61, -51, -16, 95, 65, 94, 8, 65, 15, -34, -3, 53, -56, -124, 14, 133, 98, -107, -27, 45, 7, 15, -36, -42, -109, 66, -20, -73, 60, -91, -58, 49, -108, -117, 66, 85, 74, 77, 49, 131, 30, 83, 126, -15, -20, 69, 50, -89, -145, 39, 114, -6, -66, -132, 36, -25, -135, 62, -55, -51, -3, -45, 20, 201, 81, 16, -35, 80, -28, 119, -20, 80, 87, -8, -101, -54, -109, 3, 78, -41, -53, 14, 118, 188, 82, 182, -7, -23, 13, 79, 3, 85, -140, 5, -40, 78, -110, 12, -40, 20, 40, 118, 181, 41, 96, -15, -51, 192, -24, 65, 141, -11, 45, -35, 81, -65, -164, -51, 18, -171, 149, 7, 90, -23, 31, -44, 36, -124, 32, 125, 30, 57, -13, 128, -210, 10, -158, -85, 22, -19, -153, 19, -132, -250, -33, -126, 223, -48, 4, -5, 244]
4322B44k12Q2m0j13L5M6p8M8J57k67M9L9K10j68k7J27m3N5p7o8p6r5K00J01j68
4347c9J96k39J72q0N0m6O8K1q3j38J55P1j63p1J64K1p4J64j48o6j8j37K32l3J67
4372A46j01Q7o9o6J25r7q3J25j17J4J16j72P5Q1m2o0J67k56J4J62j37%O8J3j4
4397b1o7o5K90j12l8l9L9l7k3Q9M1m3L4j19k8J7J79k1o2O4k41M3L9J95j35J60
4423A39j47O0j01R9m2j11J56l2olp2RJ7l8L9J85k58k0P1r8K22k7J06k09K4N7p6
4450e6J18J28j60N1j39l2J21j2K4L1j34J77j80k5lL6R2j88J97M7j16pR2j19J08
4475E1j68J07q5M1J67j62K8l4K19k49NJ54j32l2J08j00N4N9K8p4k9J19p5K0p7
4500e7O5n2K8N3P1k12J50M0k11J21M3M4j4k71K65j1j52J20l3o9Q9l4J02j99O8
$$ y = [244, 32, 114, 74, -39, -4, 42, -36, 12, 169, -98, -49, -10, 200, 32, 5, 132, 89, 144, 67, -1, -77, -172, 28, 129, -39, 157, -82, 90, 10, 60, 14, 82, 103, 20, -118, 37, 108, -55, -126, 38, 59, -15, 149, 1, -65, -83, -220, 12, -21, 146, 45, 132, 63, -3, 122, 25, -58, 67, -50, -36, 80, -92, -17, 64, 22, -38, 129, -127, -113, 49, -88, -88, -20, -7, -21, -88, -153, 137, 25, -13, -52, -13, -50, -73, 16, 57, 14, 48, -71, -99, -82, 97, 76, 14, 78, -163, -120, -81, 114, -21, 139, -8, 52, -49, 50, 8, -103, 53, 21, 15, 12, -60, -51, -34, -72, -33, 152, -106, -126, -55, -153, 69, 42, 148, -61, -37, 20, -56, 62, 190, 30, 81, -58, -90, 31, 19, 43, 74, -60, 117, -63, -88, -91, -55, 37, -151, 46, 93, -23, -30, 62, -57, 51, -117, -10, -95, -54, 113, -49, -21, -55, 164, -85, -80, 74, -58, -90, 18, -82, -28, 31, 59, -15, -44, 75, 0, 20, -57, 8, -44, -16, 37, 108, -104, 46, 86, -125, -4, 39, 83, 69, -202, 63, 52, -100, 20, -13, -82, 7, -27, 75, -124, -56]
4525e6J13o6j2R4k22k3K65l3P3j77L8J2M6k24j5K33q3L0j44J46R7n0o6J17j71
4550g8m7J40q8R2L0K2q6M8j77J20q5J95o5K1k29K57pl5r3r1J52NJ76k42Q0K7K0
4577F2k47J20O0p7JJ61j66M0L6j50J73k4p7R6K7j40J9n3K52R2o6j78l5p1K6N1
4603f8PQ8j8L0p5k12L30K42k84k1j3m9O8j79O2J31m3M0j13J81j82J52k11K30k22
4628a29J59jK3J6n2Ro5R5m4o4P3M0j35M9n7N0j7Q8q9K4M6n9m4K2n2o5J4J21j47
4657a91L10j70K7M4k9P0j76J74q9J12n3o6O0n5K5P1J28k30Q5L8N7j67m5K62j49
4682D3r9j6K3J74j27Q9p1N6j36j26R7J71kj20l5J69m8p8o3K24q1J3p5k2k9Q0M0
4709E1%j10K24j40m2K3K4Om7O1j64J35j62J28J3j3J8r0J75m5l8j61J46K04k82
$$ y = [-56, 57, -9, -21, 73, -149, -172, 93, 60, 133, -44, -6, 6, 52, -172, -187, 46, -37, -7, -151, -5, 92, 42, -24, 93, -78, -125, 15, -73, 19, 49, 71, -15, 33, -144, -24, -109, 86, 21, 42, -187, 70, 63, 28, -65, -156, -4, 1, 177, -65, 15, 42, 62, -185, -65, -5, -82, -81, 80, -86, -46, -10, -160, 13, -11, -88, 8, 35, -105, -86, -139, 113, 205, 139, -39, -74, -145, -119, -68, -61, 27, 9, 39, -36, -248, 82, 324, 40, 19, 6, -43, 25, -154, -92, 39, -4, 36, -77, 104, -78, 74, -137, 93, -129, 30, 29, 52, 68, 16, 25, -40, 55, 11, -53, 20, 60, -75, -26, -83, -33, -50, 38, -51, -27, 19, -40, -84, -62, -114, -179, -165, -44, -191, 119, -51, -24, 20, -9, 61, -115, 59, -30, 82, 29, -37, 23, -32, -7, 64, 192, -38, 47, 85, 142, -25, -70, 192, 43, -56, -72, -49, 125, -2, 87, 16, 72, -64, -190, -93, 78, 76, -44, -79, 90, 42, -36, -99, 125, 44, 57, -18, -40, -69, 11, 51, 51, -59, 165, 25, -17, 6, 30, 36, -11, 50, -114, 21, -141, -13, 0, -13, 5, -85, 90, 45, 7, -154, -8, 196, -86]
4734h6J1j1Q3k0q2J94j16mj36R3k2J04Qj46l0Q9K14j32j27K57j30n5J61j35K2
4759DN7J04k23j7P9O4k2O6j31j40L3O0l6J45mrM6j60L3K8Q1Q6j80O6j25J6M2K01
4787A64k68K09m6j61J41rj37J99k11J56k4n1J73j27j16R9j37J37K3n4J04m2J95
4810B17j37o2p3n0K88j57J07k00P6L8k3Rr2KN0lOL4pp1j4j84L33j36j1L4Q0Lj3
4839D4j40R9P7J6q4K1R2j83J62j00O7km5o9j5M9L8J0j11J15o1p0L9J46o1l7mn6
4867f3m1J87O5l04J92m0R5p8n3J39pj49%J67j05J19nj61J70Qk87J40o4kP8N0l1
4894B0r8Q1r5P0J15k0k07J64J1q9O7q1j3J16J84j65j80J51j8J4Ll3Oj05J26j30
4920a06P3r2J56J0lj3N0J09j22o0%J31j3j7k08J12K4O5p0r8K5K1K00j30r6J48
$$ y = [-86, -75, -86, -3, -23, -105, 89, -27, -31, -167, -74, -96, 8, 16, -130, -160, -71, 143, 11, -116, 141, 11, -44, 117, -18, 4, 61, 165, -58, -75, 4, 68, 46, 112, -19, -159, -126, -66, -102, 43, 39, 30, 76, -84, -51, -23, 58, 144, -36, 30, -95, -79, -37, 164, -104, 105, 59, -102, 39, 30, -107, 92, -119, 37, 13, -38, 135, 8, -108, -9, -146, -9, 14, -40, 64, 22, 217, 80, 18, -55, -105, 183, 26, 133, -67, 9, 47, 24, 33, -59, -57, -7, -10, -4, 30, 23, -48, -62, -246, 87, -49, -60, -26, 54, 57, 44, -96, 3, 80, 96, 12, 33, 125, -58, 104, 4, 71, 69, 24, -45, -60, -11, 27, 37, -74, 41, -20, -90, -51, 95, 34, -3, -7, -63, -104, 83, 148, -156, 36, -4, 91, 13, -40, 99, 92, -57, -57, 110, 5, 124, 119, -42, 128, 136, -151, -11, -75, -77, 1, 51, 20, -78, 3, -92, -22, 93, 73, -134, 30, 41, -48, 19, -62, -75, 41, 225, 60, -120, 31, 13, 27, 30, -3, 3, -102, 24, -106, -33, -125, 31, 41, 38, 25, 75, 184, 62, 2, 2, 133, 120, 103, -105, 7, 31, 96, 26, -72, -47, -26, 174, 44, -52, 96]
4946I6r8Ol8j3O0k2R2Rj32q9K73j44q9K6J18j88J98p9j9oJ74k32J59J3j52J20
4972D3l5p1J62j01m9K05j62n8n6n1J54J6om8mm8J5Q7q5pL4N5J65m8k84L1J92j34
5000h8K51k46L9Ln3J43k09J14M5j35J82J1n6oLl6LL1n3j09Q9j2M7O7J40j37j36
5027a08P4J43r8p5J80J4q8m9N4K0q0o2K7M6J1rK24j94j0o3J9J47j20Q6j88J98
5053I9k05J97j38N9Q2j01M2m9m5j9L8J10L2n0j15K36o9j86L4P5J18ko4mk00J52
5079B7J27k47J18j04J12L1p7Q3o6J19j88J7Q3K2l1P8j42L9J45j52L9ol7O9J9L9
5105A17j02J16j68J13k44K01q7Q1qJ02Kj28m1K5L2j43J77m6Qk3l2Q7N5j28KJ03
5131G1j06jn3j1J22R1p2j34Q4M3q1L7QM4nJ28k21J71J08r1j27M0qQm2q3Q3M6R1
$$ y = [96, -2, 4, -34, -47, 13, -9, 83, 92, -40, -129, 144, 0, -89, -63, 55, -133, 65, -14, -33, -39, 135, -97, 62, 75, -77, 43, 8, -63, 99, -2, -51, 154, -8, -66, -122, -173, -19, -3, -9, -57, -61, -109, -94, -7, -92, -99, -65, -10, 155, 107, -177, -146, 46, -88, 163, -83, -44, -41, -94, 49, -160, -46, -1, -136, 46, 57, 1, -5, -2, -38, -35, -4, -57, -166, -77, -89, -42, 25, 165, 28, -108, -34, 109, 11, -64, 116, 130, 42, -7, 47, 67, -13, -75, -48, -2, 9, 0, 224, 30, 20, -43, -24, 123, 3, 89, -99, 99, -106, 91, -47, 12, 94, -7, 35, -14, -59, -78, -40, 70, 102, 52, -63, 173, 104, -82, -48, 27, 145, 143, 79, 75, -125, 27, 154, -93, 25, -79, 33, 64, -13, 70, 4, 123, -65, -48, 35, 57, 26, 104, -38, 1, 146, -6, 33, 27, -10, 59, 78, 117, 15, 131, -37, 76, -168, 33, -54, 27, 19, 121, 123, -5, -46, -21, 11, -132, 45, -1, 7, -16, -48, 39, 94, -34, -32, 71, -35, -36, -89, -100, 22, 113, 41, -93, -9, 34, -47, -10, -2, 42, 37, 165, -56, 115, 223, 132, 5, 45, 37, 45, 3, -80, 3, 49, 140]
5160A40j49J05m0j61J59l4K2p9M7o0N0o4K2N4J75j37k80L17j33J87q0r2K11l30
5184a50P3J2J07k0m0j18J48k18K10O1k6rN3j02J47j6j78J67j37L2P1l5k08J74
5208bm3j85J99J15j17m3j1J84j35R5M9N4j57O1j17J08j4l2j27M5J63j86J63P8
5232A45j57l4R6k46K13L9k8Qmo8J16j69o1J60j8K2P9j52j13J64J08k06L3J05j71
5257a39J94N8j82j2J36n3KJ02p9P4mk2j85NK15k01J94J5j24m6k1R4j33L1J89p2
5283C6k2j41K02j34jJ43p8J0j95K12M1n0j09qN5J69j34MJ95j91n4k0M1J54r1r5
5309f1J57j4j65lJ76k35L25j62PJ05r9q0K35j61p9K11j33K6J00j22j06J97j16
5332CP8k96J26PK35J0l20J69n7J7M9j57K75j55J09j68P6k7j35J44L6p2m3Q9j93
$$ y = [140, -9, 96, 56, -105, 54, 20, 42, -37, 10, -50, 0, -64, -42, 12, 187, 50, -230, 87, -46, 141, 61, -31, 180, -150, -77, -65, 42, 22, -18, -136, 12, -206, 4, 65, 39, 30, 83, -19, 128, 112, -66, 101, -36, -4, 67, 32, -176, -2, -45, -230, -31, 84, -33, -76, -87, 97, -38, 57, 106, 160, 3, 64, -53, 55, 41, 9, -118, -73, 90, -96, 67, 145, -12, -46, 50, -196, 17, 56, 28, 36, 32, -36, 80, -89, -150, 10, -8, 14, 93, -59, -172, -8, 100, -106, -73, 32, -139, 55, 113, -69, -81, 55, 2, 4, 106, 27, 101, 97, 75, -110, -105, 110, -91, 103, 118, -6, -52, -73, 21, -112, -81, 108, 36, 14, -127, 75, -59, -60, 83, 5, 15, -180, 32, 73, 23, -86, -94, -39, 130, -4, 0, 195, 4, -50, -70, -29, 125, 34, -61, 96, 82, -83, -86, 90, -145, 180, 18, 25, 130, 31, -49, 186, 25, -54, 157, 24, 50, 150, 28, -78, 119, 3, 81, -215, -89, -82, 153, 163, -157, 12, -45, -28, 21, -136, 139, -16, 93, -75, 1, -26, -161, -17, 19, -53, -96, -7, -200]
5357b00K38J37j63j8R1jO3j64J27j79J1O3l6O0q0Q7j40m8J60Q3j73P1p4J86J0
5382A11J41l29K10l3p3r9R6n6K15l13MK87m21L23J6Lj12K15j37J7jok26K62q0
5407A4j23O5J52j95k1L18k08L6Kj05k5J36m8M1j58J02j46J55J86j70nL7j45J25
5431B0j49K21j04j0J22k11J13l7J3j03K28j59N4o7p1J62pj02J26m5r4J60Rj41
5455g2O2J3m1N2j5K3m3j54J0J54R7j07LOj32J63L3j85K51m8l5M4k1P0j68lK7Q
5483hj71J51J16Qj19J82o8q2r2N2KL6O5J4m4j51J38l2j3J7k8L5R5j29r9P0J23
5510F8n8k6M3j14LJ21o5K54k95J86p0lj1l4o0q8J71q2P7P5j17Q2m8p5O9k4J34
5537A13J0m0P8p3jM1l7q2p7J13j8n1R1k70K46n0pJ3O8k0j07O9q4N5K1J21lk88
$$ y = [-200, 38, 175, 12, -6, 85, 84, 147, -17, 110, -69, -58, 5, -31, 29, -51, 36, -104, -152, 8, 91, -82, -11, -85, 101, 111, 252, -77, 133, 100, 27, -72, 24, -32, 183, -130, -126, 161, -260, 63, 79, 82, -30, 185, 48, 65, 64, 58, -168, 94, 14, -109, -44, 108, -87, -108, 210, 2, 38, 40, -65, -90, 46, -2, 39, -119, -17, -163, -8, 178, 8, 3, 40, -105, 20, -129, 92, -12, -22, 100, -111, 2, -35, -22, -125, 103, -56, -2, -69, -140, 22, 15, -87, 39, -6, -100, 60, 69, -72, -10, 3, -38, 14, -1, 22, -21, -175, -165, -11, 86, -21, -18, -12, -144, 19, 52, -133, 118, 70, 35, 79, 58, 128, -40, -43, -16, -8, -179, -28, 88, 96, -23, 159, 91, 9, -83, -31, -29, 7, 72, 86, 42, -109, 29, -3, -16, 1, -27, 8, 103, -26, -125, -55, 68, 10, -16, 27, -87, -84, 37, -28, 226, -69, 117, 47, 44, 33, -1, -61, -149, 22, -60, 17, 92, -25, 57, 9, -66, 3, -21, 113, 123, 83, 161, 88, 87, 128, 91, 9, -68, 45, 27, -24, 67, -203, 43, -7, -14, -1, 67, 47, -60, 9, -75, -20, 1, 122, 119, -169]
5565a69L28m4l4j51K7N4K8R2K1l4j72r5J28oJ33p3k5j09Q3J44k39N5R1L6j45L2
5591d4J10k11K90n5k21j6J92NJ12j11n9j11J93N6j9J8j14n7N4Jj22J39lN6j03
5616b0M4j82K28q7M2q8p3K07j64L66k81j88M09k28L1j3o7R1l4J0k11L9Q9J33j72
5641a19J07or6M6M3Q5j20K14j61M4j4J55j80M5l5n5J14o6j59J84np7n3J17o8M7
5667a3O5j92J28R2J2k71N8P9oj50L09q1j22J05L8Q8j07j13n2P0j5OJ08j58J29
5692Go2J28m3O3r6J36k22m0O1R1Jo1r9J07Q0j0j51K09J26j75J5l9j23J97N1j66
5718a5q9K39k12M2L5J3J47j41l4L3%J31Ol07J77J85n3j94N7J8k03J26J39q7R3
5743A06k13M8j34J65J14k9n3N7n7j8kJ67j77k1R5p0n8R6k35K58k5M8Lj1k19K83
$$ y = [-169, 159, 115, 81, -70, -43, 11, 39, 131, 152, 118, -54, -149, -21, -27, 106, 33, 8, -101, -18, 126, -113, -58, 33, 69, -76, -44, 66, -145, 145, 90, -131, -147, 45, 50, 162, 51, -8, -119, 74, 130, 111, 129, 15, -42, 12, 13, -109, 30, 27, 83, -20, 24, -158, 70, -17, 25, -63, -136, 71, -93, 273, -8, -196, 213, -15, 16, 3, -64, 27, -7, 3, -208, -169, -80, 53, -119, -12, -18, -114, -68, -25, 60, -60, 154, -7, 37, 23, 178, -2, 43, 8, -47, 67, 1, -158, 26, 21, -56, -109, 8, -60, -13, 52, -140, -12, 80, 92, -179, -121, -42, -48, -198, 111, 30, -92, 13, 51, 139, 32, -81, -133, -63, -78, -72, 36, -122, 7, -55, 73, 30, 93, -3, 133, -89, -129, -68, 23, 24, -37, -136, -29, 51, 41, -110, 99, 225, 50, 65, 26, -97, 100, 151, -15, -104, 135, -77, -35, 0, 13, 160, 19, -15, 18, 18, 149, 155, -152, 25, 210, 157, -37, 20, 38, -165, -39, 100, 13, 106, -107, -59, -193, -28, 86, 57, 4, 61, 4, -14, -16, 151, -26, -47, 48, -22, -80, 16, -219, 39, 14, 62, 65, 54, -165, 118]
5769A18j55k1P3J89k40M7N7K2k3j3k0N9j85R5k3M3M6q9Ooj35J53M6q2j5r6K10
5796F1l6k11R6J3kJ03QJ05k29j10K18l8k90K74j20K03NK0j28J09q5PR0k5j30P6
5822a6M1n1J6J4j7N2K0m5l8K0J0M2j0qj33J3J8L3O2R%Rj06J02O3j29K1lk3J37
5852A03l0J47k27j4r3R7J15l6P9k13K01p8q1P3P0j06r3J07k15J38J30k85L2J17
5876f2n5J76J0n2j93J50Q5Q0j22J62k25l8J98p8j42J06J47k38K40j95j10K50M
5899I8j34K6J19j34q5K66k50J07jj50J13J75k02j05R2N4O9j25J3J26j32N9p6M4
5923c3om5L5J62j13J07k15L7L9J4m1K6J79k29J50p8P4j31L2q3O6P6J20oOo5mj5
5951E9j03J0j20K33j98J32J04J1K2k57R6l3M9m9j30J03L3o2J2Q1p0J02N8j38M4
$$ y = [118, -37, -58, 15, 204, -36, 11, 68, 90, 67, 54, 34, 93, -92, 3, -20, 23, 69, -20, -14, -20, -155, -2, 44, -38, -53, -149, 61, 25, -186, -90, -77, -79, 24, 32, 137, -92, -202, 16, -22, -312, -38, -158, 45, 50, 70, -58, 51, -34, -27, 63, 38, -92, -16, 25, -26, -10, 4, -13, 39, 59, 14, -24, -4, 6, 48, 38, 30, -103, -90, -72, -39, 23, 32, 32, 41, -65, 37, 100, -29, -8, -11, -34, 103, 73, 220, -7, -21, -114, -17, 98, 62, 141, -72, 129, 51, -30, 43, 113, 7, -86, 21, -194, -56, 74, -211, -179, -62, -117, 59, 69, 17, -176, -26, 59, 139, 17, 179, -46, -84, 114, 36, -106, 0, 147, -91, 149, -46, -156, 94, 98, -36, -10, 109, -25, -110, 156, -94, 13, 12, -138, -25, 150, -52, -157, -65, -11, 58, -67, -54, 72, -60, -1, -77, -33, -39, -84, -49, 113, 0, 107, -108, -71, -32, -18, -59, -33, 146, -83, 67, -11, 63, -68, -36, -119, -53, 23, 143, 137, 143, 78, 74, 59, -44, -34, -154, 79, -119, 13, 117, 128, 150, -107, -11, -44, 5, -44, -174, -71, -38, -100, -88, -7, -77, 25, 83, -55, -11]
5976a1O6J21k46Q6N5oj28O9M1j20n0O1jm3J80j49r8O4K48j72K5O3j23M1K0J73
6002A66k1p3Q3j56J22j73P9o1J46j37J35L7k05J82j49o8J34j15J3P6j49N6J24
6025D6j50n5J85r4R0pj6K16j9k59J34p8m4Q2r1N6n8J36J7l0N4j42K03r5j35o4
6051a18O0J75j52m6P7j22J66l5K8j11L1k7J51l4o3N6p0m6J21k1J99p9k99Q4K11
6076A36k50J02J24j97R0J65k75K20p9Qj13J05n3j54o5L06n4k7L6j57L5J27K0j06
6100e6k4O5k0K8k4k2J68j68r9J50P4m1p9LJ53j06m5K56j4l15O2L0j22K17o1r3
6126h3R6l2oj42J59PR0j60JK4K9j21R4J58k83K40J3k54R6Jj5N9K3P5j93k5K04
6153E5Lk15K64L0p4onk2J00j38PL9q3Q2j57K1J50m1J16k04P6p0J06L7m5n7J9N
$$ y = [-11, 55, 176, -70, 16, 71, 65, -63, 6, 47, -73, -123, -62, -63, -106, 74, -75, -173, -109, 139, -33, -8, 55, -68, -27, -7, 166, 145, 72, 155, -1, 121, -52, 27, -34, 112, -25, 110, 147, -58, 124, -25, -93, 41, -74, -61, 15, -134, -78, 46, -104, -159, 26, -68, 22, 15, -1, 215, 196, -63, 71, -7, -51, 31, -60, -4, -62, 74, 91, 61, 115, -27, 176, 81, -54, -118, -58, 117, -35, -81, -4, -126, 40, 5, 33, -78, -47, -74, 77, 43, -20, 36, -34, -80, 41, 20, 219, 140, -159, -75, 136, -114, -12, 112, -85, 5, 170, -105, 115, 36, 44, -69, 36, -17, -171, -236, 70, 16, -11, 25, -132, -97, 30, 50, -56, -80, -15, -35, -7, -31, -53, 115, -53, -152, -2, 72, 31, -48, -45, 108, 2, -43, 213, 199, -116, -54, -24, -146, 71, 10, -83, 13, -19, -25, -167, -8, -1, 89, -71, -70, -46, -17, -138, -44, 114, -169, 71, 84, -170, -74, -73, -88, -29, -6, 69, -124, -149, 55, 58, -157, 107, 137, 63, 57, 52, 30, 130, -8, -1, 38, -45, 37, -120, -99, 51, 10, 126, -78, -2, -72, 34, 71, 26, -31, -12, -7]
6181gO5J21j44J0j9l8L7m0N8j21Q6j6j00J42K6p5l7Q0o9J7P8o1l2m2R6oJ23M0
6209A72j25q0p9J20j34K31l2j52m6J96j36j9K7k0k4J8rR5l7K8P5j77J96J6M7o6
6235H5n6j05P6%Q8j46QL9j46K05j31K79j31p9L7j5L7J5pq0P1l1k64J52J29K7J8
6262G5j0n6r4Q5q9K69j30l8J2l6o9r6J79nL0mmK5k5n2j4N6j27J58n5qP5q1om6
6292h1m0o9K75M8j31k0n0K2K7r9j7J01j03K75j46J51j32l7O2J12r6j22m0k7Q0
6317e7J06q1l5M3r9K47l9q4o0j3J35j21J40n4L4Oj53OJ98p6j43K5M0j3J35k16
6343a29Q6J80j53J8o4K4j2l5N7L8J34l07J03PK38j68q0J76k1n9j83K97l42K38
6367D3j23J62p7j10P5J52j62J56o2p7L2j12J34R5k43K28N8j48m5J64k63l7L14
$$ y = [-7, 58, 179, 35, 45, 26, -12, 25, -15, 43, -78, 8, -8, -108, 34, 60, -15, -52, 28, -41, -24, 54, -7, -39, -81, 15, 9, 132, 172, 47, -33, -112, 8, -126, 105, 73, -79, -125, 71, -65, -84, -57, -77, -101, -83, -92, 3, -34, -6, 69, -108, 88, 104, 151, 85, 29, -76, 0, 0, 88, -58, -50, -11, -157, 48, -83, 196, 65, -14, 23, 8, 45, 60, 53, -27, 44, 13, -251, -99, 30, 57, 75, 65, 9, -85, 0, -89, 180, 50, 12, 24, -12, -81, -177, 2, -3, 27, 23, 19, 44, 19, -33, -47, 9, -118, 40, -15, -23, 52, -29, -35, -81, -121, -190, 85, 133, 2, -18, -68, -46, -19, -118, -135, -34, -137, 138, -8, 143, 11, -26, 36, 148, 52, -70, -110, -137, -57, 49, -32, -67, -24, -123, 124, 85, 1, -59, -72, 63, -58, 82, 28, 62, 68, -85, -79, 119, 43, -100, -75, -35, -48, 87, -129, -43, 137, -16, 2, -62, -38, -50, -85, -28, 10, 144, -163, -60, -53, 185, 17, -63, 113, 92, 33, -150, 147, -195, 43, -80, 82, 5, -105, -30, 122, -40, 116, 54, -23, 9, -103, 31, 126, -117, 111, 169, 21, -24, 140, -123, -160, 154]
6390A54j28j5P1m9Q0j42j46J73m9k7J13L5pj02kO0O0l4rj9j45J69j19J85p6j29
6416i8J76J7L2j31k9P9R7j54O0k1j41Q7k0l0J16J69l66J86j52J17r0Q2q5K58k96
6441a37K63o7k1K7R8m2r5j15M3o0J37J51k36l9J50n7k6J71l45K23K16l00J09k5
6465B3k3j5oO9l5r0Q0l7j65J50P0r0j6J14N9k6n3n9L8L6P9k23J45m6QL4l3J33
6493A21l7o9j13J38n3J03j41k4R0m4j25J82mk3M0j15M7K6N1P8j17j05J31j83J35
6518a1L3o9K86k31m3r3J10J85j76J14j22Q9n0r7Q9l6m4q1J28j16J61J9O2j61J20
6543F6j53N2M9J34j79o7l7L7M4MN9OJ28o8o8o1O6n3l4N9q3J24JP8o3j10n7R7M1
6572A2K0M4m2J01j54j13N1k0J85j73K24q0L7l1j28J31j7K7j5j57K65j10p5M4l3
$$ y = [154, 26, 11, 82, 33, 113, -29, -175, -2, -51, -78, 35, 70, 63, -39, -41, 19, 79, 45, 36, 17, -128, 41, -78, 107, 31, -98, 78, 95, 127, -4, -33, 46, 143, -11, 49, 28, -113, -26, -46, -76, 40, 209, -157, 29, -123, -6, -96, -14, -99, 159, -137, 126, 59, 38, 65, 163, 121, 26, -89, -46, -106, 31, 182, -54, -93, 57, 0, -26, 145, -200, 23, 239, -61, 48, 23, 0, -15, -21, 48, 13, -77, 3, -34, -199, -49, 21, -69, -85, 29, 88, 62, 9, -50, -12, 24, 103, -120, 25, -21, -13, 21, -12, 121, 84, 15, -98, 40, -13, 90, -51, -75, 15, -29, -154, 28, 24, 1, 41, -74, -27, -1, 50, 128, 11, -94, 37, -146, -11, 22, -47, 239, 8, -35, -128, -18, 167, -9, 105, -17, 72, 22, -75, 14, -22, -66, -147, -19, -135, 26, 45, 107, -54, 66, -87, -35, 14, 148, -31, -98, -135, -98, -54, -50, 9, 15, 143, 75, 7, -54, 12, -41, -75, -16, -99, 25, 26, 104, 41, -69, -126, -29, 12, 32, 76, 34, 135, -19, -132, -81, -101, 84, -89, 135, 55, 92, 61, -67, 64, 47, 74, 59, -98, 167, 57, -18, 26, -7]
6597gj6K6n1k4J27j27P7p3R4J28j95M0J28k57J45j36J11q9L5J17m6l9Q7R1j73
6622b7J6m5O1K4N3Qj3l6L4L4j96N6J8lr9K39r5J46j12Nr2m7J26j4r3J17K3j07
6650a9j4QP7j7m0j96K32j03p5K13p2M4j2L1k00R5l4M3lM8n3J03O6j54R3N8Kk01
6678h0J85j75K39j97m7q3O4MQ8M5l1q5N3l3K3O6qpl3J13j81J95J14k79N2o7J22
6705E7j17N0j9J27j12j66K75l6q6J06Kj92N9P2j27J55r1J3n7J83r6N0J50l21N0
6730g1K7K0M0j21K13o5N0p5J18l02J15J02j77J50N7O1r3j5J5O9k07K5J07j7O7
6755I3l4j32P2M4l6j34Q0K4j00K28Q6j71J00j62J7K3P0qj31J67o6k6J54k04j5
6780f1P9j3l3J82k04K9J5R5j93N7r3J71KP0n7j17KJ6P8j9K4n9N2n6n9NO5M3j80
$$ y = [-7, -23, 3, -48, -72, 55, -72, 5, -68, 26, 154, -41, -1, 127, -130, 15, -121, -10, -99, -64, 53, 7, -32, 55, 146, -27, -11, -56, 5, 29, 82, 90, 77, 41, 75, 109, -87, -31, -13, -16, -115, 124, 29, 175, 63, 68, -24, -71, 55, 41, -52, 65, 88, -19, -33, -25, 52, 35, -5, -201, 31, -72, -147, 66, -6, 38, 26, 57, -143, -48, -82, -39, -42, 6, -47, 56, 122, -32, 61, 119, 121, -80, 105, -70, 169, -28, -75, -158, -94, -90, -2, 43, 12, -73, -20, -53, -30, 36, 28, 21, -12, 101, -80, 115, 229, -50, 2, -65, 57, -60, -10, -29, 98, -14, -180, 95, 59, -27, 79, 81, -111, -52, 20, -107, 48, -43, -30, -87, 96, 0, 50, 200, -121, -71, -44, -24, 16, -105, 108, 43, 93, 18, 136, -166, -51, 51, -126, 24, 81, 142, 49, 34, 49, 118, -89, -64, 43, 26, 93, 59, -73, -1, 43, 7, -127, -47, -23, -123, 105, 191, 20, 120, -42, -25, -2, 68, 60, -71, 96, 30, 4, 158, -46, -61, 18, 5, -28, 154, -50, -21, -6, 89, -104, -47, -140, 31, 33, 103, 46, -71, -69, -53, 25, 6, 30, -29, 23, -33, -92, -87, -22, 21, -159]
6809a59J32K00k62J43J24k09N4q0j2K05k03m4J70j60L48k34O5j05n0J69k08M8
6831f8J3l2q3K38l5Q9j10L8j32n5N9K02r8N0k55J87Q8r2M4j48J36M3k24R5%j76
6857b26K27j68J66M2l0K4%q9K25j57P5j25J03p2K6m1Q0j62J00%R9O1n2j80q0K42
6883H8k54J39k8J86n1m7j05J63P5p3L2k10N9J3K3n2q5K18k2j97O6K0J14k0q6J06
6909G2j05m9K43l82K71m8l8J0J0n2L4m8J17P1j24K47k10q4k9J33j04J21P2j11
6933A7L8M2j80J69k1PM5j78M1J22j27q3P1RM6n0k3J3J66m3k51J06R8J68j73p5
6959d6K8o7R6N4m5J60k78O6j35O1P8J47k06K87l55L84k38J17k43R6J16p4l6q9
6983a22K00j89J59j03j34P5J75k0P5K9j67Q2q5K1J8p6j13J64m7m7J32N3j09J00
$$ y = [-159, -27, 173, -89, 54, 178, -31, 23, -57, -69, 136, -67, -111, 59, -101, 247, 13, 78, -27, -77, 92, -116, -68, -55, -87, -170, 68, 33, 122, 12, 50, -82, -137, -78, 124, 26, 76, -179, 8, 96, 4, 48, -100, 36, 79, -145, -50, -50, -226, 1, -167, -1, 41, 11, 35, 35, -54, 171, 14, 89, -36, 67, -5, 21, -20, 60, -102, -2, -2, 97, 158, 106, -74, -154, 88, -166, -27, -55, 131, 80, 33, -72, 91, 166, 93, 125, -85, -26, -13, 10, -42, -127, 91, 69, -128, -62, -42, 72, 52, -34, 72, -33, -82, 161, -221, 50, 2, -36, -26, -16, -68, -34, -82, 35, 106, -18, 229, 19, -65, -94, 39, -65, 56, 128, 17, 55, 97, -83, 86, 65, 72, 117, -61, -20, 102, -25, -108, -37, -28, 18, -32, -55, -42, 124, 81, -170, -64, 34, 202, 29, -46, -18, -85, 11, 65, 20, 180, -98, -32, -167, -106, -28, 119, -87, 200, -155, 229, -9, 108, -135, -39, 77, 3, -33, -122, 78, -111, 48, -55, -189, -114, 61, 41, 116, 145, -22, 60, -25, -4, 14, -62, -175, -11, -58, -105, 27, 80, -29, 71]
7007G1P3j24J03l08J74n6k5n6K21l2ln4k4P5n1O0Rpn2P1m5J00j48l9P9p2O2K7
7035B9J05j54l2M4J67l6j89M8j50j8J63J36j38L0j00J66j09M7l1O9j51K22j01
7058A7P2j41L1k1j31J88k04J96L0j02J01j36Q7n8R2j22j6J70k03K30q3J7O5j23
7082d4J41j98l4J77j22K4M2j7K0K3j96L20r6M8j62Q4m4QM3qM0mN0J2q6k4l6P1
7110C2Q9o9k2M1O6j85L1kj04J92l1k2n0j55K01J25Oq0Po5M3j4p7JJ69j70m8K23
7138A32L5l8j01O9j51K14k40J22j48R7N2q7j3J61n3J7j94O0J75j09M8p0j04L23
7162A97k85j0O4R1j65L2J93k05O3J35j67L0J20j97K55K1k12N0kJ03O6j79j6J9
7186AL5kj77LK47j17K4k7J66m9n9nn3M0l0J11K8k7j19RJ60k59J55%k2Jlj28J36
$$ y = [71, 144, 20, 123, -185, -11, -67, -92, -148, 73, 41, 38, -16, -40, 35, -16, 44, 53, 46, -6, 65, 20, 120, -28, -67, 12, -60, 2, 29, 134, -20, -52, -8, 159, 123, -66, -18, -168, -186, -23, 113, -25, 5, -95, 71, -38, 9, -22, 47, -104, 118, 17, 89, -52, -21, -42, -173, 15, -189, 7, 37, -65, 36, -100, -13, -71, 21, -101, -117, 53, -150, 80, -3, 14, 79, -44, 97, -101, -135, 42, -80, -56, -14, -31, -11, 12, -184, 136, 40, 88, -74, 10, -34, -26, 17, 9, 49, 45, 95, 107, 21, -3, -39, 32, 121, 52, 30, 71, 137, -48, -17, -19, -123, 69, 38, 16, -34, -189, 12, 137, 143, 63, 70, 5, 48, 34, -43, -42, 127, -43, -91, 132, 167, 129, 28, 97, -54, 160, -80, 42, -106, -9, 43, -44, -57, 104, 51, 68, -126, -66, 109, 0, 48, -22, -126, 197, -88, -98, -34, 57, -108, -76, 117, -88, -25, 110, -57, -27, 93, -104, 151, 172, -40, 10, 8, 111, 177, -2, -18, 1, 36, 34, -143, -140, 107, -10, 14, -13, 153, 104, 45, 40, -13, 27, -3, 108, 136, 109, -10, -1, 159, -100, 55, 55, 33, 34, 31, -97, 39]
7215C9M7q6j79K01M2p7L9q2Q9M7p4m4L8lJr5J24j1J8j42J30J7QP1j62J87j73J31
7243A01k09K30j20n2k7J12r6J19N0Q4j06l5L3q2M9k40K45o4R9m2L1j60J38l6o4
7268d2K11l05K04j18j94L49J6k76R8M3J10n8K2k1j92J74N2j63J53k7j35m5M10
7291B66k82O3q3J75k57J3K28j06O9J5n3Q3p3j29l0K05j90P6J3J53p2rj30P2M3
7316F0j27M9Q1q6K0r9J99o3p8M5K0j3k2j5p4K4l5J86n0j57J07q7K46j46J05k60
7342a70O4J69k8K6k44N3J30K0J52r2j06R7j39J20j37J04J06pk88K40l2J43l35
7365a54L7Q2J03r9J11j87J52r2O3k12L23j46L4j9J5L1km4j02K4K3m8J23J84l19
7390a19N2M4Q2k24J41P0j75J40K13l48K16j77J73l4l2LP3q6k3j90J91O1L8P9k91
$$ y = [39, 86, 0, -179, 22, 64, -13, 26, -56, 33, 80, 6, -38, 0, -3, -2, -97, 27, 16, 34, -108, 22, 39, 47, 118, -44, 143, -30, 101, -108, 122, 2, -50, -77, 35, -61, 58, 108, 192, 86, 51, 84, 2, 51, -189, 56, -8, 91, 49, 80, -80, 58, 22, -42, 169, -136, 68, -50, -244, 105, 121, -155, -57, -14, 96, 38, 60, 39, -153, 21, 73, -90, 63, 36, -99, -144, 266, -16, 47, -36, 139, -118, -105, 123, 17, 86, 101, 48, 131, 58, -71, -101, 104, -86, -10, 3, 156, 84, 75, -55, 17, 60, -67, -18, 63, -23, -3, -102, 97, 34, -44, 1, 21, 8, -14, -29, -103, -79, -114, 72, 22, -135, -28, -115, 131, -15, 90, -170, -106, 63, 35, 61, -183, -130, 0, 20, 172, 80, -26, 71, -68, 52, -85, 19, 125, 118, -170, 70, 38, 181, -154, -117, -35, 68, -31, 80, -107, 45, -47, 16, -196, 127, -19, 15, -4, 11, 42, 40, -4, -106, -82, -59, -107, 16, 200, -119, -67, -23, 59, -165, -24, 46, -129, 11, 224, -124, 92, -85, 88, 54, 22, 25, 98, 12, -11, -201, -10, 51, 89, 168, -123]
7415a23K51j35k4K5k3j00K15j04Q7j67k2J37m6Orj94K03J5m3Q2n2j6K59k37N3
7440C8qn9P5j7j30J26M0l1j4N7j60P2j09K13k70K40O2m9j40Q5l0j34L64k02n3
7465c4L2J7j38J00Qq9J07L3j16J00P5n0r0J37j20J04o9j11K24j04J30pj84M1j7
7490b1o3J22O1m7j13n4J71Joq5n7J02Q2j70K28j23j3m0j6n7J42q9L5O9j93K47
7516A13mq9q8K4J55k9p0r0J59j66L24k32OM2M7j01R3j21K06k26J81m0j23k5P4
7541B0j68K09L5j97K33r3j32J15l9J35j16J9J31j10o1K3J55j65p9J0K23j46j20
7564a18L7J18j34k2J49k4m0J79k00P4j37l8P3J05P7j43J44l5j35L2J3j32J79k1
7588Ao2J02k1j19K07k15j5J36O5k0Om7N9m9k4j03L8n8j3K0m7MK23j82j3J70p6
$$ y = [-123, 128, -7, -31, -6, -29, -129, 86, -18, 69, -98, -120, 17, -29, -23, -32, -226, -23, -8, -51, 31, -21, -37, 222, -15, 38, 30, -29, 46, 29, -101, 25, 65, 34, 20, 77, -83, -11, -120, 93, -177, 63, 125, 76, -64, 21, -9, -143, 221, 19, -34, -2, 15, -123, -23, -15, -104, 3, 36, -80, 20, 95, 45, -45, 92, -28, 76, 7, -104, 120, 16, 146, 139, -45, -4, -21, -84, 38, 99, 52, -61, -115, 56, 57, 51, -34, -91, 11, 93, -77, 151, 28, 15, -25, -41, -98, 44, -45, -10, 59, -134, 113, 109, 20, -68, -44, 111, 82, 12, -78, 81, -85, 239, 7, 13, 55, 102, 1, 94, -27, 179, -47, 134, 94, -29, -54, 20, -148, 61, 96, -101, 132, 39, -93, 22, -17, 118, 2, 21, 152, 42, -19, 4, 159, -6, -85, -75, 148, 2, -118, -81, 37, -97, -119, 30, 6, -34, 145, -55, 19, -118, -156, -83, 22, 99, -44, 100, 65, -70, -38, -25, -157, 22, 1, -61, 41, 20, -99, 108, -107, -122, 14, 79, 59, 65, 18, 77, 28, 4, -99, -61, -119, -132, -112, -159, -155, 68, -114, -127, 43, -33]
7615c3m5J70k08P0K06k56J75N0m9r1j2P4j84m5J02P6j35J44R5j67MJ59j7p3l5
7640b5Q0j47O9o9OR5J23j81O5r2l3M8N8j18m3K67M4j91R4j28J20J52l00L15j49
7665F0n7l6L9j83J87k54O6J96Mr0J06J44k09ol2m5J59k9j0Mj33J82QOr6O4n8J31
7693A18j1n2p8R5k19N5J23j40J10j0j0J10j91J12p2NN1L3j10J31rL7p7L5Q1p5
7719D2k6j9Op9J23k62J46R1j67J58Q2j53l1J42j7j04m6K7J38n5p3J95K0k17J89
7744A10q5jN2k16K53j51o6K19j76K23j50j78J62l4J39r6q2J41oRj32O9MM3k6L2
7770E7j22K63k00Q5k19Q6M0J88k85J30J41k17J5L3p3Q5J40k01J51kk5j91l1p4
7794b26K14J7R5k57K11n0M8q9j7J25j89lL5P8M4j17K1q1R7l4K80p3j61J3Q8n8
$$ y = [-33, -78, 92, -116, -46, 160, -96, 79, 129, 80, -11, -23, 51, -133, -178, -76, 0, -135, 9, 104, -63, -59, 100, 83, 10, -25, 55, -92, -23, -92, -86, 9, 132, -49, 16, -76, -109, -61, -3, -121, -164, 103, 147, -44, 50, -78, 42, 194, -106, 209, 60, 3, -33, 6, -177, 10, -244, -178, 18, 22, -68, 38, 182, -27, -33, -65, -110, 49, 20, 10, 14, -119, 63, 71, 77, -19, 45, -13, 118, 107, 55, -23, 72, -147, -92, 31, -109, 1, -9, -19, 91, -100, 12, -60, -55, -4, 29, -81, 50, 41, 78, 1, 36, 117, 42, 16, -3, 3, -76, 47, -215, -69, 22, -145, 13, 95, -58, -89, 53, 36, -68, -114, -87, 51, -4, -77, 118, 138, -79, 110, 25, 24, 76, -140, 113, -38, -104, 115, -61, 162, 12, -166, -4, -38, 101, 5, -77, 64, 58, 67, -65, 4, 8, 51, 25, 57, -65, 198, -2, 83, -136, -50, -10, 178, -107, 23, 164, -53, -38, -5, -78, 7, 147, -54, 97, 95, 70, -121, -152, -226, -12, 5, 100, -157, 54, 4, 52, -37, -54, 71, -118, -121, -86, -8, 36, -81, -60, -141, -44, -78, 202, 129, -32, -19, 69, 11]
7820A1K1n2K4Q3j88m4K97p0k5r5O1j7q3J80j81J21q2r0K07j78kJ10O8j4j61J82
7846H3j67R9L6J4ON6q1j12J60q1n4j05J76PK7O9m22K47K9Q2j07P4p6M0J21j78
7872e7P2%j27J16j0l4N4K05k78K6L5p8K6n5J57j37J64n3Mp9L6R5j48J35L0Q3j76
7899Fn3l1K07k07j51J23K26j49j2NJ42q3q8J56j99J72n7M6r6J8m8R9nK8l9K8M3
7926H1o5m7q2l4J54q3K08k17P2O7j12p2K32qj11R2K2j16KM0J46j02Nl3K3j12J93
7953A43r9j9K3k04K18r8J7R6j29N3J47k60J18n6p6J28P9j37K7K7R7j88l6Q3k4
7978g0J25p7K3p1M3j53R1K03j86pL0R7M8P1q1j05J56j19m9M9j66l7K39r8J21o6
8004A1J05k17OJ45N9k75J20M6N4j87Q2K76k53O9K3k0p6J14j96K68k90K86j51l6
$$ y = [11, 32, -20, 4, 87, -101, -145, 152, 82, 57, -38, 23, 6, -77, 103, -78, 43, -39, -129, 78, -100, -102, 8, 76, 62, -99, 83, -84, 15, 51, 65, 71, 127, 46, -66, 94, 13, -41, -146, 30, 37, 64, 133, -289, -42, -13, 69, -38, 36, -40, 0, 121, -57, 15, 15, -112, 4, -6, -40, 14, 219, -59, -33, 2, -76, -50, -105, 52, -85, 79, 26, 30, -49, -13, 82, -66, 69, 99, 182, 6, -47, -78, 129, -78, -229, -106, 120, -29, -41, -36, 106, 23, -65, 91, -108, 64, 7, 53, -43, -25, -73, 26, 21, 49, 10, 38, 81, 16, -31, -113, -147, 7, -76, 132, -85, -13, 54, -58, -130, 102, 94, -17, 75, 97, -19, -17, 23, 169, 67, 72, 39, 62, -50, 143, 44, 25, 48, -156, 62, -36, -19, 77, -52, 1, 148, -112, 6, -50, -126, 2, 81, -56, -29, -2, 95, -93, -129, -46, -70, 55, -22, 1, -70, -27, -180, -89, 114, -72, -79, -49, 48, 96, 167, 86, -19, 137, 18, -31, 18, -148, -185, 54, -44, 77, 11, 116, -101, -95, 50, 109, -166, -46, 0, 54, -133, -51, 225, -28, 41, 64, 44, -32, 82, -114, 154, -136, 150, -1, -37]
8028c7K2L7J9j3J59k21L6j32J13N0r0J0j28R5q7J06J54r1j86J73l8J56j49LJ59
8053A20k9j18J28K4j38J59k58K71l38Q6k9J5K80j88k4j12J56m8NO0L9P%n9J45
8078A54j02k0N3j93p9mJ55J01j99J26Q5L8j20k3K11k6m1j35Nk2l4j01L29j93R2
8103E7p9O2l6q0P0O8m1J46o2k80K95j85J27Q7r5p2J3J3J50j66Qk57L71j93oL7
8129d8R1J35n4k31J29o2J15Kj48K21k23M5j07R8k1J16j51j9J93k31K44j60K21
8152A55k43k6N4P7P4j31J95q4J1k97K41j17P8M0m8J6R6j16n4k5J33p9J08l0l1
8177cM5M0j12j41K21j53J58j27mo4K20p4J06m4
$$ y = [-37, -15, 22, 41, 28, 187, -34, 2, -130, -17, 33, -57, -47, -175, -80, -167, -61, 93, 2, -184, -11, -49, 107, -42, -39, 120, 91, -27, 101, 125, -13, 146, -112, 159, -179, -93, -122, -107, 173, -15, -39, -151, 5, -43, -38, 22, 61, 68, 68, 9, 154, 52, 32, 85, -108, -187, -191, -36, 65, -134, -8, 77, 115, -5, -28, 183, 157, 116, -19, -14, -36, -70, -171, 158, -35, 57, -22, 40, 4, -76, -6, 62, 21, 167, 105, -175, 120, -65, 62, 149, 54, -18, -5, 8, 158, -8, 0, -257, 114, -79, -85, -48, 43, 178, 124, -107, 22, -40, 75, 77, -71, 150, -73, -28, -135, -37, -58, 58, -93, -112, 81, -150, 94, -66, 155, -88, -114, -60, 17, 91, -40, 155, 71, 82, -215, 26, -91, -13, 27, -21, -5, 91, -25, -79, -104, 29, -50, 58, 28, -3, 42, 82, -30, -171, 50, -103, 55, -72, -76, -140, 80, 6, 112, 68]
8191F8
$$ Imaginary data points
##PAGE= N=2
##DATA TABLE= (X++(I..I)), XYDATA
0@%%%%%%%%%%%%%%%%%%%%%oJ4j6J6j6J6j6J6k4L2l2L2m0M8n2O0o4P1q0Q9j02J12
43E8j22J35j49J64j80K00k22K43k68K95l25L62m00M42m95N57o29P14q20R56j134
64f18J383j750K338l438O148k4108k6429P1292j0281m6431M3908K5342m9810J3008
78E54L8641l4457j5715M0772j5419l6745K8642J3839l8783P320L3534k1320j6369
91a5506L0807l124k9970J5275J3522k8730R68K6429j8735j6897L1895L915k6825
104a6976J8991K2084k7798m681K6696j6790k0652K6793K536k8627J5200K0952
116A7728k4898k435K8545j1859j8874K1851J519k7555R383J7552k0560m028K5473
129A1842o650j7663J8997Q802k1645L827J7400j5268j0994J6760l165j6061J4366
$$ y = [0, 0, 0, 0, 0, 0, 0, 0, 0, 0, 0, 0, 0, 0, 0, 0, 0, 0, 0, 0, 0, 0, -6, 8, -8, 8, -8, 8, -8, 8, -16, 16, -16, 16, -24, 24, -28, 32, -32, 39, -41, 48, -54, 58, -64, 71, -78, 86, -94, 106, -116, 127, -141, 154, -171, 191, -209, 233, -262, 295, -334, 380, -440, 516, -618, 765, -985, 1353, -2085, 4063, -20045, -46474, 24818, 14537, -31894, 12014, 37356, -12454, 554, 39195, 4738, -10977, 29795, 14376, -22369, 6273, 20112, -18671, -11351, 22183, 863, -15506, 15301, 12177, -17793, -2518, 11004, -17726, -16758, 9671, -9064, -25961, 5934, 9849, -16976, 2015, 24099, -3699, -8380, 18316, 1526, -19126, 7667, 10203, -18424, -3224, 17728, -7170, -9605, 18940, 7081, -11793, 10058, 11577, -15978, -6595, 10957, -9603, -13631, 11842, 5192, -12471, 6526, 15328, -6317, -2490, 14910, -358, -11352, 5408, 2243, -13818, 548]
142E48J0195j7713L415J7999j3581j2161J7250p97j8736R098R660j6142J215J7000
156G250q179p040J7560m84j6033R446Q434j7353o86J6154q579j0023J4991L048
170H506j3738P382J0312j2534k815J2177q514j2557J1630L733j4064N317J2384
183G219r805l981J3812l198j1636R740M321j4461J725J1060r009m481J4091m35
197D962j0350R864O105j2888M04R862q743o848J0245j246j0151Q060P002r286
211c008J225J0843o020p447P830l50j0225M414N919q660l96J0913l437o231R503
226D873K489r785K288O430q937m228Q916k583p265Q205M255q067L092P918p080
241E21l911Q394k584r201N078M138p752J396Q227l985l025Q237p90p489M360L539
$$ y = [548, 10743, -6970, -3555, 14444, 863, -11298, 5952, 5155, -13581, -4483, 5177, -10965, -9750, 7250, -929, -7969, 9591, 9107, -6926, 2520, 10954, -6399, -7085, 9069, 490, -9533, 5458, 8506, -5232, 2150, 12462, -72, -2887, 9290, 776, -11781, -151, 3582, -10482, -5165, 7219, -2586, -6567, 7245, 4047, -7589, 2151, 6472, -7989, -6264, 4796, -4213, -8694, 5397, 4962, -5388, 4476, 10581, -2307, -1903, 7959, -784, -7632, 2613, 1367, -8784, -724, 6278, -3008, -1783, 9060, 3040, -4407, 3423, 3073, -7152, -2738, 3181, -5479, -5875, 5038, 1601, -4630, 4873, 7362, -2423, -135, 6295, -2642, -6870, 2046, -537, -7802, 403, 4658, -3409, -317, 7601, 521, -3390, 5004, 2420, -6781, -1703, 2435, -5317, -3921, 4306, 321, -2704, 5533, 4743, -2746, 1614, 5153]
257E153q153j191O724l942m431P334J506n913M044M953o223j696N607l783n373
272e384N146J004o195L298N949m570j224O853j735n314L813J108o794J216M864
287B035m559j862O740J07m480M497K671n887L23M011m662l460M620j15m395L679
303g37L827l967Q96M780l292l460M051n89n751J772L121l809M8N336j296k109
319a179M370R18m661R31K342m566j358L706j713k575M215K243l535J641L773l240
335A312k178K826j827l744K563J033l751J327M405j715j300M158m12l559J768
350I06J145m245m81L046j795j674L853R95k687K524K240l389q69K924k192l202
366b901K166Q19k932J452L008j890ML525j556k713J983L25l638K78K396k026p68
$$ y = [5153, -3000, -4191, 2533, -1409, -5840, 1494, 3000, -2913, 1131, 6084, -139, -1835, 3772, -11, -5384, -238, 766, -5429, -2131, 3818, -752, -1976, 4877, 3142, -2172, 1641, 2749, -4045, -2829, 2035, -2524, -4386, 2354, 2461, -2019, 2478, 5149, -738, -415, 3596, -1066, -4526, 94, -21, -4416, -737, 3090, -877, 19, 4799, 1507, -1953, 2098, 1509, -4242, -2470, 651, -3158, -3110, 2226, 930, -1179, 3191, 4109, -552, 379, 2721, -1845, -3203, 503, -1210, -3785, 430, 2673, -862, 779, 4552, 1312, -866, 1960, 133, -3611, -1048, -15, -3766, -2439, 1966, 251, -1049, 3109, 2697, -862, 906, 2051, -2194, -2675, 371, -1424, -3098, 755, 1750, -937, 1587, 3827, 438, -431, 2493, 301, -2901, -735, 84, -2848, -1396, 1612, -278, -274, 3251, 1695, -1018, 965, 1290, -2348, -2070, 326, -1700, -2468]
383b468L228M00j913K161J563k778k06J740k461j821K488m62k380K519K281j867
399B4l4K447q53j979J185l20k725R44J270j647ML242r9j632K065R40k727l34J634
418A405k130j461J858k62j614J892J368j213O39K251j787k006J417j32k649N62
434a862J255j190N15K252o20n13K511K26k601K14J028k059j223J687m7r27J705
451C51R99j162O69J566j499j050J377j163k487J027J270j755K79K552k07p71J261
468A257l3j624Q15M54k625N8K035j515j151K424J313j326O65J401j438p53O97
485F54p86j590J254K88j407R51J729j100k26K269m0k076L34L84j754n03J710q07
503g16m59K022J6j671J535J150j648m64Q50j293j330J425o3j505J922J736j358
$$ y = [-2468, 760, 1160, -753, 1408, 2971, 193, -13, 1727, -734, -2555, -67, -529, -2909, -390, 1891, 24, -10, 2437, 1584, -395, 790, 470, -2255, -1311, -41, -1688, -1684, 1558, 1459, -173, 1892, 2832, 105, -229, 1405, -725, -2186, -328, -590, -2204, -312, 1056, -157, 482, 2733, 946, -1060, 357, 225, -2424, -1862, -607, -1797, -1282, 970, 350, -163, 2348, 2574, -27, 187, 1215, -844, -2067, -380, -427, -1354, 351, 1350, 188, 857, 2423, 924, -126, 1251, 88, -2399, -1372, -102, -1857, -1578, 974, 767, -4, 1257, 1224, -400, 415, 869, -1756, -1698, 337, -1178, -2329, 95, 1408, 82, 747, 2148, 710, -43, 654, -132, -1722, -468, -180, -1587, -636, 1093, -7, -233, 2036, 1996, -80, 254, 638, -1116, -1619, 91, -716, -1175, 847, 863, -808, 727, 1877, 229, -235, 615, -678, -2008, -583, -646, -2151, -229, 1507, 149]
520A49k89J621o23j659J020J63j641K51R87j229K16K054k3o54J666J27k457j63
538d84J655j485j546J758K89j385P93R56o31P71J456j820j017J273p41k386J034
555a510J734j393j44K085j29j114J598K75j466P45M7j936k10J459p96j009K673
572I09Q25j812L08J539j151r12J077q55j312J077J66j730R79K106r03k63J710
589A758o72j823P40P51k003Q5J617j166n56J699J40j057J422J072j953n48J140
606F46j259j250J562L42j271J202J292j649J3K202q61j461J148j35j775K02J162
623A10r70K80K000o94j182J564K97k106M33J298j681q36J460m03j119J400J367
640A218j269M42J127j770m20J225o68j482J363R60j830K90J903o93n16J546l20
$$ y = [149, -140, 1481, 858, -801, 219, 382, -1259, -1008, -21, -1250, -1034, 1020, 997, 343, 2009, 2136, -321, -484, 1171, -314, -1860, -102, 187, -1198, -405, 551, -80, 691, 2147, 327, -690, 583, -158, -2544, -1510, 224, -1169, -1313, 772, 643, -471, 1127, 1402, -64, 681, 728, -1208, -1418, 41, -755, -1764, 909, 1734, -78, 230, 1769, 618, -294, 783, -72, -1384, -307, -141, -1871, -892, 1214, 311, 48, 1758, 1086, -737, 3, 754, -1249, -1164, 453, -713, -1269, 430, 570, -487, 935, 2007, 54, -494, 646, -613, -1863, -301, 41, -1230, -28, 1264, -385, -372, 1830, 969, -492, 656, 521, -1254, -1052, 110, -860, -580, 1420, 726, -456, 1108, 1405, -701, -268, 1030, -651, -1487, -27, -430, -1549, -149, 1218, -51, 391, 1518, -252, -672, 553, -115, -1597, -234, 726, -1104, -814, 1089, 396, -120, 1426, 1106]
657A106j490O23M55j893m0J636p13p36J721P0j384J064J170j560m43J265r68j547
675a664J247L53j263J157J558j343n36J906p08j546J199L70j919L61J219j468
691a077j59K178l15r98J244M88j761R8J077j390n90J559k49j501J326R53j067
708a84K22J492j278q57J362m85j577R00R90j277l7J596o67q81J572J89j717P10
726G3P51j653k46J284n05q03J713J25j154P04R73j472l66J368p59j196J326J25
744B88j514R60J428j125k37J352m65j443R15J97j479O38R95j142l58J528M3j118
762e37J169N68j514n8J061j159r51J588j13j013Q74J069j289K48J509r34j143
779f25J150l7j643N14J012j083J76J325o12n78J398N8j577N45O01j185m51J277
$$ y = [1106, -384, 239, 694, -1199, -1239, 397, -316, -1052, 669, 739, -645, 419, 1589, 29, -414, 851, -117, -1664, -417, -64, -1327, -170, 1388, 45, -491, 1415, 707, -839, 360, 730, -1189, -828, 391, -1077, -1236, 942, 627, -371, 873, 1361, -400, -302, 775, -615, -1205, 354, 105, -1396, -70, 883, -184, 38, 1530, 252, -605, 757, 272, -1305, -405, 585, -692, -729, 867, 200, -681, 891, 1080, -637, 73, 824, -829, -1075, 209, -296, -1099, 614, 739, -415, 289, 1262, -210, -576, 792, 33, -1163, 163, 288, -1226, -266, 1162, 37, -200, 1152, 687, -756, 159, 356, -1123, -485, 510, -632, -990, 538, 581, -537, 632, 1200, -314, -372, 689, -470, -1421, 167, 54, -959, -85, 984, -305, -57, 1452, 518, -625, 525, 488, -1155, -641, 371, -712, -536, 789, 177, -401, 997, 1055, -522, 23, 624, -561, -1012, 265]
797B65n98p10J232L43r62N77Q79r81m35R01m31j289J088M11j179M87J211n62n49
816c02J143j85r80P47J84j317J58Q19n44m08R21J55r33P45N14j064j65J047q72
835c37m30Q02N6q83O93Q52j034K71Q97n17q23O05L42j221K29Q96q14j12J292m96
855B68o62R84K06j081K44M47p47l52R85q2r71R36N66r04K12P03p09k37M84l73
875h3o99N15N93q90J01Q88j94m61P73j11o51O8O12j071o2Q80m24l82Q23J85o61
896b51N18O43q98l71Q20k91p48N71K06o60N35O58q81o6J021l73q47L68M16j157
916g87M83M42n72k03R25k3p97Q13L94j089J84O06o50m02Q12o5o60O16M45n47J77
937A02M34m33k53N04P8r69K02P52n71k28P06j28m43N45J1m56K07K76o25k69P83
$$ y = [265, -333, -1043, 189, 532, -430, 147, 1026, 45, -390, 511, 80, -1209, -121, 290, -889, -402, 809, 247, -302, 841, 656, -324, 423, 607, -710, -552, 267, -277, -685, 236, 391, -542, 203, 717, -347, -512, 535, -337, -767, 35, 91, -792, -99, 753, -281, -10, 887, 370, -453, 152, 494, -727, -498, 398, -416, -528, 764, 268, -394, 590, 796, -285, -41, 406, -341, -693, 292, 210, -761, 175, 741, -163, 49, 752, 43, -194, 290, -83, -782, -267, 326, -564, -463, 425, 231, -230, 543, 432, -219, -151, 461, -610, -672, 208, -216, -598, 225, 410, -251, 267, 910, 12, -359, 461, 170, -578, -7, 199, -461, 74, 732, -149, -215, 806, 433, -414, -46, 370, -787, -304, 138, -434, -637, 288, 265, -532, 281, 675, -414, -230, 376, -274, -676, 136, 71, -589, 27, 472, -75, 102, 536, 103, -150, 354, 432, -537, -335, 417, -154, -382, 324, 196, -247, 298, 309, -147, 60, 336, -289, -558, 225]
958B25l40k26N03K67n20Q6M12k82m15M16p9m89M62N8o84N53M96l11m00N74K1o17
980b90K59K17n56J40L80j10l63P69j03n47N13J70l56k46M37m15l76M69Q7l99L80
1001F0K17k56j52L20j23m63M98m0m90J52K34k46j55P18M9n40M47J37o89K7P08
1022D13k93m89M37j46k9N0K14j86l7N69m86k33K14J79n17K23L38l84j20N47k55
1043Il70L96J91l02J73O9k94r2L98k5n02L78L32n44m8M00j30j75K65p2m13J37
1065b19L20k50M0N94l18j65J61M1n31J07M26j85j97K96K5m34K87L05m21L38K50
1086D70n92k32L15M1k50K42R2k58J77O2j31k24N23j01k28O6j9k65L27K31k87r8
1108a39M89j45l59J6L50l21k5J76J4k93J26L42m32J12M16k76j52L52l80j69L51
$$ y = [225, -115, -341, 162, 429, -91, -5, 407, 125, -290, 126, 47, -442, 20, 78, -606, -53, 443, 132, -268, 306, 327, -290, -31, 186, -370, -230, 150, 40, -323, 446, 343, -204, 309, 479, 123, -123, 314, -101, -477, -8, 79, -320, 60, 277, 21, -131, 189, 66, -397, 101, 61, -429, -277, -43, -289, -444, 274, 323, -217, 230, 367, -322, -295, 413, 120, -369, 68, -78, -107, -57, 157, -29, -66, 503, 17, -216, -2, 177, -340, -117, 221, -163, -283, 264, 9, -361, 35, 226, -76, 97, 166, -128, -220, 178, 153, -349, 29, 361, -183, -231, 169, 39, -136, 129, 57, -356, -219, 101, -149, -109, 485, 167, 2, 163, 204, -327, -220, 206, 21, -176, 120, 145, -289, -2, 303, -118, 220, 470, -122, -354, -39, 2, -248, -6, 86, -172, 5, 67, -64, -288, 235, 134, -94, -28, -47, -312, 15, 246, -41, -139, 350, 205, -154, -138, 212, -109, -134, 42, 56, -237, -111, 231, -201, -89, 327, 51, -101, 251, -129, -298, 53]
1129E3J13k07k4K70l48k71L41K59l42L11J47m25j22M23k45M0J14J16n24L73K37
1150B89l89q9M79k79j97K61R1m67R7L48k58lK84j35m45M27J53l84K59L70l77l71
1172c36M63j99k85N02o9k67K07R7k37j11L06K21n12K89J45k39j23L85j81j03J83
1193A36m1l36K15J75k55P2J84j00j04J96o8l24O6N01l40k29L46j97k3K64rk24
1215i5J71J09l60kK42j12l04M76J2l46J71M12n04R1J75K8m71M74N2l51O7L30k32
1238C3l70N89k13l75K99K13k55j62L23j82r4K47J01l54L49K1l55Q8J64l34j65
1259d32L47L28l75l0N48m34r2K73qm66N82j4k48m2K40k00o2K96k65j17J52K73
1281B54m50J78L35m43n3K88r9l23J91M03m89L6M17q2l54K92N5l98J07L39l28m7
$$ y = [53, 166, -41, -65, 205, -143, -414, -73, 186, -156, 155, 302, -123, -245, 178, -67, -27, 87, 203, -321, 52, 289, -100, -189, 290, 11, -186, 75, 166, -301, -204, 144, -114, -117, 167, 32, -413, 14, 167, -217, 42, 412, 35, -336, 127, -72, -357, 145, 76, -191, 16, 113, -124, -235, 71, 292, -220, 69, 214, -25, -148, 237, 56, -47, 136, 95, -241, -26, 149, -106, -34, 150, 50, -54, 142, 74, -250, -184, 317, -23, -252, 94, -103, -126, 138, 129, -95, 76, 185, -175, -177, 65, -47, -351, 125, 137, -209, -38, 374, -130, -39, 136, 164, -307, 167, 219, -132, -65, 265, 33, -337, 252, 39, -336, -37, 176, -79, -241, 82, -100, -194, 53, 154, -200, 149, 170, -185, -97, 67, -267, -432, -85, 243, -132, -162, 386, -48, -140, 133, 125, -341, 241, 227, -21, -63, 177, -23, -85, 211, -54, -171, -19, 254, -196, -18, 317, -126, -179, 109, 10, -313, -122, 281, -208, -172, 245, 163, -191, 101, 156, -242, -135, 204, -124, -171]
1303a71M42j08m54M17K6k77mK94l56j84M70o5k36J21K36j74l5K53k93r4M56k30
1325C4q4Q6r5k46M18K04l09k77N41j18m26M07J68n83R9M06k84j99M13j59k99M66
1347A63J41l83m4K47l20r3M00P7m09K65K57l89R2K79l58j05L46P4l03NK62k54
1369e0j20N01k13l08K00J28m40K62K83m78r8N45j88j59L14M2k82J69K48l93k98
1390c35N16j11l19P4K79k66O3K56j95p6M14q9l98K48N7k51j89L39j14j58L87N7
1412A89l37J8L98k22l39M77l00j58K24J58k22Q1J59j74R9J84j30k78L24k2m66
1433c37K73P5q0l2J90m3k01K37L8k87K26J69k35j35J93j24m6K27R7m37J37M28
1455C33m06j42L16j24l64K89K45k10lL44m21L7K07J00l65K31M6l35J23J74q4j88
$$ y = [-171, 271, 163, -291, 126, 152, -125, -129, 165, -191, -375, 95, 30, -206, -85, 151, -23, -58, 195, -98, -192, 264, 34, -50, 36, -59, -305, 113, 317, 8, -269, 272, 154, -272, 135, 303, -280, -181, 225, -59, -258, 155, -4, -303, 163, 304, -79, -123, 124, -196, -289, 111, 188, -221, 44, 301, -88, 4, 283, -75, -180, 166, 240, -63, -58, 204, -50, -170, 331, 118, -190, 10, 138, -302, -40, 243, -235, -333, 212, 24, -135, 179, 221, -61, 108, 356, -37, -335, 181, 70, -249, -175, 104, -162, -99, 157, -38, -114, 300, 211, -187, 61, 118, -133, -322, 17, -97, -255, 132, 189, -148, -130, 268, 46, -293, 184, -116, -274, -50, 108, -114, -33, 126, -48, 51, 235, 105, -173, 151, 129, -337, -64, 11, -69, -101, 89, 46, -155, 82, 120, -167, 59, 228, -7, -142, 51, -73, -119, 108, 205, -232, -95, 333, -73, -215, 101, -23, -387, -98, 147, -63, -66, 278, -143, -106, 101, 201, -164, 67, 113, -222, -99, 75, -9, -197]
1477a97M56m1m48L74M9j19r8R1k62N1J09R2k01J87K65l61l6J96k10m2K79n0k76
1500a92j10L96k32lK81j58j49K33J71m86J72L50k15k96K42K4j98L10J24k58j06
1521a00K76q4k90L34j97j45J83L4j17N7J58j23j09K20K03m09K17m1k49k0K50j29
1543h1Q6K22n6l77L83o7j07mQ7l6j92J8J91j81Q5K59j83Q4L1k20m7J86j91J09
1567ak04L61j14j68K86M1l22K38R9l67MJ48j05r6K52j04N6q0K21k24LL35j89j66
1591i6J94Rl55Q7K26j93qK08%k10J91Q0k16J86m4m00J09K73k18l6M06j31j47L7
1615d8J96j93j15J43K2r1o8J77r1J0J33j69q7M15j67j47L4J09p4j11J32l2j12
1638a34J94o1N4r7J98p9q8L6r6j78J78J0r2K26L0k6k16K46j4q9J76j29j02j3J84
$$ y = [-197, 259, 218, -230, 144, 193, 74, -24, 67, -195, -144, -35, 57, -144, 43, 308, -53, -89, 107, -103, -145, 134, 84, -192, -302, 94, -138, -141, 140, -18, -167, 66, 237, -249, -77, 273, 58, -238, 4, 28, -170, 140, 264, 6, -100, 176, 92, -198, 136, -61, -206, -23, 11, -106, -49, 109, -14, -123, 97, 300, -109, 108, 67, -182, -202, 48, -81, 5, 227, 171, -206, 177, 110, 3, -1, 86, 50, -142, -124, 67, -114, -29, 230, 47, 131, 162, -58, -105, 81, -110, -1, -205, 156, 42, -126, 160, 201, -121, 117, 216, -151, -147, 1, -104, -200, 52, -52, 4, -76, 145, -79, -76, 259, 70, -96, 98, 107, -248, -161, 65, -128, -136, 72, 72, -138, 53, 133, -83, 103, 59, -341, -232, 41, -177, -213, 193, 62, -85, -48, 148, -45, -160, -17, 5, -86, -154, 23, -68, -58, 75, -94, -181, 234, 67, -80, -46, 63, -11, -122, 10, -22, -134, 60, -1, 53, -44, 154, 75, -13, 23, -73, -251, -73, -63, -155, 71, 101, 75, -141, 105, 91, 2, 178, 49, -53, -66, 118]
1663A18j67n1L18j94r6j4J32j61O2O8pr2J84j87mJ37l7l1K14p8j41q0K55j94j4
1688f0mJ61k70J09O6R1k49K56J77j49l07K17j20q3J7K86j54N1K24k02j91K40q5
1711B1j35J80q6k23J29Q7k6m5J06N7n9K2m7p6P5o5R4j26J96n8j41K00O6j9j21
1736FL9j0j40J02r0l9J61L0j09%Q3Jj28J53J34l02J18N7l60K37J37q2J10k5q4
1761an3O2K0j02K2J15k1j76L5N6k8J08M4j19M6J0j77K22j22J27j61q7J79j72K86
1786A13k9L9n3R3q0k10J69J7k26R8J44j29L8P7j1m9q3L89l86Q4J02j31K4k15K32
1811A7OR3k09J8JJ71j5j09o2K76k31J65k4j39j8J84m6r2j7J07l2j48J06j23J9
1836a02K47r0m0k4J69p1r3Q3j08r0K12p7k07K21L2k8p0lJ69k20J64L9k56L5J41
$$ y = [118, -49, -100, 218, 24, -72, -86, 46, -115, -53, 15, 8, -84, 100, -87, -91, 46, 9, -22, 192, 114, -27, -107, 148, -46, -60, -64, 97, -173, -64, 2, 93, -156, 100, 277, 128, -179, 38, -82, -165, -148, 138, -16, 35, 259, 57, -134, 106, 21, -114, 66, -20, -243, -114, -27, -53, -98, 8, 65, 6, 28, -19, -95, -20, -85, 9, -117, 79, 21, -120, 80, 146, 127, 6, 45, 35, -105, -3, -93, -132, 29, 59, -50, -50, 33, 34, -94, 59, 193, -109, 9, 66, -294, -57, 80, -2, 108, 83, -1, -54, 8, 28, -74, -52, 63, 42, -134, -99, -43, -71, 37, 81, -38, 8, 18, -159, 63, -59, 68, -93, -180, -1, -173, 113, 84, 123, 70, 163, 83, -127, 42, 59, -167, -69, 75, -54, -16, 61, 50, 1, -82, 307, -79, 5, 107, -24, 0, -215, 17, 23, 116, -93, -75, -74, 97, 82, -27, -89, 187, -44, 121, 97, -42, -60, 124, 78, -14, -31, 76, 44, -104, 2, -121, -102, 145, 55, 15, -9, 160, 89, -4, 79, -29, -119, 93, 16, -191, 30, 62, 34, -36, -39, 130, -90, 74, 113, -143, -108, 33]
1861C3r2j16N6J33j90J47J66r7P1K3k50M4N2O9o0N1k1j56P4J73Mj28K2J45j06
1886D7j43K31l29J3K11O8k51J49P7k20J60P1j95K7K44j51l27K96O7q4J09j4k3
1909C3Qmrj32N2J12j98OL24k03pP0L0l6p1J18j55k30J96N8Lk1mJ13m4K09n7j26
1937C5N2j0l02L46j4j62J3K17k69qJ24N6k23J74M7j48m1P1r9P2K24k51J00k32
1961b28K84j3j7J14p9k31J80j46P5R4J01m4L9k34O9l7J05J80k34j38K36k06o0
1984a90J77j20K11p2k7j2p1J80n7n0N9j59J62l2l3Q9k26M44k44m2J21j04p7K10
2008A37k0j98J00m1r3K69j40P7m6j27L9l5j8J09j71O4L22j28k1k3j76J58N4k7
2032F5j73p0J70P0k25J88m0q6Q0MK10l72L04M1j27j8J31j76J05l14J69J11m4P2
$$ y = [33, -59, -175, -119, 14, -176, -29, 137, 40, 111, 134, -116, -72, -20, 49, -11, 40, 19, -137, -63, 110, 114, -14, 8, 153, 47, -96, 135, -194, -181, 30, 98, -153, -4, 73, -147, 13, 84, -111, -84, 160, 9, -318, -22, 45, -39, 70, 56, 33, 41, 37, 28, -104, -52, 60, -138, -132, 192, -11, -18, 52, 82, 46, -25, 93, -62, -292, -96, -38, -35, -56, -60, 53, 9, 218, 161, 35, 87, 77, -225, 121, 107, -55, -42, 175, -94, -102, 22, 78, -145, 29, 76, -72, -113, -42, -141, -69, 155, -96, 4, -228, 56, 43, 26, 140, 61, -170, 10, -136, -61, 33, 134, 90, 129, -105, -36, -73, 32, 212, -22, -160, 76, -130, -190, -13, -133, 78, 6, -21, -33, -104, 76, 19, -31, 28, -131, 31, -1, -34, 55, -171, 273, 29, -13, 108, 4, -73, 137, 117, -81, 19, -22, -115, 154, 14, 91, 45, -82, -43, -78, -96, 13, -158, -94, 228, 100, 79, 56, -120, 38, 92, 65, -108, -178, -8, 62, -163, 25, -15, -101, -21, -17, 193, -179, 125, 166, 39, 21, 152, -24, 81, -233, -64, 47, 3, 75]
2056G5j78J40R3q5q6R9p6j80J48K02j84N8K28k92p9J76o6k60K15Q9K0p0q2O5j28
2081a58K76j9O1j52K0j10P2P8j86r4L66j96N8l0J0k23O9L50n2k45l7K02j0Ol3
2106B3r4l0KL4M1O3k00K07J54r7l09J04K59k50n6J88K0m5j06L18l62P0J86k27
2130a07J78k1P5j34M3n6Q1m5K6J32l47K55m8o8k0J91m2k25K37r2p4k9Lk7P8J25
2156H9n6k03K35k70R7J72%l6p7j0J45k17J07K30j88j7l6l3l6LJ50q3k8J28r3m2
2182f9L5J04j09R1o6j37J09J28j00o6K42k02j27J21J75j23k07J82Kj3Q2J3n3P9
2206I1Q0k91J39K41k11j9M2j05J26N6l1k00R2M8q9q1J18M2P1j55J43j46K1J85
2230A67j26J65j92J34j93N7N4m1M5m2p3O3p7Q3p8R9j25J58q2p3r4O9L5J06j21
$$ y = [75, -103, 37, 130, 45, -41, 58, -18, -198, -50, 152, -32, 26, 254, -38, -117, 59, -7, -267, -52, 37, 57, -13, -95, -30, -158, 118, 99, 160, 8, 28, -82, -10, 68, -118, -212, 154, -42, 16, -14, -4, -227, -158, 192, 140, -105, -142, 60, 50, 56, 23, -71, -101, -99, -65, -24, 39, -161, 46, 200, 103, -206, -102, 157, -93, -149, 39, 59, 14, -92, 226, -136, -66, 120, -107, 71, 50, 125, -9, 34, -22, 59, 14, 40, 172, -175, 80, 32, -36, -56, 135, 93, -132, 105, 13, -61, -90, -87, -114, -36, 89, 33, -170, 65, -205, -108, 64, 64, 28, -49, -59, 86, -131, -24, 206, 18, 1, -35, -68, -104, -101, 49, -34, -62, 66, -27, -69, -34, 70, -39, 52, -14, -151, -42, 86, -14, -80, 162, -40, -167, -46, 129, 6, -201, -19, -17, -30, 52, 65, 12, 91, 171, -120, 19, 260, 49, 30, 72, -33, 93, 149, 118, -82, 10, 58, -31, -112, 6, 48, 119, -36, 107, -39, -18, 167, 41, 206, 14, 148, -45, 12, 66, 25, 70, 28, -45, 18, -59, 24, -54, 45, -80, 78, -4, -77, -171, -102, -67, 39, -82]
2255h2J89nk27J3J62Q4k11K8R5j1n9lK04k26P1J18k93L2J66J5kr5J12Nj76L2M2
2282b2J95j92m2J13j58qR4J0M3j08q3K28J1j00L4J23j64R6m7O3o3K3O9p6k6j74
2308a61J2J15J70j42L8l5K7N0m8J3j18J35M3j70k3O6J31k3L0j04r4K68k56J12
2332C6Q0m2k22J61J36k23J94k82J27O8j82L09j17P0j20ML2n0J25j66j76L01%k3
2356D0o9p4pm8J59j41J12%J8L5o3J4l7J19O1k56K67j85L7j8J52k82J12rJ6J48
2382A01k34J01J70l48J82K8j40J87p2K5o5J21m1j20J80j21n4N2P9Q0j24j9J17
2405H5r4l8M8nN4n2o4l5J38N5k22PK09j04n7n2K96l66K64j35J71k53J51On1k0
2431f4J9r9K09j6jJ62k99K2l4J71k30J55J13J7j74N2m5J06j09L3P4o1M6J63j99
$$ y = [-82, 107, 102, -125, -112, 50, 134, -77, -49, 46, 35, -24, -27, 177, -49, 22, 140, -153, -121, 45, 60, 58, -37, 75, 80, -96, -64, -22, 173, -19, -61, 52, -106, -114, -20, -10, 33, -75, -158, 70, 81, -19, 15, 138, -26, 70, 23, 86, 23, 46, 115, 39, 13, -161, -149, -34, 136, -6, 32, -3, 24, 74, 26, 39, -79, 56, 99, -71, -94, -28, 103, 80, 110, 6, -88, 180, -76, 36, 116, 74, -148, 13, 149, -74, 120, -162, -35, 33, -149, 160, 43, 113, -7, -3, 29, -21, 104, -62, -238, 63, 63, 40, -29, -103, -110, -158, 1, -140, -28, -28, -10, 25, -38, -24, -61, 58, 119, -137, 130, -55, -18, -36, 116, -166, -54, -63, -47, 101, -133, -32, 138, -210, -28, 0, -140, 47, -25, 0, -65, 56, 15, -105, 75, -46, -100, -48, 31, 111, -13, -32, 85, -9, -47, 1, -4, 50, -2, -66, -101, 37, 92, -130, -123, 86, -18, -75, -127, 169, -197, 67, -68, 103, -150, 1, 7, -44, -64, -45, -144, 65, 49, 48, 210, -89, -67, -101, 70, -160, -5, 108, 125, -49, 3, -42, 64, -45, -12, 62, 1, 47, 210, 11]
2456A1r3R3j7j43K45lj4J3q6P8k5j7l5p9j1J30j6k0M2J20j81N5j45n6J59J49j80
2483b6m0j48K43r6J26J16j66m5Q3j08K7l0M4O7o4N4q1mj0K8j2J99l00K80j0r6
2509C1j70J52l0j05r5K69M8j0j68J00j0pQ3k02J9J12O8p6q2q2K48J5j68P0j05
2534i5R7J39k01o7J94j26n4J87j46J33j04J42m4j51K23j98O5j29l4Q6K3J24j63
2557i9J69r3J25j98J01r0l5R6k0N8j26J90j07p1J76m6j82N6J98j57J30k3k5j02
2581g5J70O2o8K3j47K28k42J82j71j03J14n8J66j72J15n3jJ41J05j43Kj2j90J20
2605gj40P7J45j1p8j58K84j21R5K9n6j24L9j53L07l3j64M0j53J27r6K30j77J20
2629B2J15j35j35J04k4m1J62J1J10k45K09j25K1N2k36J68K6rj69J08p9J20LJ69
$$ y = [11, -82, 11, -6, -149, 96, 93, 79, 92, 6, 84, 59, 42, 7, -72, -83, 47, 31, 11, 53, 173, -8, 47, -98, -154, 5, 154, -26, -66, -214, 29, -67, 59, 175, 9, -36, 47, -61, -34, -64, -20, 47, -17, 37, -44, -48, -58, -30, -42, 157, -143, 137, 127, 31, -139, 13, -17, -122, -217, 52, 100, 90, -78, 22, 12, 5, 88, -114, -95, 17, 85, 9, -73, -155, 93, 108, -60, 10, -95, 2, 141, -60, -127, 67, -59, -113, 74, -72, 61, -43, 99, 55, -96, 127, -71, -6, -135, -169, -83, -60, 64, -99, 70, -23, 102, -96, 5, -85, -120, -24, -44, 14, -112, 78, -29, -100, 76, 30, -152, -96, 102, -55, 75, 52, 27, -75, 95, 157, 89, 112, -35, 193, -49, 133, -38, -141, -27, -85, 81, -91, 24, -29, -30, 111, 216, 73, 75, 63, -127, -7, -147, -70, 75, 64, -14, -172, 112, -9, 86, 115, 59, -65, -26, -179, 128, 95, -69, -29, -182, -55, -151, 79, -98, 22, 137, 2, -133, -29, -53, -94, 68, 79, 189, -56, 153, 28, 49, 101, -135, 33, 59, 50, -119, -11, -90, 30, 33, 202]
2653B02k67Q9nJ49k92K75k01M9k86K52J27r6J3K7k9o3O5r2m2N6OM2M4r0M4J24
2679A01j59J23l7rJj46KK33J3j25R5k06K29j01mJ13p2k40K26j75P1J29J5j21M7
2704CRO9k03J41p4R3q5j30O5R0o9N1QQ2Q8j34m7J68k6q0j10J02J22j86r7P1k9
2731a08K22K1o1j59K05n5j68M4j62J16J08J09k06K3N9J12j23m4K60j89m4rj93
2754b42Q9K00OK1N2k5j50O5J1m5o9K31k01o6P1k0J21M6q7o0J46k21K27k12O1P4
2780B3j30J31J4PN0j62K0J59k40K48j15O2q6j2O1j35L0J93j91L5K16k29K19J9
2804A87r2r5j7R3N0k23K19j19K01k84Q6j1Q2m0o8J24j63O8Qj9n5J15l9J08o0m6
2830A0j60R6rJ97p1l3p3P3j81J79nr7M0m9J26j31K1K29k15q8J32L1p4K3O3jq2
$$ y = [202, -65, 24, 19, 168, -124, 151, -50, -1, -287, -35, 92, -4, 9, 36, 7, -56, 9, -83, -125, -69, -63, -21, 23, -67, -23, 101, -58, 65, 28, 19, 20, -126, -124, 109, 122, -3, 92, -114, 115, 14, 10, 123, 51, -189, 37, -138, -67, 62, 77, -44, 3, 12, 81, -122, 19, -55, 38, -47, -177, -112, -22, -91, -40, -32, 50, 138, 4, -43, 125, 99, 19, -91, 11, 133, -53, -150, -79, -108, 114, 135, 74, -85, 120, 65, -103, -59, -221, -105, 3, 112, -94, -71, -12, 100, -23, -67, 193, 4, -40, -49, -242, -153, 47, 53, 74, 126, 101, -49, 16, 27, -18, -87, 144, -57, -123, -52, -72, 49, 95, 8, -52, 94, -127, 100, -112, -51, 23, -107, 24, 38, 45, 95, -67, -47, 112, -128, 120, 5, 67, -19, -31, 30, -105, -75, 118, -73, -38, 178, -51, 168, 187, 95, 0, -17, 76, 126, -97, 122, 3, 204, -80, 6, -5, 77, 37, -31, 93, -70, -2, 6, -13, -68, 47, 8, 116, 56, 10, -150, -54, -63, 134, 63, 30, -43, 30, -151, 28, 23, -74, -34, -83, 43, -88, -67, 162, -53, -141, -9, 22, -52, -29, 34, 33, -49]
2857d9R6j50Q0m3m8N0J16J32k12k2kJ5nj1Q9j25N8jp8P6R7r4J53o9j5j24K9L3
2885b4M7r0O8l1L02k38l4J62j53q5j5L15j02j47j33R3N3O7P2N3j33Q2j8r1O5j18
2911c3J07n4q5j91L05mR7j53L3M5n6r7Q7j01L2R5j09J53r9J13j45L5J24p3k27
2936b01R9J82j65J46j2n5N2m4qj5q0K40j27m1N9L8K2P8k19j61K12R2Rj57O1r7
2962i2J78J9j62J37n2lq3M8Q2K2n5R5M5p3L0j93K4l2m3M3r5L43j97R1l5M0j21
2989c9L6n0%P5j14k8J8K31k16J41r6N2K0J26k41P7j45L06k30j2j0K58k33L9n3
3014h8J27Q8j71O9l3k0j36L36q0j59J08q0J37o5R3m6k02J37j07OJ08m6O9j5J4
3039D4K7j07J05L3j32j4l4P7n0L8k28R8J16J25j78jJ20Pj5m1M6j18mJ33q4R5k6
$$ y = [-49, 47, -103, -23, -66, -114, -64, 52, 184, -28, -50, -52, -37, -42, -53, 36, -89, -31, -32, -110, -34, 63, -31, 122, 53, 38, -86, -57, -24, 23, -67, 1, -30, 272, 34, 0, 162, 9, -76, -91, 224, 122, -25, -158, -65, -12, 55, 127, 180, 47, 129, 111, 20, 85, -33, 74, 20, -65, -256, 49, 45, 142, -11, 22, 67, 11, -86, 1, -100, -68, 27, -82, 71, -28, 85, -60, -25, 99, 26, -201, -102, 80, -85, 61, 49, -6, 46, 2, -6, -21, -101, 139, 12, -29, 30, 68, 90, 168, -51, -212, 0, 92, 101, -56, 5, -92, 86, 105, -57, 80, 28, 25, -58, -10, 72, 94, 39, 134, 179, 106, 136, -57, -33, -65, -108, -65, -160, 183, -14, 77, 42, 82, -39, -3, -53, -53, 22, -92, -120, -102, 129, -87, 54, -42, 10, 30, 156, -85, -8, -153, 153, -77, -89, -99, 159, -74, -35, -88, 39, 127, -44, 25, -8, -28, -164, 172, 92, -67, 41, -39, 98, 33, 126, 80, -122, 15, -92, -86, 22, -24, 45, 30, 44, 71, -36, 69, 102, -30, -44, -78, -1, -51, -13, -241, -143, -27, 98, -80, -81, 39, 46, 31, -10, 36, -82, -86, 47, -37, 58, 32]
3066C2P7q9R6j82L4J82k98N3J35J2o2l0j02K79jk00L15l22N7K9n5O2Q8P8k06k8
3092d6J43j45R0k9K0j45J53r0n7K1J67L1j32J85p2P7k23J63K8m1q7j71Q2k0J26
3117B8o5j02J23Q5p6mOq0O4J39n0q6MR9m6o8R8j9o0q1J30K4pM0M5j75J15j69R0
3146BJ24j62j4J40o6q9L11l60J32P2k0j47Q6J00o5j53k4J92p3L5q4J44o2q8J26
3171E7lR1j05J09n4k6j26K58k56J39n2j09j9J73P0k42M1J03oj31J42K2j4qj38
3196h4J95j21Q2j19J85j7j44J37r3j05J0N7J33j63m0J37j38l4R2J52j63MQ9jq
3221D3j31K19j34j72J81M8N3j89K6Q0N6q1j38J39nKj08J27%p9K11q8n5j29J12
3246a2oN0R0k57K82j99J38P0j70J8l4Q6j08K27k15l7n1J00J4O4J20j91Q5M4k10
$$ y = [32, 109, 20, 116, -66, -32, 150, -148, -95, 40, 52, -10, -40, -142, 137, 136, -64, 251, -71, -14, 15, -40, 22, 110, 188, -18, -46, 97, -48, 42, 13, 33, -112, 41, -49, -106, -85, 82, 113, -19, 166, 94, 171, -52, 111, 139, 98, 11, -160, -78, -98, 28, -37, -139, -16, 69, -7, -11, -5, -85, -21, 118, 68, -18, -14, 85, 39, -29, 69, 50, -10, -91, 39, 63, 56, 96, 141, -34, 81, -88, 2, 126, -36, -50, 90, 24, -65, 246, -114, 18, 90, 70, -77, 9, 109, 44, -109, -133, 59, -14, 21, -63, 81, 19, -69, 57, 54, 145, 40, 149, 95, 69, -57, 201, -55, 84, 32, -77, -96, 77, 147, -95, -54, 49, 43, -88, 54, 76, 62, 54, -84, 111, -10, 72, -47, 138, 121, -23, 114, 21, -84, -74, -17, 116, -47, -87, 50, -88, -122, -30, 122, -41, -37, 52, 51, 43, -88, 131, -3, -175, 6, 54, 107, -82, -56, 24, 80, -1, -139, 0, -5, -3, -111, 16, 16, -63, 148, 60, 5, -124, -12, -18, 32, 122, -135, 147, -52, 86, 156, -14, 4, -30, 56, -52, 175, -40, -77, -128, -28, -14, 50, 170, -21, 64, 108, -102]
3271a02J56k02J74j06q1J06l0J04J1j09MK00j77L7N4q5q7Q4J04l6k19R1R9k1J02
3296G1j1j09J36j6o4qJ42j67n8J03Rj18J85O3j50p6J39k24P7o0J14j16J2R7L9
3321A0R5m9p2K83l05j3o6J08J4rj27J77PK4P8j54j20K73k02P9p9q5J39n1l7k4
3347a06K1J42m7L7r3K5P7j82R7o6K23k08J19k9j93M16j46K9m4j29K05j07j63K47
3371A25k35J86p4n5N6J37j50o4N2m5L0M2j18J72J20k17R8k22L09j40j37K45j14
3394AJ35k72J3o8J95L2j49R4L1P3j22J19o1p3L8P3j00Q5Ql7m8Q1j8L7j0L8r0M4
3422D9L7l32J41M1J61j02m6N5j24J60j92L12j59m0N5r9R9Q7j35M2Q0Oj42J16O5
3447A35j99n8J97k13K90k46L01k94K9K3J44j8j16m1J83k33N8l2O6R8J24r2k01
$$ y = [-102, 54, -148, 26, -80, -161, -55, -85, 19, 30, -79, -75, 125, -52, -15, 39, -46, -133, -49, 55, 19, -200, -109, -10, -31, 71, 60, -49, 87, 71, 7, -1, 141, -26, -84, 19, 28, -90, 95, 158, 8, -68, 71, -153, -76, -136, -22, -138, -126, -29, 10, 105, 56, -16, 267, -38, -51, -117, -9, 5, -4, -131, 46, 53, 77, 155, 1, -119, 154, -48, 31, -48, -133, 6, -45, -82, -106, -85, 57, 10, 47, -46, -21, 56, -126, -29, -95, 128, -80, 39, 10, -183, 233, 87, 116, 72, -57, 148, 41, -122, 125, -110, 76, 2, -53, 3, 140, -10, -74, -22, -67, -37, 5, -113, 59, 179, -38, 60, -162, 147, 7, -130, 115, 1, 136, -136, -123, -191, 4, 36, -113, -19, 12, 85, -37, 82, 21, -52, -14, 59, -41, 44, 52, 15, -33, 48, 30, 67, 57, 95, 5, 49, 86, -246, -105, -64, 97, -5, -51, 4, -120, 40, -152, 160, 1, -39, 16, -83, 16, 103, -32, 10, 90, 96, -46, 70, 135, -64, -122, 75, -138, 152, -94, 207, -87, -58, -35, 109, 91, -25, -66, 117, -116, -58, -90, -24, 74, 198, 106, -95]
3470i5J40l4J47j75j8k05L2M5K63k74Q0Q6O7L5n4j7p1L0N0j5j83K73j60J41l17
3495b29K69Q8k36N1K2j71J25m0j6J79m0M8m7r7K81k69K59m0j18O6j86K78k48J85
3519A14j4m6m8j50J18Q9j03K6J09j87J4J19L9k1k06L11l63J53K19j19P4k16K34
3542A46j39J25r8j62K01j63K32j35L4J1k2j5j61K60j42o9P1j41J97p8J85%j44
3565gN5l02L08J01j54q2LQ3l6j03K16o4p1O0J05j4q8q8J31j38J66q5j35j5L16
3590A62j27k2nP9r7q3j0J30r8J20m1m9R6j6N1j15N4L4J2j06K8o6N9k4q0P8K2N1
3618C7J5p4q5j1rL78m50J94L1r1J39K9j90J93r7LOj49J23k3R0J74m10J35RqJ6
3645b5lJ96k54Q3J33j29Q6q3K05k85j6q4J94R2j02mm0N6O4l6n3j5JN2J9m0J7J53
$$ y = [-95, 45, 11, 158, -17, -35, -240, -208, -163, 100, -174, -94, -8, 59, 94, 40, 23, -48, -18, 32, 17, -166, 107, -53, 88, -229, 40, 128, -108, -57, -35, -206, -81, -121, -137, 42, 2, 50, 3, -94, 187, -82, 177, 137, 19, 85, -101, 177, -71, 114, 100, 54, 6, -144, -26, 63, -40, -14, 95, -92, -78, 41, 80, 59, -147, 164, -199, -46, 173, 54, 128, -88, 146, 7, 132, 34, -128, 73, -90, 142, 7, 41, 52, 30, 15, -146, 114, -28, -97, -26, -167, 30, -48, 137, 137, -7, 48, -254, 54, 155, 1, -81, -78, 5, -31, -134, 82, 18, -53, 7, 112, 98, 10, -78, 53, -85, 81, -4, -139, -154, 162, 35, 13, 8, 87, -10, -93, -103, 27, -71, 49, 8, -41, 55, 39, 90, -25, 29, 63, 75, -31, -3, -69, -10, -34, -114, -36, -14, 37, 52, -22, -107, -118, -127, 251, -199, -5, 26, -65, 74, 103, -87, 106, 9, 12, 18, -131, -8, -31, 59, 233, -177, -42, -33, -41, -25, -28, 168, -86, -3, 130, 1, 87, 4, 209, -76, -92, -176, 18, 110, 8, 4, -36, 20, 84, 48, -5, -20, -19, 33, 52, 12, 29, 182]
3673A82k76J35J06j26Qq0K23k29J33l00J86J30j55J60q5J32k66J47n2N1q3j59
3695b18K46J4jL0j21K29q8j14nl5J26J26r0j66p3O5J5K06r1j08oJ34o5p7O1R0
3721H4m2k3k46K94J03Q9k37j43J85j76Q2r0K31j27R7j1j02R6j13O3lJ03r3j48
3745a27J03O1N7o0K5j28O3J4m1K36k06R9Rj88R0n1J27k7m8J6q9J53k07J10p8k
3771h9Ql5J44j03lJ0J1kJ31j52Q4Q8J05l40J6J47j22N9K9k2L1L1J19j67P2P1j21
3798@Pl4N9m4n5K94k99J53r4j12m1J59o7L8k4R9J54j72L0l9K3L9k03J06m8J54
3824H3k3m9j0j42J89K19m11K89j55M2n7M6M9j16mR4K5r0n5N5K5N4k01J90q6R7
3850E8o5NO4n3L1Jm5P9m4L6k20Q6K48j31j72L4M4K24l58K95m2r2J11j21j4R6j07
$$ y = [182, -94, 41, 147, 21, 29, -51, 172, -57, 76, -224, -38, 92, -63, 97, 12, 144, -122, 25, -27, 24, -59, -218, 28, 42, 41, 71, -50, 179, 91, -23, -28, -63, 63, 189, 99, -67, -140, -75, -60, 146, 55, -53, -59, 75, 10, -67, -6, 84, 42, 19, -227, 67, 170, 259, 22, -121, 64, -112, -30, -120, 111, -16, 81, 70, -32, 64, -49, 14, 11, 114, 21, -127, -24, 37, 94, 34, 59, -69, -6, 8, -33, 203, -3, 96, 105, -83, 7, -44, 83, 56, 8, 24, -65, 88, -119, -9, -87, -89, -81, -116, 28, -75, -78, -68, -57, -59, 72, -80, 4, 92, 197, -143, -127, 20, -102, -43, -14, -36, -5, 26, 145, -22, 50, 121, 0, 7, -27, 32, -12, -67, 227, -72, 81, -13, -125, -166, -7, -74, -36, -60, 39, 193, 21, 51, 12, 35, 74, -129, -23, -71, 83, 60, 11, 1, -141, 48, 267, -144, 145, -10, 32, -25, 21, 70, -46, -50, 44, 69, -21, -76, -21, 4, 58, -143, 47, -39, 58, -7, -2, 62, 9, 40, 41, -4, 75, 31, 67, -153, -67, 181, 50, -122, -88, -44, 180, -178, 117, 75, -17, 94, -27, -41, 55, -52]
3877e2o5R3J3J3j80K24pj37J71O4k02N1J4m5m0M6P2kJ6j65J36j3Mp8O0O7P8k57
3905a21K28p0L9q0q9J57n8J13q4k9k1j38K58r7L9k9q6j1qJ69o7L7pJ86j13j06
3931A2O6m4p1N2l9K58k88L8K4Q4j22Q5j59L5J25n3j84K69r9o7K22k06J71l9n4
3956A6l4O2Kj12o7Q6m8O0j47L35j11n0P5n0L6o2q3P5Rq0J03n3J51k51J25j46J06
3983e3Q7j8N5M4j38kj55J70J83j82O2o2P2o1p6J41l0j51n9J22M9m9J06o0Nq2J55
4010G3J8r1n2J43j17l3M1l0R1r4J08l7k7k1j5K17Jl14J27M4m9K1J6O0n2jJ4l0
4038A1l8J59j16p1L4R9j48M5N2j01K55k54J12j95K72r7n4J67j80L6M1q4R9j9q5
4063f0J50k82J19K0J02j54L4J57j01J52L5j98l7L0q3J83j03j7N5p7j8J32j16P1
$$ y = [-52, -117, -24, -11, 2, -178, 46, 39, -98, 73, 137, -65, -14, 0, -45, -85, -39, 33, 31, 47, -118, 18, 5, 9, -69, -9, 58, 136, -121, 107, 37, 76, -4, -93, 64, 6, 119, 35, 6, -15, -153, 105, 8, 47, 18, -68, -79, -87, 82, 15, 52, 45, 231, 118, 12, 78, 34, -37, 15, -24, 234, -54, -16, 8, 92, -30, 55, -104, -69, 56, 3, -181, 88, -11, -78, 144, -62, 109, 70, 16, -18, 44, 46, -66, -133, -47, -95, -35, -182, 153, 42, -8, 67, 17, 53, -9, -92, -17, -8, -88, 15, -38, 113, -138, -13, -159, -53, 34, 16, 71, 115, -23, -25, -180, -10, 173, -9, 53, -9, 63, 2, -74, 67, 37, -114, -173, -51, -2, -51, 55, -5, 0, -82, 73, 91, 0, -52, 91, -26, -59, -18, -48, 43, -51, 57, 20, -7, -28, -43, 174, 175, -139, -12, 32, -17, 4, 20, 80, 28, 27, 41, 11, -27, 132, 16, -55, -21, 78, -70, -25, 27, -74, 181, -73, 39, -156, 116, 19, -35, 132, -48, -12, 29, -55, 44, 25, -60, 90, -192, -73, -53, 49, -105, -71, 86, -15, 137, 172, -26, -63, -33, -116, 67, -36, -53, 2, -75, -93, 39, -77, -6]
4087fj59J53Q1p2j4N3J07j66J55j7j42N5j07J70j79R9Nk8J26oo9j5J06k40K9J74
4113I3o2o9O0k10K20L1j8j08lJ64k09J56k7p6R4r1m2P9J17j84J30r9O7j76K63
4138A00k51J03N2oj5k9Q8n7J3l7P2n4J40j47J31j48Kpp9J88j23J99j87O7J3j10
4164h2R1k52J77N1Q0n0j49J09p4N3j02J18r6l0N5N8Rp5J16PO6j73J15j52J04Q0
4190E4J66o8k09J96j90J58k97J58J23j85J8qJ31Rp3K5j69L11j04l9L4k64K38j21
4214a06J67j9oj70J63M7n8l1J46k08J95k2r0M1k29K63j87J11j79K37n1j3Q2o5
4238A8p1o1J40q4j04J16R5l9J5k31K49m2l5j14J35N8m6n2k4O4J73k68NKJ35J09
4264A43o9l8no5M1MM7n7Q0q3K4k3J63p5r7j1J9k14K72j36R5J03K2k25KJ67k3j15
$$ y = [-6, -165, -12, 69, -3, -17, 36, 143, -23, 132, 115, -27, 28, -79, 91, -88, 11, 16, -12, 114, 108, 39, 24, 130, -110, -81, 93, 31, -38, 22, -188, 32, 63, 45, -63, -66, 98, -111, 45, 18, -58, 36, -55, -97, -18, 99, -85, 45, -54, 13, -163, 100, -151, -48, 4, -2, -17, -46, 42, -15, -2, -39, 33, -21, 119, -28, 103, -45, -43, -50, -129, 59, -64, 135, -52, 15, 28, -82, 9, -243, -66, -15, 65, 15, -134, -25, -99, -46, -148, -30, -126, -156, -101, -43, -34, -109, 7, 14, 80, -93, 22, -130, -26, 54, 220, 152, -57, 139, -51, 107, -190, -32, 91, -94, -76, -84, 47, 56, -17, 8, -161, 150, 46, 7, 41, -223, 15, -106, 61, 42, 36, -134, 29, 76, 18, -13, 133, -75, 120, 98, 8, 49, -180, 83, -104, 7, -172, 65, 14, 1, 83, 18, -53, -114, 26, -58, -162, -46, 49, 10, 25, -206, 43, 1, -34, -148, -13, 45, -1, -53, -77, -13, 160, -108, -103, -101, 34, 143, 74, 36, 31, -34, 7, 11, 58, 1, 81, -2, 22, -1, 162, 87, -10, -21, -2, -216, 56, -80, 15, 118, 140, -85, -83, 84, 61, -54]
4292e4O5M1l6j20J66q8qn9p3K07omP6j09j04K53m9j21P4K2j53p1K28j22L6Nj81
4319a85J26M6mQ5k6k37K59Oj74n0K23j9k04M4K9P2J2J5Jj11K18p6j40J49l2j20
4345i3L2k4K26j01M3o9J53k53J79j9k62K35j22J67j12N1j40R6r2O9P6r2K4oO8
4370C4r4j7J16J5j53J29p6N9q0j41L56p8j18Q1j11Q1J3k8J7J8L3M2r6P1k47K87
4396A13p5M2p3PL2n4K5m1O1j44J01J03j65M1J57k32N0Q7k8%R5n6M8j94O8m2Q9
4423A5L4j07o0J28k7M5p6J22k99K59K7k07K03L7J01k78j0J3J14Rl1R0j27r6J44
4448B3O4j63N0oJ12m4r5M4o1J74l4j9j61R1n7N4p3N6P5j73J10M8j13K25j06J67
4474A88j23j12P7J15k60O1N6r7K55k34nR0O9Jo3o1O6P4M0k34J42r2O6O8j67L8
$$ y = [-54, 11, 52, 16, -104, 62, -26, -34, -93, -166, 41, 35, 31, 107, -2, -106, 147, 98, -23, 51, 73, -80, -151, 77, -45, -9, -4, -185, -59, -13, -17, 68, 42, -195, 64, 70, -104, -154, 69, 50, -154, -110, -81, -9, 3, 18, 19, -92, 126, 50, -90, 59, 27, -93, -61, -85, 141, 40, 83, 14, 167, -86, 93, 74, -188, 47, -75, 92, -20, 31, -109, -13, -105, -36, 40, -52, -28, -34, 34, -60, -77, 39, 54, -99, 30, -46, 13, -67, -208, 148, 70, -48, 33, -78, 3, 16, -12, 5, 23, 56, 98, 2, 73, -174, 113, 38, 80, 7, 14, 46, -8, 17, -24, 37, -107, -6, 97, -68, -27, 130, -102, -52, 35, 7, 7, 102, 46, 94, -100, -32, -74, 15, 49, -58, -118, 10, -17, 28, -48, 74, -225, 34, 61, -146, 57, 94, 195, -83, -93, -80, 34, 43, 12, 102, -25, -121, 23, 87, -76, -26, -32, 80, 36, -59, -15, -76, 98, 64, 45, -116, -25, -82, -28, -101, -45, 30, -143, -33, 15, -98, 127, 21, 188, 65, -47, 30, 145, -115, -54, 2, -95, 160, -74, -79, 11, 80, 81, 18, -43, 23, 97, 137, -97, 45, -47, 19, 87, -80, -42]
4500d2J42k28J57Q4j10l6KJ02j01P1j30J58k8R4q5k86N7K38L3k63J78ol0J40m9
4525F2P3k43J62m3q6L3k7P4J4O8np2j99J15K9M3l2k5R2N0Jq0N5om3j45J43J03
4553A11r7N1j35L1Q6O6j30J66j20j70J61k9J20l2j57L6L2Q2o2O7M0o2K1rl6J38
4579A69p6p9n8M3L9m1p2omj5m0J42J5o9J4M6K2J06k22J12j12Q8m2J08j35J16m1
4606HP0L1j37K9j54K34j27M2j7L1m1N7M2p0L5m7J0j25P1R7M5j60L5J48q0p6K5
4633b4Kj57J77K1j15K64j20j06k2J69o4q0k0K19k63N1J36j69Q8N4m9q7o4R9O5
4658ErM0J0n0R5j93J74J13k13jM2K5r1q3J19J08r2L6o7J58j43qJ18j10K2j89J30
4685e4K1n7R6L7pl3J9O0j10K04k27K13rq5q2O6r1J32j45p4N1P4O8J08k38O7J8
$$ y = [-42, 100, -128, 29, 113, 3, -33, -31, 71, -30, 41, -89, 69, 41, 135, 50, -236, -179, 59, 92, -171, 7, 1, -29, 111, 62, 135, -108, 54, 11, -75, -42, -69, 5, 19, 87, 82, 10, -189, -74, -45, -2, -34, -59, 33, 83, 84, 4, 59, 53, 10, -135, 8, 111, 14, 65, -70, -39, 47, 113, -17, 149, 29, -141, 20, -9, 111, 79, -78, -42, -10, 72, 10, 77, 117, 55, 76, 67, 31, 169, 93, 14, -44, -1, 38, -3, -75, -81, -85, -100, -140, 2, 17, -52, -38, 8, 30, 136, -86, 26, -86, 2, -40, 68, -67, 49, 8, 78, 109, -28, 1, -153, 81, -46, -4, -21, 10, -31, 26, 68, -2, 33, -14, -4, -129, -58, 39, 84, -76, -41, 107, 27, -49, -24, -22, -179, -2, 19, -96, 168, 48, -58, -80, 89, 25, -55, -75, 144, -119, -68, 68, -101, -13, 41, -8, -95, -159, -60, 5, -4, 36, 46, -4, 91, -102, 72, 185, -28, -29, 13, 38, -53, -136, -17, 91, -1, 35, -32, 126, -17, -25, 93, -17, 5, -184, -54, -33, -90, 6, 43, 36, 3, 22, 82, -28, 176, -51, 162, 153, 68, -14, 52, -39, 93, -52, -126, -75, -1, 67, 175, -63, 4, 22]
4712B2l6l5J32k8k79K24L9j16J36k6p1J29j24L5p9J41k2Q2r6k4k25J47J49n9J6
4737C2N6K6n4o0j1q3M1L0J50O2j20J13j87k9k2N3Q9r4L1O4m5j49O3J4j41J97j19
4764i3Q0k10J32J12J34k47L4J52p4n3q0J09q0O0J9J77j20p3K2K6L9k3j01m4PM6
4790d9J03J34Kk00j09K00j11j6P3m8J59n8p1r8K3p5N0n9Q4j1J25k6J6j67K18j99
4816a10N4j63K01k1M3Q7j14J83q2O6n9j61K11j40J28q0k7J12k05M6L8k0J40j20
4840GJ18j37m8J26M1o4o0l9j98J40Q8q1P6Q3j7m7lJ29j15j5Q1n2j39Q0r0J70N1
4867H5j54L3L4q9LQ1Lk9Q3r9K24k75N1J48r8J19j65K8J66l03J71P4k25K31p3l4
4893a0n0P8j6J77k66oN6N0j34Q8M1j36J71J20Rj06k75O3J86kP1j91J24l2l5J42
$$ y = [22, -14, -49, 83, 55, -224, 0, 39, -77, 59, 33, -38, 91, -33, 2, -77, 64, 42, 124, 28, 4, -221, -74, 75, 16, 32, 88, 114, 60, 0, -11, -94, -53, -23, 127, 189, 69, 182, -5, -34, -56, -3, 86, -8, 23, 87, 42, -107, -44, -30, -171, 26, -93, -13, -223, -91, 21, 155, -92, -58, 94, 20, -33, -113, -4, -84, -24, -5, 172, 52, -21, 1, 27, 66, 43, -58, -102, -95, -49, 54, 188, 190, -10, -119, 81, -30, -46, 27, -21, 138, 80, 9, -89, -66, -141, -91, -150, -66, -77, 48, 22, 38, -129, 89, -110, -56, -219, -18, -39, 4, 91, -23, 160, 78, 144, 85, -76, 135, -5, 123, 43, 16, 128, -77, -31, 7, -13, 127, 7, 125, -12, -60, 66, 107, 43, -17, -56, -254, -114, -26, -107, -31, 52, 35, -12, -15, 114, -1, -16, 65, 13, -126, -46, -136, 34, 85, -69, -36, -2, -91, -88, -7, -4, -33, 50, -49, 175, -100, -49, 99, 1, 120, -45, -17, 149, -154, 17, 91, -134, 97, 24, -10, -60, 18, 2, 179, -87, -93, -37, 13, -121, -33, 8, -128, 43, 163, 172, 66, -209, -146, 40, 38, 109, -82, 42, 10, -25, 117]
4919A17j32Mq1k7J16M1j01m3J44j72K25m7p1k9J14q7J4J8n5p0N2J14q4J59n8j28
4945f7J57M0k03J48Lj71M2jJ57n9J16p7j55J48j19m3j00Q9k8K8L2L2l8J21k4j15
$$ y = [117, -15, -11, -92, -119, -3, 38, -63, -106, 38, -134, 91, 44, -27, -56, 58, -29, -15, 3, -52, -122, -70, 44, -40, 119, 61, -67, 90, 130, -73, 75, 78, -93, -51, -52, 105, 46, 162, 85, -70, 78, -41, -84, -184, -95, -123, -95, -63, -31, -69, 52, 28, -87]
$$ [...]
8191E
##END NTUPLES=NMR FID
##END=
