##TITLE=1H_UK-26-1
 CD2Cl2+CF3COOD
 8 sc, 
 17.03.2022
##JCAMPDX= 6.0         $$ Bruker NMR JCAMP-DX V2.0
##DATA TYPE= NMR FID
##DATA CLASS= NTUPLES
##ORIGIN= UXNMR, Bruker Analytische Messtechnik GmbH
##OWNER= root
$$ XWIN-NMR		Version 3.5
$$ Thu Mar 17 12:25:18 2022 Russian Standard Time (UT+4h)  she@DPX200
##.OBSERVE FREQUENCY= 200.131346
##.OBSERVE NUCLEUS= ^1H
##.DELAY= (6, 6)
##.ACQUISITION MODE= SIMULTANEOUS
##.ACQUISITION SCHEME= undefined
##.AVERAGES= 8
##.DIGITISER RES= 18
##SPECTROMETER/DATA SYSTEM= spect
##.PULSE SEQUENCE= zg30
##.SOLVENT NAME= CD2Cl2
##.SHIFT REFERENCE= (INTERNAL, CD2Cl2, 0, 15.7039)
##AUDIT TRAIL= $$ (NUMBER, WHEN, WHO, WHERE, WHAT)
$$ ##TITLE= Audit trail, XWIN-NMR		Version 3.5
$$ ##JCAMPDX= 5.01
$$ ##ORIGIN= Bruker BioSpin GmbH
$$ ##OWNER= she
$$ F:/spectra/data/she/nmr/H-F/1/audita.txt
$$ ##AUDIT TRAIL=  $$ (NUMBER, WHEN, WHO, WHERE, WHAT)
(   1,<2022-03-17 12:24:13.70 +0400>,<she>,<DPX200>,
      <created by zg, POWCHK disabled, PULCHK disabled
       configuration hash MD5:
       00 E9 B6 7A A2 85 ED C7 34 08 36 98 17 FE 4E 26
       data hash MD5: 16K
       1B E1 D6 24 1A C2 F9 7D 8F 34 AF 51 0B AD 18 F3>)
$$ ##END=
$$ 
$$ hash MD5
$$ 0C DA 63 F1 1B 37 C5 3F F4 D1 11 DB 8C EC 31 9C
##$RELAX= 
##$RELAX= 
##$RELAX= 
##$RELAX= 
##$RELAX= 
##$RELAX= 
$$ Bruker specific parameters
$$ --------------------------
##$DU= <F:/spectra>
##$EXPNO= 1
##$NAME= <H-F>
##$PROCNO= 1
##$TYPE= <nmr>
##$USER= <she>
##$AMP= (0..31)
100 100 100 100 100 100 100 100 100 100 100 100 100 100 100 100 100 100 
100 100 100 100 100 100 100 100 100 100 100 100 100 100 
##$AQSEQ= 0
##$AQ_mod= 1
##$AUNM= <au_zg>
##$AUTOPOS= <>
##$BF1= 200.13
##$BF2= 200.13
##$BF3= 200.13
##$BF4= 200.13
##$BF5= 200.13
##$BF6= 200.13
##$BF7= 200.13
##$BF8= 200.13
##$BYTORDA= 1
##$CFDGTYP= 0
##$CFRGTYP= 5
##$CHEMSTR= <none>
##$CNST= (0..31)
1 1 145 1 1 1 1 1 1 1 1 1 1 1 1 1 1 1 1 1 1 1 1 1 1 1 1 1 1 1 1 1 
##$CPDPRG= <>
##$CPDPRG1= <>
##$CPDPRG2= <>
##$CPDPRG3= <>
##$CPDPRG4= <mlev>
##$CPDPRG5= <mlev>
##$CPDPRG6= <mlev>
##$CPDPRG7= <mlev>
##$CPDPRG8= <mlev>
##$CPDPRGB= <>
##$CPDPRGT= <>
##$D= (0..31)
0 1.2 0 0 0 0 0 0 0 0.06 0 0.03 0 0 0 0 0.0002 0 0 0 0 0 0 0 0 0 0 0 0 
0 0 0 
##$DATE= 1647505453
##$DBL= (0..7)
120 120 120 120 120 120 120 120 
##$DBP= (0..7)
150 150 150 150 150 150 150 150 
##$DBP07= 0
##$DBPNAM0= <>
##$DBPNAM1= <>
##$DBPNAM2= <>
##$DBPNAM3= <>
##$DBPNAM4= <>
##$DBPNAM5= <>
##$DBPNAM6= <>
##$DBPNAM7= <>
##$DBPOAL= (0..7)
0.5 0.5 0.5 0.5 0.5 0.5 0.5 0.5 
##$DBPOFFS= (0..7)
0 0 0 0 0 0 0 0 
##$DE= 6
##$DECBNUC= <off>
##$DECIM= 32
##$DECNUC= <off>
##$DECSTAT= 4
##$DIGMOD= 1
##$DIGTYP= 9
##$DL= (0..7)
0 120 120 120 120 120 120 120 
##$DP= (0..7)
150 150 150 150 150 150 150 150 
##$DP07= 0
##$DPNAME0= <>
##$DPNAME1= <>
##$DPNAME2= <>
##$DPNAME3= <>
##$DPNAME4= <>
##$DPNAME5= <>
##$DPNAME6= <>
##$DPNAME7= <>
##$DPOAL= (0..7)
0.5 0.5 0.5 0.5 0.5 0.5 0.5 0.5 
##$DPOFFS= (0..7)
0 0 0 0 0 0 0 0 
##$DQDMODE= 0
##$DR= 18
##$DS= 0
$$ [...]
##$SUBNAM2= <"">
##$SUBNAM3= <"">
##$SUBNAM4= <"">
##$SUBNAM5= <"">
##$SUBNAM6= <"">
##$SUBNAM7= <"">
##$SUBNAM8= <"">
##$SUBNAM9= <"">
##$SW= 18.0517287032376
##$SWIBOX= (0..15)
0 0 2 0 0 0 0 0 0 0 0 0 0 0 0 0 
##$SW_h= 3612.71676300578
##$TD= 16384
##$TD0= 1
##$TE= 0
##$TE2= 300
##$TE3= 300
##$TEG= 300
##$TL= (0..7)
0 120 120 120 120 120 120 120 
##$TP= (0..7)
150 150 150 150 150 150 150 150 
##$TP07= 0
##$TPNAME0= <>
##$TPNAME1= <>
##$TPNAME2= <>
##$TPNAME3= <>
##$TPNAME4= <>
##$TPNAME5= <>
##$TPNAME6= <>
##$TPNAME7= <>
##$TPOAL= (0..7)
0.5 0.5 0.5 0.5 0.5 0.5 0.5 0.5 
##$TPOFFS= (0..7)
0 0 0 0 0 0 0 0 
##$TUNHIN= 0
##$TUNHOUT= 0
##$TUNXOUT= 0
##$USERA1= <user>
##$USERA2= <user>
##$USERA3= <user>
##$USERA4= <user>
##$USERA5= <user>
##$V9= 5
##$VALIST= <valist>
##$VCLIST= <CCCCCCCCCCCCCCC>
##$VD= 0
##$VDLIST= <DDDDDDDDDDDDDDD>
##$VPLIST= <PPPPPPPPPPPPPPP>
##$VTLIST= <TTTTTTTTTTTTTTT>
##$WBST= 1024
##$WBSW= 4
##$XGAIN= (0..3)
0 0 0 0 
##$XL= 0
##$YL= 0
##$YMAX_a= 92081
##$YMIN_a= -84150
##$ZGOPTNS= <>
##$ZL1= 120
##$ZL2= 120
##$ZL3= 120
##$ZL4= 120
##$ABSF1= 10
##$ABSF2= 0
##$ABSG= 5
##$ABSL= 3
##$ALPHA= 0
##$AQORDER= 0
##$ASSFAC= 0
##$ASSFACI= 0
##$ASSFACX= 0
##$ASSWID= 0
##$AUNMP= <proc_1d>
##$AZFE= 0.1
##$AZFW= 0.1
##$BCFW= 1
##$BC_mod= 2
##$BYTORDP= 1
##$COROFFS= 0
##$CY= 11.3945322036743
##$DATMOD= 1
##$DC= 2
##$DFILT= <>
##$DTYPP= 0
##$F1P= 2.36226072786647
##$F2P= -0.459571619588291
##$FCOR= 0.5
##$FTSIZE= 0
##$FT_mod= 4
##$GAMMA= 1
##$GB= 0.15
##$INTBC= 1
##$INTSCL= 1
##$ISEN= 128
##$LB= 0.24
##$LEV0= 0
##$LPBIN= 0
##$MAXI= 10000
##$MC2= 0
##$MEAN= 0
##$ME_mod= 0
##$MI= 1.114404
##$NCOEF= 0
##$NC_proc= 0
##$NLEV= 6
##$NOISF1= 3.799351
##$NOISF2= 2.8
##$NSP= 1
##$NTH_PI= 0
##$NZP= 0
##$OFFSET= 15.70392
##$PC= 1
##$PHC0= -16949.74
##$PHC1= 12.00078
##$PH_mod= 1
##$PKNL= yes
##$PPARMOD= 0
##$PSCAL= 0
##$PSIGN= 0
##$REVERSE= no
##$SF= 200.130013532006
##$SI= 16384
##$SIGF1= 3
##$SIGF2= 2
##$SINO= 400
##$SIOLD= 16384
##$SREGLST= <1H.CDCl3>
##$SSB= 0
##$STSI= 0
##$STSR= 0
##$SW_p= 3612.71676300578
##$SYMM= 0
##$S_DEV= 0
##$TDeff= 0
##$TDoff= 0
##$TI= <>
##$TILT= no
##$TM1= 0
##$TM2= 0
##$TOPLEV= 0
##$USERP1= <user>
##$USERP2= <user>
##$USERP3= <user>
##$USERP4= <user>
##$USERP5= <user>
##$WDW= 1
##$XDIM= 8192
##$YMAX_p= 0
##$YMIN_p= 0
$$ End of Bruker specific parameters
$$ ---------------------------------
##NTUPLES= NMR FID
##VAR_NAME=  TIME,          FID/REAL,        FID/IMAG
##SYMBOL=    X,             R,               I
##VAR_TYPE=  INDEPENDENT,   DEPENDENT,       DEPENDENT
##VAR_FORM=  AFFN,          ASDF,            ASDF
##VAR_DIM=   8192,          8192,            8192
##UNITS=     SECONDS,       ARBITRARY UNITS, ARBITRARY UNITS
##FACTOR=    0.0002768,     1,               1
##FIRST=     0,             0,               0
##LAST=      2.2672688,     0,               0
##MIN=       0,             -84150,          0
##MAX=       2.2672688,     92081,           0
$$ Real data points
##PAGE= N=1
##DATA TABLE= (X++(R..R)), XYDATA
0 0 0 0 0 0 0 0 0 0 0 0 0 0 0 0 -8 8 -8 8 -8 16 -16 16 -24 24 -32 34 -40 48 -56 64 -73 82 -96 106 -121 137
36 137 -154 173 -194 217 -241 267 -299 327 -363 399 -444 488 -536 592 -650 721 -794 875 -964
55 -964 1069 -1185 1321 -1476 1659 -1880 2148 -2484 2922 -3517 4371 -5718 8157 -14005 61339
70 61339 18243 -33805 92081 17281 -59002 33286 55706 -53142 -2073 60100 -29924 -46448
82 -46448 55515 9575 -64187 10182 30934 -68296 -44837 27158 -32311 -59489 29663 20540
94 20540 -45220 11523 49230 -28608 -20288 50521 322 -43157 30305 27070 -43937 4142 50574
107 50574 -19811 -17885 54734 9423 -42800 21678 23932 -45639 -8734 36158 -23879 -23048 42655
120 42655 5693 -35866 28255 35621 -30166 -1883 41869 -14357 -29853 25783 3430 -35967
132 -35967 12874 24500 -29853 -8547 30612 -20080 -37048 19288 2024 -45501 -2940 19625
144 19625 -30624 -17098 30218 -4265 -19969 33905 22250 -24283 13398 35443 -17858 -10475
156 -10475 37160 3871 -18965 30363 23853 -22978 8963 32648 -17772 -18198 23628 -8520 -38527
169 -38527 5091 5208 -37403 -7782 24045 -17315 -19241 26208 1563 -30961 10159 17179 -28091
182 -28091 -7945 26520 -10477 -17905 28175 12874 -18604 19504 28989 -18256 -5588 27816
194 27816 -10622 -27461 16009 7119 -27208 5716 22516 -17255 -6998 28585 -2276 -20918
206 -20918 18217 10357 -27913 -2117 18431 -18551 -14187 24377 3016 -17874 17941 17376 -20211
219 -20211 -1043 20319 -17041 -20868 15977 -2554 -27436 7684 16005 -18447 -913 26510
231 26510 -5500 -14465 20585 4656 -25236 4728 15911 -18510 -5706 24679 -1344 -12273
243 -12273 23481 14065 -17664 6388 17879 -18026 -13531 15394 -7944 -21645 12766 10452 -18573
256 -18573 3437 20259 -11713 -12098 16117 -3770 -22757 6886 8648 -19586 -1338 20645 -5749
269 -5749 -8042 21232 6012 -15846 9037 12270 -18842 -6351 16592 -7398 -13546 16711 7621
282 7621 -14835 8548 16010 -13970 -6954 15596 -7857 -18536 9939 4734 -18108 4045 16940
295 16940 -10325 -5866 18566 -961 -15822 9729 6596 -18340 -1137 14069 -10324 -8314 18586
308 18586 3724 -12378 11903 12686 -13971 -2018 13633 -10600 -13897 11705 1333 -15296 7234
321 7234 13305 -10604 -991 16613 -5535 -13349 10155 1591 -18773 631 10126 -12202 -4674
334 -4674 16634 -647 -9539 13785 8570 -13796 1363 11161 -12363 -9865 11776 -2373 -13102
347 -13102 10740 11165 -10493 3149 15861 -6849 -8922 11370 -2268 -17171 4269 7439 -13329
360 -13329 -1474 15488 -3029 -6602 14135 4178 -12999 4571 8355 -14257 -7212 10400 -5857
373 -5857 -11580 10411 5755 -10739 5442 12558 -9285 -5929 11012 -4426 -14105 6050 4589
386 4589 -12887 1824 13269 -5052 -2939 15315 2663 -9246 8330 6870 -13429 -2315 10797
399 10797 -7298 -8369 11801 3394 -9385 7030 9109 -10220 -2374 10088 -7990 -12935 7067
412 7067 258 -14292 2707 9943 -7421 -1878 13011 -2264 -9391 8104 2689 -13260 961
425 961 9206 -8503 -4205 13420 1237 -7307 10028 8241 -8900 800 8913 -8626 -7754 9117
439 9117 -776 -9966 7536 9193 -7381 761 10449 -5277 -7627 7820 -1113 -13331 2895 6585
453 6585 -10077 -3145 11162 -1557 -6375 8984 2410 -11640 1401 5642 -11731 -5489 10328
466 10328 -2089 -8337 9338 7094 -8007 3164 10556 -5293 -3973 9010 -2812 -9925 6827
479 6827 5343 -9069 3046 13461 -2697 -4764 9749 901 -10008 3054 3499 -10882 -2491
492 -2491 7531 -6390 -7690 8970 2938 -8247 4519 7244 -8785 -4833 6531 -6330 -10082
505 -10082 6179 2940 -8684 3609 9368 -4969 -1216 11051 -516 -6576 6893 3038 -10645
518 -10645 605 8394 -5980 -3176 12593 3286 -5968 6722 5900 -7878 -491 6060 -7348 -6830
532 -6830 6994 -2416 -11321 4467 6926 -7628 -1199 9243 -3535 -7614 4310 -1420 -10223 1837
546 1837 5751 -7516 -1175 9978 -2000 -5690 9078 5150 -6981 2853 7616 -6209 -4254 7159
560 7159 -1737 -6280 8082 5824 -6194 2619 8227 -5274 -4616 7209 -1741 -8269 4290 3046
574 3046 -9754 -1080 8258 -4042 -4520 7693 943 -7734 2234 2749 -9242 -1907 7155 -4158
588 -4158 -5417 7965 2411 -7843 3276 7146 -5588 -1907 7638 -2901 -6685 5604 1792 -6539
602 -6539 4826 8855 -4090 -1259 9037 -1099 -7423 4337 2821 -7542 456 5643 -5217
615 -5217 -3308 7427 -497 -6248 4928 3604 -8211 -1831 4288 -6790 -6287 5966 346 -6091
629 -6091 4751 5928 -5413 37 7251 -3103 -4766 6217 611 -7885 2538 5282 -4864 148
643 148 9245 -563 -3956 7057 1792 -7768 452 4155 -6652 -3296 5809 -2397 -5670 5769 3332
658 3332 -6077 2114 6779 -4858 -4203 4663 -2730 -7040 3392 3052 -5506 1385 7305 -2739 -2679
673 -2679 6877 115 -5926 3529 3160 -6939 -1693 5325 -3138 -3429 6594 2143 -4393 4360 4567
688 4567 -5844 -1571 5303 -3233 -5233 4613 771 -6053 2291 5250 -4130 -807 6738 -1130 -5054
703 -5054 3917 990 -6920 536 4530 -4393 -2026 6365 -254 -4531 4070 2829 -5249 762 4790
718 4790 -4432 -3354 5056 -491 -5260 3882 3753 -4268 850 5727 -3107 -3331 4837 -88 -5306 2295
734 2295 2969 -4815 -428 5266 -2152 -3013 5076 1366 -5326 1617 3215 -4907 -1725 4530 -1844 -3435
750 -3435 4734 1905 -4268 1718 4244 -3749 -2095 4543 -1687 -4752 3473 2086 -4664 1186 4869
765 4869 -2754 -1791 4700 -983 -4716 2338 1707 -5440 -68 4019 -2776 -2131 4910 410 -3824 3176
781 3176 2655 -4452 -694 3441 -2848 -3230 3736 569 -3642 3118 3921 -3033 -138 4706 -1619 -3713
797 -3713 2729 -187 -4924 880 3202 -3286 -563 4767 -490 -2790 3350 1384 -4788 164 2698
812 2698 -3894 -2680 3319 -647 -3085 3120 2378 -2992 1505 3918 -2759 -2582 3447 -840 -3889 1743
828 1743 2013 -3133 740 4307 -1503 -1560 3855 567 -3607 1255 1760 -3759 -890 2878 -1909 -2008 3537
845 3537 1323 -2637 2041 2896 -2695 -955 3239 -1506 -3221 2231 822 -3153 1134 2992 -2296
860 -2296 -418 3534 -935 -3158 2269 1093 -3530 -24 2157 -2024 -1170 2922 -566 -2316 2700
875 2700 1967 -2699 211 2935 -1545 -1854 2479 39 -2544 1763 1891 -2317 232 3118 -1667 -2122
891 -2122 2451 306 -3066 871 1925 -2333 -941 2222 -1132 -2072 2207 425 -2804 778 2171
906 2171 -2313 -1177 2385 -311 -1638 2303 1045 -2434 897 2156 -2014 -1111 2548 -167 -2169
921 -2169 1508 1287 -2163 542 2180 -1475 -1285 2412 -283 -2736 893 1109 -2556 -93 2331 -533
937 -533 -1154 2010 477 -1535 1386 1331 -2361 -196 2158 -1701 -2472 1513 862 -2220 850 1583 -1242
954 -1242 -490 1783 -1209 -2147 1336 434 -2320 -73 1635 -1158 -622 2550 206 -681 2104 1352 -1717
971 -1717 -21 1371 -1534 -812 1945 127 -1307 1394 1401 -1514 243 1652 -1206 -1474 1543 -620
987 -620 -2773 -73 846 -1550 -362 1861 -110 -831 1791 -65 -1623 719 1443 -1323 -617 1893
1003 1893 -317 -1253 1336 1106 -666 1200 1516 -663 -542 1404 -917 -1747 1151 568 -1722 -188
1019 -188 1285 -997 -937 1387 191 -1017 936 821 -1857 -488 1193 -1110 -1180 1461 339 -1230
1035 -1230 546 661 -1729 -68 1786 -346 -983 1108 -67 -1783 312 863 -1026 153 1995 -323
1051 -323 -975 1129 482 -1112 749 1746 -556 -258 1182 -166 -1350 564 563 -859 531 912 -1223
1068 -1223 -855 1071 -355 -1548 804 860 -1077 -389 740 -1053 -983 1094 331 -921 1011 911 -1157
1085 -1157 -134 1651 -211 -527 1574 497 -1004 146 650 -1010 -136 1230 -215 -850 922 139
1101 139 -1467 -119 682 -887 -579 959 -374 -1171 259 279 -997 352 1410 -107 -351 765 -291
1118 -291 -1140 554 701 -1251 -27 1320 -364 -754 1028 466 -711 955 1103 -907 -324 416 -988
1135 -988 -1341 748 165 -767 524 950 -1207 -322 994 -76 -442 858 459 -1087 -208 449 -825
1152 -825 -257 1113 277 -352 799 634 -782 161 993 -438 -634 859 -291 -980 298 442 -843
1169 -843 410 1122 -327 -643 926 -97 -1128 255 577 -812 4 852 -499 -617 849 458 -448
1186 -448 699 1018 -675 -402 520 -508 -1042 504 100 -762 45 545 -485 -128 929 99 -327 691
1204 691 378 -970 177 362 -650 -331 1129 129 -565 869 545 -755 -24 830 -558 -677 270
1221 270 -335 -1297 192 369 -973 -136 726 -440 -733 739 71 -845 514 593 -767 132 1038 -190
1239 -190 -440 990 691 -366 829 1056 -615 -294 883 -84 -765 748 8 -992 68 645 -1085
1256 -1085 -629 765 -211 -662 315 253 -947 28 518 -387 -404 1007 -260 -818 468 406 -600 213 1154
1275 1154 -291 -428 953 166 -627 325 372 -684 50 779 -546 -780 677 306 -707 243 640 -109
1293 -109 -163 1134 -217 -526 619 69 -881 370 728 -787 -25 801 -284 -549 491 -17 -1057 -259
1311 -259 188 -971 -598 686 -147 -744 856 444 -386 492 825 -462 -50 703 -208 -393 624 775
1329 775 -531 119 1283 128 -223 614 -2 -785 73 188 -1132 -338 663 -433 -771 407 -21 -828
1347 -828 313 503 -463 -198 594 -352 -726 477 -61 -721 193 825 -50 -257 981 118 -304 620 -29
1366 -29 -1058 238 188 -676 -372 886 -104 -508 708 473 -375 114 555 -587 -350 499 -148 -734 340
1385 340 608 -613 31 653 -415 2 637 -230 -709 246 -62 -973 -386 681 -816 -660 576 125
1403 125 -517 244 251 -604 127 607 -441 -306 919 355 -247 275 1000 -350 227 605 -104 -392 526 -16
1423 -16 -729 140 621 -707 -50 639 -224 -650 458 29 -931 -79 13 -419 -211 754 59 -498 442 243
1443 243 -483 -78 141 -290 -430 618 -115 -433 376 545 -265 7 833 -454 -338 550 -68 -644 399
1462 399 608 -513 -62 760 -227 -146 553 214 -560 288 141 -824 -395 104 -495 -179 702 345 -563 319
1482 319 565 -367 -220 403 -129 -386 231 -175 -660 255 968 148 -53 901 49 -118 321 7 -706 22
1502 22 537 -471 -240 525 100 -393 472 567 -256 217 587 -548 -736 124 -357 -542 24 306 -52 5
1522 5 312 -300 -431 695 -15 -263 217 -72 -781 -145 552 -20 25 775 259 -21 258 387 -366 -38 602
1543 602 -253 -565 199 -155 -655 301 431 -305 -108 518 24 -727 256 -99 -454 259 277 -367 -26 586
1563 586 34 -487 707 413 -362 122 296 -298 -337 442 65 -125 594 454 -233 -14 316 -203 -280 461
1583 461 14 -281 216 319 -402 -238 348 46 -238 88 123 -599 -21 108 -466 -207 370 300 -45 402 229
1604 229 -521 295 562 -89 -135 314 -68 -85 99 198 -30 351 738 -433 -308 44 -492 -727 -214 119 -397
1625 -397 -1 268 -181 -358 359 446 -21 329 262 -524 -320 416 -79 -376 308 379 -24 215 242 -178 -62
1646 -62 298 143 -375 225 116 -492 -77 437 45 355 739 297 -42 351 195 -536 -127 338 -252 -277 369
1667 369 -100 -360 393 379 -248 -35 3 -510 -563 -260 -449 -376 267 374 -97 196 487 152 -32 710 471
1688 471 -119 434 310 -214 14 401 250 78 508 583 -135 26 196 -527 -471 -28 -745 -746 -381 -80 -533
1709 -533 -269 208 -534 -66 343 99 -384 111 -26 -353 0 439 162 233 609 311 -239 355 638 77
1729 77 -136 463 -81 -112 121 129 -83 292 307 -215 -144 235 -310 -521 -241 113 -121 239 217 -159 -203 121 94
1752 94 -365 -223 165 -667 -349 36 -288 -388 288 215 -316 426 241 -242 -50 76 -94 -204 448 89 54
1773 54 475 730 323 435 700 259 -182 332 326 -545 7 12 -309 -299 101 -81 -453 130 -50 -404 -238 -145
1795 -145 -518 -573 -306 -100 -576 300 529 22 277 763 429 245 329 132 -117 -132 166 -212 -36 480 126
1816 126 -63 282 316 -352 112 45 -568 -454 -48 21 -486 213 192 -211 366 294 91 -365 287 125 -597 -53
1838 -53 43 -586 -62 142 178 -99 195 219 -263 0 220 -381 -214 172 -67 -377 375 107 -158 125 450
1859 450 -237 172 297 -50 -234 178 166 2 -27 486 -14 -131 326 -126 -330 224 166 -432 -304 78 -274
1880 -274 -609 230 -26 -322 81 113 -274 -216 116 -14 -321 197 265 -317 267 441 54 40 387 -178 -278
1901 -278 344 102 -592 3 143 -209 -81 251 -6 -231 105 271 -104 -211 100 -436 -320 228 32 -33
1921 -33 398 225 -216 233 263 -14 -491 119 -119 -581 306 236 -254 -114 542 44 -64 376 145 -267 -262 -26
1943 -26 -420 72 368 -51 -61 475 613 -153 103 459 -110 -148 417 -219 -380 61 116 -503 -164 493 -351
1964 -351 -63 446 51 -265 72 152 -496 -314 68 -232 -237 258 122 -161 130 610 -83 69 450 -27 -403
1985 -403 95 -36 -206 141 367 -381 6 145 49 -291 255 302 -232 -38 168 -334 -336 336 -10 -124 305
2006 305 302 -393 -267 274 -118 -371 301 87 -359 52 103 -29 128 350 38 -151 87 145 -120 -38 226 -230
2028 -230 -164 387 36 -368 -19 87 -347 -166 77 -228 -214 271 -180 -521 351 228 -144 -6 319 -145 -214
2049 -214 383 -217 -161 189 281 -281 132 237 -353 -304 343 139 -199 134 30 -617 -204 214 184 -62 179
2070 179 110 -421 77 179 -209 -259 -44 114 -347 54 128 -474 89 490 2 -47 254 -152 -327 208 -31
2091 -31 -567 192 360 -112 -132 362 14 -211 369 314 -185 -133 12 -210 -477 412 305 -287 495 306 -186
2112 -186 -34 421 -236 -337 198 99 -210 -421 302 -113 -371 314 274 -504 202 161 -357 -97 96 -201 -278
2133 -278 200 70 -38 121 113 -165 112 464 -24 -111 330 198 -250 143 178 -195 -131 464 96 -200 157 -96
2155 -96 -230 -162 168 -199 -136 221 -422 -430 -44 351 -291 94 260 -294 -90 244 213 -139 176 98 -304 -69
2177 -69 326 -6 -222 204 6 -425 103 25 -41 -221 201 -115 -244 245 84 -423 -17 196 -181 48 231
2198 231 -43 25 346 123 -351 17 136 31 -64 460 -103 -288 -45 327 -352 -14 371 -181 -370 481 -215
2219 -215 -187 6 91 -215 120 498 -180 24 274 126 -293 246 377 -325 -376 -15 -262 -399 205 213 -437 -143
2241 -143 202 -178 -123 376 -113 -227 433 91 -377 -75 221 -142 -38 479 96 -407 281 229 -30 -34 234
2262 234 121 93 164 31 -473 -79 104 -474 56 219 -294 -170 336 164 -472 -26 258 -278 -289 241 -50
2283 -50 -206 96 380 -264 184 376 -319 -287 390 244 -263 248 53 -434 -156 463 -220 -363 141 160 -159
2304 -159 319 63 -263 -201 249 -106 -200 120 57 -404 2 157 -168 89 148 142 -366 217 3 -290 149 11
2326 11 -46 -156 134 -106 -302 189 126 -274 293 138 -222 -35 -47 -135 -679 138 248 -131 -24 434 -158 26
2348 26 5 46 -223 175 243 -442 41 181 -157 -286 306 212 -147 52 97 -194 -235 133 -123 17 162 91 -177
2371 -177 67 338 89 -47 154 -74 -319 525 38 -466 119 166 -143 -205 248 -14 -268 331 467 -381 -18
2392 -18 206 -329 -412 447 245 -242 141 288 -202 -137 419 5 -257 126 -26 -167 -10 261 -312 -258 471
2413 471 -104 -382 117 1 -279 60 304 -156 -171 194 -108 -203 297 245 -244 -77 449 -211 -365 407 9
2434 9 -459 210 433 -180 -167 293 -18 -119 287 204 -500 44 204 -143 58 420 -129 -183 484 107 -406 -160
2456 -160 265 -126 -112 256 -62 -338 351 -92 -392 55 392 -338 -23 465 -134 -208 225 -239 -248 8 376
2477 376 -105 -115 769 72 -211 261 73 -361 65 285 -176 -142 124 -1 -176 475 426 -190 101 236 -50
2498 -50 -347 241 129 -369 -55 277 -175 191 347 26 -214 255 137 -368 -55 74 -162 -9 379 -272
2518 -272 -371 244 260 -136 73 410 -194 -152 205 -106 -363 -105 381 -246 265 578 -156 -79 241 120 -382
2539 -382 -12 251 -415 48 290 -43 -38 401 359 -389 125 230 -517 -78 274 47 -454 113 227 -217 31
2560 31 235 -39 -168 312 -30 -371 145 -126 -320 -4 71 -82 -180 491 10 -552 223 202 -359 12 345
2581 345 -131 -192 384 20 -602 245 378 -93 -65 289 -380 -586 138 30 -189 94 363 -186 -327 288 43
2602 43 -208 40 220 -693 -102 111 -435 -340 304 107 -267 373 434 -99 219 421 -447 -60 190 75 -296
2623 -296 384 168 -257 267 466 205 -305 275 103 -615 -113 62 -164 -37 450 -8 -387 452 464 -14
2643 -14 20 292 -281 -252 196 -304 -275 226 442 -55 250 118 -43 -62 206 -299 -520 -224 85 -317 135 465
2665 465 -192 -201 496 287 -332 399 236 -364 -133 205 -34 -165 217 179 -256 188 230 -357 134 384 -148
2686 -148 -446 14 15 -544 44 494 -168 39 312 -179 -504 132 -44 -289 -38 121 -329 -302 235 80 -360
2707 -360 107 457 -130 50 179 -336 -286 349 -304 -366 172 381 -44 -83 388 -109 -167 84 -14 -451 -103 196
2729 196 -316 -184 629 140 -325 344 290 -70 116 298 -310 -208 307 210 -375 159 287 -54 44 625 -78
2750 -78 -73 558 -18 -570 64 50 -303 -191 475 73 -371 581 230 -138 152 397 -481 -211 40 -370 22
2771 22 285 532 -323 121 461 -186 -76 146 -324 -352 26 230 -337 52 175 3 -8 554 121 -375 7
2792 7 -113 -530 -209 167 -328 -328 400 64 -240 331 305 -147 -25 482 -85 -410 -98 121 -402 78 180 -38
2814 -38 42 508 -344 -212 16 -13 -644 -117 405 -269 -163 278 141 -108 402 140 49 45 125 -165 -157 280 -131
2837 -131 -219 26 79 41 -125 578 -144 -400 291 -198 -414 -74 78 -531 -319 306 201 -124 468 372 -225
2858 -225 -94 78 -315 -291 176 -356 -176 60 252 -144 220 315 -3 -168 159 -134 -474 171 -49 -336 183
2879 183 425 -93 82 356 23 -374 150 27 -534 -138 284 -136 -52 351 342 -291 89 177 -309 18 294
2900 294 -185 -503 332 -87 -224 -22 173 -25 -106 382 -60 -368 -80 -158 -453 -156 72 -75 101 516 48
2921 48 -74 228 184 -160 -30 -161 -243 -584 97 -229 -333 275 269 -113 58 418 -52 -400 363 -202 -434 -194
2943 -194 180 -257 -226 465 -24 95 595 380 -210 -14 192 -68 -580 230 -111 -254 233 219 -5 93 303
2964 303 87 -248 128 -229 -501 7 137 -290 89 504 68 79 474 105 -215 27 26 -640 -359 319 -258
2985 -258 -215 324 -103 -161 185 398 105 -182 355 35 -375 -31 22 -233 471 402 -263 -64 459 -174 -214 139
3007 139 87 -530 -181 144 -152 -282 391 68 -178 342 118 -180 70 -32 -263 -136 72 4 -287 209 273
3028 273 -253 471 384 -248 -389 -62 -21 -555 -141 156 -122 -177 292 122 65 414 8 -424 -12 59 -267 -268
3050 -268 -118 -81 -299 300 391 -204 284 378 -213 -47 126 -128 -279 -12 455 -509 -22 373 233 49 280
3071 280 -175 -403 20 37 -360 -250 246 -357 -373 461 172 -169 71 286 -426 -48 211 48 -255 -110 -24
3092 -24 -302 151 516 -57 45 260 105 -187 55 45 -181 -419 -194 -38 -310 524 111 -216 150 316 -29
3113 -29 65 103 -216 -267 131 -213 -240 261 402 22 143 456 -212 -292 334 -229 -411 -92 187 -209 -43 530
3135 530 270 -184 469 267 -158 -193 -23 -251 -513 206 -331 -114 176 360 -200 411 389 -206 -139 193 -34
3156 -34 -266 249 21 -235 269 341 64 -84 496 -95 -421 -9 191 -177 -96 -5 -297 87 359 244 130
3177 130 54 301 -422 -29 -3 -385 -235 123 76 -165 181 498 -64 28 308 157 -142 65 165 -276 -68
3198 -68 245 -136 -49 269 -110 -132 133 275 -18 -317 3 -26 -317 35 -288 -52 394 169 210 196 291 -115
3220 -115 -304 -97 -138 -430 -268 40 -420 113 249 135 -53 222 -15 -194 210 237 -432 -41 0 -146 -186
3241 -186 358 402 171 100 298 -184 -254 -92 -5 -309 110 183 8 50 434 -40 -51 523 180 -319 -179 -73
3263 -73 -300 -6 129 -133 -239 389 222 -38 341 94 -203 35 71 -60 -190 47 -1 -192 102 470 -77
3284 -77 126 134 -19 -231 -49 -274 -348 -66 156 -150 -77 46 158 36 237 167 -350 -128 246 13 -337 70
3306 70 -30 -231 380 201 -23 150 183 -12 -58 36 -127 -167 35 360 -57 -75 144 198 -201 103 114 -263 -96
3329 -96 149 -286 -520 528 77 -296 4 255 17 183 153 -5 -175 47 -191 -392 14 120 -28 168
3349 168 388 -47 191 198 5 -87 11 -54 -214 -52 149 316 -11 197 269 -82 193 24 -193 -477 135 -154
3371 -154 -333 52 228 55 38 290 -74 -91 211 -100 -247 -80 4 -332 -13 54 -13 86 377 88 -234 178
3393 178 117 -358 -81 -15 -218 -38 13 156 -56 194 148 -17 -14 181 110 -212 -44 -349 -629 -450 201 56
3415 56 -68 288 106 -142 2 38 -309 -43 61 -242 -333 97 77 -167 248 143 -56 79 227 -189 -89
3436 -89 60 -207 -385 210 244 -210 248 172 56 73 213 -66 -110 169 107 -139 -271 -94 -118 -30 190 251 -25
3459 -25 69 122 -332 -222 133 -79 -294 122 161 -58 106 351 -117 129 206 16 -251 24 -353 -317 -129 88
3481 88 -20 -273 337 90 -68 39 349 -252 5 114 -254 79 -243 -27 130 19 232 -114 11 135
3501 135 66 -278 -32 -158 -90 -33 3 -64 -4 219 3 -185 134 305 -220 -23 -40 -150 -225 30 2 -325 95
3524 95 18 -33 150 20 -57 -354 -33 -191 -281 -134 93 -439 124 284 38 79 -12 165 -144 63 -272 -193 -96
3547 -96 128 131 212 257 71 67 71 -53 -58 -133 -23 -203 -109 59 -66 36 24 14 70 -245 95 -22 -116 -203 121 -289
3573 -289 -142 125 -103 263 233 107 -87 164 202 -148 59 125 -77 -44 169 283 303 167 286 27 22 228
3595 228 -60 -154 154 75 -236 165 103 25 -151 157 -75 10 1 172 -25 75 -26 -111 -159 0 -36 135 206 10
3619 10 99 44 -109 -128 -349 62 48 -181 22 105 -153 145 293 21 161 -101 41 -439 -232 -8 48 14 20
3642 20 83 -157 303 261 69 -77 96 -189 -147 124 -119 -336 -5 254 -13 205 89 54 130 -14 199 -217
3664 -217 -232 -46 71 -102 60 84 -10 250 83 54 249 80 -275 -79 -171 104 61 247 112 -256 -14 43
3686 43 -90 -73 1 -167 -225 226 -271 -122 -22 -23 78 -75 184 120 92 -119 150 -262 -315 251 -134 -75 277
3709 277 241 65 9 88 1 88 97 -285 -111 20 -135 -246 -175 258 -53 135 388 162 -21 209 69 -60 49
3732 49 -58 58 11 318 -133 34 -156 -12 -442 17 62 15 -188 -154 32 -81 215 -132 -87 108 220 49
3754 49 45 24 -107 -300 -70 -99 -15 8 58 -186 4 325 -100 32 -38 82 -177 -76 -45 -65 -88 124 64 51 -51
3779 -51 142 36 -39 76 -391 110 -225 -146 -32 208 70 187 64 80 200 -47 -1 208 -163 -8 -88 -39
3801 -39 -41 153 38 -64 156 21 -76 -126 83 -277 -4 26 -104 -77 76 -299 -138 18 137 -90 66 -85
3823 -85 -53 -128 -2 54 -80 45 84 -94 -223 50 111 -14 60 -216 -265 75 154 -100 -99 321 45 145 1 -159
3847 -159 -80 77 222 -101 -248 -206 -103 137 -42 40 52 -249 41 -66 -80 -260 21 -294 -246 81 -132 196
3869 196 -3 48 -161 29 68 -182 -86 -28 -52 -146 -85 -104 -266 -106 -70 -378 3 332 166 -44 -147 2 -270
3892 -270 100 -119 -46 117 111 -193 -153 160 158 114 -348 74 -254 -73 -46 -70 -12 104 201 86 18 18 6 -31 -126 108
3918 108 -63 -242 141 -61 51 24 58 -3 126 -49 2 -206 313 -93 -14 148 -125 -48 -31 175 54 210
3940 210 -94 4 9 79 -31 -128 -208 228 -55 18 210 -172 -71 53 -65 -154 -155 -224 62 -310 -9 -20 185 184 -19
3965 -19 -17 259 32 1 -9 32 203 -196 -117 141 -141 92 33 131 -121 83 -112 -38 29 -91 -108 -29 -40 246 -233
3990 -233 117 -128 138 198 -98 146 39 26 -112 22 -105 -173 58 27 -6 -114 17 -155 -19 276 173 46
4012 46 -118 -51 22 -103 -278 -3 144 -209 341 80 99 62 -93 -178 -314 137 -111 -206 -89 91 27 20 128
4035 128 -32 123 161 -20 13 -110 -85 148 281 258 -263 209 310 -103 -47 51 53 74 -108 -131 23 -151 -35
4058 -35 78 -191 -176 -45 221 159 54 -268 153 52 -75 -72 -59 95 -75 -84 92 131 188 -201 -44 -74 72 215
4082 215 -77 -6 68 -61 4 27 45 -405 -64 74 -21 169 44 -40 -18 49 -257 -246 2 -67 -181 -197 -85 -95
4106 -95 -117 46 264 -50 -86 -86 173 -111 48 -44 24 0 -64 -17 -73 -93 -101 2 -12 368 -55 -76 61 324 -176
4131 -176 -94 23 -150 -168 -191 33 148 -225 90 -34 209 -73 -117 -256 -35 -69 -58 -20 29 38 -44 149 61 -20
4155 -20 -214 9 18 21 49 2 -103 33 -144 -372 -100 -105 -231 67 121 82 -53 -64 61 -94 -285 -129 -68 36
4179 36 171 95 266 280 65 146 -146 -218 6 -112 6 274 107 -225 10 97 105 -84 15 146 69 -14 -222 152
4203 152 -30 -194 13 92 -5 207 -22 92 91 -6 241 42 34 40 -66 81 -118 -141 239 81 -105 112 -100
4226 -100 -326 -71 55 -119 -7 9 -42 70 -288 5 -193 -88 104 104 -116 -146 139 -146 24 39 -27 270
4248 270 112 64 48 183 -126 218 55 -119 -18 -145 8 -73 71 -102 -80 -222 -344 -91 -5 6 -249 1
4270 1 -324 -121 35 -99 0 206 -73 83 -98 -207 -11 53 224 -41 33 -10 100 83 -56 -98 -127 -196 -158 88
4294 88 -58 -102 -28 54 127 226 53 8 151 -45 53 -101 -127 43 -273 -328 134 8 70 70 179 17 -39 -61 -50
4319 -50 61 -38 121 8 -69 -167 314 38 90 299 81 -126 88 -30 -14 10 -267 139 17 -88 -98 -63 -19
4342 -19 -80 115 124 -180 -105 -85 -168 -151 99 -31 -123 162 -295 252 33 49 -32 -64 -140 37 35 -254 -17 -105 -112 -172
4368 -172 138 144 -29 -9 -259 44 -3 -10 -132 -25 -40 181 104 59 50 -25 -64 -153 -169 -171 -311 -185 -156 -138 -100 101 153
4395 153 -6 -236 80 -126 4 3 -388 97 -227 122 -61 -145 157 -109 -22 47 -15 81 -196 -76 -110 -70 66
4418 66 -36 -18 104 235 -13 -21 56 -265 80 -127 -175 35 -60 -167 -152 6 74 -169 -31 117 188 -119 131
4441 131 11 -354 39 124 -98 -77 -30 6 77 38 47 -57 171 -97 -14 19 141 175 -63 194 -99 -42 -156 -75
4465 -75 47 -181 -102 -232 -286 137 -31 147 46 266 113 -122 270 64 252 -52 -212 24 -26 14 -195 -12
4487 -12 -131 -72 -153 -113 36 -56 18 66 74 -22 6 71 49 219 109 -114 -251 23 -71 -152 -79 -47 198 190 -107 103
4513 103 -101 -24 37 77 -47 153 14 235 37 195 99 -9 196 151 -21 -171 -219 -43 -171 -48 62 -54
4535 -54 -77 -233 11 78 76 -134 126 -176 -150 -131 -215 -65 -231 -129 85 -180 162 58 53 -157 40 -10 -229 117
4559 117 -21 -42 88 -85 76 154 92 23 -34 175 -34 -163 -133 15 313 48 92 17 -9 -375 -167 73 -197
4582 -197 -106 -6 168 -127 40 -159 -26 160 81 -28 -146 10 -308 236 17 -102 -109 -10 60 129 71 66 -30 -88
4606 -88 -33 -17 -136 -48 35 -207 -102 151 74 -88 -19 111 63 20 211 108 89 -22 -122 275 -3 78 -169 74
4630 74 97 21 -128 82 56 -162 78 -220 -148 53 204 217 115 -87 -148 -172 -192 -84 179 8 250 29 -138
4653 -138 -109 -132 195 171 -46 103 -2 -55 -150 136 -55 112 66 -109 -153 26 -166 -74 43 89 84 -6 99 30
4677 30 230 37 -4 58 -38 77 -5 -157 -50 137 -39 -70 30 -209 -119 -121 -13 -72 -3 -45 -62 -211 235 -117
4701 -117 278 16 -98 -59 -61 -90 -145 53 -289 74 -112 -178 -39 168 19 15 -101 20 -38 -119 41 133 165 -27
4725 -27 -110 -33 90 -88 -42 132 12 108 51 78 -118 -190 49 87 83 -39 15 14 -94 36 5 58 -138 19 -115
4750 -115 -80 65 86 84 -293 28 117 -13 -333 40 1 142 -93 -52 -136 131 155 46 -56 -52 -127 -366 88 89 -82
4775 -82 107 157 173 41 184 130 -47 84 53 9 63 46 -38 -12 198 27 -202 53 -56 59 -186 6 146
4798 146 26 -23 75 -92 122 -55 89 -86 -52 85 -152 285 -6 117 230 55 -146 170 73 23 61 -54
4820 -54 1 -278 -252 -29 -7 74 194 181 98 -16 -32 121 -252 -283 -64 -72 -261 -40 32 23 -208 177 26 -91 -38
4845 -38 178 104 267 -211 -143 -137 -6 157 97 162 -30 12 260 204 -171 -156 -170 -236 -157 130 -17 -15 66 283 33
4870 33 41 -64 -287 -134 -337 -111 119 -119 5 39 193 -73 -18 -86 95 23 51 139 2 38 65 134 58 47 281
4895 281 -43 61 61 -50 182 -179 -90 -34 127 -54 16 36 -137 -106 27 46 173 -15 -347 148 -117 -6 229
4918 229 -135 197 -9 -38 -45 186 -214 -274 41 -72 48 -164 197 142 -147 -18 223 24 -29 -180 -76 -255
4940 -255 -10 46 55 183 203 18 -66 133 32 -3 13 112 -109 50 -121 30 -144 178 55 96 123 -174 -19
4963 -19 303 20 125 -50 -110 45 -31 196 30 -233 -38 -3 246 -150 64 48 74 189 176 -104 -5 -89 -14
4986 -14 74 -41 70 108 129 107 399 65 297 146 46 189 -79 -153 -46 86 -277 103 165 108 37 22 -18 106
5010 106 -154 173 -17 -36 12 17 -28 101 65 169 -25 -119 -154 229 -222 -67 78 -106 -43 -291 -6 118 -93
5033 -93 -43 91 -55 -87 250 -142 -45 151 121 -118 -59 23 36 -42 96 71 -29 85 231 199 122 136 -11 38 67
5058 67 -139 224 -227 -99 -88 71 -172 -198 -113 -88 42 -52 122 167 148 36 146 -232 12 -89 -244 -9 -73
5081 -73 22 75 47 131 -88 -14 -117 116 -152 -106 -23 -71 -114 35 198 80 33 -174 65 -51 107 -163 68 -10
5105 -10 -55 265 -73 -234 -27 -117 -125 6 -70 29 -133 95 88 8 -16 38 168 103 -129 -175 15 -195 4 -85 307
5130 307 -185 -31 306 -24 -12 52 -166 104 187 37 103 -98 -225 -13 38 17 -74 219 -16 9 167 -160 8
5153 8 50 21 88 -24 -148 30 136 -124 -64 76 -141 59 -19 56 124 11 -239 44 163 -92 -21 -20 180 1
5177 1 72 -262 22 143 161 16 -121 -151 41 -77 -207 15 -71 4 96 -245 -104 -149 82 -113 139 -37 -241
5200 -241 179 -176 -14 36 -53 144 -122 -2 -102 68 179 -116 101 110 -1 70 34 -303 -156 -13 -143 -267
5222 -267 132 33 -90 207 167 80 216 13 -107 -41 16 -9 25 -162 -64 36 52 -197 -3 -7 -88 -65 20 -20 -67
5247 -67 134 -304 -32 116 17 -24 78 108 115 298 135 -54 74 57 78 156 -194 163 -307 -175 -38 -9 262
5270 262 -59 48 -48 -148 -58 -50 139 -139 -92 102 -132 -131 80 -28 131 -156 -78 -7 65 258 -229 117 -272
5293 -272 -174 -100 276 -101 -124 17 -88 -47 -186 -73 -203 -143 -35 353 -130 -241 76 97 -25 -121 17 -120
5315 -120 93 129 16 22 95 1 -73 105 -102 17 200 -314 -92 73 220 -165 56 182 -43 -179 72 66 -55
5338 -55 -88 3 -59 100 -191 112 133 29 -30 94 102 -236 -91 81 -21 74 -208 16 25 169 154 -168 63 -103
5362 -103 29 -11 152 53 -14 -131 17 -107 -22 144 372 -153 160 99 23 149 40 -102 70 -125 14 198
5384 198 -37 -29 -33 215 71 -186 172 8 336 43 -136 103 109 -46 -39 -89 -53 -178 59 354 117 128 176 -27
5408 -27 -85 -11 127 98 256 289 -177 0 -136 -25 160 -137 -84 -17 0 144 -60 96 43 -18 -16 126 124 -190 101
5433 101 104 -146 -147 -245 -194 -43 -169 -256 138 -1 -217 295 -15 149 55 -47 206 -144 -192 175 103 -26 109
5456 109 273 16 32 -122 68 -33 -107 -80 -9 -115 168 226 -48 -162 17 73 -17 -113 80 -194 -257 91 -36
5479 -36 -266 -243 -12 99 -51 130 18 -80 11 -42 -23 7 -68 184 -249 -320 170 96 87 64 -189 -46 98 44 -129
5504 -129 -26 37 64 -287 97 -252 -252 -36 81 -79 -213 -38 -119 -212 224 43 212 -272 -77 84 -126 119
5526 119 -206 -122 -225 -162 -99 -15 112 -237 -1 -141 35 207 44 -47 17 -84 230 34 117 34 -18 264 183
5549 183 121 -111 -158 63 -155 -28 -33 -156 59 -154 -112 133 -50 -191 -137 108 145 -322 160 -15 -159 52
5571 52 201 38 -104 51 8 105 -120 90 1 -150 -40 -57 60 159 6 -185 39 83 2 -422 -17 -48 -158
5594 -158 -31 88 216 -3 83 -61 -252 125 195 -2 -49 184 -130 16 178 70 -41 -15 18 -71 43 -101
5616 -101 65 66 -235 -74 -32 171 -68 -127 305 111 19 -7 -52 -232 19 115 228 12 -132 117 199 -275 176
5639 176 -41 96 41 31 68 -2 251 128 42 -147 127 -22 -152 -18 -20 -35 181 -15 -15 38 130 -42 215 74
5663 74 -33 -142 -2 39 -85 -174 216 -68 -3 -122 121 119 -358 161 54 -1 73 -80 -13 87 -96 -316 -89
5686 -89 -423 18 111 -66 -169 -104 41 164 51 44 247 236 88 108 1 160 200 194 -102 31 198 10 -234
5709 -234 144 -176 -99 127 -145 -96 -127 104 22 -46 232 6 -170 -82 9 71 -77 191 -26 184 -280 92 -47
5732 -47 -100 -223 -27 73 -319 -48 -133 138 36 82 -38 232 28 87 112 -115 -19 209 16 -23 5 10 3 -51 11
5757 11 2 210 132 383 -207 202 -108 -195 -147 0 38 -145 -108 42 -69 -94 68 -134 -26 34 -73 49 66 -167
5781 -167 111 -2 -161 76 -106 97 78 -76 -61 31 64 -138 -43 61 267 142 -172 134 332 177 -80 -317
5803 -317 84 -90 -77 -25 -96 -93 65 -21 -70 -197 89 -95 27 24 -130 116 -143 62 -21 1 89 -23 -161 -34
5827 -34 36 8 -21 -8 183 29 -50 -247 -89 -83 -69 -61 145 156 25 -94 -283 -321 56 144 -23 -195 -155 -179 2
5852 2 -46 241 -45 -24 -35 87 20 -27 91 176 -143 -36 99 -68 -188 86 71 212 399 116 -238 -120 -18
5875 -18 -63 -62 -231 -25 -178 36 -19 -63 -32 109 46 68 43 -10 -70 1 -118 -35 89 -152 110 -122 175 -14 -32
5900 -32 246 287 -74 -102 26 -77 28 189 8 -207 -16 -29 -15 -27 179 -51 23 -209 36 77 24 57 98 -127
5924 -127 -95 -130 -177 -113 340 96 -212 -68 105 -135 -52 129 72 239 23 -46 72 31 11 53 -35 -39 94 275
5948 275 -318 -112 151 56 -46 -115 118 175 -146 -276 212 -128 -11 -129 -40 14 -101 -111 7 91 276 184 -64
5971 -64 117 146 134 66 -30 -54 30 -55 166 70 77 43 9 -189 3 64 -67 -14 -170 202 25 64 -37 -171 165
5996 165 -100 53 35 -19 -116 85 244 270 115 -242 -261 59 -172 31 -89 -89 25 141 -137 -12 -6 -86 -37 126
6020 126 -49 -71 -189 137 -41 43 -52 19 194 -157 15 91 -188 24 -58 -150 -141 -88 141 -158 2 -61 247 275
6044 275 220 64 -152 -85 157 3 53 145 -77 106 -166 22 79 -54 53 194 -102 175 52 -269 -39 206
6066 206 96 -259 -118 -83 -157 -229 38 -180 113 177 -72 216 -180 18 -202 158 212 -94 46 90 -233 -146
6088 -146 -230 -131 -236 -14 -25 -65 89 -222 65 3 198 39 -153 -159 98 -118 -14 209 213 123 142 -270 25 -7
6112 -7 43 -54 23 -207 -74 -135 7 -74 -49 -106 132 103 80 85 -198 -212 -9 260 -53 -32 1 -135 -52 -130 19 24 -228
6139 -228 -173 -29 -221 -184 -155 -240 -73 323 -368 139 -77 -110 53 108 -177 9 -95 -83 -152 52 38 -9 -109
6162 -109 166 88 213 -33 232 -10 -141 -95 -65 -17 63 115 -132 302 -119 226 -41 35 218 52 223 -170
6184 -170 35 61 115 149 -29 92 -261 -71 -153 -77 39 47 135 82 100 83 -153 -156 281 60 -88 105 335 -49
6208 -49 -112 17 4 202 20 228 -30 -165 110 -134 -115 182 129 84 -52 -114 -164 -96 -141 150 -77 -110 61 56
6232 56 214 85 -123 -124 141 -24 -149 119 134 39 -285 -201 43 -43 -85 88 -24 48 171 -214 -38 -150 -70
6255 -70 175 -149 -195 2 -122 51 5 -152 -122 -28 -48 -135 -81 -35 -66 174 -21 -311 193 -75 -181 -27 112
6278 112 64 319 147 -86 -133 177 127 203 -152 -83 -232 108 -5 35 91 63 66 -139 157 -101 -230 -3 -58 15
6302 15 -72 13 192 149 37 267 83 17 285 122 -197 -42 -48 129 9 -88 85 -220 -50 -88 -255 -118 69
6325 69 -167 -219 -125 -139 -232 -29 -324 -116 8 139 167 28 -223 101 -7 -11 -78 -161 -26 -263 41 -129 59
6348 59 86 -23 75 -201 -71 251 98 36 1 -46 -84 13 -108 -99 -145 122 83 103 -156 -33 -14 -64 -164 -8 -52
6373 -52 -1 -99 -81 43 42 160 -32 106 71 -210 -60 132 -35 -65 5 34 -77 39 -153 -207 -80 121 111 -161
6397 -161 -49 -133 -87 -42 97 102 -26 5 50 -95 -94 36 -19 -51 -325 32 -189 8 -81 113 -234 -101 93 2
6421 2 -76 -62 -110 -1 -35 111 53 -286 -152 -117 -18 265 193 3 195 90 -72 -41 1 -214 29 121 23 -364 60
6446 60 149 28 -57 -41 -28 -45 -34 166 -82 -92 -56 256 -108 30 55 219 151 49 195 -148 182 -74 -109 10
6470 10 -167 56 -38 -57 -39 -98 16 -15 -259 -34 22 203 -9 92 130 67 141 99 9 -28 8 -65 -86 -271 97
6495 97 27 -308 72 46 95 77 7 41 -173 -222 56 115 -19 78 225 -110 -30 -165 -175 -326 -86 5 95 15 -110
6520 -110 -62 111 -67 92 -71 92 -176 0 -163 -164 68 16 58 -92 59 167 -9 -102 297 -260 -140 222
6542 222 -76 -276 -295 -30 -142 19 -44 352 0 -173 77 160 256 -113 137 55 -210 -109 -71 48 -2 -97 -286
6565 -286 -38 219 117 -298 -218 106 50 31 78 -113 124 -227 114 -125 90 -38 -54 -97 148 -51 -94 16
6587 16 -86 -45 -24 -36 58 267 -297 -68 54 94 -67 90 41 -166 -142 -71 -72 15 -129 58 36 -101 0 5 -27
6612 -27 -164 -159 -22 39 -199 -126 -30 -49 -104 58 -21 98 -203 -71 52 98 54 14 -137 -69 56 -107 -195 29 24
6637 24 -160 -13 79 194 -135 -274 -67 96 17 -261 5 -163 -4 -41 -61 80 -3 -129 49 14 63 146 54
6660 54 -5 108 77 68 23 -56 -58 -36 -6 57 177 192 -159 -107 -93 90 33 -83 -100 -332 -222 -75 65 -126 -92 -70
6686 -70 128 267 104 -83 -256 -7 -109 31 80 -16 103 -139 15 -91 119 -70 -301 37 -54 39 132 -269
6708 -269 121 47 -119 42 -39 -182 -2 -29 53 3 91 -201 -126 -52 225 70 -47 188 -83 -27 -154 327 -102
6731 -102 83 -321 -34 -45 201 21 17 24 118 29 -85 -35 -55 -134 -116 -54 -163 37 -131 -125 -161 -12 98 227 -9
6756 -9 49 -102 16 21 35 176 -167 203 -21 -236 -138 1 -140 -238 -189 7 -55 -67 -135 87 -89 -21 198 179 181
6781 181 3 -76 -128 -92 -87 139 162 84 140 104 197 6 255 -43 197 20 138 168 324 62 38 -85 3 61 -16
6806 -16 -122 -27 -218 105 8 131 -198 11 -109 127 -47 -64 -27 -193 193 134 -22 2 -295 18 -35 4 -267
6829 -267 -56 -110 102 41 -90 -7 -105 -40 -183 2 -149 229 70 -122 36 79 40 -164 -249 -215 168 -110 -115 -42
6853 -42 -253 -180 34 -41 185 -84 161 145 2 -91 21 -7 27 -128 -347 -38 -101 171 138 27 -304 -56 97
6876 97 -225 44 93 -76 147 32 73 36 176 46 67 -130 92 275 -63 -87 -106 -198 130 39 -153 144 -47
6899 -47 37 -54 -65 -41 -35 -146 29 -181 127 -25 80 254 141 59 -50 135 60 -192 0 5 18 23 -150 31 -92
6924 -92 206 -132 24 -106 47 -96 -213 -189 -100 95 -68 29 -88 384 -138 -322 -54 -48 212 -78 2 18 -22
6947 -22 -275 -104 195 -212 51 -24 -12 -143 27 47 121 142 -46 -99 -146 -201 -232 -4 30 -2 63 105 -59 -27 28
6972 28 -22 -7 124 38 164 167 4 -62 330 25 31 -73 -124 43 -135 -76 131 -163 -120 88 413 -94 -168 150
6996 150 56 -21 -3 -11 -86 -115 -229 -28 111 -181 20 50 193 33 36 5 -77 116 -153 -118 -106 113 94 -107 -23
7021 -23 -155 265 41 -322 -45 -60 -211 196 88 128 -58 139 149 -84 121 -284 109 -20 -294 -198 -6 -132
7043 -132 -114 189 -60 -66 -33 113 35 -185 88 -63 30 50 77 47 264 -9 42 -76 -116 68 60 -253 181 54
7067 54 118 208 -43 -96 371 -34 12 -54 8 219 43 -95 -211 104 -174 120 -31 135 60 19 8 403 -59
7090 -59 -89 141 -179 -28 185 -5 -70 3 -243 -141 -200 -120 81 120 -164 30 173 114 -218 171 -221 142 222
7113 222 -135 -119 160 -17 -308 -75 93 3 0 6 245 17 7 164 -16 -53 -81 15 -264 210 -154 -190 -279 10
7137 10 217 -121 -165 73 -196 72 -327 190 219 43 -164 -176 391 -103 -63 28 142 48 -125 61 -171 -233 -156
7160 -156 74 -120 -32 124 -85 189 -70 -29 -125 205 123 22 -164 54 -451 -54 92 -152 -10 188 -433
7181 -433 -11 16 -14 207 -74 202 15 -374 -60 68 -39 -22 171 151 14 126 163 8 -192 59 -49 -120
7203 -120 -174 -59 297 -17 -114 -185 -255 -27 -180 -180 -94 125 16 -10 183 175 -49 -165 -104 -29 -16 -27 -17 -26 217 44
7229 44 -96 -85 -92 9 -111 -171 -90 24 40 242 -78 272 -158 186 -106 22 -88 357 4 75 16 -70 -201
7252 -201 37 242 52 -73 0 77 78 -45 120 -86 -40 -163 106 70 19 -14 132 -78 157 -72 45 30 -121
7275 -121 -64 -56 194 16 35 -181 1 -125 8 -76 -8 114 8 76 111 -112 -120 -142 -74 17 -138 183 -43 -48 -277
7300 -277 -30 -84 -159 -182 90 20 -184 -102 -8 66 152 11 155 -25 -179 283 331 59 -106 -38 -27 125 -221 -48
7324 -48 -45 285 -110 13 80 77 -35 -145 -217 -178 9 -140 -111 -116 -45 91 8 132 -10 54 48 110 8 -11 215 134
7350 134 -60 -160 -81 47 -25 152 206 0 -141 59 -10 87 -22 137 -184 0 -59 76 -35 31 -70 -147 -1
7373 -1 210 27 27 -102 -48 -7 76 230 -16 -56 -203 -61 -147 -155 39 1 -12 77 62 -438 -192 -121 -39 129 -20 -92
7399 -92 59 33 -31 -42 -54 -55 -132 92 76 -164 -7 61 -119 -26 -242 -339 58 -57 191 74 -289 -124 58 -254
7423 -254 102 -121 -107 -103 45 -5 -356 -152 185 123 -56 -112 42 235 27 -49 -73 21 19 46 115 20 169 -10 267
7448 267 -99 -107 -4 -322 -107 -126 120 -85 240 -118 -62 -68 135 87 150 61 26 -85 -340 -178 -28 -135 -50 -85
7472 -85 85 -156 164 48 5 71 21 91 191 92 -33 -313 66 169 -10 121 35 15 86 184 82 115 -137 23
7496 23 -200 -32 203 32 -35 48 363 -135 10 -57 -52 5 -16 246 -43 121 -280 77 126 -25 -71 45 84 -79
7520 -79 46 -349 -40 -249 -246 307 -161 139 -108 -75 -102 -18 63 -83 117 6 -48 113 -98 127 25 -93 44
7543 44 70 133 -251 269 -86 -37 -228 -54 -90 52 39 22 290 5 5 -197 85 -65 -234 48 -192 -139 175
7566 175 -173 -27 63 -90 -133 -50 -100 202 -97 9 -137 -43 79 -38 -122 246 -79 -160 -62 -93 89 -58 25
7589 25 -86 -76 -77 85 -45 -12 141 70 -323 -59 -6 -98 -1 50 136 -93 360 115 -215 104 -337 -18 -19 138
7613 138 -81 276 91 -48 -43 -116 -63 -35 -212 31 60 -156 58 -58 -5 -212 -128 9 -99 80 209 -63 83
7636 83 -7 -95 -53 31 -38 -10 -190 123 -161 -32 -58 45 46 79 -47 -60 35 94 98 218 -165 -3 159 128 311 54
7662 54 195 -235 -129 -412 49 54 58 -160 -12 -32 -281 74 160 85 -140 -131 -121 -27 -161 -102 -103 -13 96 -152 -27
7687 -27 105 1 -51 -30 -93 66 177 37 49 -44 -104 105 36 283 -143 -113 -92 -150 -87 208 -111 -50 -134 148 -197
7712 -197 301 -77 -28 3 107 91 80 -138 86 232 -12 379 -206 -11 -21 -326 -69 216 -200 -99 110 150
7734 150 -107 -149 -116 -64 102 -197 13 -121 189 234 169 125 -41 -135 -22 -210 36 -76 -8 -3 113 75 243 161
7758 161 -200 -85 -186 -176 -96 134 -33 -133 -54 -80 194 37 -140 202 -99 -76 -50 -34 -66 9 -87 -128 75 56
7782 56 -121 285 -114 -324 -1 -115 113 -101 51 -174 -64 23 -53 -72 -157 165 -17 97 -181 7 137 -109
7804 -109 232 -232 -60 97 95 -138 -104 48 205 170 -159 113 115 60 -214 180 -66 -20 -24 -18 -61 -17 272 35 -28
7829 -28 -44 -98 10 -4 -218 -25 -58 260 -16 -23 1 -5 189 38 -174 -1 42 95 -242 169 248 -147 33 -202
7853 -202 33 212 25 16 26 -175 -86 -8 -216 142 -20 -135 -123 -97 -114 47 177 59 105 84 139 212 -83 46
7877 46 17 -288 7 -138 -63 -211 -95 38 17 88 99 -56 -60 -106 83 171 -50 -263 44 87 59 -166 -32 -49
7901 -49 -153 11 -4 53 37 41 108 -57 -142 118 -121 0 -194 28 104 106 -101 -156 -136 122 38 138 133 73 -111 -108
7927 -108 -83 -28 -14 136 -90 -70 2 14 -38 -53 76 -43 -140 -88 116 201 -130 151 -161 -62 -34 -252 43 -77
7951 -77 143 -103 -222 -83 -50 -85 260 -237 -9 -149 -192 162 140 -37 -110 44 143 -75 119 201 70 -58 47
7974 47 -119 -125 93 -163 179 43 265 210 -207 -147 -64 155 -48 237 55 12 44 -188 86 64 147 183 -76 71
7998 71 -143 -172 -105 -9 -165 102 -99 63 -91 19 236 -52 197 -252 -39 15 -128 33 229 126 -37 -67
8020 -67 147 -15 -94 -241 -154 -6 -131 112 -274 -86 215 124 -21 97 196 10 98 -4 14 49 61 -42 -108
8043 -108 -61 -126 68 74 -118 326 -72 -136 41 255 -25 64 26 -63 -64 -11 -195 -48 236 22 108 65 -86 -136 -49
8068 -49 -67 -238 133 -26 39 -119 -16 -11 28 -8 117 295 26 -123 1 -276 108 -44 -64 163 -67 30 -216
8091 -216 155 83 -335 174 225 78 -83 176 84 -126 -72 123 41 -76 -124 30 111 256 234 -139 -100 -15 207
8114 207 147 -62 -203 93 -117 22 37 50 -9 -20 -51 28 179 -62 16 -113 201 -243 -76 -155 -20 -69 -153 92
8138 92 -137 -2 153 78 15 13 -88 -94 34 163 -105 -40 -27 -90 173 -166 98 34 -12 283 -235 109 169 -116
8162 -116 -44 75 -131 -150 31 79 -12 -118 -119 312 119 152 56 83 87 124 115 51 -49 83 -119 -88 -68 -356 81 -61
8188 -61 232 -20 211
8191B11
$$ Imaginary data points
##PAGE= N=2
##DATA TABLE= (X++(I..I)), XYDATA
0 0 0 0 0 0 0 0 0 0 0 0 0 0 0 0 0 0 0 0 7 -8 8 -8 8 -8 12 -16 16 -16 23 -24 28 -32 36 -40 45 -51 57 -63 70 -78
40 -78 87 -98 107 -119 131 -145 160 -176 193 -213 234 -258 285 -315 349 -388 430 -482 541 -613
60 -613 701 -811 951 -1139 1408 -1817 2503 -3863 7535 -36374 -84150 59888 40251 -60132
74 -60132 23345 77696 -28143 -5980 84135 10487 -34910 63033 43123 -49155 12169 60657
86 60657 -32354 -33355 50589 2617 -53099 22670 29215 -52100 -18599 35290 -35698 -49837 29822
99 29822 1326 -56200 10847 33897 -39902 -11722 52074 -8628 -31045 43596 17648 -49072
111 -49072 6803 33922 -36932 -18314 42334 -8038 -30142 36359 16698 -39866 12814 37486
123 37486 -30931 -20214 36797 -7082 -36024 25583 24402 -22275 16987 44309 -10695 -8061
135 -8061 38120 -2212 -34730 18510 16285 -39402 -9059 26463 -22464 -27146 24029 -1293 -34372
148 -34372 11050 12087 -41243 -15587 21035 -24367 -29344 26738 9255 -24435 21852 32476
160 32476 -16374 4238 41317 -2621 -16720 30510 11576 -26983 11751 26542 -19413 -4452
172 -4452 33594 -5264 -24508 19586 5945 -36228 -2713 16644 -28695 -21479 21283 -7090
184 -7090 -27680 17223 15116 -23761 4888 26712 -18201 -16766 25559 -1587 -27389 16278 20582
197 20582 -20123 2557 28730 -10091 -14243 24357 1692 -27260 9305 15045 -24927 -6794
209 -6794 24508 -7394 -15275 24183 10577 -21199 8589 18871 -19893 -9560 22079 -6876
221 -6876 -19768 19086 11430 -21259 5718 22222 -15682 -11852 19649 -6908 -25989 9999 7325
234 7325 -25592 -743 21457 -12051 -10918 22945 1954 -19946 12837 13130 -20748 -2301 21078
247 21078 -9818 -12983 21050 6569 -16126 13470 18478 -15296 -3479 19694 -8927 -18703 12660
260 12660 2513 -22105 4159 15136 -15292 -6287 20357 -2917 -15954 12965 6241 -20653
272 -20653 241 13537 -15663 -10426 18765 193 -14282 14884 13494 -14014 2938 17809
284 17809 -11199 -12383 14583 -1959 -19441 8024 11235 -14571 760 20219 -5680 -10520 16144
297 16144 1907 -19627 3296 8747 -17563 -6587 15316 -5380 -11410 16628 8080 -13916 6195
310 6195 14123 -13260 -8007 13592 -5709 -15311 10969 8225 -13315 4768 17263 -7179 -5369
323 -5369 15828 -1535 -16085 7103 6153 -17230 -2129 13539 -7739 -7983 15357 2578 -13129
336 -13129 8044 9412 -14805 -4701 12103 -8172 -12223 11865 3304 -12994 7506 13718 -9790
349 -9790 -2964 14529 -4717 -12504 9226 2772 -15628 3059 12602 -9268 -4226 15725 195
362 195 -10530 9791 6151 -14045 -5 10840 -9856 -8134 13482 1560 -10474 9897 9748
375 9748 -10489 137 11312 -8855 -11487 9438 -662 -14427 4917 9470 -9895 -1583 13496
388 13496 -4299 -9573 9147 1344 -14123 1990 7714 -10978 -3345 14123 -179 -7231 12481
401 12481 8312 -9380 2584 9779 -9425 -5880 10579 -2691 -11287 8806 7944 -10035 1567
414 1567 12874 -5817 -7563 8990 -2467 -14238 2881 4253 -12691 -1783 11347 -5111 -6768
427 -6768 11693 3313 -10483 4585 7956 -10595 -4367 8766 -5502 -9202 9660 4655 -8589
440 -8589 6199 12179 -5722 -3090 10591 -2443 -9463 6843 3184 -11860 1414 10317 -6029
453 -6029 -4399 12276 2550 -7636 6486 4441 -11831 -1910 6375 -9354 -7975 9511 454 -10380
467 -10380 5834 8513 -8619 -1527 9688 -5248 -8913 5659 -1217 -11718 4093 7952 -7412
480 -7412 564 14056 -524 -6952 8510 4632 -9117 1739 7132 -7143 -3319 9521 -1849
493 -1849 -6891 9353 7171 -7648 1848 8274 -7828 -7539 6344 -2807 -10455 4713 5356 -8970
507 -8970 -495 8929 -5062 -6338 7807 -371 -10512 2558 3677 -10171 -1748 9869 -2928
520 -2928 -4954 10927 5004 -8357 3033 7406 -6746 -2215 8363 -2521 -5243 8892 3536
533 3536 -8162 4816 10803 -5117 -3951 8662 -2583 -10299 2408 1584 -9214 842 7627
546 7627 -5476 -3858 8332 -1443 -9283 4239 3803 -10142 -2914 6322 -5759 -6104 7822 2811
560 2811 -5280 6879 8054 -6258 -1115 7781 -4541 -6911 6557 1886 -7381 4209 7596 -5511
574 -5511 -574 10814 -640 -5839 6034 1887 -9834 -760 4072 -7168 -2463 8885 -729 -6292
588 -6292 6671 4191 -8162 -169 6402 -6323 -6496 5117 -2100 -8258 3795 4670 -5424 2314
602 2314 9360 -3414 -4598 7157 -2 -8425 2753 5483 -6206 -466 7771 -2075 -3131 8688
616 8688 3329 -5507 3954 5668 -6997 -3943 5392 -3816 -6840 5555 2797 -7106 2073 6231 -5608
631 -5608 -3395 6193 -2400 -7159 3760 1118 -8514 -286 6253 -3742 -1578 8545 1138 -5538 4948
646 4948 3946 -7421 -584 6352 -3619 -3909 6511 660 -5260 5117 5236 -5358 -256 6522 -3928
661 -3928 -6396 3829 -133 -7138 2604 5062 -4776 -866 6467 -2171 -5120 4865 1062 -7110 916
676 916 4331 -5827 -2803 6627 -630 -4219 5541 3416 -5716 1316 4396 -5564 -3561 5810 -769
691 -769 -5017 4537 3952 -4796 1378 6504 -3067 -3088 5237 -830 -6642 2114 2803 -5473 197 6595
707 6595 -1843 -2696 6128 1141 -5610 1626 3043 -6012 -2030 4666 -3266 -4369 5390 2463 -4418
722 -4418 3093 5357 -4060 -1889 4852 -2923 -5701 3244 1238 -5500 1797 5497 -2684 -729 6203
737 6203 -506 -3991 3444 1523 -6355 -838 3471 -4050 -2337 5350 961 -3472 4087 3585 -4408
752 -4408 -235 3876 -3457 -4054 3432 -730 -5023 2836 4109 -3357 493 6024 -954 -3144 3824
767 3824 240 -5489 1144 2829 -4521 -933 5205 -942 -2639 4522 1898 -4162 1509 3260 -4564
782 -4564 -2424 3589 -1861 -3879 3194 1903 -3482 1913 4468 -2583 -1920 4183 -666 -4382 1789
797 1789 1757 -4061 329 4322 -2069 -1382 4410 695 -3501 2277 2147 -4271 -666 3623 -2308 -3272
813 -3272 3349 1010 -3397 2256 2908 -3443 -640 3554 -2281 -3500 2895 867 -3713 1382 3063
828 3063 -2534 -120 4166 -1026 -2957 2992 799 -3965 420 2681 -2681 -1113 3888 -259 -2292
843 -2292 3041 1935 -3470 -167 2613 -3082 -2278 2933 -216 -2938 2413 2703 -2487 584 3166 -1526
859 -1526 -1975 2433 -553 -3971 1101 1975 -2971 -533 3513 -643 -1425 3110 294 -3229 875 1354
875 1354 -3794 -1629 2666 -1464 -2124 2709 1651 -2024 1494 2790 -1988 -1236 2585 -1562 -3051 1813
891 1813 1172 -2630 969 3350 -1258 -582 3105 124 -2166 1333 649 -3494 -818 1947 -2077 -2161
907 -2161 2453 939 -1436 2020 1964 -2223 -106 1820 -2117 -2725 2052 328 -2728 1108 2236 -1316
923 -1316 237 2860 -495 -1327 1966 -14 -3103 71 1608 -2162 -954 2744 30 -1568 1991
938 1991 1129 -1689 288 1631 -1958 -856 2237 -890 -2631 1843 1978 -1446 397 2214 -859 -972
954 -972 1219 -494 -2076 949 1139 -2341 -676 1341 -1291 -1531 1582 54 -2050 970 1479 -2060
970 -2060 -509 1740 -603 -972 2117 1205 -1344 1026 1569 -1214 -150 2297 -347 -1103 1756 620
986 620 -2016 187 1774 -1122 -809 1640 -288 -1785 344 -293 -2076 78 1706 -1181 -1027 1723
1002 1723 37 -1562 789 1256 -1146 -130 1165 -1189 -921 1355 275 -844 1586 1756 -965 -60
1018 -60 1597 -637 -1518 631 189 -1452 321 798 -1433 -513 2244 283 -815 1589 582 -1572
1034 -1572 -257 572 -1666 -912 1338 46 -1205 809 741 -1398 179 1357 -1090 -814 751 -961
1050 -961 -2224 294 634 -1407 313 1967 -194 -257 1370 556 -1071 299 889 -619 -198 1081 -679
1067 -679 -1098 1439 708 -1014 864 1638 -1097 -1040 515 -731 -1176 783 249 -1219 79 812 -964
1084 -964 -842 1122 122 -966 706 604 -1587 -268 799 -423 -276 1564 310 -515 724 488
1100 488 -710 114 1430 -222 -707 692 7 -1107 498 591 -1020 -89 1210 -506 -1239 401 254
1117 254 -949 495 1096 -815 -266 1071 -322 -1125 653 414 -919 444 866 -709 -737 1039 -250
1134 -250 -723 993 511 -925 139 732 -1352 -1094 1186 373 -812 617 741 -830 19 719 -559
1151 -559 -411 1186 26 -1188 167 347 -779 28 1331 187 -382 1046 99 -1019 195 664 -660
1168 -660 -257 869 -499 -960 831 626 -780 401 1150 -546 -508 533 -449 -1136 683 414 -606
1185 -606 130 758 -373 -410 763 -133 -761 617 545 -1103 -347 387 -689 -589 971 166 -639 610
1203 610 655 -774 -401 781 -334 -563 820 50 -760 431 978 -700 76 1020 85 -447 883 150
1221 150 -893 222 902 -698 -374 1033 -160 -1128 295 -33 -631 45 451 -894 -503 504 -599
1238 -599 -784 439 506 -817 246 722 -423 -382 1175 326 -337 757 651 -508 118 697 -501 -399
1256 -399 936 109 -1099 236 504 -843 -299 836 -490 -541 746 105 -1118 -106 209 -1011 -211
1273 -211 895 -185 -575 1047 860 -595 521 879 -365 -245 712 -436 -1076 493 292 -582 129
1290 129 686 -213 200 520 180 -505 584 332 -808 -17 501 -417 -245 822 232 -55 1009 653 -798
1309 -798 103 618 -661 -803 221 -514 -1102 232 452 -776 -430 758 -307 -441 476 83 -1055 187
1327 187 545 -715 -295 1102 114 -295 896 469 -128 891 825 -729 -434 712 -182 -845 529 277
1345 277 -737 -36 793 -526 -321 500 -270 -748 181 269 -819 34 864 -449 -569 681 346 -606 296
1364 296 209 -774 110 747 -265 -331 741 341 -820 666 321 -739 -48 730 -453 -408 807 313 -587
1383 -587 485 731 -290 142 656 -140 -490 527 80 -492 130 404 -514 -49 926 -111 -546 670
1401 670 -114 -752 -187 -22 -1061 -494 449 -271 -643 642 892 -495 273 677 -250 -338 305 -170 -501
1420 -501 515 483 -292 672 1017 -56 -108 1053 99 -707 -49 131 -929 -443 229 -441 -225 686 17
1439 17 -472 388 503 -623 -417 419 -575 -549 289 -412 -732 424 601 -58 205 878 -76 -349 496 -18
1459 -18 -676 66 360 -271 -300 622 246 -345 750 638 -265 -147 325 -206 -423 254 -19 -318 655 415
1479 415 -479 281 671 -208 -592 401 -201 -949 131 159 -671 273 838 -152 -187 471 -60 -577 53 242
1499 242 -709 -5 751 -280 -176 477 285 -478 300 454 -429 -46 552 -708 -517 423 -77 -234 355
1518 355 657 -416 -294 433 -277 -704 322 -83 -574 -124 306 -553 -69 740 119 -453 269 25 -727
1537 -727 -510 159 -261 -190 589 69 -456 578 522 -381 181 615 -300 -284 277 -196 -608 -21 10 -23 323
1558 323 538 -49 -257 406 -247 -738 -153 18 -568 -573 253 -143 -313 497 804 -104 339 601 -354 -267 8
1579 8 -287 -420 366 386 -278 317 813 -67 41 456 72 -539 -158 -319 -1025 -282 214 -302 75 725 253
1600 253 -286 275 265 -472 -170 529 -264 -551 103 -49 -277 519 424 85 376 542 -312 -451 228 13 -443
1621 -443 268 245 -346 50 381 -27 -260 404 248 -194 2 -146 -921 -630 373 -116 -199 291 305 -397 70
1642 70 235 -164 -387 285 -97 -369 151 173 -326 -122 97 -276 33 319 -166 -470 -128 148 -292 170 595
1663 595 108 -282 608 233 -143 151 483 154 36 31 -294 -385 100 351 -437 82 182 -340 -323 -33 -423
1684 -423 -730 -97 103 -607 26 288 -61 -95 567 508 254 369 563 -9 14 235 -53 -129 895 450 25
1705 25 301 228 -315 -176 107 -299 -705 -400 -493 -718 -267 230 -245 -74 485 165 -384 -27 100 -621 -75
1726 -75 184 -42 -299 597 511 -37 272 437 -188 48 517 -414 -499 -165 24 -563 -13 411 -6 194 660
1747 660 321 -32 338 58 -388 79 28 -417 -254 161 -16 -131 307 220 -357 -254 66 -510 -645 203 -558
1768 -558 -666 -73 -87 -143 -19 510 121 -37 260 197 -181 112 345 -23 105 567 217 31 653 569 -9
1789 -9 389 477 -345 -408 94 -180 -575 -180 43 -414 -202 204 -267 -534 169 237 -417 -74 252 -470 69 497
1811 497 102 14 546 236 -63 35 367 -360 -234 231 -195 -355 359 336 -57 37 286 -210 -190 481 -238 -359
1833 -359 94 23 -270 214 681 -73 111 447 238 -140 197 -17 -639 -332 98 -199 -314 266 131 -277
1853 -277 398 164 -287 -208 93 -373 -302 129 70 -343 414 558 106 -109 545 185 132 241 18 -387 -161
1874 -161 346 -317 -178 219 280 -271 293 180 -531 -340 22 -479 -472 -70 -317 -399 -94 277 -70 372 474
1895 474 10 -187 202 -103 -218 -263 53 -568 95 537 79 -191 269 391 -203 -153 -107 -473 -442 333 -109
1916 -109 -469 257 217 -127 126 470 177 2 350 -211 -464 280 191 -220 -163 159 -163 24 295 82 -245
1937 -245 85 270 -314 -154 69 3 -217 449 11 -329 265 315 -198 -112 441 -204 -141 234 251 -260 112 414
1959 414 -276 28 451 -43 -289 175 114 -680 8 222 -158 -237 450 -73 -389 105 319 -356 109 268 -327
1980 -327 -258 250 18 -367 320 223 -354 355 482 14 -495 82 113 -373 -69 -22 -301 -154 460 109 -256
2001 -256 182 138 -340 53 69 -457 -299 74 105 -194 639 128 -471 48 290 -187 -326 206 52 -312 -115
2022 -115 6 -252 46 460 24 -43 317 67 -589 131 122 -463 -260 116 -257 -133 297 385 19 167 319
2043 319 -309 -187 62 -216 -480 28 227 -98 294 295 -113 76 613 -41 -200 224 103 -284 -119 -52 -505
2064 -505 -249 257 64 -426 165 241 -459 88 84 -57 -23 211 -24 -401 207 98 -258 70 522 -82 -190
2085 -190 177 -152 -416 -148 208 -341 -107 412 -241 -251 13 154 -298 101 484 40 -353 239 -187 -245 329
2106 329 242 -133 -1 226 -362 -348 136 187 -488 179 282 -105 54 51 -224 -463 216 279 -239 -176 154 -280
2128 -280 -150 327 -71 193 334 14 -218 62 47 -183 -158 140 23 -328 88 287 -428 149 260 45 4
2149 4 495 -65 -240 72 36 -182 -38 421 52 -11 162 81 -167 380 303 -302 -191 23 -182 -383 105 14
2171 14 -406 318 424 -401 -12 424 171 -208 522 114 -75 4 381 -293 -412 362 83 -119 422 249 -65
2192 -65 180 267 -164 -273 203 75 -249 172 177 -66 131 395 -19 -75 186 -18 -600 -332 15 -207 -14 144
2214 144 -180 -363 302 332 -563 -262 321 -247 -115 123 -185 -318 194 267 -195 134 247 -163 -154 351 161
2235 161 -302 359 241 -182 -375 -16 -290 -114 39 98 -178 14 322 -252 -266 132 -433 -238 346 -12 -478
2256 -478 -34 379 -309 -337 359 77 -225 179 157 -17 -44 237 -285 -182 403 67 -336 314 378 -67 243
2277 243 -3 -194 -168 291 -143 -307 263 238 -409 -53 172 -75 -29 222 144 -313 87 172 -140 -14 293 -322
2299 -322 -259 324 81 -288 257 360 -159 -112 395 233 -93 346 181 -301 193 427 -87 -179 205 -90 -271
2320 -271 60 345 -242 227 169 -342 -265 307 310 -481 93 194 -100 -189 275 -225 -148 219 230 -168 142 399
2342 399 -86 -183 336 -77 -337 115 315 -271 119 303 46 -52 460 201 -81 138 -201 -345 135 334 3
2363 3 -196 -34 -155 -252 208 266 -386 158 410 -147 -400 180 84 -259 189 257 -273 117 328 -30 -423 233
2385 233 147 -266 -93 126 -601 185 294 -95 -182 489 213 -225 102 426 -309 -284 80 -76 -461 200 204 -445
2407 -445 -91 283 6 -26 228 -149 -180 -242 111 -382 -250 175 -8 -271 401 309 -217 28 365 -248 -348
2428 -348 345 -390 -359 211 150 -354 72 392 -124 46 533 242 -410 110 -112 -643 -280 412 -275 -361 160
2449 160 -86 -213 222 48 -249 0 331 -327 -438 -68 -12 -599 195 423 -333 -321 484 -264 -66 51 97
2470 97 -272 -1 226 -354 -83 483 237 -282 354 13 -380 57 158 -512 -247 99 -168 -153 316 277 -208
2491 -208 -106 374 -175 -567 312 73 -508 279 336 -292 18 371 -185 -210 181 -21 -297 84 134 -390 -164
2512 -164 351 -124 64 504 150 -342 134 270 -401 -293 174 -218 -352 262 330 -299 182 321 -78 -117 319
2533 319 -215 -533 243 -192 -249 -285 413 -76 -185 440 255 -406 367 233 -249 -331 218 -357 -447 385 429 -112
2555 -112 328 491 -292 26 431 87 -291 110 -60 -568 -198 379 -17 -152 509 183 -191 32 71 -439
2575 -439 -158 255 -457 -292 164 -34 -332 194 266 -166 387 359 -30 -67 370 -40 -429 -48 120 -248 281
2596 281 484 52 -231 718 160 -208 258 203 -488 -251 402 164 78 587 334 -427 77 387 -228 -232 220
2617 220 -296 -251 375 -22 -359 177 520 -83 -133 395 -278 -405 211 65 -115 7 394 -152 -7 650 86
2638 86 -209 392 206 -430 -121 82 -338 -198 132 77 -93 168 580 -176 104 178 -266 -55 -20 -109 -517 208
2660 208 467 -181 -264 282 23 -403 62 46 -502 -167 237 -280 -288 114 38 -443 482 559 -507 138 379 -137
2682 -137 -414 75 -71 -183 -153 244 -332 43 335 -73 -165 210 245 -331 -25 173 -375 -31 476 -99 -283
2703 -283 330 347 -406 -43 301 -273 -203 302 -125 -259 363 279 -63 218 621 282 -298 342 -162 -550 122
2724 122 -2 -220 -194 192 -82 74 388 398 -126 105 81 -319 -324 152 -283 -416 136 41 -202 410 353 -186
2746 -186 -6 37 -127 -602 7 -162 -445 45 40 -290 -188 293 -65 -185 193 147 -397 116 218 -460 -248
2767 -248 459 -79 -68 473 373 -287 191 70 -338 -347 44 54 -715 95 210 -161 -61 449 -65 -163 216 -121
2789 -121 -283 19 54 -244 -83 371 -13 46 201 81 -242 33 352 -228 -369 123 -96 -450 143 1 -116
2810 -116 286 271 161 -324 135 -138 -530 -33 108 -457 -117 362 -110 -321 349 53 -136 23 329 -336
2830 -336 -404 41 -33 -127 252 185 -137 131 374 4 -162 302 -232 -102 71 -132 -556 -130 440 -170 57
2851 57 648 312 -169 218 140 -214 -256 72 -644 -356 359 296 44 78 414 -145 -102 200 -323 -422 62 -113
2873 -113 -309 42 183 -170 364 175 -45 -118 93 112 -494 -176 -124 -314 -288 204 108 -122 226 122 -134 25
2895 25 59 -485 -408 170 -55 -459 138 285 -157 390 455 -341 17 353 179 -87 -133 261 -521 -55 252 -183
2917 -183 -117 291 370 -247 88 44 -251 -183 -16 -310 -419 413 146 -217 240 433 -167 42 36 -277 -342 26
2939 26 42 -202 258 449 -123 -223 414 31 -336 180 213 -342 -125 47 -293 -344 422 100 -60 310 251 -287
2961 -287 -48 106 -165 -546 -114 -113 -479 84 354 -70 -92 526 -53 -266 216 53 -438 121 265 -137 -301
2982 -301 171 193 -162 343 278 -254 -285 282 -359 -384 120 -230 -192 61 278 98 159 481 -140 -325 169 -114
3004 -114 -381 -107 -71 -444 -195 230 -62 -51 309 238 -198 99 233 -349 -341 22 -521 -298 355 342 -459 61
3026 61 438 -58 -38 170 -45 -456 166 131 -321 55 352 129 56 579 126 -182 209 39 -424 -143 201
3047 201 -270 -310 359 -60 -123 294 510 -175 127 250 -73 -489 67 -206 -445 130 328 -375 101 470 -42
3068 -42 -279 251 -199 -263 -56 206 -227 -171 128 248 5 406 206 -104 -191 30 -267 -493 7 -6 -333 -38
3090 -38 196 -91 -312 250 166 -35 -41 -43 -451 -16 228 -231 228 291 -130 11 170 150 -154 147 82 -265 -68
3113 -68 400 -52 64 444 255 -42 43 374 15 -159 233 -35 -292 147 115 -178 123 163 -33 98 332
3134 332 72 -247 37 8 -442 -260 77 15 -92 310 301 -193 57 165 -322 -111 99 -257 -345 -93 -21 -192
3156 -192 127 486 25 -39 361 -233 -180 70 -165 -404 -177 451 -219 37 155 75 -61 345 458 -35 -65
3177 -65 -111 -372 -418 -60 -161 -284 224 223 -127 -62 400 4 -163 288 -355 -492 -96 204 -244 -52 417 188
3199 188 35 600 99 -154 -45 383 -446 -327 62 -66 -313 118 216 -187 293 419 -461 6 260 -354
3219 -354 -575 -168 -33 -324 55 289 182 81 329 219 -139 -160 131 -243 -31 305 -104 -93 227 186 -188
3240 -188 418 64 -130 -141 -22 -26 -147 87 107 -380 48 476 -51 46 414 119 -290 73 49 -500 30 40
3262 40 -26 -33 151 258 6 103 114 -19 61 174 -198 -288 16 -153 -245 282 167 -186 186 189 -175 100 204 1
3286 1 -197 -58 152 -50 -49 319 117 -256 216 80 -353 216 -98 -477 -266 391 -6 -132 228 127 -9
3307 -9 378 236 64 -170 -110 192 -99 -49 93 -166 188 328 244 39 197 -12 -228 -30 -14 -403 -194 -50
3329 -50 -44 30 323 124 154 124 28 -194 -129 -98 -250 -275 68 90 -21 -45 231 10 210 340 -35 -126 88 348
3353 348 -172 -237 120 -142 -71 420 222 68 84 183 101 -152 102 -233 -165 76 -44 -84 131 363 60 74 375
3376 375 -49 -233 -124 -121 -454 4 88 -323 90 132 48 -6 190 22 -304 -192 -296 -281 -126 396 32 -235
3398 -235 168 106 85 -19 299 -28 -116 3 -115 -155 159 312 -217 143 349 201 203 189 116 -133 -32 144 -327
3421 -327 -303 175 -20 -167 256 330 230 128 285 -365 14 150 -12 -122 192 68 -137 -111 194 76 -51
3442 -51 137 -172 -223 -38 172 -391 -268 180 -51 86 231 261 125 -6 171 -443 -126 -8 -197 -144 -132 74
3464 74 -38 318 253 88 79 115 -85 -183 -224 -424 -385 -21 19 -130 -13 300 258 52 204 194 -113 106 -124 -301
3488 -301 -280 -6 148 272 296 313 54 284 143 161 -218 -63 -29 -191 -153 162 -26 173 185 169 -50 74 148
3511 148 -2 10 -82 -222 -209 291 -139 -120 241 322 -177 90 130 42 -130 160 -245 -338 -73 172 69 -61 71
3534 71 -257 -72 53 8 -219 82 1 -127 -199 -2 -107 26 -35 226 -83 159 59 -115 -228 -40 82 -45
3556 -45 -47 -29 -66 249 174 -25 76 292 -57 -272 -175 -55 -175 -20 165 -101 86 178 135 96 404 32 -175
3579 -175 -375 -14 -176 -245 124 -166 196 182 196 79 147 227 -33 20 21 -40 -315 -37 29 30 90 148 72 -35 79
3604 79 -119 -24 1 29 -163 92 -70 -41 -103 325 139 2 57 124 191 -346 145 -294 -263 166 0 -198 118
3627 118 295 -90 73 71 68 -345 146 -17 -133 -214 -13 -157 -261 -67 14 108 375 -123 -81 33 66 -82 -114
3650 -114 -117 -11 -156 113 203 -115 -90 142 19 -339 62 -13 -327 183 185 -69 379 217 -49 -49 101 171 -237
3673 -237 46 48 -418 -223 -84 84 64 102 247 -230 44 61 -25 -45 -6 -123 -72 9 268 -311 205 364 67
3696 67 -53 7 51 -84 86 -92 102 -225 276 3 152 366 199 -116 90 -56 104 -98 19 -64 -72 283
3718 283 148 125 34 136 -37 263 -5 -192 -196 -233 64 21 138 267 -15 128 275 85 105 144 -65 -177 -328
3741 -328 -138 -71 115 82 1 -9 91 47 47 149 30 -54 -160 -22 -330 -112 -177 -174 -25 -45 145 74 55 82 109
3766 109 -229 4 269 102 -97 174 -194 149 130 55 -161 -184 214 132 -68 -66 64 -400 107 -49 16 116
3788 116 -1 -176 155 255 19 -107 -64 12 -145 -172 61 205 194 233 126 183 140 228 -207 -156 -5 -94 -58 -329
3812 -329 -275 -138 37 161 260 33 365 52 -67 -270 164 0 -143 105 -14 36 14 -28 -134 94 -57 188
3834 188 4 -151 -246 52 -9 -128 -156 103 125 125 64 -26 125 -40 -36 -184 -274 15 -5 -17 78 -5 82 -29 -8 53
3860 53 76 137 -132 -90 -53 63 136 46 10 -126 -16 -7 254 -213 22 -20 -77 -239 -54 326 -181 -193 87 -269
3884 -269 -47 320 48 -295 -202 -269 -60 -247 490 -125 6 -68 -9 -187 -75 -92 -513 -20 -79 10 -35 180 -47
3907 -47 -187 81 -26 157 -190 -19 44 -131 107 -77 -218 -60 175 0 22 -103 94 -9 24 128 -108
3928 -108 -239 34 -75 95 301 -26 -226 53 -57 -157 97 -58 179 -391 30 -211 -12 12 4 -81 169
3949 169 -71 64 53 208 -36 -159 -13 -178 67 182 186 92 -32 200 97 -66 -195 -61 -278 -127 2
3970 2 -175 -41 109 134 -20 -220 51 -57 -206 36 -164 90 -29 -97 -39 49 -133 -11 60 -206 7 15 102
3993 102 -10 48 -295 247 -73 -124 -70 -109 -10 -100 61 134 101 90 -120 -105 97 92 104 -62 -136 236 -65 -10 300
4018 300 -62 63 -69 -9 -152 -171 -259 -182 -81 39 105 -127 91 8 -216 94 90 178 23 24 3 -42 -113 72 89
4043 89 -31 124 146 162 -22 -150 -134 -79 -214 -42 64 -281 -69 80 53 -184 -151 -7 30 -149 119 80 86 -3
4067 -3 -83 7 178 145 -221 41 54 -127 102 -116 263 -169 -254 201 -67 325 245 16 -80 24 3 -83 -47 -59
4091 -59 52 -237 -86 75 165 286 -62 167 -40 86 -179 -102 -219 -72 -117 -87 239 -162 36 11 10 -186 111
4114 111 137 -123 -328 105 -88 -79 195 -43 0 -112 109 76 -32 -54 -224 -190 25 38 32 22 -42 -93 98 -66
4138 -66 -37 -109 214 146 -353 -79 7 -57 -201 14 49 -102 39 71 74 1 1 150 -190 38 -55 -25 57 80 81 -137
4164 -137 17 28 -12 -7 57 -51 -239 -135 86 73 202 7 233 11 229 -164 119 107 -155 -106 107 17 157
4187 157 94 -34 -98 55 97 -108 26 219 191 -11 50 36 -66 168 46 -14 -248 -113 -10 -472 323 3
4209 3 39 -216 216 75 120 123 -206 -4 -6 103 55 -206 118 -32 -228 47 75 52 -26 113 -10 -50 404 -354
4233 -354 35 94 88 -123 13 79 -116 29 31 44 134 -71 134 -130 -29 -3 79 249 -13 -83 12 -21 -8 -116 -254
4258 -254 -12 -170 -165 83 -8 -8 28 -136 81 -70 -104 86 -52 -198 185 221 169 -252 -20 -34 -223 -101 -1
4281 -1 104 24 -58 202 6 69 -18 -35 -78 -232 -106 41 6 144 62 244 -226 -208 -68 -204 -25 93 269 212
4305 212 -38 -109 -31 207 211 102 15 73 -53 65 108 376 -2 -42 -81 -159 -277 34 72 -176 -326 -66 52 29
4329 29 -12 -29 275 23 12 -28 14 -49 66 -194 138 -42 81 35 -131 23 -16 56 -105 -89 128 -115 -143 -171
4353 -171 61 -164 -10 176 -7 71 52 14 63 -249 -123 -12 -234 -156 184 -41 98 97 -187 -74 59 -46
4375 -46 36 133 -135 -35 162 -12 -159 195 -306 -52 113 -53 -105 -86 -53 -85 103 -71 9 -230 7 -26 -261
4398 -261 -129 -120 -244 241 100 342 -17 -3 -142 -75 -232 -2 74 -17 252 259 -56 26 36 -71 -117 -45 -61 -322
4422 -322 -89 -64 130 108 96 99 10 -28 3 58 -39 -17 193 90 17 -39 -221 213 -121 -3 265 85 -217 102
4446 102 -42 53 53 -4 -55 90 66 111 -47 -46 40 -158 -172 -109 -201 -59 150 97 223 -11 152 -206 51 190 110
4471 110 6 195 87 -92 47 -5 28 40 -187 62 -94 73 37 -65 -97 8 278 51 -56 -29 -119 125
4493 125 263 51 133 57 -157 -75 249 1 95 63 54 71 -93 21 20 31 57 -30 132 259 93 -77 -207 207
4517 207 -8 -1 93 83 -90 -152 -204 -149 -323 10 -247 2 -64 -287 -118 -222 -132 98 -158 110 -81 -21 -192
4540 -192 133 -14 -8 140 -136 -180 -70 256 150 -32 14 77 27 -405 -201 -155 85 -79 13 33 14 236 -13
4563 -13 -158 -178 -97 -92 -150 -40 53 9 -7 20 -153 3 18 -3 165 -187 142 -95 108 22 122 174 -127 -71 -4
4588 -4 156 -62 -97 83 -188 -93 39 -139 -20 46 178 143 51 -74 6 22 -10 36 14 269 182 -24 -53 -71 35
4613 35 -69 -43 31 206 -137 -110 -215 57 118 51 -80 -36 204 -58 64 -190 -23 219 15 -262 106 105 -165
4636 -165 -80 184 119 50 -86 217 -72 -102 168 42 -174 -59 151 73 71 -24 31 122 -15 45 0 -117 14 136
4660 136 -229 -145 46 215 -27 -88 -23 -136 146 22 44 149 115 86 146 7 0 -246 1 -178 -311 537 14
4683 14 -91 148 -195 230 -119 10 -31 79 -165 67 142 91 2 -135 156 121 281 36 99 -62 181 -82
4705 -82 134 129 5 -214 -308 171 -275 -163 147 -211 72 -86 152 4 200 -100 90 58 -22 99 -95 -296
4727 -296 -134 115 154 -103 125 35 -37 -174 -133 105 64 158 -54 51 -106 -152 121 123 -22 101 -245 28 123
4750 123 3 -141 32 93 -42 -34 241 21 -43 63 -83 108 142 -161 -139 -120 85 -40 76 -51 144 128 180
4773 180 125 79 -48 47 -51 216 83 -7 40 -147 -34 21 -153 -40 18 98 151 -63 -180 -320 17 24 -23 69 52
4798 52 58 34 -21 -26 -30 -172 141 -136 141 34 214 -165 61 5 -43 -2 -228 -167 -289 64 -22 75 100 -161 52
4823 52 -31 -66 6 -90 -179 -148 157 -42 238 70 -156 -239 -213 -23 108 -33 77 -76 -331 195 -310 -32 -199
4846 -199 165 100 -99 111 -4 125 63 -77 -9 83 -89 -81 13 -73 -267 -129 -180 30 82 -155 177 205 53 -272
4870 -272 3 63 -66 -31 -44 79 -40 -42 -92 -90 -118 -31 176 53 148 44 -4 29 113 11 43 -134 131 14 88
4895 88 81 -32 -63 -40 93 -20 22 44 262 -9 188 75 -196 52 -74 51 -69 133 80 -353 164 183 63
4918 63 141 -262 -193 -7 46 6 -101 -46 4 -229 -56 191 231 -29 234 160 18 54 -57 -65 97 -58 -252 -118
4942 -118 -2 109 154 210 15 247 -79 -229 24 -128 -52 48 5 48 -170 117 59 -152 191 -107 34 -67
4964 -67 115 -76 -126 67 42 -61 65 -233 -59 -435 8 253 -283 216 -144 -61 64 159 -62 -6 -69 177
4986 177 -18 123 35 -95 272 -77 -175 -152 128 -183 -1 -218 -51 48 161 -92 17 32 10 -195 -91 137
5008 137 -58 -2 -34 -66 -198 -197 25 60 -289 117 -96 -124 -162 33 5 12 -12 -167 -23 224 -114 101 173 -37
5032 -37 60 195 -38 192 -91 73 -57 -72 -65 -284 -113 50 -19 -75 -87 31 -35 18 60 -32 4 276 188 -34 143
5057 143 -103 -57 27 160 -74 -7 54 304 153 72 -26 124 -253 -188 220 -205 109 -53 212 158 -103 -240 -286
5080 -286 -47 69 66 -175 -15 -193 44 -257 147 23 27 -311 -37 18 -103 122 -85 -49 -160 96 -21 -138
5102 -138 -138 -100 15 95 -7 8 -47 90 -72 175 132 109 21 175 343 -68 179 70 -33 -75 83 -131 -153 155
5126 155 -69 -51 -15 157 -103 17 -192 118 6 123 -314 125 -144 58 49 38 -76 206 -31 -95 66 101
5148 101 -14 130 95 10 -125 57 92 -4 -46 -202 -35 -238 -152 -147 70 -202 -7 80 -28 196 -200 -168 -69 11
5172 11 -32 112 53 324 173 27 22 12 129 -5 251 169 -118 18 52 -49 -71 2 -165 156 -173 -79 -68 158
5196 158 -280 91 -191 54 -50 -200 44 -45 -52 -124 116 66 -199 -49 -39 90 -63 -129 -10 114 90 164 220
5219 220 -147 -55 -343 -123 -63 102 98 412 -114 29 -193 42 145 121 -12 -252 -42 181 137 29 20 25 95 333
5243 333 17 66 221 153 -56 -327 -194 -60 125 165 32 -194 149 -147 150 5 77 -40 107 78 67 43
5265 43 -60 -56 104 -12 168 -90 133 132 78 211 72 -103 -46 210 51 93 143 -102 103 16 -131 -87 -157 56
5289 56 -44 108 77 -215 117 -92 108 -160 -127 -102 -47 -6 -107 230 88 69 183 67 -80 -140 -50 -57 178 -268
5313 -268 -40 203 33 102 40 -141 -369 -96 -108 -101 69 62 7 -130 -86 60 -92 -59 -109 -41 17 72 -28 19 -56
5338 -56 -218 64 -145 -88 -123 121 93 94 47 73 -140 69 -263 31 -112 -13 -183 -15 25 -85 26 149 88 27
5362 27 86 294 -31 30 312 44 -61 151 -75 58 226 -28 60 -28 -19 -32 -150 -180 22 64 67 -124 47 223
5386 223 -223 25 -51 129 -122 -85 224 150 29 186 87 177 -186 97 84 32 30 -31 -43 19 -120 -113 36 -58 -131
5411 -131 116 -289 -41 57 -103 -55 1 -67 188 20 -163 -224 109 -14 -148 -137 20 -1 209 -293 90 -79
5433 -79 -285 29 37 25 -57 0 209 -41 351 159 104 -142 -164 109 -137 -60 -1 219 -82 161 90 -114 -52 -257
5457 -257 -26 90 239 77 71 45 -124 3 117 -59 -168 -103 -159 121 87 -109 -317 -6 60 -24 -13 32 -72
5480 -72 -199 183 -116 -173 194 -2 -223 -54 203 -277 -70 255 93 258 -30 -122 -152 -206 -54 -112 243 2
5502 2 287 182 125 205 399 -9 -36 -118 27 105 -24 165 24 -211 -61 -251 -135 -146 105 172 -15 266 15
5525 15 167 -172 53 249 -84 124 177 -75 -257 -14 112 -103 -268 46 -28 138 188 66 -46 140 -10
5546 -10 -47 10 122 -420 48 -230 120 -155 30 24 -113 19 -103 -184 -144 -53 138 -285 129 39 -120 148 -30
5569 -30 94 13 171 -143 38 -90 158 71 110 175 -7 -155 101 141 76 -192 162 70 53 259 -133 89 69
5592 69 -47 -34 -156 144 79 -187 184 -29 -229 34 30 -160 -23 -53 201 130 -17 -222 111 -110 164 -93
5614 -93 -12 -6 -132 193 115 -100 83 -263 63 -44 88 55 -28 -205 -141 93 44 -256 180 -10 -109 -155 -187 0
5638 0 -14 58 71 -223 -33 56 76 -246 -185 -43 87 60 128 206 -484 -125 -6 -134 -209 131 21 59 33 112 -3
5663 -3 1 51 -113 -58 -13 -43 33 156 -191 -64 252 -71 78 -121 -5 34 -154 -188 12 -66 -29 -226 -16 -200
5687 -200 115 -109 -71 -24 55 -78 107 -265 128 -43 -91 38 -17 51 -99 -40 -74 -291 62 76 91 -334 -14
5710 -14 90 40 -160 -116 150 105 37 -30 -17 -17 41 -44 -192 201 177 -38 16 -14 16 -205 -37 4 -128 -76 -157 208
5736 208 -181 -204 104 -270 -176 -79 50 -14 -285 161 -268 45 59 86 -2 -80 313 63 28 -48 -187 217 207 -67
5760 -67 -181 209 -121 -81 -97 221 -105 -157 22 -93 200 22 225 156 -56 -240 207 -239 117 -44 32 -65
5782 -65 165 -28 61 -3 179 -80 -202 85 108 -122 84 34 116 -241 7 -101 -62 34 80 -46 27 -62 -142 -77
5806 -77 -229 44 -65 -170 -66 -254 17 -96 -187 82 54 36 39 -28 22 -86 -214 39 -35 -29 83 -283 -305 131
5830 131 -74 -20 142 1 -37 -149 -51 62 -116 107 -247 41 -95 103 -118 -79 -37 140 58 -324 -30 -13
5852 -13 -271 -181 31 -45 19 158 71 -86 -32 -30 -152 -119 244 148 83 18 200 -93 -161 78 62 -294 -171 -96 -89 -127
5878 -127 -2 8 -196 -1 8 -115 146 -129 -76 -273 35 19 -34 -174 -167 0 44 -8 177 20 -15 -144 -215 60
5902 60 -69 56 -91 38 202 28 109 -236 106 15 204 -302 204 -168 -145 40 -43 34 -142 -143 26 -31 176
5925 176 87 -9 106 1 -62 -86 175 -47 209 48 -142 39 -197 -163 -201 285 80 -18 -87 -186 -108 -143 190 241
5949 241 93 -13 346 -14 -100 138 -18 -122 171 113 -42 -235 48 307 -130 25 -170 -125 107 -46 -280
5970 -280 -119 121 115 186 79 32 138 178 -126 -12 146 80 -54 265 -12 -37 -142 173 107 -125 63 38 -62
5993 -62 -250 -100 87 176 40 37 -96 -81 -16 -142 60 -134 -105 2 44 -235 193 79 -155 -85 -161 -40 -71 -151
6017 -151 208 96 -244 114 31 132 -105 292 238 134 185 119 17 -140 -32 -25 -28 -26 98 -361 143 210 -98 90
6041 90 123 78 -19 79 -122 -130 26 25 -91 -107 201 -96 -124 -94 -52 -261 -105 64 -132 31 -43 45 113 -154 61
6066 61 -166 -99 -113 259 10 25 -162 -187 217 130 146 -94 81 -72 63 -134 -85 58 156 208 -106 -194 -103 -56
6090 -56 127 -45 -190 -32 32 -212 46 113 -83 -25 -33 -35 144 8 -43 -108 49 -9 248 -100 -208 51 13 86
6114 86 104 53 -133 97 -2 26 51 311 -174 -105 -40 -151 -83 3 -80 -159 -99 -73 59 96 -26 -129 -21 -84 -93 -142
6140 -142 -271 -39 -10 -159 -31 87 -293 -23 -8 100 -298 -40 14 -53 -14 66 -2 -34 -24 0 95 75 16 190
6164 190 52 -195 -77 -77 -39 -76 22 -107 192 -138 95 57 158 204 142 213 -217 -223 -45 -95 -4 -44 -15 70 72 -125
6190 -125 77 61 13 113 20 -41 59 123 111 109 -46 176 -37 24 101 156 -34 -196 33 -91 -216 55 -240 8
6214 8 -9 42 29 126 11 -107 -111 -74 256 6 -111 -112 190 -111 -86 -90 -243 21 80 11 7 -75 74 6 17 23 -86 -111
6242 -111 -144 184 86 -352 116 46 40 79 172 -102 13 64 107 91 144 8 63 -21 -195 42 -15 33 41 -1 132 -69
6268 -69 -43 -259 -146 128 29 41 57 119 -87 -227 -179 170 59 142 -17 28 -185 -33 -380 -68 -26 -81 213 -64
6292 -64 119 -86 63 -91 -58 43 -191 -152 -39 34 -89 -149 24 -246 -164 8 42 268 -29 94 101 -228 -17
6315 -17 -37 -55 3 -4 137 48 -158 363 -205 -125 -75 157 -75 138 76 321 134 -54 -282 -62 167 -52 49
6338 49 -138 -78 72 146 -18 234 -87 -176 -86 188 -73 81 -30 87 172 -36 -34 -39 20 -3 -71 -103 216 189 180 104
6364 104 -70 -48 21 142 -114 -105 96 72 -37 60 55 -71 -216 -35 -78 145 -65 -128 -56 39 84 -4 -124 56 -68
6389 -68 -14 -155 109 76 313 64 28 8 -57 -7 -89 139 -75 -24 186 50 -218 21 -85 -20 -209 37 -28 -171
6413 -171 -36 181 -113 -78 -133 39 -209 181 -7 81 79 -14 -128 -151 214 -27 184 -37 -95 -133 64 26 -138
6436 -138 -295 169 42 -29 -11 162 -81 -38 -156 -24 -106 133 25 38 69 -36 -81 -55 191 46 -200 222 24
6459 24 69 32 142 -135 -126 118 -132 6 15 -192 31 25 178 35 -77 89 -213 -24 136 -28 68 84 -227 -89
6483 -89 11 79 -77 208 -96 185 -148 -47 46 102 42 -55 82 -47 -116 -33 -24 81 30 357 70 -130 35 128
6507 128 15 3 236 -21 -95 204 110 -32 57 38 -335 173 -5 -45 146 45 184 -171 151 -211 -3 -207
6529 -207 53 166 -9 170 95 288 191 -1 160 107 -281 113 63 -112 -94 62 36 18 40 56 26 21 358 -47
6553 -47 -178 55 -1 156 -171 145 -69 133 91 -173 31 168 40 -240 -97 -231 252 191 -43 143 53 -70
6575 -70 -97 -46 -242 58 -58 -72 -95 -185 -293 10 129 147 -99 182 8 20 160 -166 76 197 11 54 -81
6598 -81 34 71 -116 230 -174 16 104 75 -161 30 -232 167 -89 201 69 7 17 3 -167 216 18 -49 -12
6621 -12 -241 65 -91 -225 -281 -76 254 -59 -170 4 105 232 72 201 -145 4 -147 46 243 -132 34
6642 34 79 44 109 130 -62 -137 126 -114 68 -18 -271 -59 100 114 37 -135 -20 -29 104 24 -38 31 -204 -19 -93
6667 -93 -35 223 -200 -112 -9 19 -8 -318 27 43 -65 6 -91 -36 -117 -129 -119 -172 213 20 90 -105 -111 115 -29
6692 -29 149 -216 -49 85 -88 -189 -38 58 -166 177 204 -237 31 172 -54 -80 52 -3 -22 -190 8 -281
6714 -281 -137 -107 -153 -37 -191 -5 -64 -39 -14 -338 -220 -10 49 89 -49 -39 44 -142 -77 277 -269 -80 25
6737 25 -38 -122 -208 -430 64 -168 -291 27 77 127 115 14 -208 -216 -245 -30 55 19 104 31 -67 -59 -207 165 160 -161
6763 -161 -53 -105 175 125 -150 71 115 141 35 -89 -8 71 79 -255 -112 -80 -227 -27 9 -112 219 -30 -17 -16
6787 -16 -56 75 100 245 -41 -42 -21 -14 -88 -60 110 -48 130 15 59 231 67 119 116 -129 -68 -331 27 147 -94
6812 -94 68 21 172 -261 204 221 123 23 -231 179 215 -135 60 -180 -10 -46 84 -185 -265 -88 -52 72 -24
6835 -24 221 62 13 -156 37 9 -12 -311 207 93 91 -168 102 170 16 109 108 67 -116 262 199 1 -179 52
6859 52 -144 -33 -29 50 9 230 -22 -79 170 23 -72 108 -158 -28 19 182 -34 -43 -118 93 -227 17 -103 103
6883 103 14 39 2 7 -235 -45 -6 -100 98 169 99 95 19 58 3 -170 -64 -307 -86 29 -130 -90 -34 82 -291
6908 -291 -85 165 21 -88 -64 -57 -165 -59 -89 -124 -215 70 7 239 103 278 53 -161 -19 -70 90 114 79
6931 79 -14 -12 8 191 -44 81 -279 19 -152 -14 153 -40 -145 74 -104 -164 125 193 -50 -110 -77 -90 -168 -146
6955 -146 -36 -59 22 59 102 -63 -99 -19 -41 205 131 38 -22 136 -79 98 0 -55 -95 -57 167 -185 25 -96 8
6980 8 83 211 -23 -34 -90 -46 -115 134 -76 -44 -186 204 183 -120 288 -34 -132 -47 -67 276 77 -198 -71 12
7004 12 105 -85 136 139 -322 -24 -213 -118 185 -16 11 -71 91 -76 160 13 -70 -12 50 117 106 -12 -116 -27
7028 -27 -88 79 -199 -109 -341 -64 11 -19 -210 -188 -123 -151 130 42 -90 -138 -20 300 -19 -76 18 -319 41 -38
7052 -38 309 -131 168 -12 -5 251 -77 219 143 -25 -21 -61 50 214 -97 -57 95 18 -98 105 -114 -38 185
7075 185 -81 -271 129 -80 -132 60 4 104 122 74 49 -105 -86 61 29 -68 80 -57 43 110 -37 55 100 44
7099 44 -58 18 231 -21 -5 -16 118 -80 -43 137 122 -58 10 77 -69 -170 58 -66 -186 -63 -37 91 181
7122 181 11 149 262 90 -97 11 -14 60 58 55 95 13 59 -228 -213 63 98 29 175 -119 141 -269 141 191
7146 191 -69 -7 -47 52 118 57 219 18 13 127 -136 -72 -56 -85 -244 -27 -61 80 182 -40 217 -76 216 -265
7170 -265 73 309 -78 -11 61 -54 -54 139 -78 17 85 23 105 49 4 -219 15 23 146 17 -13 -20 -147 180 -107
7195 -107 214 75 55 210 -7 157 6 -4 91 -51 143 16 -109 73 137 159 -11 14 -16 171 3 150
7217 150 110 -112 -57 85 -42 -87 -99 75 -127 -94 -79 23 -47 62 212 44 58 9 -10 -45 83 -124 120 -79
7241 -79 -135 -69 -9 -145 -155 153 101 24 -122 -41 160 -137 218 46 -82 141 -76 -258 -161 57 -119 -54 198
7264 198 148 -62 -114 -98 43 -107 -129 41 -19 -82 28 -117 16 125 -133 -82 -123 -45 56 -96 -79 21 235
7287 235 62 -7 103 -62 71 135 -22 -72 140 -49 -173 140 116 -46 268 -274 106 102 78 129 -278 -309 228
7310 228 -234 -66 78 290 21 5 202 -12 89 261 71 23 102 4 212 -54 -212 69 106 -32 115 -19
7332 -19 14 -125 276 -253 -14 -99 -186 72 -80 95 -257 0 -43 24 -3 -4 -22 13 103 -26 274 43 222 33
7356 33 -3 -116 92 -178 -11 210 -7 -153 -188 84 -61 -105 -82 85 -23 -5 84 -53 15 -6 -28 -56 66 147
7380 147 -45 208 126 29 120 -143 22 -35 -131 25 92 106 -82 -247 -118 213 71 269 -147 12 41 -8 -59
7403 -59 259 -122 -111 -12 117 73 -61 141 33 -65 -209 36 -85 -116 155 54 92 -247 -202 46 91 164 43
7426 43 25 -276 -133 -102 109 44 -23 -183 12 39 59 -11 77 -95 207 198 -71 -142 14 163 -12 -16 21 39 83 117
7452 117 -56 9 127 -3 -14 -91 139 -302 111 12 -106 -75 145 110 106 30 58 -85 -227 64 234 -74 -17 17
7476 17 147 -134 -83 -2 -200 232 40 -371 -20 231 55 -112 22 253 -207 -34 52 226 101 17 -158 1
7498 1 -5 -88 227 -53 -164 -46 -7 -146 41 -230 296 -48 -71 45 43 108 51 -48 -65 18 -67 -292 6 -23 -59 -103
7524 -103 -14 42 207 -74 -174 -78 -4 -190 -238 -154 87 -49 21 -87 30 96 -7 61 -17 -20 68 71 -158 -97 96
7549 96 -250 -9 -139 47 91 -74 -59 -38 148 -163 57 -77 -245 -150 78 58 -61 -33 71 44 -45 -180 17
7572 17 223 178 2 211 -74 5 110 248 77 -15 20 46 86 -84 -192 2 -99 18 25 -13 -45 90 76 65
7596 65 -72 -52 46 81 173 14 64 114 -243 127 -34 -111 248 24 -35 -40 92 -12 9 -85 -215 -26 -239 -167 -68
7621 -68 82 -136 148 50 276 311 -94 105 24 -40 32 148 -62 232 17 11 104 -60 22 40 96 211 -24 -4
7645 -4 76 149 169 57 62 -265 188 -3 -183 -86 124 -175 141 -17 -342 176 150 16 -144 135 17 43 -162
7668 -162 122 268 -174 37 150 -119 60 161 119 131 -145 -198 30 57 -195 98 168 95 -18 111 -120 -12
7690 -12 -244 49 92 73 42 -122 381 143 -118 22 -21 102 -64 -85 91 -319 -14 215 -206 -312 171 -2
7712 -2 65 51 -82 -129 -81 161 -88 -18 18 80 172 10 -189 -260 196 45 99 -236 250 90 -107 48 -6 172
7736 172 209 -131 55 0 -163 222 -238 106 -143 348 -29 237 20 244 7 -42 5 71 69 -18 142 151 134 -24
7760 -24 71 -30 14 -248 52 -17 -265 84 -52 104 -72 192 44 -110 -111 90 -24 61 5 183 35 27 295
7783 295 1 160 -106 22 -108 -87 351 6 -63 105 -219 74 139 -25 -41 147 -124 -80 114 109 21 -51 -74
7806 -74 -85 23 -121 -195 18 92 19 62 33 86 26 48 -145 -219 195 33 -40 79 146 -105 67 24 -135 -148 -119
7831 -119 -55 8 32 -43 -18 127 184 -19 -75 -71 45 204 95 9 37 28 22 30 79 -28 258 -25 93 -43 302 126
7857 126 171 -181 -163 125 -16 -75 58 -60 -95 -245 -32 -162 218 2 -107 -155 -116 120 255 5 -46 -138 -17
7880 -17 64 17 6 21 227 -170 229 -70 -124 137 165 -148 138 -159 137 160 9 107 149 -8 -207 50 -262
7903 -262 62 -248 -39 -92 28 153 -122 93 -89 -124 -58 155 -82 -123 149 11 -125 38 291 15 -118
7924 -118 107 -118 -116 46 -42 138 -185 -175 71 46 56 -262 24 75 119 76 111 17 42 124 -74 -240 -95 -147 5
7949 5 118 87 116 101 80 -379 210 38 -40 258 -250 219 -74 -24 -98 -187 44 -181 42 86 -302 236 166 0
7973 0 -140 -61 -88 -69 4 264 -128 -16 16 62 -40 118 -119 71 30 -16 -66 -45 137 235 -108 170 256 342 34
7998 34 -102 68 -260 -38 -155 37 -56 93 -103 40 -222 -24 44 -31 -173 -112 -326 -13 -128 205 87 92
8020 92 125 -21 7 13 43 65 70 -102 4 -114 -27 -90 127 -94 68 28 34 13 156 -15 -179 -54 235 123 -53
8045 -53 -144 92 -53 85 42 47 -71 -103 28 -146 -204 -24 30 -55 -67 48 123 106 47 -316 7 276 -250 -61
8069 -61 60 -131 17 -167 171 113 -120 136 -147 -33 35 43 -173 218 10 -4 25 30 -66 -89 72 104 -134 -146
8093 -146 213 -221 62 -47 78 122 -41 131 -194 -102 -236 -241 22 98 -62 24 -11 -3 -225 18 -57 -11 140 195
8117 195 355 -166 -136 110 -28 -194 -117 -93 41 64 82 -93 -23 -61 -167 262 -37 -215 74 72 99 -318 41
8140 41 -127 -91 -161 -98 160 33 41 36 -266 84 91 -36 34 -59 -29 101 -44 -90 103 -149 41 318 54 96 -199
8165 -199 -237 258 -53 80 -223 107 -82 -11 -158 30 -299 -142 -38 185 88 -34 164 -217 21 19 -67 -102
8187 -102 -32 80 47 75
8191G5
##END NTUPLES=NMR FID
##END=
