##TITLE=1H_UK-25_2
 CD2Cl2
 8 sc, 
 9.03.2022
##JCAMPDX= 6.0         $$ Bruker NMR JCAMP-DX V2.0
##DATA TYPE= NMR FID
##DATA CLASS= NTUPLES
##ORIGIN= UXNMR, Bruker Analytische Messtechnik GmbH
##OWNER= root
$$ XWIN-NMR		Version 3.5
$$ Wed Mar  9 11:29:56 2022 Russian Standard Time (UT+4h)  she@DPX200
##.OBSERVE FREQUENCY= 200.131346
##.OBSERVE NUCLEUS= ^1H
##.DELAY= (6, 6)
##.ACQUISITION MODE= SIMULTANEOUS
##.ACQUISITION SCHEME= undefined
##.AVERAGES= 8
##.DIGITISER RES= 18
##SPECTROMETER/DATA SYSTEM= spect
##.PULSE SEQUENCE= zg30
##.SOLVENT NAME= CD2Cl2
##.SHIFT REFERENCE= (INTERNAL, CD2Cl2, 0, 15.7039)
##AUDIT TRAIL= $$ (NUMBER, WHEN, WHO, WHERE, WHAT)
$$ ##TITLE= Audit trail, XWIN-NMR		Version 3.5
$$ ##JCAMPDX= 5.01
$$ ##ORIGIN= Bruker BioSpin GmbH
$$ ##OWNER= she
$$ F:/spectra/data/she/nmr/H-F/1/audita.txt
$$ ##AUDIT TRAIL=  $$ (NUMBER, WHEN, WHO, WHERE, WHAT)
(   1,<2022-03-09 11:29:05.71 +0400>,<she>,<DPX200>,
      <created by zg, POWCHK disabled, PULCHK disabled
       configuration hash MD5:
       00 E9 B6 7A A2 85 ED C7 34 08 36 98 17 FE 4E 26
       data hash MD5: 16K
       13 61 BC 29 CF 99 51 A8 5C 37 80 56 2D 4D 34 7E>)
$$ ##END=
$$ 
$$ hash MD5
$$ 44 DC 0E 9E 95 9C 9F 8B 8C 3E 0A B6 E2 B4 E5 E3
##$RELAX= 
##$RELAX= 
##$RELAX= 
##$RELAX= 
##$RELAX= 
##$RELAX= 
$$ Bruker specific parameters
$$ --------------------------
##$DU= <F:/spectra>
##$EXPNO= 1
##$NAME= <H-F>
##$PROCNO= 1
##$TYPE= <nmr>
##$USER= <she>
##$AMP= (0..31)
100 100 100 100 100 100 100 100 100 100 100 100 100 100 100 100 100 100 
100 100 100 100 100 100 100 100 100 100 100 100 100 100 
##$AQSEQ= 0
##$AQ_mod= 1
##$AUNM= <au_zg>
##$AUTOPOS= <>
##$BF1= 200.13
##$BF2= 200.13
##$BF3= 200.13
##$BF4= 200.13
##$BF5= 200.13
##$BF6= 200.13
##$BF7= 200.13
##$BF8= 200.13
##$BYTORDA= 1
##$CFDGTYP= 0
##$CFRGTYP= 5
##$CHEMSTR= <none>
##$CNST= (0..31)
1 1 145 1 1 1 1 1 1 1 1 1 1 1 1 1 1 1 1 1 1 1 1 1 1 1 1 1 1 1 1 1 
##$CPDPRG= <>
##$CPDPRG1= <>
##$CPDPRG2= <>
##$CPDPRG3= <>
##$CPDPRG4= <mlev>
##$CPDPRG5= <mlev>
##$CPDPRG6= <mlev>
##$CPDPRG7= <mlev>
##$CPDPRG8= <mlev>
##$CPDPRGB= <>
##$CPDPRGT= <>
##$D= (0..31)
0 1.2 0 0 0 0 0 0 0 0.06 0 0.03 0 0 0 0 0.0002 0 0 0 0 0 0 0 0 0 0 0 0 
0 0 0 
##$DATE= 1646810945
##$DBL= (0..7)
120 120 120 120 120 120 120 120 
##$DBP= (0..7)
150 150 150 150 150 150 150 150 
##$DBP07= 0
##$DBPNAM0= <>
##$DBPNAM1= <>
##$DBPNAM2= <>
##$DBPNAM3= <>
##$DBPNAM4= <>
##$DBPNAM5= <>
##$DBPNAM6= <>
##$DBPNAM7= <>
##$DBPOAL= (0..7)
0.5 0.5 0.5 0.5 0.5 0.5 0.5 0.5 
##$DBPOFFS= (0..7)
0 0 0 0 0 0 0 0 
##$DE= 6
##$DECBNUC= <off>
##$DECIM= 32
##$DECNUC= <off>
##$DECSTAT= 4
##$DIGMOD= 1
##$DIGTYP= 9
##$DL= (0..7)
0 120 120 120 120 120 120 120 
##$DP= (0..7)
150 150 150 150 150 150 150 150 
##$DP07= 0
##$DPNAME0= <>
##$DPNAME1= <>
##$DPNAME2= <>
##$DPNAME3= <>
##$DPNAME4= <>
##$DPNAME5= <>
##$DPNAME6= <>
##$DPNAME7= <>
##$DPOAL= (0..7)
0.5 0.5 0.5 0.5 0.5 0.5 0.5 0.5 
##$DPOFFS= (0..7)
0 0 0 0 0 0 0 0 
##$DQDMODE= 0
##$DR= 18
##$DS= 0
##$DSLIST= <SSSSSSSSSSSSSSS>
$$ [...]
##$SUBNAM2= <"">
##$SUBNAM3= <"">
##$SUBNAM4= <"">
##$SUBNAM5= <"">
##$SUBNAM6= <"">
##$SUBNAM7= <"">
##$SUBNAM8= <"">
##$SUBNAM9= <"">
##$SW= 18.0517287032376
##$SWIBOX= (0..15)
0 0 2 0 0 0 0 0 0 0 0 0 0 0 0 0 
##$SW_h= 3612.71676300578
##$TD= 16384
##$TD0= 1
##$TE= 0
##$TE2= 300
##$TE3= 300
##$TEG= 300
##$TL= (0..7)
0 120 120 120 120 120 120 120 
##$TP= (0..7)
150 150 150 150 150 150 150 150 
##$TP07= 0
##$TPNAME0= <>
##$TPNAME1= <>
##$TPNAME2= <>
##$TPNAME3= <>
##$TPNAME4= <>
##$TPNAME5= <>
##$TPNAME6= <>
##$TPNAME7= <>
##$TPOAL= (0..7)
0.5 0.5 0.5 0.5 0.5 0.5 0.5 0.5 
##$TPOFFS= (0..7)
0 0 0 0 0 0 0 0 
##$TUNHIN= 0
##$TUNHOUT= 0
##$TUNXOUT= 0
##$USERA1= <user>
##$USERA2= <user>
##$USERA3= <user>
##$USERA4= <user>
##$USERA5= <user>
##$V9= 5
##$VALIST= <valist>
##$VCLIST= <CCCCCCCCCCCCCCC>
##$VD= 0
##$VDLIST= <DDDDDDDDDDDDDDD>
##$VPLIST= <PPPPPPPPPPPPPPP>
##$VTLIST= <TTTTTTTTTTTTTTT>
##$WBST= 1024
##$WBSW= 4
##$XGAIN= (0..3)
0 0 0 0 
##$XL= 0
##$YL= 0
##$YMAX_a= 60245
##$YMIN_a= -50970
##$ZGOPTNS= <>
##$ZL1= 120
##$ZL2= 120
##$ZL3= 120
##$ZL4= 120
##$ABSF1= 10
##$ABSF2= 0
##$ABSG= 5
##$ABSL= 3
##$ALPHA= 0
##$AQORDER= 0
##$ASSFAC= 0
##$ASSFACI= 0
##$ASSFACX= 0
##$ASSWID= 0
##$AUNMP= <proc_1d>
##$AZFE= 0.1
##$AZFW= 0.1
##$BCFW= 1
##$BC_mod= 2
##$BYTORDP= 1
##$COROFFS= 0
##$CY= 11.3945322036743
##$DATMOD= 1
##$DC= 2
##$DFILT= <>
##$DTYPP= 0
##$F1P= 2.36226072786647
##$F2P= -0.459571619588291
##$FCOR= 0.5
##$FTSIZE= 0
##$FT_mod= 4
##$GAMMA= 1
##$GB= 0.15
##$INTBC= 1
##$INTSCL= 1
##$ISEN= 128
##$LB= 0.24
##$LEV0= 0
##$LPBIN= 0
##$MAXI= 10000
##$MC2= 0
##$MEAN= 0
##$ME_mod= 0
##$MI= 1.114404
##$NCOEF= 0
##$NC_proc= 0
##$NLEV= 6
##$NOISF1= 3.799351
##$NOISF2= 2.8
##$NSP= 1
##$NTH_PI= 0
##$NZP= 0
##$OFFSET= 15.70392
##$PC= 1
##$PHC0= -16583
##$PHC1= 6.400778
##$PH_mod= 1
##$PKNL= yes
##$PPARMOD= 0
##$PSCAL= 0
##$PSIGN= 0
##$REVERSE= no
##$SF= 200.130013532006
##$SI= 16384
##$SIGF1= 3
##$SIGF2= 2
##$SINO= 400
##$SIOLD= 16384
##$SREGLST= <1H.CDCl3>
##$SSB= 0
##$STSI= 0
##$STSR= 0
##$SW_p= 3612.71676300578
##$SYMM= 0
##$S_DEV= 0
##$TDeff= 0
##$TDoff= 0
##$TI= <>
##$TILT= no
##$TM1= 0
##$TM2= 0
##$TOPLEV= 0
##$USERP1= <user>
##$USERP2= <user>
##$USERP3= <user>
##$USERP4= <user>
##$USERP5= <user>
##$WDW= 1
##$XDIM= 8192
##$YMAX_p= 0
##$YMIN_p= 0
$$ End of Bruker specific parameters
$$ ---------------------------------
##NTUPLES= NMR FID
##VAR_NAME=  TIME,          FID/REAL,        FID/IMAG
##SYMBOL=    X,             R,               I
##VAR_TYPE=  INDEPENDENT,   DEPENDENT,       DEPENDENT
##VAR_FORM=  AFFN,          ASDF,            ASDF
##VAR_DIM=   8192,          8192,            8192
##UNITS=     SECONDS,       ARBITRARY UNITS, ARBITRARY UNITS
##FACTOR=    0.0002768,     1,               1
##FIRST=     0,             0,               0
##LAST=      2.2672688,     0,               0
##MIN=       0,             -50970,          0
##MAX=       2.2672688,     60245,           0
$$ Real data points
##PAGE= N=1
##DATA TABLE= (X++(R..R)), XYDATA
0@%%%%%%%%%%%%%%%%qJ6j6J6j6K3l1L2l4M2m9N7p0P8q8J04j20J35j51J69j88K12
$$ 0 0 0 0 0 0 0 0 0 0 0 0 0 0 0 0 0 -8 8 -8 8 -8 15 -16 16 -18 24 -25 32 -38 40 -48 56 -64 71 -80 89 -99 113
38A13k39K64k92L26l63M03m46M92n43N99o61P28q01Q84r75J074j185J310j453
$$ 113 -126 138 -154 172 -191 212 -234 258 -285 314 -347 381 -420 464 -511 563 -622 688 -765
57g65J617j802K021k283K598k992L498m173N123o576R093j4685N3087k2346l6129
$$ -765 852 -950 1071 -1212 1386 -1606 1892 -2281 2842 -3734 5359 -9326 43761 21415 -14714
72a4714P4209m0987n3450M8345K2925p0025J3555M8719m1116k9925N8878k147
$$ -14714 59495 18508 -34942 13403 36328 -33697 -20142 28577 -12539 -42464 16414 14267
84A4267n3934K1976L4119m5844j0257N1741m965l5418L6380K5331l7535P70M2784
$$ 14267 -39667 -17691 16428 -29416 -39673 12068 7103 -28315 8065 33396 -4139 -3369 39415
97C9415k0004l1638K6454N065l9603P167K8565k2108j3780K8533j230k4806J4535
$$ 39415 19411 -12227 14227 19292 -20311 -13144 15421 -6687 -20467 8066 6836 -17970 -3435
110c435J6812k0239o921J5998m944j3461J1542J3014n833q31J1206J973r026J096
$$ -3435 13377 -6862 -13783 2215 -2729 -16190 -4648 8366 2533 1702 12908 14881 5855 6951
124F951P579n442j2671J539L057j2061l023J4786L19j2776Q624J1298j5011n549
$$ 6951 14530 9088 -3583 -2044 1013 -11048 -14071 715 1034 -11742 -3118 8180 -6831 -12380
138a2380J8507l082j9416J0320J3489j7809j775K7083l897j8566J9156J2243k7859
$$ -12380 6127 3045 -16371 -6051 7438 -10371 -12146 14937 11040 -7526 11630 23873 -3986
151c986j308K6547j7291k4270K3843O561l1013J0808L0141k1943j4611L2913k497
$$ -3986 -5294 21253 3962 -20308 3535 10096 -20917 -10109 20032 -1911 -16522 16391 13894
164A3894l3943J8228K2331l2782q542L4149j1452k7330K9739J7851l2813L952
$$ 13894 -20049 -1821 20510 -12272 -20814 13335 1883 -25447 4292 22143 -10670 -6718
176f718L2729k2202k4512L0508M308l6331J1318K7416k6511j1559L6662j367k8858
$$ -6718 26011 3809 -20703 9805 14113 -22218 -10900 16516 -9995 -21554 15108 13741 -15117
189a5117K0840J8860l2266n321K9840j4052k4534K3885J0564k7940O286K8136
$$ -15117 5723 24583 -7683 -13004 16836 2784 -21750 2135 12699 -15241 -8955 19181
201A9181j5301j4867K3783J322k6667O858J7281j8903r115K2104k088j8090J4097
$$ 19181 3880 -10987 12796 14118 -12549 -5691 11590 -7313 -16428 5676 3588 -14502 -405
214d05J4872j5767l194J7421o849j7309J0392P355j5367m81J4753n396r074J2080
$$ -405 14467 -1300 -4494 12927 6078 -11231 -839 6516 -8851 -9332 5421 25 -9049 3031
228C031P300j1075k34R983o194j0719O145M285q561o06J0359j212p389P358P629
$$ 3031 10331 -744 -978 9005 2811 -7908 -1763 2522 -6039 -6645 3714 2502 -4887 2471 10100
243A0100q164m016Q888l279j2200M492Q010r238l168J3048l82j1311Q406J0538
$$ 10100 1936 -2080 6808 3529 -8671 -4179 3831 -5407 -8575 4473 4091 -7220 1186 11724
257A1724j2655m495J3128m964j4820R037R590j4227l83J7750n351j3121J4690
$$ 11724 -931 -5426 7702 2738 -12082 -3045 6545 -7682 -8065 9685 4334 -8787 5903
270E903P543j8602L85J6150j2205j4578J7256M836j8953P431J9034j4690r118
$$ 5903 13446 -5156 -4771 11379 -826 -15404 1852 6688 -12265 -4834 14200 -490 -9608
283i608K0936p66k1443J0170J2907k0720n759K1931n454j6897J7805J1706k0946
$$ -9608 11328 10562 -10881 -711 12196 -8524 -14283 7648 2194 -14703 3102 14808 -6138
296f138R00K0978j1963j6550J7611L986k3129N812J8839j4235q208K1911P33j9776
$$ -6138 -5238 15740 3777 -12773 4838 8824 -14305 -8493 10346 -3889 -12097 9814 10547 -9229
310i229J0779J3637j8471o365J7839o115j7484J3579J0400j6351J479J9050p859
$$ -9229 1550 15187 -3284 -9649 8190 2075 -15409 -1830 8570 -7781 -6302 12748 4889
323D889j2583J3666M389j7515J840J2786j1019q867J4653K677j2866P448J2242
$$ 4889 -7694 5972 10361 -7154 -5314 7472 -3547 -12414 2239 4916 -7950 -502 11740
336A1740j0301n917J1696j595j3343N302P474j0581l088J1656p11p382P002O849
$$ 11740 1439 -4478 7218 5623 -7720 -2418 5056 -5525 -8613 3043 2332 -5050 1952 8801
350H801q137l321P842k714r435M417N270p362k079R338L74o271N351O398p277
$$ 8801 664 -2657 5185 2471 -6964 -2547 2723 -4639 -6718 2620 2994 -3277 2074 8472 1195
365A195l880P011j828r027L494O413p143l190J0288O40q191N350P385q573n144
$$ 1195 -2685 4326 2498 -6529 -3035 3378 -3765 -6955 3333 3973 -4218 1132 8517 -56 -5200
380e200R464k074j0987O303P709r870j817J3544k398j0333R704O619j4169j947
$$ -5200 4264 2190 -8797 -2494 5215 -4655 -6472 7072 4674 -5659 4045 10664 -3505 -5452
394e452J2932p614j1037J1833N026j4666L942J4945r319q371J5081J105j6868
$$ -5452 7480 -134 -11171 662 5688 -8978 -5036 9909 590 -7781 7300 8405 -8463
407h463N564J1633j3566o073J7172k267j4109J1920J0668j5026j712J6364p890
$$ -8463 -2899 8734 -4832 -10905 6267 4000 -10109 1811 12479 -2547 -4259 12105 4215
420D215j4465J2276M678j7282K784J5474r803q381J6280K280j5158O248J1803
$$ 4215 -10250 2026 6704 -10578 -7794 7680 -2123 -10504 5776 8056 -7102 -854 10949
433A0949j3239o746J4261k741j3327J0161R532j2249o44J4612n022j0748R965
$$ 10949 -2290 -9036 5225 2484 -10843 -682 8850 -3399 -4043 10569 5547 -5201 4764
446D764L815j3940K33J0282q098p621J1449K929j0271M551R656p515m563Q670
$$ 4764 8579 -5361 -5128 5154 -2944 -10565 884 3813 -6458 -1907 7749 234 -4329 4341
460D341r13r298L598N904o851j917Q859n5n931M251N054n733k898M633j359o775
$$ 4341 3428 -5870 -2272 3632 -3219 -5136 3723 3668 -2263 1988 7042 1309 -1589 3044 1685 -5090
476e090J592L826l995j994O300J626n017K354N346l133m508M920Q90o802J155
$$ -5090 -3498 328 -3667 -5661 639 2265 -2752 -398 4948 1815 -2693 2227 3117 -3685 -2530
491b530N832l675l687P766K250q011K249P454p083o005P562M25j0614L622Q252
$$ -2530 3302 -373 -4060 3706 5956 -2055 194 7648 565 -5440 2122 2547 -8067 -4445 3807
506C807q010l041J1571l31r674P358O940j1588k295J1700m950j0372J0227N623
$$ 3807 -4203 -7244 4327 3996 -5678 1680 8620 -2968 -5263 6437 1487 -8885 1342 6965
520F965j2308K043J3186p935q512J2486R97j4579M540J0221j1863m971J4195j514
$$ 6965 -5343 -3300 9886 1951 -6561 5925 6922 -7657 -3117 7104 -4759 -9730 4465 2951
534B951j1896R772R081j2699j324J3182o301j1287J0531M229j3696K699J2112
$$ 2951 -8945 827 9908 -2791 -4115 9067 2766 -8521 2010 6239 -7457 -4758 7354
547G354p806o866J2824J555j2617M980Q123j0848m094J0461k212r822Q141O778
$$ 7354 -452 -7318 5506 7061 -5556 -576 7547 -3301 -7395 3066 854 -8968 -827 5951
561E951r396M46J0524l911p522P199K389r117j33O924m763m575P328K179o375
$$ 5951 -3445 -2999 7525 3614 -3908 3291 5680 -3437 -3570 3354 -1409 -5984 1344 3523 -2852
576b852K544N644m236l921M648k99n563J288L997k925k264M935J804l636J408
$$ -2852 -308 5336 1100 -2821 1827 1528 -4035 -2747 1250 -1675 -3939 996 2800 -836 572
591E72M016k346l594K287J106m736n46M447j569l321L696L563m439o65N780k236
$$ 572 4588 2242 -1352 935 2041 -2695 -3241 1206 -363 -3684 12 3575 -864 -1529 4251 2015
607B015n581L962K766o998o28P573k612n204P272L215p914J344P186n798n691
$$ 2015 -3566 396 3162 -3836 -4464 3109 497 -4707 2565 5780 -2134 -790 6396 598 -5093
622e093P875K38r706L873P409p350l095J0806j054r423O559N919j0515j415J0000
$$ -5093 2782 3020 -6686 -2813 4596 -2754 -5849 4957 3903 -5520 1039 6958 -3557 -4972 5028
637E028m595q446R340L723j0261K785J0613p131o378J0299M74j1312M014P843
$$ 5028 433 -8013 1327 5050 -5211 -2426 8187 1056 -5322 4977 5451 -5861 -1847 5996
651E996r606l189J0855j746q742P659N869r955n15R299m806p636P710K734r454
$$ 5996 -3610 -6799 4056 2310 -6432 1227 7096 -2859 -3374 5925 1119 -6517 1193 3927 -5527
666e527K342Q528n735m122Q871N85q566L257N413o874l105P338j411o101M339
$$ -5527 -3185 5343 -392 -4514 4357 4942 -3624 -367 5046 -1828 -4933 2405 994 -5107 -768
681g68M441n209l45N994j884n126L732J978n536j61M544j811l580L819L019l684
$$ -768 3673 -1536 -1881 4113 2229 -2897 835 2813 -2723 -2884 1660 -151 -3731 88 3107 -577
697e77k6M073j503l898K192K013l940j307M057q27l219K706L145l119p21L900
$$ -577 -603 3470 1967 -1931 261 2274 -1666 -2973 1084 257 -2962 -256 2889 -230 -951 2949
713B949r39m407J988K706m455j380M714k47m595M021L780m854j156O031k306n823
$$ 2949 2010 -2397 -409 2297 -2158 -3538 1176 929 -3666 355 4135 -719 -1875 4156 1850 -3973
729c973M262K816o740K96O728l178m889O830K295p043J608O482n732m242O908
$$ -3973 289 3105 -3635 -3339 3389 211 -4678 2152 4447 -2596 -988 5494 -238 -4480 2428
744B428j73p390L496O110o768j714Q296j233p252N352M138p956j076P520l774
$$ 2428 2255 -5135 -1639 4471 -2297 -4011 4285 3052 -4200 1152 5290 -2666 -3742 3778 4
759Dn960P144K732p893K225P481n396l893P156k8p953K995N606o406k695P955
$$ 4 -5956 1188 3920 -3973 -1748 5733 337 -3556 3600 3572 -4381 -1386 4220 -2186 -4881 3074
775C074j012o321M970M138o210j110O482k714n871M877K453o223P82O130k892
$$ 3074 2062 -4259 711 4849 -1361 -2471 4011 1297 -4574 303 2756 -3467 -2685 3445 553
790E53l663N128J407n697J229M609m036l225N036K10n029K521M076l227k062M496
$$ 553 -3110 2018 3425 -2272 -1043 3566 -470 -3695 1341 1551 -3478 -957 3119 -108 -2170 2326
806B326M7m408J677K838l765j597M021n38l030K068L109k766j072L324l18l827
$$ 2326 2373 -2035 -358 2480 -1285 -2882 1139 601 -2429 -361 2748 -18 -1090 2234 1916 -1911
822a911J678K362l243j685L815j20l589K323L571l585j196L906p37m129K097K801
$$ -1911 -233 2129 -1114 -2799 1016 896 -2693 -370 3201 -384 -1580 2326 1589 -2540 -443 2358
838B358m072j284M549n70m039L375L053m138p35M651j982m271L501K287n159J00
$$ 2358 -1714 -2998 1551 981 -3058 317 3370 -768 -1503 3148 1166 -3105 396 2683 -2476 -2376
854b376N001k224l737M970J824n316J081M879m180l563N255L94n796K667M518
$$ -2376 2625 401 -3336 1634 3458 -1858 -777 4102 -78 -3641 1614 2008 -3788 -1121 3397
869C397m342k133O298q72n811L816L680o238j056N752j968n115N030K706n812
$$ 3397 -945 -3078 3220 2348 -3463 353 4033 -2205 -3261 2491 523 -4592 438 3144 -2668
884b668Q68O183l126m248M886R16n612J409M649m405k710N778L91n440K842M334
$$ -2668 -1800 4383 1257 -2991 1895 2811 -2801 -1392 3257 -1148 -3858 1920 2311 -3129 -287 4047
900D047m891j597N294j412m975L088L438n180k35N097j819l708M165J933n112
$$ 4047 -844 -2441 2853 1441 -3534 -446 2992 -2188 -2423 2674 855 -2853 1312 3245 -1867
915a867P66L844l026k940L913J071m240J249L775k681k216L958K83l689J115K847
$$ -1867 -1101 2743 -283 -3223 690 1761 -2479 -1230 2545 -136 -2352 1606 1889 -1800 -685 2162
931B162k911j326L273J51l318J709K916k516j121K750j13l262J438K107k644j306
$$ 2162 -749 -2075 1198 1349 -1969 -260 2656 140 -981 1769 1656 -1606 -168 1939 -705 -2011
947b011K967K00k952J438K427k502j116K857j16l172J156K517k890r98L661k20
$$ -2011 956 1156 -1796 -358 2069 -433 -1549 1308 1192 -1980 -824 1693 -1197 -2195 1466 1246
963A246l363K076K739l288j051L737j096l504K485K076l989k93M596j809l594
$$ 1246 -2117 -41 2698 -590 -1641 2096 1000 -2504 -19 2057 -1932 -2225 2371 562 -3032
978c032M140J972m484J26M524k982l347M453Q63n083J787M180l725j919M996k65
$$ -3032 1108 3080 -1404 -1278 3246 264 -3083 1370 2233 -2850 -1063 3117 -608 -2527 2469 2204
994B204n017K700L358m812j366M863j440m117L832K688n073J78N103k403l591
$$ 2204 -2813 -113 3245 -1567 -2933 1930 490 -3627 205 2893 -2180 -2002 3101 698 -2893
1009b893M335J364n150J170M083l417k396M675N01m695K273L394l918j678M430
$$ -2893 1442 2806 -2344 -1174 2909 -508 -2904 1771 2272 -2423 -150 3244 -674 -2352 2078
1024B078j128l843K647K473m071j37M107j668k793L371J245l701M81L051k080
$$ 2078 950 -2893 -246 2227 -1844 -1981 2126 458 -2335 1036 2281 -1420 -939 2112 32
1039C2k317K906R62l061O75K668j630j889K612M48k511M18K268j904j269K205
$$ 32 -2285 621 1583 -1478 -803 1865 235 -1654 958 1406 -1105 -687 1581 -323 -1592 613
1055F13L46k258Q13K142j612j440K349J92k229N29K038j481j590K269N86k476
$$ 613 959 -1299 -486 1656 44 -1396 953 1145 -1084 -555 1483 2 -1588 681 1267 -1209
1071a209O29K486k041j441K546L89k895P13K459k046j617L378L8l308J322K780
$$ -1209 -580 1906 -135 -1576 970 1359 -1536 -823 1636 -410 -2027 1351 1389 -1919 -597 2183
1087B183k517j337L372l91l576K244K424l637o32M015j259l360L223J489l904
$$ 2183 -334 -1671 1701 1310 -2266 -22 2402 -1235 -1867 2148 889 -2471 752 2241 -1663
1102a663M19L616k443k619L835Q09m498J364L722l033j906M435l92l827K247K579
$$ -1663 -1244 2372 -71 -2690 1145 1954 -2544 -1180 2542 -491 -2397 2038 1646 -2181 66 2645
1118B645l794j202M476j278l667L103K058l829P4L886j778l042L218J150m071
$$ 2645 -1149 -2351 2125 847 -2820 283 2341 -1488 -1414 2472 694 -2348 870 2020 -2051
1133b051Q64L239k616j817L911L71l961J654K730k706j235L249n30k945J820J924
$$ -2051 -1187 2052 -564 -2381 1530 1901 -2060 -406 2324 -382 -1617 1632 1102 -1843 -23 1901
1149A901k812o63K836q38k183J896J543k592j18K591j568j713J938R80k040k24
$$ 1901 -911 -1574 1262 424 -1759 137 1680 -912 -1030 1561 -7 -1720 218 1198 -842 -1066
1165a066K460j087j591J620J198k193m3K216j106j916J691J315k555M06J857r87
$$ -1066 1394 307 -1284 336 1534 -659 -702 1514 408 -1508 183 1498 -1057 -651 1206 219
1181B19j680J791J038k789O04K353j356j620K023Q86k702O35K246j567j378K095
$$ 219 -1461 330 1368 -1421 -817 1536 180 -1440 583 1469 -1233 -598 1648 81 -1297 798
1197G98M79k813J134K318k046j725L294l97k941J537K241k633q34L083q54k651
$$ 798 1277 -1536 -402 1916 -130 -1855 1439 1042 -1899 -362 1879 -754 -1588 1495 641 -2010
1213b010K233J805l107j7K726j288k309K683P42l089P12K785j615k059K849L70
$$ -2010 223 2028 -1079 -1096 1630 342 -1967 716 1458 -1631 -919 1866 251 -1808 1041 1411
1229A411l202R79K868k545j384L172k28k850J448K143k433j119L284p63k701K021
$$ 1411 -1791 -812 2056 -489 -1873 1299 1071 -1779 -331 1812 -621 -1740 1544 781 -1920 101
1245A01J675k848k75K919r65k370K165J414k948q2K828j502j992K519P76k716
$$ 101 1776 -1072 -1347 1572 607 -1763 402 1816 -1132 -1214 1614 112 -1880 639 1415 -1301
1261a301N24K263j679j412K466M2k352Q44K102j968j153K824l92k362J568J353
$$ -1301 -777 1486 -193 -1605 861 903 -1449 -605 1497 -471 -1624 1200 808 -1554 14 1367
1277A367j915p22K531n80k101J391J413j884p11K408q44j692J690R73k025k16
$$ 1367 -548 -1270 1261 681 -1420 -29 1384 -500 -1211 1197 353 -1339 351 1324 -701 -917
1293i17K152p93j994J688J041j999k40K082r56j293J423Q12j922M52K283j710
$$ -917 1235 442 -1552 136 1177 -822 -1062 1020 64 -1229 194 1006 -916 -464 1819 109
1309A09j378K017L15k292P98J579j436j114K234L2j886J049J532j761j198K047
$$ 109 -1269 748 1063 -1229 -431 1148 -288 -1402 832 864 -1022 27 1559 -202 -1400 647
1325F47J38k469J431J401j965k10K058l72k199J767J106j789m89K154q16j977
$$ 647 785 -1684 -253 1148 -817 -1027 1031 659 -1540 227 1333 -456 -945 1209 393 -1584
1341a584J639J366k508p7K617j101j739J841J086k584M75K132j524j417J869P91
$$ -1584 55 1421 -1087 -1164 1453 352 -1387 454 1540 -1044 -569 1563 39 -1378 491 1282
1357A282k762R05K296k003r64K229J21k818J312J819k217n92K503l33k452J789
$$ 1282 -1480 -575 1721 -282 -1246 983 1104 -1714 -402 1417 -800 -1392 1111 778 -1674 115
1373A15J605k581k00K419o08k462J928R74k498L33K312r76k066K588L13k505R16
$$ 115 1720 -861 -1061 1358 750 -1712 216 1190 -1308 -975 1337 361 -1705 883 1196 -1309 -393
1390c93J836j639j069K078K36k395R85J722j789q11K528m52k206J599J348k151
$$ -393 1443 -196 -1265 813 1049 -1346 -361 1361 -428 -1239 1289 837 -1369 230 1578 -573
1406e73n59K152r07j369J515P47j649J08J849r93j399J345M48j585j15J624o93
$$ -573 -1132 1020 113 -1256 259 1006 -643 -535 1314 321 -1078 267 715 -870 -985 639 -54
1423e4j347K099K66j737M17J618j058j217J467L68j899J009R34r78q28J517L89
$$ -54 -1401 698 964 -773 -356 1262 204 -1013 454 822 -1077 -68 866 -112 -940 577 966
1440I66j562N54J123r53j154J471k11j460N67J698j725m74J889J11j831R84J276
$$ 966 -596 -42 1081 128 -1026 445 234 -1226 -659 1039 -686 -1160 729 840 -991 -7 1269
1457A269j637l83J531m35j720J333J164j600m48K185o37k011J927R87k480J10
$$ 1269 -368 -751 780 345 -1375 -42 1122 -478 -926 1259 622 -1389 538 1525 -955 -845
1473h45K065j218j427J954L07j759N07J951j569j095K106O7k473J198J632j954
$$ -845 1220 2 -1425 529 836 -923 -416 1535 -34 -1129 977 1044 -1429 -231 1401 -553
1489e53r86K603m62j868J351J283j951l28J884n97j738J611Q39k277J24K324j306
$$ -553 -1539 1064 602 -1266 85 1368 -583 -911 973 376 -1362 249 1088 -1189 -1065 1259 -47
1506d7j371K390K78k301P85J598j439j097J962k68j832J189J360j608n93K182
$$ -47 -1418 972 1250 -1051 -266 1332 -107 -1204 758 490 -1342 -153 1207 -401 -994 1188
1522A188l67j837J152R20j729k42J584m94j240J271P54j284m27J574n00j184J010
$$ 1188 821 -1016 136 1056 -673 -915 669 175 -1065 206 960 -324 -751 823 323 -861 149
1539A49O28j591M26P89l17r81J005P01j286K79J343q25j210J024J73j171K18J336
$$ 149 777 -814 -388 401 84 -897 108 809 -477 -198 1145 320 -890 134 307 -864 -646 690
1557F90q63q18J389J36r52M48J038p63j162J046N15j658K52J468j018o83J686
$$ 690 -173 -991 398 534 -418 30 1068 305 -857 189 704 -954 -702 766 -252 -935 751
1574G51J17j462P75Q81j292n29J344j31j565O24J435j598m7J834l95j418J079
$$ 751 868 -594 181 1062 -230 -759 585 454 -1111 -487 948 -650 -697 1137 742 -676 403
1591D03P95j898l03J838p76j266J473P74k030N11J999j710q97J939p8j841O90
$$ 403 1198 -700 -1003 835 59 -1207 266 1040 -990 -479 1520 -190 -1087 852 774 -1067 -377
1608c77J257j503n46K037o0j639P41J509j753m78J887m75j790J022J062j763K04
$$ -377 880 -623 -1169 868 808 -831 -90 1419 -334 -812 1075 600 -1190 -168 894 -869 -665
1625f65J597p76j502K145J55j740N54J154j097j181J814K78j784Q07J450j417
$$ -665 932 156 -1346 799 954 -786 -232 922 -175 -1356 458 736 -1048 -241 1209 -208
1641b08n28J448n9j507J065P26j186l71J077j22j375J169O95j246J53R46k72j262
$$ -208 -736 712 653 -854 211 937 -249 -620 457 335 -1040 129 824 -422 -269 677 405 -857
1659h57Q21P70j289l26J354o01o55R98M60r04q9J161n43p92O65J92j001J18J041
$$ -857 -36 734 -555 -881 473 -128 -783 215 675 -229 -318 843 300 -492 173 365 -636 -518 523
1678E23l29q23J001N00j213o6J231n21j037P71L52j354K31J210n28n26J307J46
$$ 523 194 -629 372 872 -341 -407 824 303 -734 37 389 -965 -734 476 -52 -578 729 875
1696H75j475N48R19j124o91J177j34j182O09J329j295k52J475k83j261R36J007
$$ 875 -600 -52 867 -257 -948 229 95 -1087 -478 851 -444 -696 779 496 -765 171 1178
1713A178j796l50J651o59j260J238Q88j379J31J775j013j260J410N49k256O88
$$ 1178 -618 -968 683 24 -1236 2 890 -489 -358 1417 404 -856 554 1103 -1153 -465
1729d65J720j566p18J717J49j577P47J445j420o72J298k43j623Q96R94j714j24
$$ -465 1255 -311 -1029 688 837 -740 7 1452 32 -640 658 415 -1208 -312 682 -1032 -1156
1746a156J817l80j240J409Q88j942K82J423j302r11J568Mj288O10J259j204k55
$$ -1156 661 281 -959 450 1338 -604 -322 1101 -201 -1112 456 460 -828 -218 1041 -163 -418
1763d18J219j74j240P07N56j322O5J387n60r97R89M15p68j6Q84l50j082O18N87
$$ -418 801 627 -613 94 650 -672 -607 780 220 -777 212 627 -141 -157 727 377 -705 -87 500
1782E00r58p0Q42l40m73Q49K47r84R5Q48q15l83O03M37q40J2O33L0n87O22M05
$$ 500 -458 -528 314 -26 -499 350 597 -387 -292 556 -259 -642 -39 398 -442 -430 203 233 -354 268 673
1803F73o74L4M85j89p40L66O14r91J89M92k78k30Q71J51q69j99R44o93r31J186
$$ 673 -1 33 518 329 -411 -45 569 -422 -233 259 -19 -249 622 773 -96 -295 649 -44 -975 211
1823B11J35j241L81J394j084n67J180J83j103L94R87j275o19J500k62j199J058
$$ 211 346 -895 -514 880 -204 -771 409 592 -511 -117 870 -405 -1024 476 214 -985 73
1840G3J042j664K10J295l98j404J384L40j528l7J561j028q08J588K89j592Q16
$$ 73 1115 -549 -339 956 558 -846 538 878 -650 -687 874 -154 -962 626 915 -677 139
1857A39J178j201q86J764p90j169R51J032j781J3J690m80j299J254M79j705M49
$$ 139 1317 116 -770 994 204 -965 -14 1018 -763 -750 940 460 -839 415 894 -811 -362
1874c62J103r57q91J199L5q44M58Q74m57n02J053o4j430O62P91q91k48Q19k84
$$ -362 741 -216 -1107 92 127 -717 -259 615 158 -344 709 645 -785 -123 668 -223 -471 348 64
1893F4l91L80O89o81k69J008q94m01M62L62p80J40K02K06m49L75K27l94J64K45
$$ 64 -327 53 742 61 -208 800 -94 -495 -33 329 -451 -311 -109 97 -352 23 250 -144 20 265
1913B65j6o31L35O2m89J6N18J15m75L26O58o65j06L80m3q25M87O08o58m58J333
$$ 265 249 -382 -47 15 -474 -458 60 175 -300 26 684 19 -87 293 250 -575 -88 520 -138 -596 737
1934G37m41p75J076K07q62o21J325m57j242J467J40j296M53J173q62n87J405k68
$$ 737 296 -479 597 804 -58 -679 646 189 -1053 414 554 -742 -289 884 22 -565 840 572
1952E72j406Q03R29j066q93J733m62j368J249R99j615JJ469n29j601J521M85j821
$$ 572 -834 -31 898 -168 -1061 672 210 -1158 91 1090 -525 -524 945 416 -1185 336 821 -1000
1970a000M14J293j002o05J509J37j519P43R96j264m49J558o18j418J159K36p48
$$ -1000 -586 707 -295 -900 609 746 -773 -30 966 -298 -747 811 193 -1225 -66 170 -578
1987e78N6J354m80j059J207kr97K53P76p89n99J021j7q08P70N41q01k35R83l26
$$ -578 -522 832 352 -707 500 498 -499 -246 530 -259 -858 163 146 -662 108 649 -152 -387 596 270
2007B70p20M38L90r68J56N73N9n70N43L47n26rK38n0l41K40r0j44mK02J13j78
$$ 270 -450 -12 378 -590 -434 139 198 -372 171 518 -8 -17 221 171 -170 70 -20 -164 -168 34 147 -31
2029c1j21N96k71k56L23M7n56j08M70l84M3M70R5n31qQ35p90j94P81p1o60J29
$$ -31 -152 444 173 -83 240 287 -269 -377 93 -291 -248 222 317 -214 -222 613 -177 -371 410 339 -321 -192
2051a92O35p07j66Q19L4r82O15N88j079K55Q51n15p42O51M74r45J13J088p57o53
$$ -192 443 -264 -430 389 423 -559 56 644 -435 -180 671 156 -586 65 539 -406 -293 795 38 -615
2071f15J295l58r18M39P72q98m22J275n10j081J238N11j123J82J137q80r01J042
$$ -615 680 322 -596 -157 615 -283 -705 570 60 -1021 217 728 -395 -213 924 44 -857 185
2089A85L12j390P07O64r37l96J499r8j174N71P76r15k53J186n14q95O29N58o93
$$ 185 497 -893 -186 478 -459 -855 644 546 -628 -57 719 -196 -449 737 223 -672 -43 515 -178
2108a78j98R03k71p35Q78j68r41O26N39o44l05O61J23o21M55L92n84o0L24J6o73
$$ -178 -376 527 256 -479 399 231 -710 -84 455 -189 -494 167 290 -331 124 516 -68 -128 196 212 -461
2129d61K47O02n41j29N16j95j71L28Mo7k60J70qj92K7K95k50K8K20n3j24k29M92
$$ -461 -214 388 -153 -282 234 39 -132 196 200 133 -127 43 35 -157 -130 165 -85 -57 163 110 -14 -243 249
2152B49K35o48J98J51k80o9N40l01l99O85K5p17Q2P56o82l64Q64K51j236N17N62
$$ 249 484 -164 34 185 -95 -164 376 75 -324 361 386 -331 -249 507 -175 -539 325 576 -660 -143 419
2173D19m56m64N84L12r26M65P23j000j06J087l92j029J162M05j153J86Q07m03
$$ 419 -37 -501 83 395 -531 -66 657 -343 -449 638 246 -783 379 784 -369 -183 624 221
2191B21p68J177l56q53L40P74p29k54R52l30j135J161L86j095L69P31o32q54R68
$$ 221 -547 630 274 -579 -239 535 -194 -448 504 174 -961 200 586 -509 -140 591 -41 -895 73
2210G3N32j170K57R37p85m47J112n8q34K92O55q72j80Q54j77p81Q49K88q70K04
$$ 73 605 -565 -308 629 -156 -603 509 451 -383 -91 564 -308 -488 366 189 -592 257 545 -325 -121
2230a21P21n47n50M16K69n05R2N18n75p2N39N1m49J30L43m98N3M15k19k63K25
$$ -121 600 53 -497 -81 188 -317 -225 293 -282 -354 185 236 -213 -83 260 -238 -185 230 11 -252 -27
2251b7M07l88j98J69J63k53l7J95K04j64L5J15k57k47P09m11m44L27M07k75k86
$$ -27 380 -8 -206 -37 126 -127 -164 31 235 71 106 221 -36 -283 426 15 -429 -102 305 30 -256
2272b56L33J54p67M10Q05q26k85O50j29p28Q24K73n69l29J079o53n19O95P5o17
$$ -256 77 231 -536 -126 679 -147 -432 218 89 -639 185 458 -111 -440 639 -14 -533 162 237 -380
2292c80K11Q23o09m91O73K8r67J018L36j007PJ022k79q17R06J76r88n9J074r94
$$ -380 -169 654 45 -446 227 255 -712 306 642 -365 -358 664 385 -432 474 650 -338 -397 677 -317
2312c17n39J365k80o96M35J043j281j31J090k43j026O47L04p85PJ028m65p03R65
$$ -317 -856 509 229 -467 -32 1011 -270 -401 689 446 -580 67 371 -414 -407 621 156 -547 418
2331D18J48j198L70Q60p15l27N72M78j239O08K33m82k3O27m8o48O32Rn53L90L36
$$ 418 566 -632 -262 598 -117 -444 128 606 -633 -25 208 -274 -297 330 282 -366 266 275 -278 112 448
2352D48p13j34N02J06l49J83L59l41l82M19o3l54J58J42m5LJ1J63j72J78J38j66
$$ 448 -265 -399 103 209 -140 43 402 61 -321 98 35 -319 -161 -19 -64 -61 -50 113 -59 119 257 91
2374I1k77L29k42p9R0M8K37k51J96K62m29Q4j22J59j97J1M66j79l93L92J74o02
$$ 91 -186 143 -99 -178 -88 -40 197 -54 142 404 -25 59 -63 96 -101 -90 376 197 -196 196 370 -232
2396b32L59M60n70k11N92M8r44O20Q6o70K54O23j80p76P54L04q86PR40o91l31
$$ -232 127 587 17 -194 398 446 -498 122 208 -462 -208 415 235 -541 213 517 -369 -362 578 -113 -444
2417d44O90j46o94O28M39p12j00Q94l58o39O77K10o00p2P07p02k58P77m9p70N03
$$ -444 246 100 -594 34 473 -239 -339 555 197 -442 235 445 -155 -227 480 -222 -480 297 248 -522 -19
2438a9O14o84m25P28L5j001O40M26r16K11P90n41k84P34K4n54M64L28p62l21P40
$$ -19 595 -89 -514 214 249 -752 -112 314 -602 -391 399 -142 -426 308 332 -222 242 570 -192 -513 227
2459B27n6q42N58M88n88J01M40j23l97K64o0l11J37K18k17k61N06J1q2Q3j04L
$$ 227 171 -671 -113 375 -213 -112 328 205 -192 72 12 -299 -162 56 -161 -422 84 95 13 96 -8 -5
2481eQ4j01l8r3p7K75j22J16j66Q6P6J09k62L24k7k62K44j33k06J42L37l95J7
$$ -5 79 -22 -60 -153 -230 45 -77 39 -127 -41 35 144 -118 206 179 -83 161 28 -178 -36 301 -94 -77
2504g7L38O2n07M59J28p36L1P74l71m93N96j89k19K95K52l42k46O80j59p79M26
$$ -77 261 323 -184 275 403 -333 -302 472 101 -392 204 15 -204 91 343 1 -245 435 276 -503 -77
2525g7K31p77K89M44j23j18N17L96j237M91M95o91l78N62Q3r79Q15J79k78L5O55
$$ -77 154 -623 -334 110 -13 -131 386 782 -455 36 531 -160 -538 24 107 -872 -57 122 -156 -121 534
2546E34l02p37M39L31p35N9P79n18m93R75k69n64N52O51q00j50P48o86m77P22
$$ 534 232 -505 -66 265 -470 -411 368 -150 -643 332 63 -501 51 702 -98 -248 500 -186 -663 59
2566E9K87p34L32P19n40o51Q78p3o31M99J0k35k48M29l53l27N01J54mR6J52J05
$$ 59 346 -388 -56 663 123 -528 350 277 -354 145 155 -80 -328 101 -252 -579 -78 76 72 168 320 425
2588D25m20J13M1l39P3K50l10N3J43O6R2o7k5O8j21J38r2k91j27K15K47k58J46
$$ 425 5 118 159 -180 -107 143 -167 -114 29 95 187 120 95 163 42 180 88 -203 -330 -115 132 -126 20
2611B0l7K70j87K03J23l93j20L15l33n01P95m9k64r7M45l22M7M15j13o05P0K32
$$ 20 -17 253 66 269 392 -1 -121 194 -139 -640 155 106 -158 -255 190 -132 -85 330 217 -388 -318 -86
2633h6J00n25M55K69m76M19K94l56j37L89k54n60L12L52n67J47N57n34PM82K69
$$ -86 14 -511 -56 213 -263 156 450 94 -43 346 92 -468 -156 196 -371 -224 333 -201 -194 288 557
2654E57q62K85O09q52j6O09k46o29P32M42q55o9Q98j58r79Q89j3r33M24O0j49
$$ 557 -305 -20 589 -263 -279 330 84 -545 187 629 -226 -295 603 445 -534 355 342 -591 -167 -107 -256
2675b56k09O94K04q78O99M20n17l36N52m44n14L99L5l75K67Q43p39j38O46L2m99
$$ -256 -465 229 433 -445 254 674 157 -179 373 -71 -585 -186 -151 -526 -259 584 -155 -293 353 385 -114
2696a14K61Nn05l0M34j18j72J02K60r4J54J81l05j41R8k25j69L35p6L7j09K48
$$ -114 147 152 -353 -383 51 -67 -239 -137 123 29 183 364 59 -82 16 -209 -378 -43 -119 -82 -191 57
2718E7K05p0M3J13k06R2k05j40k41j6J48K83K5n5K18R6l43J69K01m56j06K20n4
$$ 57 262 192 235 348 142 234 29 -111 -352 -368 -220 63 88 33 251 347 4 173 374 -82 -188 32 -22
2741b2l38L9N46j75p5O26l82k28J94k4m46r6N36o86J57O76j23l86J70N26n17j16
$$ -22 -360 -321 225 50 -25 601 219 -9 185 161 -285 -381 155 -531 -374 302 179 -207 -37 489 -28 -144
2763a44M95l72m45K95K16p43N49N29m75j81N04K29m89j6K71l74l09N39K5o15N54
$$ -144 351 -21 -466 -171 45 -698 -149 380 -95 -276 228 457 -32 -48 223 -151 -460 79 104 -511 43
2784D3L62m84J89M40m18j66J71J07q19M09K34r2l81P78J59m66O4L06m42J13K01
$$ 43 405 -79 110 550 132 -34 137 244 -575 -166 68 -24 -405 373 532 66 130 436 -6 107 308
2805C08m95j83K74J69m86K39N70k62l3K49J1m96J4K13l99J4L26j67J4L05J1k33
$$ 308 -187 -370 -96 73 -413 -174 396 134 101 350 361 -135 -121 92 -307 -293 33 -134 -120 185 196 -37
2827c7K66O2l57K63j00k16j44J39l2k7M34k82J56L26l47N9O8k47l67L83j29j20
$$ -37 229 291 -66 197 97 -119 -263 -124 -156 -183 251 -31 125 451 104 163 231 -16 -383 0 -129 -249
2849b49O5J01K99j78L37K72m78k2M01q47K3J59j92K5O6K21J85k93M46k93m00M17
$$ -249 -184 -83 216 38 375 647 169 147 548 -299 -276 -117 -309 -284 -218 3 188 -105 341 48 -352 65
2871F5J41o45K6O39m30m40Q33J82l70L37K20p63k86Q02k02p65O31K27p72L94M28
$$ 65 206 -439 -413 226 -204 -644 189 371 1 338 558 -205 -491 311 109 -656 -25 202 -570 -176 252
2892B52j39j59P31j27o47J03K60l79k04L19p7n12O24K17l88Q4N66m84m02N00n1
$$ 252 113 -46 685 558 -89 14 274 -105 -309 10 -67 -579 45 262 -126 -42 524 40 -362 138 87
2913H7m80l7N73n78K47L13j21k34K05M56l61l08L41m50k06K23J8K8J69M82j91
$$ 87 -393 -430 143 -435 -188 125 4 -230 -25 431 70 -238 103 -347 -553 -330 -312 -284 -115 367 176
2934A76m0K99m67P3m8Rj71oQ4pR2J59K06k2l6K8j29k19K70m58j31K24j87P6M27
$$ 176 136 435 -32 41 -7 2 -169 -175 -91 -98 -6 153 359 337 301 329 200 -19 251 -207 -338 -114 -301 -225 202
2959B02k37M43k14kk96K59k37k71L24k74K3J0M47j54K86j2K8k57m9K8m49l4J78
$$ 202 -35 408 194 192 -104 155 -82 -353 -29 -303 -280 -270 177 23 309 297 325 68 19 47 -402 -436 -258
2982b58k7k17M73L96l51N3M88m64k75L47k01j56l09M92l38N6N66L9l11P4M32n87
$$ -258 -285 -502 -29 367 16 69 557 93 -182 165 -36 -192 -501 -9 -347 -291 275 314 3 77 509 -78
3004g8lL12l52m22Q29r9q49N25M95j50l69L68pl33J4K59l18k42M19k6k19M34M07
$$ -78 -81 231 -121 -543 286 187 -662 -137 358 208 -161 207 200 -133 -119 140 -178 -420 -1 -27 -246 188 595
3027E95q27J75O21n30j73J22M1m52N09k24q8J58M09m21J06K66Ql20j27K30j31
$$ 595 -232 -57 564 34 -139 -17 24 -428 81 -143 -231 -73 336 -85 21 287 295 -25 -152 78 -53
3048e3m33M07n5p9K67K08m6j67J60J18m25j39j17J41J4k22M08J02Q9l2J43j33
$$ -53 -486 -79 -134 -213 54 262 216 49 209 327 -98 -237 -354 -213 -199 -421 -13 89 178 146 289 156
3070A56N9q4r5k48j81L6q2K48K03R3j95K24N06n02j06r5m7l34K56J58l63K28L00
$$ 156 215 131 36 -212 -393 -357 -439 -191 12 105 -90 134 640 138 32 -63 -110 -444 -188 -30 -393 -165 135
3093A35P8j15J56R1l76J01k9m87O3J11J01j69M18J97l53L95L89l36m51K57j01
$$ 135 213 98 254 345 -31 70 41 -446 -383 -272 -171 -340 78 275 -78 317 706 370 -81 176 75
3114G5n36K62M28n10P1N20j5l01L12J98n65o3J18k05j65J87K02j95J08L98j83
$$ 75 -461 -199 229 -281 -210 310 295 -6 306 504 -61 -124 -6 -211 -376 -189 13 -182 -74 324 141
3135A41n8L64q7l63R4K52o87K7K20l4o7M38Q5l91K16M19n58j49L85m82j08J12
$$ 141 83 447 360 -3 91 343 -344 -317 -97 -131 -198 240 325 -66 150 569 11 -138 247 -235 -343 -231
3157b31K94k80J35M08rp8J02r2m56j28J38O4m19L83K2J65J45j03J34k0Pp4j92
$$ -231 63 -217 -82 326 317 239 341 249 -207 -335 -197 -133 -552 -169 -147 18 163 60 194 174 181 107 -85
3180h5M2k48J54j56R5L25J10%J66j80q3j6j24j2p6j36R5q4J89J30J37o4K52k28
$$ -85 -43 -291 -137 -293 -198 127 237 237 403 223 140 124 0 -12 -88 -224 -129 -213 -24 106 243 179 431 203
3204B03k18j7j9m9l26M03l34J67O1M28n9k05K47k58j62J28j30k77qK83r4Q1L03
$$ 203 -15 -32 -51 -100 -426 -23 -357 -190 -129 299 240 35 282 24 -138 -10 -140 -417 -425 -142 -236 -155 148
3227A48J24k58%J48j38P9N9k14l27R2L44l04K95K48J2l91N58J31q50J03J67l45
$$ 148 272 14 14 162 24 103 162 -52 -379 -287 57 -247 48 296 308 -83 475 606 -244 -141 26 -319
3249c19j45N35Mj46O8M67k97j78L66k31l72O4M3l44N5M72p2j58M60j6k74K72J01
$$ -319 -464 71 75 -71 -3 464 167 -11 355 124 -248 -184 -141 -485 -430 42 -30 -188 272 256 -18 254 355
3272C55j53l74J14J07m14J96P0K16N7k21J04k09M85m43J83j02j92R3l6k9%L17
$$ 355 202 -172 -58 49 -365 -169 -99 117 174 -47 57 -152 333 -110 73 -29 -221 -128 -164 -193 -193 124
3294A24MR7k22j43K93l2k84j41nL32j62j51M23P1j15K83j81Q9k23j25J40l49J54
$$ 124 128 225 3 -140 153 121 -163 -304 -309 23 -139 -290 133 204 89 372 191 280 57 -68 72 -277 -123
3317a23j8k59J43O40k93J07J21k13n1k77M47m17l06L00Q4j33M00R1j26P1l0k3
$$ -123 -141 -400 -257 383 90 197 318 105 54 -223 224 -193 -499 -199 -115 -248 152 243 117 188 158 135
3339A35m78L18L2m26mJ79J81J57K8J71k71J33J4j52P0n4l03k63L11N7K89m5K57
$$ 135 -343 -25 7 -419 -423 -244 -63 94 122 293 22 155 169 17 87 33 -270 -533 -222 -165 124 79 336
3362C36j90j90L36O4l53k44J84j55J2J32Q4o9N8M71m46pL94r4n97j45K91r8J15
$$ 336 146 -44 292 356 3 -241 -57 -212 -200 -68 16 -53 5 476 30 23 417 323 -274 -419 -128 -226 -111
3385a11o2J1J45L2Q8p1j28O17l71m76J40J49l36J25J94L2K80l3R0j40k3j94j9
$$ -111 -173 -162 -17 15 103 32 -96 521 150 -326 -186 -37 -373 -248 -54 -22 258 225 315 175 152 -42 -61
3408f1j37J40j12j00pK28K71n4J66j90O5k10J02M9m50K10K89m33K14J38n0j1L4
$$ -61 -198 -58 -170 -270 -277 -49 222 168 334 144 209 -1 101 150 -300 -90 199 -234 -20 118 68 57 91
3431I1P0p0k06k3J13k44J31K90k80Q0K52j9k75N55k42m22K10km39K37J82k19N5
$$ 91 161 91 -115 -138 -25 -269 -138 152 -128 -48 204 185 -90 465 223 -199 11 9 -430 -193 -11 -230 -175
3454a75L46J77j7k43K62o2j94j59k23j03J61L10k09K46K37n6j37NK81n07r0L5
$$ -175 171 348 331 88 350 288 94 -65 -288 -391 -230 80 -129 117 354 298 161 166 447 -60 -150 -115
3476a15M5m78N03J85l33N7M36j05k53L04P6m23j16K95j53k21K73j19J75K07Q5
$$ -115 -70 -548 -45 140 -193 -136 300 195 -58 246 322 -101 -217 78 -75 -296 -23 -142 33 240 325
3497C25j64j5N1j51j50k38L32n11M12N3k2K40J4k8j19M1j46J4pn4j10r2L21j57
$$ 325 161 146 197 46 -104 -342 -10 -521 -109 -56 -78 162 176 148 29 70 -76 -62 -69 -123 -233 -325 -4 -161
3521a61K98J96m8r8o1r6J4P0n09K71k2L0k36M57Mj23L39l3k95J6Q0l08Q7j30K81
$$ -161 137 333 285 187 126 30 44 114 -395 -124 -146 -116 -352 105 109 -14 325 292 -3 13 93 -215 -128 -258 23
3546B3J57j47NL1O5J72k30n5j96L4pj45rK86k85M14K77k25J00P1k60k75N3Q1J6
$$ 23 180 33 38 69 134 306 76 21 -175 -141 -148 -293 -302 -16 -301 113 390 165 265 336 76 -199 -146 -65 -49
3571d9l23K06R9j06M17q8k0j80lK58k46K61m29k49K79K61m8J77j65K83r3j73J16
$$ -49 -372 -166 -67 -173 244 156 136 -44 -47 211 -35 226 -203 -452 -173 88 40 217 52 335 242 69 185
3594A85m13q3J64j5k32O1N38k00L4k09M56j79Q5r7Rn11L86p0j17k01N00K40k38
$$ 185 -228 -311 -147 -162 -394 -333 205 5 39 -170 286 107 192 95 104 -407 -21 -91 -208 -409 91 331 93
3617I3R7r9P1O8l98R3k87K20q1r1L83l8P7R4J4j05L1j63O5k52LRQ4Q1M8J87k65
$$ 93 190 91 162 230 -168 -75 -362 -142 -223 -314 69 31 108 202 216 111 142 -21 44 -208 -205 -196 -112 -31 17 204 -61
3644f1J84J67l29m9J89j96k55K43rJ6J74Q6J58k02k6M0k03K03l96J42j42mJ80
$$ -61 123 290 -39 -88 101 -95 -350 -107 -116 -100 74 160 318 116 90 130 -73 130 -266 -124 -266 -270 -90
3667i0J35n0J11K07l30K57k63Ql3M6l44r3R5M16k12N5Q3J59k28K46N4k62j26R3
$$ -90 45 -5 106 313 -17 240 -23 -15 -48 -2 -346 -439 -344 72 -140 -85 -2 157 -71 175 229 -33 -159 -66
3691f6r2k21M15j60J12l16N68n8m9J2j54K03l50k2j65L60R6K7j73Q3J02m2L2j08
$$ -66 -158 -379 36 -124 -12 -328 240 182 133 145 -9 194 -156 -178 -343 17 113 140 -33 50 152 110 142 34
3715C4j49j58K35k10O0J57L27p5j32K25j61j45K28k37P1n17J49Q9J07J32J21n0
$$ 34 -115 -273 -38 -248 -188 -31 296 221 89 314 153 8 236 -1 70 -447 -298 -209 -102 30 151 101
3737A01j49L05o1k04j39m4J28k28L09m6j4Q0l8j22K83J7k95P3L2o8k04L48l46
$$ 101 -48 257 196 -8 -147 -191 -63 -291 18 -28 -42 38 0 -122 161 178 -117 -44 -12 -80 -284 64 -282
3760b82K73j1J28j65K8K90jj02l18J25P7n0k46J31Q2J45K09r1p5rJ33j0o22K64
$$ -282 -9 -20 108 -57 -29 261 260 158 -160 -35 42 -8 -254 -123 -41 104 313 222 147 138 271 261 -361 -97
3784i7q6K58K06k13mk07K88p3RP5k44R1m4J0j59m3K01J07L2lP8k83K3J14k2k77
$$ -97 -183 75 281 68 64 -143 145 72 81 156 -88 3 -41 -31 -190 -233 -32 75 107 104 182 -101 -78 36 14 -263
3810b63J3L05j19p6j01L15k03L22J83l34j90J63P8l24J10k08J07J64J91j51M29
$$ -263 -250 55 -64 -140 -241 74 -129 193 376 42 -148 15 93 -231 -121 -329 -222 -58 133 -18 411
3831D11p5K0k20j01n0j75j08O7K54r7m0J90K2j41L17j47j84J22k26kk41J90k3
$$ 411 336 356 136 35 -15 -190 -298 -231 23 -74 -114 76 98 -43 274 127 -57 65 -161 -163 -404 -214 -237
3854b37K45p8K95r3k90J85j8M1Kp2Kj0p6K24k46L7K07j76J32j3k2j18J55j51j40
$$ -237 8 -70 225 132 -158 27 9 50 52 -20 -18 -28 -104 120 -126 -89 118 -58 74 61 39 -79 76 -75 -215
3879b15J63j21K29k11J28R5m3J37L3j96l45P8J82j6o8j9J25k14M39J40j61j52
$$ -215 -52 -173 56 -155 -27 68 25 162 195 -1 -346 -268 -86 -102 -170 -189 -64 -278 161 301 140 -12
3901a2K02k29k53K61P5k11J00O4J24k59K09n3k4J89j16m1k48J56j29J66O6J10
$$ -12 190 -39 -292 -31 44 -167 -67 -3 121 -138 71 18 -6 183 67 26 -222 -66 -195 -29 37 147
3923A47k32j41O04j73l89K52l95L22p9j06J83j98qL86j87j64K79j65J32j57q3
$$ 147 -85 -226 378 205 -184 68 -327 -5 -84 -190 -7 -205 -213 173 -14 -178 101 -64 68 -89 -172
3944a72k2m2K12j90L01N2n6j82L49j54J77k43J9o4l29J62j2M16l18M23n6j30R
$$ -172 -194 -236 -24 -214 87 139 83 -99 250 96 273 30 49 -15 -344 -182 -194 222 -96 327 271 141 150
3967A50o0q4J22Rj51k14J06K3j86K50J3J51M7j77J09k47J45O4O2r2n1K69k87J39
$$ 150 90 6 128 137 -14 -228 -122 -99 -285 -35 -22 129 176 -1 108 -139 6 70 132 40 -11 258 -29 110
3991A10l6j80K06j43K19l33J33L78n34M8L32j46nO7L9l44L86p1k16P2J08m4p4
$$ 110 74 -106 100 -43 176 -157 -24 354 -180 -132 200 54 49 116 155 -189 197 126 -90 -18 90 46 -28
4014b8J16m63M57l86K31M1L7M7P4n6j60R8j83M5M9PN8P2J27j94R4m6L0j40m3J5
$$ -28 88 -375 82 -304 -73 -32 5 52 126 70 -90 8 -175 -130 -81 -74 -16 56 183 -11 83 37 67 -73 -116 -101
4040a01J94k26P6K74k70n8K51J04k74j89P4K71q7j97L23j96R4l1O1M5K0O4j95
$$ -101 93 -133 -57 217 -53 -111 140 244 -30 -219 -145 126 39 -158 165 -31 63 32 93 138 158 222 27
4063B7k61J6J1J09K30k70J98j98J07J2K20k99l2j1k0n9K30n6K20m23L27k00J13
$$ 27 -234 -218 -207 -98 132 -138 60 -138 -31 -19 201 -98 -130 -141 -161 -220 10 -46 174 -249 78 -122 -9
4086iJ21K29r7k80j69L44l23J16k7O9j69K10J33j35J4r5K02k66J93p9r6o3J65
$$ -9 112 341 244 -36 -205 139 -184 -68 -95 -26 -195 15 148 13 27 -68 134 -132 61 -18 -114 -177 -12
4109a2K37k89q2M00j15j18k0j0QP7j49L3r5K41j39K38j52J10j78o2J20l06L72
$$ -12 225 -64 -146 254 139 21 1 -9 -1 76 -73 -40 -135 106 -33 205 53 163 -15 -77 43 -263 109
4132A09j05k18L13k57J64K48k40k3j94K06M4k0j34L59k10Q7l85J44J53n6J20%
$$ 109 4 -214 99 -158 6 254 14 -9 -203 3 47 27 -107 252 42 129 -256 -112 41 -15 105 105
4154A05l12L48k93j07K71k19k02K99K04O8j31L21k60o4M8j26k9l5l38M28J03K7
$$ 105 -207 141 -152 -259 12 -207 -409 -110 94 162 31 352 92 28 76 -50 -79 -114 -452 -24 79 106
4176A06k76Q9J04Q6k38r2K99m5J05l0j07J92r7R4j29j9Q5j90J66k42K42j00R5
$$ 106 -170 -81 23 109 -129 -221 78 33 138 108 1 193 96 190 61 42 127 -63 103 -139 103 3 98
4199I8l4k30J70N1J13j94K8J82j03j59K14j62j0n4kj37K44o1R0J17j27K41l10
$$ 98 64 -166 4 55 168 -26 2 184 81 -78 136 -26 -36 -90 -92 -229 15 -46 44 161 34 275 -35
4222c5K36j57K58l76n0K24l22K7K53k46K78q7J76j60m9r3L43m48J39J0k7P5L16
$$ -35 201 44 302 -74 -124 100 -222 -195 58 -188 90 3 179 19 -30 -123 220 -228 -89 -79 -106 -31 285
4245B85l28j36K67k9m4M3J73j79l77L57j94L65k3n9j54J25J05j25J18j55M1j73
$$ 285 -43 -179 88 59 15 58 231 52 -325 32 -162 203 180 121 -33 92 197 72 190 35 76 -97
4267i7K76o7n44N17k12m2J36L5J01l29K87J36q9k04M2K8k7k38L21Q8k05L81m28
$$ -97 179 112 -432 85 -127 -169 -33 2 103 -226 61 197 108 -96 -54 -26 -53 -291 30 118 -87 294 -134
4290a34J16J12j38q2O6K97j93p7j04J56k84J57Q4J41j21J26q0n8k21M80l16J2
$$ -134 -18 94 -44 -126 -60 237 44 -33 -137 19 -265 -108 -24 117 -4 122 42 -16 -237 243 -73 -61
4312f1k91L12M7k57M41l27J86n6r7Jk7K77q9j4N5l5R2J29k83l3Q4j73J26K4j56
$$ -61 -352 -40 7 -250 191 -136 50 -6 -103 -102 -129 148 59 45 100 65 157 286 3 -30 54 -119 7 31 -125
4337a25L78k90J61p6R5l02J08J88k35Q5M9n8L37k46J06j40N7L1j55J65k49J39
$$ -125 253 -37 124 48 143 -159 -51 137 -98 -13 36 -22 315 69 175 35 92 123 -32 133 -116 23
4359B3j53K02j25J89r2n2K3O3k7j13Q8K15m49J84q8K73k77L10o8mN3k79J49n0
$$ 23 -130 72 -53 136 44 -8 15 78 51 -62 26 241 -208 -24 -112 161 -116 194 126 122 175 -104 45 -5
4383eQ9k10K38j32j4O3j76J33p3o0M4K7M8K99k22j03J30r1Q5j52K33m3j20j07
$$ -5 84 -126 112 -20 -34 29 -147 -14 -87 -147 -103 -76 -28 271 49 -54 76 -15 70 -82 151 108 -12 -119
4407a19j36K31R8%k78L16o9M5l0k86L37j2o5J06k5m2k66J23Ln1K73j51P0n4r6
$$ -119 -255 -24 74 74 -204 112 43 88 58 -228 109 97 32 138 113 71 -195 -72 -69 -120 153 2 72 18 -78
4432g8J83q8MJ26k29Q1k5R6o1J50k47R4p1M9N8N1k0j7k90L12j43L13j0l2k21K10
$$ -78 105 17 21 147 -82 -1 -26 70 9 159 -88 6 -65 -16 42 93 73 56 -234 78 -65 248 238 206 -15 195
4458A95m62M7K62J5k58L50L27l27k41j1J62n3J6L58l48o8L0J39j03m7K47j90m4
$$ 195 -267 -220 42 57 -201 149 476 149 -92 -103 59 6 22 380 32 -36 -6 133 30 -17 230 40 -4
4481dL32k39l22L89j54J39k19J24q3K32k09J21r0o5O8LK7q5J6j48L18k12k68K87
$$ -4 328 89 -233 156 2 141 -78 46 -37 195 -14 107 17 -48 20 23 50 -35 -19 -167 151 -61 -329 -42
4505d2K59rq9j32J56j54M0p2N1j01J66k50O4K86l51K74j28K69l00Q9q9l1J84k15
$$ -42 217 208 119 -13 143 -11 29 -43 8 -93 73 -177 -113 173 -178 96 -32 237 -63 26 -63 -94 90 -125
4529a25J44q1qJ17J14k99J52k76K76J30j76k75J56J23M1M8L1k57M37j22l45J52
$$ -125 19 -62 -70 47 161 -138 14 -262 14 144 -32 -307 -151 -28 13 61 92 -165 272 150 -195 -43
4551d3j29J81k18K61MnK63k88l1J3M8J06j71O5O0j11r6R7m5p2K5K58l52L38k0
$$ -43 -172 9 -209 52 56 51 314 26 -5 8 56 162 -9 56 116 5 -91 6 -39 -111 -86 172 -180 158 138
4576A38j25K1J35j12Q0k04J04O2N0l4j6k08K70k53J92k41L44k18J11j48N3k28
$$ 138 13 34 169 57 137 -67 37 99 149 115 99 -109 161 -92 100 -141 203 -15 96 -52 1 -227
4598b27K13J44j80J49K1K1L6J28m52Q6J09J01j79K12J6p4k14N6r2M6J01j46L50
$$ -227 -14 130 -50 99 120 141 177 305 -147 -61 48 149 -30 182 198 124 -90 -34 -126 -80 21 -125 225
4621B25k93J05P3q3%K7k85R8J28k80M63Lk19O3J20l04K32k20J45k69K48J37o5
$$ 225 -68 37 110 27 27 54 -231 -133 -5 -285 178 181 -38 25 145 -159 73 -147 -2 -271 -23 114 49
4644D9j2q2Rk5N3j58j06K65j66J85J05k56r3K28k01j7K35J37l97K54J30j06j68
$$ 49 37 -45 -36 -61 -8 -166 -272 -7 -173 12 117 -139 -232 -4 -205 -222 13 150 -247 7 137 31 -137
4667a37J88j70J93j97L47n5M1k97J16J95l35k0J57N0k30L17l17L02j09q8r4q8
$$ -137 51 -119 74 -123 224 169 210 -87 29 224 -111 -131 26 76 -154 163 -154 148 39 -49 -143 -231
4689b31M09j04MK13r9k29O7l0p0R0J05J07l51J16J79j80k56J20J63K2l4Oj04o6
$$ -231 178 74 78 291 192 -37 30 0 -70 20 125 232 -119 -3 176 -4 -260 -140 23 45 11 17 -87 -153
4713a53j01J69j15J92r4K92k10o3p2o1K45k8p1j78L47j0r6N0j55N6q4K47j82R1
$$ -153 -254 -85 -200 -8 -102 190 -20 -83 -155 -216 29 1 -70 -248 99 89 -7 43 -112 -56 -140 107 -75 16
4737A6q1j30J36K96m53L43q8l2J61k36J58p9o4K13l00R2K95k47j74J56o9j0RJ43
$$ 16 -65 -195 -59 237 -216 127 39 7 168 -68 90 11 -53 160 -140 -48 247 0 -174 -18 -87 -97 -88 55
4761E5j69J09K35k35J0M1l8J58j56K1l8k41M06j7K6l1j33j4J36j64k5k19R0N3
$$ 55 -114 -5 230 -5 5 46 8 166 10 31 -7 -248 158 141 167 136 3 -11 125 -39 -64 -283 -193 -140
4785a40j10J21K60L0l8j35l4k60L17j68m2J14l2J16j51J91o6Q0N5q3m6K7K2J78
$$ -140 -250 -129 131 161 123 -12 -46 -306 11 -157 -199 -85 -117 -1 -152 39 -27 53 108 25 -21 6 28 206
4809B06k12R1k37n3K61k32k3J91k07K00k4O7K1K9j9j4r4K22N3n47K29r4K95l94
$$ 206 -6 85 -152 -205 56 -176 -199 -8 -215 -15 -39 28 49 78 59 45 -49 173 226 -321 -92 -186 109 -285
4833b85K17J99l0Jq4r7K68j55J72k77J52j4l38K64l13K58L62n72K45J35n8J7N7
$$ -285 -68 131 101 102 18 -79 189 34 206 -71 81 67 -271 -7 -320 -62 300 -272 -27 108 50 67 124
4856A24j69J64j88L6J33k16J00j9q8J80R8p3j73L57k86j88L13R7j02j3Rj49P3
$$ 124 -45 119 -69 -33 100 -116 -16 -35 -123 57 155 82 -91 266 -20 -208 105 202 100 87 96 -53 20
4879B0r5J1J89k06K9O4q2J42j49j06K32K26j58l05J14K96k06O5o7Q3j38n7J06
$$ 20 -75 -64 125 -81 -52 12 -70 72 -77 -183 49 275 117 -188 -74 222 16 81 14 97 -41 -98 8
4902Hl65N40k36M9p6R0n4q3M5J52J9k0N5j13P1j95J57M5K4j7n6j14K55j73q4L12
$$ 8 -357 183 -53 -4 -80 10 -44 -127 -82 70 89 69 124 11 82 -113 44 89 113 96 40 -74 181 8 -76 236
4928B36k56J70j45L6j35R4rJ98r7j08K23j75L43k99lj08J84k1j18p0J29n6j62
$$ 236 -20 150 5 41 -94 0 -9 189 92 -16 207 32 375 76 73 -35 149 128 10 -60 69 13 -149
4951a49J41k35J15J71J6p0k38J49mp0K25K7j26K65k14j83K69k80K51k57R1j12
$$ -149 -8 -243 -128 43 59 -11 -249 -100 -104 -174 51 78 -48 217 3 -180 89 -191 60 -197 -106 -218
4973b18R4L6L10j60J0r2M1k44K88k4j07J16k52kL09R8k55m5J59p1j14K12k42K36
$$ -218 -124 -88 222 62 72 -20 21 -223 65 41 -66 50 -202 -204 105 203 -52 -97 62 -9 -123 89 -153 83
4997H3r1N6k55L72j02k12J24j7j46J8J92r2K33j21N8k28K63j97K81j88L0J32n4
$$ 83 -8 48 -207 165 63 -149 -25 -42 -188 -170 22 -70 163 42 100 -128 135 -62 219 31 61 193 139
5020A39j18J16mj81l3K43j49N1M9l2k19K24k9l03K68o0K71j19j95R1k9N0Q2k8
$$ 139 21 137 133 -48 -81 162 13 64 113 81 -138 86 57 -246 22 -38 233 114 -81 10 -19 31 113 85
5044H5q1Q3p2j18R2rL5j03j19N0L6J54J46j56j70K00o8r4J79q3J02m0r8k89L51
$$ 85 4 87 15 -103 -11 -20 15 -88 -207 -157 -121 33 179 23 -147 53 -15 -109 70 -13 89 49 -49 -338 13
5069A3k3Q0q4O4j39j08K92j37N0J55k90J55j48r6L02j27J20L5L3j19R1k36J60
$$ 13 -10 70 -14 50 -89 -197 95 -42 8 163 -127 28 -120 -216 86 -41 79 114 147 28 119 -117 43
5092D3k78L12k01M3N6j26J91L3J26k60q7Q8j44M12o5n5mJ25q9k75J25R4k33J94
$$ 43 -235 77 -124 -81 -25 -151 40 73 199 -61 -148 -60 -204 208 143 88 84 209 120 -155 -30 64 -169 25
5116B5M6m3L0K6j26RJ05Q6j09m3k0p5J87M3m52M17k73J71J24k60o0O0K15j95J19
$$ 25 71 28 58 84 -42 -33 72 158 49 6 -14 -89 98 141 -311 106 -167 4 128 -132 -192 -132 83 -112 7
5141GQ2j55K18k33K07j57j94J7J50P0P3L7j43m0R6j60K6J40r5J35j30M0J27j48
$$ 7 89 -66 152 -81 126 -31 -225 -208 -58 12 85 122 -21 -61 35 -125 -99 41 -54 81 -49 -9 118 -30
5165c0k8Kq8K22j80J57j47j38J3J04L00o4j91P7r5j64L28j4j14J1N5j95J59O8
$$ -30 -58 -56 -144 78 -102 55 -92 -230 -217 -113 187 123 -68 9 -86 -250 78 64 -50 -39 16 -179 -20 48
5189D8K9k9l2k0J5k38L85j84L3J78j93m2J76p8k56K70j30J37j27M05m16R6j94
$$ 48 77 48 16 -4 11 -227 158 -26 7 185 -8 -50 126 48 -208 62 -68 69 -58 347 -69 27 -167
5212a67j12M10j01J9q5JJ54m3K36m13K63j07j72o8J65k95J47L20m39K63oR8m6
$$ -167 -279 131 30 49 -36 -35 119 76 312 -101 162 55 -117 -185 -20 -315 -168 152 -287 -24 -30 68 22
5235B2m3J83l49K04k19K68j90j46N61l82J60o6O9j7J48k48P6L4L4o9N6K7k1Qq4
$$ 22 -21 162 -187 17 -202 66 -124 -270 291 -91 69 3 72 55 203 -45 31 65 99 30 86 113 92 100 16
5260A6j3m9q4L1K59k4L7j12j42L7J9O5l8j19O4J83j06m2o2J11j27J5RJ0R6J46
$$ 16 3 -46 -130 -99 160 136 173 61 -81 -44 -25 40 2 -117 -53 130 24 -18 -80 31 -96 -81 -72 -62 34 180
5286A80j47m9q8J43R1ml39K55r4N6l3J44r2k32L10O9o7j17k9M5Q5M8l7Q8j67K01
$$ 180 33 -16 -104 39 130 126 -213 42 -52 4 -29 115 23 -209 101 170 103 -14 -43 2 87 135 98 186 19 220
5312B20r9k4k17J00j95L53l48J54o2J45j80M4L50l10L8qJ22n07M56j09M1J00p3
$$ 220 121 97 -120 -20 -215 138 -210 -56 -118 27 -153 -109 241 -69 -31 -39 83 -424 32 -77 -36 64 -9
5335iL5k16M3K12l2q8J56p3J57k50o4K1P2J7k76L10n9M4K23k85j11L26k06Q4j8
$$ -9 26 -190 -147 65 33 -55 101 28 185 -65 -129 -108 -36 -19 -295 15 -44 0 223 -62 -173 153 -53 31 13
5360A3j14J06k20L9K71k66Q9J71M1j53L8R7l59L08j31J18k79K55l81M57o5j39
$$ 13 -101 5 -215 -176 95 -171 -82 89 130 -23 15 112 -247 61 -70 48 -231 24 -357 100 35 -104
5382a04L38k49J74k16p0M9R1p8p7L4O6j8K03k09K54l12J78l1N5j8j32J61k15K32
$$ -104 234 -15 159 -57 -127 -78 13 -65 -142 -108 -42 -60 143 -66 188 -124 54 23 78 60 -72 89 -126 106
5406A06p0J60l65RJ22j30j2K09m9qP5l3P5Rl15J56J66Q0j13j12K6J6K53k22q0
$$ 106 36 196 -169 -160 -38 -168 -180 29 -20 -28 47 14 89 98 -217 -61 105 185 72 -40 -14 2 255 33 -47
5431d7J71l68M77k76P1k48K34j87K74l23K4M21l76J96j98mK75o0p5l0O6J07j65
$$ -47 124 -244 233 -43 28 -220 14 -173 101 -222 -198 223 -153 43 -155 -159 116 56 -19 -49 17 124 -41
5454d1k6M5K29m2j21N4l06K05m7J2J64j4j39J84k71J74J06j38J97l57K91k84J96
$$ -41 -67 -22 207 165 44 98 -208 -3 -50 -38 126 112 -27 157 -114 60 166 28 225 -132 159 -125 71
5477G1L3j72j52P0L01j1j95K15J01l80K11k84J59K7J58l96L4R7o7L71j53k50L74
$$ 71 104 -68 -220 -150 151 140 -55 160 261 -119 92 -192 -33 -6 152 -244 -210 -113 -180 191 38 -212 162
5500A62j54k53K38j23K64j19J14r8j30p4K02J7O9j05j83K18j25R2P3l38J14L39
$$ 162 8 -245 -7 -130 134 15 129 31 -99 -173 29 46 115 10 -173 45 -80 12 85 -253 -139 200
5522B00j57j47J5m7K27j12O8Q3q1k40M8JK99j57n1j23J14Rp5J76j89J92k59K94
$$ 200 43 -104 -89 -136 91 -21 47 130 49 -191 -143 -142 157 0 -51 -174 -60 -51 -126 50 -139 53 -206 88
5546H8q9K3L10l39nP8M0K9j09r0K57k8j13M0j28R6J4k8j5K36k18j16R7J92j08
$$ 88 -1 22 332 -7 -12 66 106 135 26 -64 193 165 52 92 -36 60 74 46 31 267 49 -67 30 222 114
5571A14k08K43K9J13k40j52LJ43k12K6K70L4l6j06o1K12n6m5r7O8k02M90n65O0
$$ 114 -94 149 178 291 51 -101 -98 45 -167 -141 129 163 127 21 -40 172 116 71 -26 42 -160 330 -235 -175
5595a75J95j27M42l46pJ2K23q3n0j90J94l6M2L5q5j55J77j0r9K6J62j68J3m2j50
$$ -175 20 -107 335 -11 -18 -6 217 134 84 -106 88 52 94 129 44 -111 66 56 -43 -17 145 -23 -10 -52 -202
5620b02K33j61J32N6j15j26l9M09k39J50kN4l03j9NJ01J4r7mL6q9K14J40k27P9
$$ -202 31 -130 2 58 -57 -183 -222 187 -52 98 96 150 -153 -172 -167 -66 -52 -149 -153 -117 -206 8 148 -79 0
5645@J70k26J22N4k80J31n5pJ26N5K4K52l21O3l19O4J04j47K05m0P9l6K60k31
$$ 0 170 -56 66 120 -160 -29 -84 -91 35 90 114 366 45 108 -211 -147 -43 -190 15 -25 54 18 278 47
5669D7p5o7K54k10K69j33k41K41k0r3L00j15j4knj23N2l1k69K24p1J16k9J93j79
$$ 47 -28 -95 159 -51 218 85 -156 85 65 -28 272 157 143 141 136 13 65 34 -235 -11 -82 34 5 198 19
5694A9M7J22j59J07j03K69j65k03J58j75J84k62M05k5l80K36q6K59k95K4K9O0
$$ 19 66 188 29 136 33 302 137 -66 92 -83 101 -161 244 219 -161 75 -11 248 -47 -23 6 66
5716F6l3l2P2o5R9q1o3k79K35L13k63K68k78Q6j50K77k54q0nn3J99l8o6M47m34
$$ 66 33 1 73 8 107 26 -37 -316 -81 232 -31 237 -41 45 -105 172 -82 -162 -167 -220 -21 -59 -125 322 -112
5741a12M5K20l68J36Pl3K05j25k53J96O1q6j04R1p0K45j10K12k53J66K6l7j6j36
$$ -112 -67 153 -215 -79 -72 -105 100 -25 -278 -82 -21 -107 -211 -120 -190 55 -55 157 -96 70 96 59 43 -93
5765i3NP2j58j70L40N6k66R9O8J22n8k33L14p9j76M7J72Q1rK3m5k44N77n13J66
$$ -93 -88 -16 -174 -344 -4 52 -214 -115 -47 75 17 -216 98 19 -157 -110 62 143 134 157 112 -132 445 -68 98
5790I8L7J72m22J52J16k85J70j88P0p1K64r1L8o6k0q7r6J38K61l99K77n5j39J37
$$ 98 135 307 -115 37 153 -132 38 -150 -80 -151 113 22 60 -6 -26 -113 -209 -71 190 -209 68 13 -126 11
5814A1j05o9K88R6l64O6j17O6L23j7k35Q3J7r9N2J27J15l04K16k93J12J60j56
$$ 11 -94 -163 125 221 -143 -77 -194 -128 195 178 -57 26 43 -56 -4 123 238 -66 150 -143 -31 129 -27
5837b7K6n8k7J10k8N1P3J6j65K1J02j09J68O0k65k4j6P0j05J6j4M3J82r4j91J75
$$ -27 -1 -59 -86 24 -4 47 120 136 -29 -8 94 -15 153 213 -52 -76 -92 -22 -127 -111 -125 -82 100 6 -185 -10
5863a0k03J82J3O0m9K7o2r1P7j71L39K14o36N20j78k7O6j69K61l71L35l33R1l3
$$ -10 -213 -31 -18 42 -7 20 -42 -133 -56 -227 112 326 -310 210 32 5 71 -98 163 -208 127 -206 -115 -148
5887a48J08M5j20J66j21j03L75O1k85L0j58J30J13j94J5M1K11k32J76k50K64j3
$$ -148 -40 5 -115 51 -70 -173 202 263 -22 8 -150 -20 93 -101 -86 -45 166 -66 110 -140 124 111
5909A11j85n2J64r5J32k21j09K03J22Q2m06K70q6m3K68k18k14J56K20n1k96K51
$$ 111 -74 -126 38 -57 75 -146 -255 -52 70 152 -254 16 -70 -113 155 -63 -277 -121 99 48 -248 3
5931CJ6P3k52K48n1O9J51j08q4K7j83LJ05qJ61j11l0Q7J31k20Kj59L8J80o4K3
$$ 3 19 92 -160 88 37 106 257 149 65 92 -91 -88 17 9 170 59 29 116 247 27 29 -130 -92 88 24 47
5957D7L03n19m5K83P5o6k42K45p0l8p9q6J69o5m1q6J71M0n3l6R4j7r7K61k18R9
$$ 47 350 -169 -214 69 144 78 -164 81 11 -27 -106 -192 -23 -88 -129 -215 -44 -4 -57 -93 1 -16 -113 148 -70 29
5983B9O5k60M78k14P0n2j63K43k57J5j20J8J99J62j60j11M52k94k28J14q6J03
$$ 29 94 -166 312 98 168 116 -47 196 -61 -46 -166 -148 51 213 53 -58 394 100 -128 -14 -100 3
6005Cj9J70j08o5j23J92P8j99l4J93J5J12j95l9q3q9K44Q4p9r5Pk3L0j07J36K6
$$ 3 -16 154 46 -19 -142 50 128 -71 -105 88 103 215 20 -19 -102 -191 53 137 58 -37 -30 -53 -23 -130 6 32
6031C2J54j05K28l22k9l02J16K96J20k51l2J86n5j03m3j65J89J04J49l42L20j39
$$ 32 186 81 309 -13 -42 -344 -228 68 188 -63 -95 91 36 -67 -110 -275 -86 18 167 -175 145 6
6053Fj04J35j20K67k58J47j30L7o9Q0J43l11J05K09k48J69o0n1o2K29j99q9K20
$$ 6 -98 37 -83 184 -74 73 -57 -20 -89 -9 134 -177 -72 137 -111 58 -2 -53 -115 114 -85 -174 46
6076D6j89K99j80J90j47j84K67k29J11j10o8J76j17K66K2k5R9R8j98j88R9J7l17
$$ 46 -143 156 -24 166 19 -165 102 -127 -16 -126 -194 -18 -135 131 153 128 227 325 127 -61 38 55 -262
6099b62K26J3r2J11k9q1N1m3P3N1j2L5L3L0K6k02J34o4nj08J70J1L7l9k9r5K22
$$ -262 -36 -23 -115 -4 -33 -114 -63 -106 -33 18 6 41 74 104 130 -72 62 -2 -7 -115 55 66 103 64 35 -60 162
6126A62l34j18M09j97m8J98j3l09K53l7Q1n7Q1k1l07J69J93l38L74m36L88L1m6
$$ 162 -172 -290 119 -78 -126 72 59 -250 3 -34 47 -10 71 50 -257 -88 105 -233 141 -295 93 124 78
6149G8j5J49m03J83L2L60n79K43K8j75J9J03l8P1K01l19J54k73K31n5J66Om6m8
$$ 78 63 212 -191 -8 24 384 -195 48 76 -99 -80 23 -15 56 257 -62 92 -181 50 -5 161 167 121 73
6173G3j36PJ8K68r2Nj61P3j13J69m06L89L6k64J00l46L42Q0j3j0p0o5J08J32j37
$$ 73 -63 -56 -38 230 138 143 -18 55 -58 111 -295 94 130 -134 -34 -380 -38 42 29 19 -51 -116 -8 124 -13
6198a3j0J28m1r6M8l34K2M11j72R8p8o8K50J21j27lk04k3k65L14J50J09j02p2
$$ -13 -23 105 64 -32 16 -318 -296 115 -57 41 -37 -105 145 266 139 136 -68 -91 -356 -42 108 217 115 43
6222D3K42k81J86K7n9q5Q8p1Q0m51M33l74K09p9K01q5K2j16k4J86j31kk0j21J3
$$ 43 285 4 190 217 158 73 161 90 170 -281 152 -222 -13 -92 109 24 46 -70 -94 92 -39 -41 -61 -182 -169
6247a69L2k3M4k4K91l79J24Q2Q0k3n8j21K29r6K38j50n4j96J51L8j12r3K54Kl8
$$ -169 -137 -160 -116 -140 151 -228 -104 -22 58 35 -23 -144 85 -11 227 77 23 -173 -22 16 -96 -189 65 67 29
6272B9l9jj66J52J3k54J29j5J66P1J40j98O2j83K22j74O6j10L13j16j49K15j55
$$ 29 -10 -11 -177 -25 -12 -266 -137 -152 14 85 225 27 89 -94 128 -46 20 -90 223 107 -42 173 18
6295A8k20L30q8J5k28J72J76k46p9J03J9K17k38K57k13k3K89k58J31j45k0Q4L8
$$ 18 -202 128 40 55 -173 -1 175 -71 -150 -47 -28 189 -49 208 -5 -28 261 3 134 -11 -31 53 91
6318I1k43J44q8J86o3n1k74N00l42J97q3K9j30K3qK31j48K18l40K65k21J50J5
$$ 91 -152 -8 -96 90 27 -24 -298 202 -140 57 -26 3 -127 -104 -112 119 -29 189 -151 114 -107 43 58
6341E8k47J78j53J74J50k1l3M1r0j98P6J15J5k02J13J59j36o7M9J0J30o3k47J58
$$ 58 -189 -11 -164 10 160 139 106 147 57 -141 -65 50 65 -137 -24 135 -1 -68 -19 -9 121 58 -189 -31
6365c1K62j59j95J22J19j20k0J02J85l35J75k8k50M14m80J57J6O5j20p8R6N6L39
$$ -31 231 72 -123 -1 118 -2 -22 80 265 -70 105 77 -173 241 -239 -82 -66 -1 -121 -199 -103 -47 292
6388B92m17M9L02K5j62o9J40L7k36J07mj71L26k84J02j29J17j94J20J66r3j16
$$ 292 -125 -76 226 251 89 20 160 197 -39 68 64 -107 219 -65 37 -92 25 -169 -49 117 24 -92
6410i2R8J27k03J62k97M94l48O9J4j25j06J74J04j56j1j3K12k55j12K73K4j18
$$ -92 6 133 -70 92 -205 289 -59 10 24 -101 -207 -33 71 -85 -96 -109 103 -152 -264 9 33 -85
6432h5J27o8k15J46p4q9K81J57l15J19J9K84k43n3j28n2J51J86j44N4J00j41q6
$$ -85 42 -26 -241 -95 -169 -258 23 180 -135 -16 3 287 44 -9 -137 -189 -38 148 4 58 158 17 -69
6455f9K46m4j64j27nL39k07M3J60k75J91J8N1k60K77M8k22j88J39q6l4J01N1N1
$$ -69 177 133 -31 -158 -163 176 -31 12 172 -103 88 106 157 -103 174 222 0 -188 -49 -135 -169 -68 -17 34
6479C4Mk5r7K45p1k47L81j37j13O2K6j56J13l5P8J71j20J12k16N5k35J32Q5j15
$$ 34 38 13 -84 161 90 -157 224 87 -26 36 62 -94 19 -16 62 233 113 225 9 64 -171 -39 46 -69
6503f9k33K87kO8j1k54J32J9K7o6J03J89k1l53mQ6J59%n1p5J80q0J2j32PL1Lj3
$$ -69 -302 -15 -17 51 40 -214 -82 -63 -36 -102 1 190 169 -184 -188 -102 57 57 6 -69 111 31 43 -89 -82 -51 -48 -61
6531f1P7j81K29J89j67q0J21n1j97J96k2lO4k91R8J77l31J50RJ38j2J00j81K3
$$ -61 16 -165 64 253 86 6 127 76 -121 75 53 50 114 -177 -79 98 -233 -83 -74 64 52 152 -29 -6
6555fNk09J01k2J32m0jM2L16k81L9J0j32K11j91j4J9J53J03l16J37K42l18J91
$$ -6 -1 -210 -109 -131 1 -39 -40 2 318 37 76 86 -46 165 -26 -40 -21 132 235 -81 56 298 -20 171
6579A71k58L48k44j62K81r5j90j08J98K84K5j60l44K42Q8lk35K12l12J55j8J03
$$ 171 -87 261 17 -145 136 41 -149 -257 -59 225 250 90 -254 -12 76 73 -162 50 -262 -107 -125 -22
6601b2nO4r4J42j05j0J47k59r3L91k18rl1J18K3r8J07j10J33j1k6j02K11k46J22
$$ -22 -27 37 -57 85 -20 -30 117 -142 -235 156 -62 -71 -102 16 39 -59 48 -62 71 60 34 -68 143 -103 19
6626A9k47M01ol40K74L4j12Q2j72O9M3k45K42n6J16l39K52%Q5l7k48R5J81k00
$$ 19 -228 173 167 -173 101 135 23 105 -67 2 45 -200 42 -14 102 -237 15 15 100 63 -185 -90 91 -109
6650a09K56k75P1p6J90l7J9o2L9K6M7q4k43O8K65j16r5J54j66J51p0R2J66q9o2
$$ -109 147 -128 -57 -133 57 20 39 -23 16 42 89 5 -238 -170 95 -21 -116 38 -128 23 -47 45 211 122 60
6675F0j12N9l9J17K1j70j15K95k44J39J6P0q5J5j08%J18j89L39j58J91j11j47
$$ 60 -52 7 -32 85 106 -64 -179 116 -128 11 27 97 12 27 -81 -81 37 -152 187 29 220 109 -38
6698c8j32J88l8J24k2o0j56O9K5j44J28K82j69k4J05j75NJ2L33m50K9J46N0j26
$$ -38 -170 18 -20 104 82 22 -134 -65 -40 -184 -56 226 57 33 138 -37 -32 -20 313 -137 -108 38 88 -38
6722c8J4J40L8j48j26P4J26l51L38j91J15n3q4J62J63q7k50K56N1j20l5j76J81
$$ -38 -24 116 154 6 -120 -46 80 -271 67 -124 -9 -62 -146 16 179 92 -158 98 149 29 -6 -182 -1
6745aJ53k82K83l63O01k05p6N2m35L11M7j11J15k01J01L9j34R5l5J67Op2k90J27
$$ -1 152 -130 153 -210 391 186 110 162 -273 38 85 -26 89 -112 -11 28 -106 -11 -46 121 127 55 -235 -108
6769a08j57N5J41J87J5p7p7J52Ljp1m5j6j56l9K33jR2K7l53K24n7NL9j8j44J49
$$ -108 -265 -210 -69 118 133 56 -21 131 134 133 62 17 1 -155 -194 39 38 130 157 -196 28 -29 -24 15 -3 -147 2
6796BJ9M1J29l62K4N9j03K60j08R4j84R8J0j24J52j94J40n6K96j77OJ18j64j31
$$ 2 21 62 191 -171 -147 -88 -191 69 -39 55 -129 -31 -21 -145 7 -187 -47 -103 193 16 22 140 -24 -155
6820a55J28q5L17k00K0m4p6K2q2K80Mk3l39J57n8nK92l26M44l00R6J33r8J3p5
$$ -155 -27 -112 205 5 25 -19 -95 -73 -155 125 129 106 -233 -76 -134 -139 153 -173 271 -29 67 200 102 115 40
6845D0o6J32j8K5O9k73N8j05K05j60K93k15j5N0J34o4m3k44K74j92J41qR2j23
$$ 40 -26 106 88 113 182 -91 -33 -138 67 -93 200 -15 -30 20 154 90 47 -197 77 -115 26 18 110 -13
6869a3K83k17Q4l54J77J77k95N2r7K41k34L06r9j19K8J18l2j60K00j41oJ07J14
$$ -13 270 53 137 -217 -40 137 -158 -106 -203 38 -196 110 11 -108 -80 38 6 -154 46 -95 -101 6 120
6892A20j45j88O2O8R7J90l31J13m1P3k7N2l2o0l5L9p7K60j49K86k06qj28j29J43
$$ 120 -25 -213 -151 -83 14 204 -127 -14 -55 18 -9 43 11 -49 -84 -45 -122 138 -11 275 69 61 -67 -196 -53
6917e3j94K48Q1kk04K24j08O2l4j43K54R1k53o1K23k64o9J63j6j36L06P8k76O1
$$ -53 -247 1 82 80 -124 100 -8 54 20 -123 131 222 -31 -92 131 -133 -202 -39 -55 -191 115 193 -83 -22
6941b2K0k28K91K1j06J37J17l35j26K81J60j94K34k78J41j70j8K10j44M9j40J3
$$ -22 -2 -230 61 82 -24 113 230 -105 -231 50 210 16 250 -28 113 -57 -75 135 -9 40 -100 -87
6963h7m2K13J24r2k17n5J31R6J85n4k63J8o0J82mk3k2p8L1k86L25j18K34p6k47
$$ -87 -129 84 208 116 -101 -156 -25 71 256 202 -61 -43 -103 79 75 52 30 -48 -17 -303 22 -96 138 62 -185
6988a85J82n0J99m2j73L7j86K50Q3r9k53K38k37K0L16o5j15J63k45O3J6K30k73
$$ -185 -3 -53 146 104 -69 -32 -218 32 115 16 -237 1 -236 -216 100 35 -80 83 -162 -99 -83 147 -126
7011a26K56k96N0J04j97L09J13l2k64L4p6L8q6P3J78k98K13J51l07o8L77k79P1
$$ -126 130 -166 -116 -12 -209 100 213 181 -83 -49 -125 -87 -173 -100 78 -220 -7 144 -163 -231 146 -133 -62
7034f2J00k5l10K53P1k60J66k65K53j11K14R8q5Q6q5j02L10m20M49k77n3l0J19
$$ -62 38 13 -297 -44 27 -233 -67 -332 -79 -190 24 122 37 123 38 -64 246 -174 275 -2 -55 -85 34
7057C4r0K80k33M1k27L48q5k13J41J98l01J90oj55N7j31J13J34r8N9o4p7J48p1
$$ 34 -56 224 -9 32 -195 153 68 -145 -4 194 -107 83 77 -78 -21 -152 -39 95 -3 56 -8 -85 63 -8
7081hj35O1J93j50J8O2ok%r9Kp5Q4J70k0q6mj7J40j28O4k89L07J84n26K11k6J11
$$ -8 -143 -82 111 -39 -21 41 35 33 33 -66 -64 -139 -55 115 95 9 5 -12 128 0 64 -225 82 266 -260 -49 -75 36
7109C6j4j04j98L54R0l15J81J0K09k52j20J43k00L06K8q7K9r0K04k23K92k00k33
$$ 36 22 -82 -280 74 164 -151 30 40 249 -3 -123 20 -180 126 154 67 96 6 210 -13 279 79 -154
7132a54O4J84k66K4J67J00J19m6m33J49J53J05L8k04n2J16j85R1J27n6J62j6j28
$$ -154 -90 94 -172 -148 19 119 238 192 -241 -92 61 166 204 0 -52 64 -121 -30 97 41 203 187 59
7155E9j70K38m14R2K07J10k97M11k97Q5j0P4j25k7K35q6j3j02j13K43k70J11l12
$$ 59 -111 127 -287 -195 12 122 -175 236 -61 24 14 88 -37 -64 171 85 72 -30 -143 100 -170 -59 -371
7178c71J56K63K49l02q0M6J07J52o8Kr7k14K01j19p1J15K96l98K06j97J24J9k37
$$ -371 -215 48 297 -5 -85 -39 68 220 152 154 57 -157 44 -75 -146 -31 265 -133 73 -124 0 19 -218
7201b18K99j50J33q2J28k47J7L00l6p7j17M4K7o4J08j73M3Q5j14J78l0o4K0l1
$$ -218 81 -69 64 -18 110 -137 -120 180 144 67 -50 -6 21 -43 65 -108 -65 20 -94 84 54 -10 10 -21
7225b1K33j45R0j30k31M23l47K15N8l84K44Q4J07l03Ql6R2j06O2R2J12Lj14j38
$$ -21 212 67 157 27 -204 219 -128 87 145 -239 5 89 196 -107 -99 -135 -43 -149 -87 5 117 120 6 -132
7249a32L79n22J30J59J08p0k40j3K21j13k9P0L5O6q1J07J4Oj82K8K07j85k36K58
$$ -132 247 -275 -145 14 122 52 -188 -201 20 -93 -122 -52 -17 49 -32 75 89 95 -87 -59 148 -37 -273 -15
7273a5j03K09n5r6J8k1lJ83j74O4n0j10R6J36j29l29L22L3n3R4r3k16K96O5p0
$$ -15 -118 91 36 -60 -42 -63 -66 117 -57 7 -43 -153 -57 79 -50 -379 -57 -24 -77 17 -76 -292 4 69 -1
7298ap1pM6J36j17J23o6k20L99k54q5J18J60q8o6J8O6ML6j30O9j22j29n8K74K1
$$ -1 -72 -79 -33 103 -14 109 43 -177 222 -32 -117 1 161 73 7 25 91 95 131 1 70 -52 -181 -239 35 56
7324E6J18l42K07r6P9o5K9k02P3K10J0m01L65PM8k38R6J21j32m4L4K02J96m96
$$ 56 174 -168 39 -57 22 -43 -14 -216 -143 67 77 -324 41 48 96 -142 -46 75 -57 -101 -67 135 331 -165
7348a65J22N5J37m2j17O8J88k09j81K80l20O9L87l98K01j20j47L17j77K50j49
$$ -165 -43 12 149 107 -10 58 246 37 -144 136 -184 -115 272 -126 75 -45 -192 125 -52 198 49
7369D9M1k22lM01j41m4r2o5kk8oK64p5P8k00K98j69q5J87l40M69k91j17J49j03
$$ 49 90 -132 -135 266 125 81 -11 -76 -78 -106 -112 152 77 155 -45 253 84 -1 186 -154 315 24 -93 56 -47
7394d7M7M4q1K36n5o8k59L01p0k93L40l1j74K26m42M32j81O7K9k5J24j81J82j02
$$ -47 0 44 -37 199 144 76 -183 118 48 -245 95 64 -110 116 -326 106 -75 -8 21 -4 120 -61 121 19
7418A9p9j28L42p6j51J26m8k85M93l31n7J20j7N8j17J25K14l08J99l45J82K7O6
$$ 19 -60 -188 154 78 -73 53 5 -280 213 -118 -175 -55 -72 -14 -131 -6 208 -100 99 -246 -64 -37 29
7441B9k14L31Q9k83J03r0Q0N2l30J99J55m1m5j76M22l43L0j38L14j94J00N1L0
$$ 29 -185 146 235 -48 55 -35 45 97 -233 -34 121 80 35 -141 281 -62 -32 -170 144 -50 50 101 131
7464A31j34k0J85l34J03K41j96j20K60k53K69J23n41J53J09J33k90m4J52Q1l6
$$ 131 -3 -23 162 -172 -69 172 -24 -144 116 -137 132 255 -286 -133 -24 109 -181 -225 -73 8 -28
7485b8k31K45L6j34J95p5K84m63L05k35J32j30J15LQ6k46J59J07k00J75r0O9l58
$$ -28 -259 -14 22 -112 83 8 292 -171 134 -101 31 -99 16 19 105 -141 18 125 -75 100 10 79 -279
7508b79M84j68n4m8m0O4J76l36K06p4L2K10l02K01r2p4o3j8K75k06O9k4Pj7k1
$$ -279 205 37 -17 -65 -105 -41 135 -201 5 -69 -37 173 -129 72 -20 -94 -157 -175 100 -106 -37 -61 -54 -71 -92
7533i2j73M3K20P9J87k80K9j05K59j2k3k25MmJ44j14k5Mj40L02l5k57Q5j1R4M5
$$ -92 -265 -222 -2 77 264 -16 13 -92 167 155 132 -93 -89 -93 51 -63 -88 -84 -224 78 43 -214 -129 -140 -46 -1
7559aj81J43P6j04K7JK0p0k7O6J24j31J5N4l38L09K1j22J15k6m27K17J94l5R3
$$ -1 -182 -39 37 -67 -40 -39 -19 -89 -116 -50 74 -57 -42 12 -326 -17 4 -118 -3 -29 -456 -239 -45 -80 13
7584A3j44J0K5K46l03J01j37P2N8l8J12R7k61J66j71J02rj82J41K22k70J47J86
$$ 13 -131 -121 -96 150 -153 -52 -189 -117 -59 -97 15 112 -149 17 -154 -52 -61 -243 -102 120 -150 -3 183
7607A83m8n4j15j0oj3J26l47L95j82J17k11J87J19k03R7q2N3j85J84k1K02r2k52
$$ 183 135 81 -34 -44 -50 -63 63 -284 111 -71 46 -165 22 141 -62 35 -47 6 -179 5 -16 186 94 -158
7631a58Q6j1J20L1j73l6J19k17K00kP4rk60K42o3j2n1J2J05j04l2J63J31k44R
$$ -158 -72 -83 37 68 -105 -141 -22 -239 -39 -41 33 24 -236 6 -57 -69 -120 -108 -3 -107 -139 24 155 -89 -80
7656h0n1j15N75n54J71R8k4l8K31j22j32O1j81K28K46m78L6J61l02L70j01P9l21
$$ -80 -131 -246 329 -225 -54 44 20 -18 213 91 -41 20 -161 67 313 -165 -129 32 -270 100 -1 78 -243
7679b43K35m8J15j23j5j4O7J01J9n2R0j81L19k20Q1m2j42j63J58N2l02N80k69
$$ -243 -8 -56 59 -64 -79 -93 -26 75 94 42 132 -49 270 50 131 89 -53 -216 -58 -6 -308 272 3
7702CK4n0l9J19j46J96l9j88J11p7L32k97O6J06o0j99m8P2M68k22l7j53J71q4
$$ 3 27 -23 -62 57 -89 107 68 -120 -9 -86 246 -51 15 121 61 -138 -186 -114 354 132 95 -58 113 29
7726B9L1j63j09K85L05o78K80j7MJ34k9J19k04o9P9j3Qq8%Qo2M5o6P9J97n1k7
$$ 29 60 -103 -212 73 378 -300 -20 -37 -33 101 72 191 -13 -82 -3 -16 -8 -96 -96 -88 -150 -105 -171 -92 105 54 27
7753B7J47j28n8K82k29Q6m9L0LOnM6j46N6M5j96J76l87J96O1j7J03j70J68O3k07
$$ 27 174 46 -12 270 41 127 78 108 111 117 112 158 12 68 113 -83 93 -294 -98 -37 -54 49 -121 47 110 -97
7779i7K7o9L05l17K12k33M14j56r4qN8Q6j88O3j05M4N3J28k30O8q8K92m34K02
$$ -97 -70 -139 166 -151 61 -172 242 86 -8 -16 42 128 -60 3 -102 -58 -5 123 -107 -39 -127 165 -269 -67
7803f7K25k44j80K84O2j40o6J41n9J03N1n4j03k9M26l46j74J56M24m83k7J49l0
$$ -67 158 -86 -266 18 80 -60 -126 15 -44 59 110 56 -47 -76 350 4 -170 -14 410 -73 -100 49 19
7826A9n5j17j69K96l99M12NJ34j6k36J00k10J31P9m9n0%J81l9K52l59r5K59nm4
$$ 19 -36 -153 -322 -26 -425 -13 -8 126 110 -126 -26 -236 -105 -26 -75 -125 -125 56 17 269 -90 -185 74 69 25
7851B5j45J84j04J50j98kJ54j46J31K3r9q6J30%k76K36M5j69J37J01J7l6j63o0
$$ 25 -120 64 -40 110 -88 -90 64 -82 49 72 -27 -113 17 17 -259 -23 22 -147 -10 91 108 72 -91 -151
7875a51J55O4l1m1p7L52j93O1j73J6m0oJ22Lo1N3K4l12L36n8m5j50K54k32J54
$$ -151 4 68 37 -4 -81 271 78 139 -34 -18 -58 -64 58 61 0 53 77 -235 101 43 -2 -152 102 -130 24
7900B4o9L9L1j7R7l56L50m4O0k52J29Q2N3Ml0M8Rk63j9Q7P8n2R8l25J36J63j7
$$ 24 -45 -6 25 8 105 -251 99 55 115 -137 -8 74 127 131 101 149 158 -105 -124 -37 41 -11 87 -238 -102 61 44
7927D4m0j60L12j78r5J71P9m2o1rj02M6m2rn3K94L9j47n6n6Pq3M05k41j62q2K32
$$ 44 4 -156 156 -22 -117 54 133 91 30 21 -81 -35 -77 -86 -139 155 194 47 -9 -65 -58 -141 264 23 -139 -221 11
7954A1R7j94R6N4j35L14k40J9l01O49l41k17K32J41j56k50K08j74K78j11k6m3
$$ 11 108 -86 10 64 -71 243 3 22 -279 370 29 -188 44 185 29 -221 -13 -187 91 -20 -46 -89
7976h9J87j00m9J26l5OP2q9M5mL6j96J98j50m0R0O0j18R8Q0k30M4PJ94k99J40
$$ -89 98 -2 -51 75 40 46 118 29 74 70 106 -90 108 -42 -82 8 68 -50 48 128 -102 -58 -51 143 -156 -16
8002a6o1K9L58j15k03O0J05j41K1R5m7K0k61K90p3k33j95M56j4J3j85j46K69j81
$$ -16 -77 -48 310 195 -8 52 157 16 37 132 85 105 -156 134 61 -172 -367 89 75 88 -97 -243 26 -155
8026a55K49j24n0M7K2j8K9J5n2l06K36M8j42L04j44K5O6o7N0j80J55J96j83o8
$$ -155 94 -30 -80 -33 -11 -29 0 15 -37 -343 -107 -59 -201 103 -41 -16 50 -17 33 -147 8 204 21 -47
8050d7k4N5M1k9j65L30o2n5N0j99P7lk20K24m5J5K8J24Q2P3l39m0J93k33J11J98
$$ -47 -71 -16 25 -4 -169 161 99 44 94 -105 -28 -31 -251 -27 -72 -57 -29 95 177 250 -89 -129 64 -169 -58 140
8076A40Q5m08M20j33j03l6m7K7p9K43K00m26K38L1r7O4l0k40J18j13K32j39K31
$$ 140 225 -183 237 104 1 -35 -82 -55 -134 109 309 -117 121 152 55 119 89 -151 -33 -146 86 -53 178
8099A78Qk95L14j78K04k37J24k18RJ55m0R7j10J03N5O3k56K06l23J91j72n1J30
$$ 178 186 -109 205 27 231 -6 118 -100 -91 64 24 121 11 114 169 232 -24 182 -141 50 -122 -173 -43
8122d3n3L96o01J46J78r4J44K73m21J59k41J55j0R7k67L92j34q5Q1j14KJ38O6
$$ -43 -96 300 -301 -155 23 -71 73 346 -75 84 -157 -2 -12 85 -182 210 76 -9 72 -42 -40 98 164
8145A64k90J12R9J05k01k3J00p8j23P6K14k65J2J64K19p9k40j19j2K88j49J26
$$ 164 -126 -14 85 190 -11 -34 66 -12 -135 -59 155 -110 -98 66 285 206 -34 -153 -165 123 -26 100
8167A00M5k45R7J11k90M12j33o3j03K72m55J83J45j25K12k08j81R4K12p0j58K33
$$ 100 145 -100 -3 108 -182 230 97 34 -69 203 -252 -69 76 -49 163 -45 -226 -132 80 10 -148 85
8189H5K6m4
$$ 85 111 67
8191F7
$$ Imaginary data points
##PAGE= N=2
##DATA TABLE= (X++(I..I)), XYDATA
0@%%%%%%%%%%%%%%%%%%%%Kj0J6j6J6j6J6j8K5l1L2l4M1m7N0n7O5p3Q1r1J02j12
$$ 0 0 0 0 0 0 0 0 0 0 0 0 0 0 0 0 0 0 0 0 0 2 -8 8 -8 8 -8 8 -10 15 -16 16 -18 23 -24 26 -31 34 -39 42 -49 53 -59
42e9J24j38J53j68J85k05K26k49K75l03L33l68M08m53N03n59O27p07Q03r22J071
$$ -59 65 -73 80 -88 97 -108 118 -131 144 -159 174 -194 214 -239 264 -295 332 -375 428 -494 577
63E77j267J542j943K587l790O742k5776k9642Q3121n228o0286M5810M3614n7945
$$ 577 -690 852 -1091 1496 -2294 4448 -21328 -50970 32151 26923 -33363 12447 56061 -1884
77a884J025O1104l2194m8543M4624P885o0456J1015M3444m0345k7549M6555K525
$$ -1884 -859 60245 28051 -20492 24132 32017 -28439 -17424 26020 -14325 -41874 4681 7206
90G206m2194K5971L4496l8217j4341M1284r743l3737K9777K2582l3321J159L4815
$$ 7206 -34988 -9017 25479 -12738 -27079 14205 4462 -29275 502 23084 -10237 -9078 25737
103B5737j4576j9153K8403N882l1475K177J5503k1755j2650J9418J090j6328P580
$$ 25737 11161 -7992 20411 26293 -5182 -3005 12498 -9257 -21907 -2489 -1399 -17727 -10147
116a0147J2698o932k616J2348L609j0022k032P028k249p933O771J0043o479m087
$$ -10147 2551 -4381 -6997 5351 8960 -1062 -3094 3934 1685 -6248 523 10566 4087 0
130@J2142K090j3242M729J0307j5982j4070J3264k49j9390Q296J8594j4277q417
$$ 0 12142 14232 990 5719 16026 44 -14026 -762 -1011 -20401 -12105 6489 -7788 -16205
144a6205K3276R21k0753J4225J6993k5294r194K6559p335k3756K3894J7760k8300
$$ -16205 7071 7992 -12761 1464 18457 -6837 -16031 10528 3193 -20563 3331 21091 -7209
157g209R58L0571j7072k2411K8514N172l7329P730K7609k6157j4245L6626n25
$$ -7209 -6251 24320 7248 -15163 13351 18523 -18806 -11076 16533 -9624 -23869 12757 12232
170A2232l1319K0523K3053l2085o182L4929j4173l1211K5650J3759l3986N241
$$ 12232 -19087 1436 24489 -7596 -13778 21151 6978 -24233 1417 15176 -18810 -13569
182a3569L4617j8974k0824L1568M327l3820J2252K5361k8027j3963L0951m853
$$ -13569 21048 2074 -18750 12818 17145 -16675 -4423 20938 -7089 -21052 9899 5046
194E046k7461K2035J9994k6089k273K8305j2032k2489K1102Q394k6611J853K1400
$$ 5046 -22415 -380 19614 -6475 -8748 19557 7525 -14964 6138 14532 -12079 -10226 11174
207A1174j4597j2644K2648M971j9677P569J6336j6504r879J7650j738j8094P918
$$ 11174 -3423 -16067 6581 11552 -8125 -556 15780 -724 -10603 7047 5309 -12785 -4867
220d867J1817j3279k966J7128q49j1599Q201P236j3006m153J0412l142j0840N697
$$ -4867 6950 -6329 -9295 7833 6984 -4615 3586 10822 -2184 -6337 4075 933 -9907 -4210
234d210O794o951j633J1623J005q308L708O737q897o618Q852L41j0876L576J0168
$$ -4210 2584 -4367 -6000 5623 6628 -1680 2028 8765 -132 -6750 2102 2443 -8433 -4857 5311
249E311o594m896J2809L040j2630L297R500j1742q474J2676M54j4572O958J2682
$$ 5311 -1283 -6179 6630 9670 -2960 337 9837 -1905 -10379 2297 2751 -11821 -4863 7819
263G819j1286m001J8030j782j5796R047R512j8234m266J8042o038j5422J5455
$$ 7819 -3467 -7468 10562 8780 -7016 2031 11543 -6691 -10957 7085 1047 -14375 1080
276A080R916j8459K590K0423j0727j4944J7265K596k2669N230J8220j5455r152
$$ 1080 10996 -7463 -4873 15550 4823 -10121 7144 9740 -12929 -7699 10521 -4934 -14086
289a4086K1920M99k0201J2938J5816j9950o008K0875q025k0013J5445J0702k0632
$$ -14086 7834 8333 -11868 1070 16886 -3064 -9072 11803 3778 -16235 -790 9912 -10720
302a0720J747K1444r740j4062J9263N065k1424N046J5790j5760j0983J8941N56
$$ -10720 -8973 12471 2731 -11331 7932 12997 -8427 -3381 12409 -3351 -14334 4607 5163
315E163j7618J0679J4527j5466m689J8828m366j6327J0693P524j7026j529J6012
$$ 5163 -12455 -1776 12751 -2715 -7404 11424 7058 -9269 1424 8948 -8078 -9607 6405
328F405o038j0818J3345O249j4250K797J2905q646r626J0995J055j3399L610J0420
$$ 6405 367 -10451 2894 9143 -5107 -2310 10595 1949 -7677 3318 4373 -9026 -5416 5004
342E004p285m356J1877J246r945M346P808q452n833P959q43r428L649P576n130
$$ 5004 -2281 -6637 5240 6486 -3459 887 8695 243 -5590 2369 1526 -7902 -4253 3323 -1807
357a807k395Q743J141p921K422O263o461n953O627P58q550L011Q567m121l916
$$ -1807 -4202 4541 5682 -2239 183 6446 -15 -5968 659 1417 -7133 -4122 4445 324 -3592
372c592Q873K159r919J810P725p766p092Q662J112j0723M594J0440p343m089J2749
$$ -3592 5281 7440 -2479 -669 7056 -710 -7802 860 1972 -8751 -4157 6283 -1060 -5149 7600
387G600r08j2519N844Q360j2386m658J3294l349j1601J0508R044j2453l39J5244
$$ 7600 6692 -5827 17 8377 -4009 -8667 4627 1278 -10323 185 9229 -3224 -3563 11681
401A1681p552j2465J1683M425j7058J632J4669j0105q776J6381K922j5320P899
$$ 11681 4129 -8336 3347 7772 -9286 -7654 7015 -3090 -11866 4515 7437 -7883 16
414A6J3182j4397o815J6126l313j6305J0536J0176j5429r43J7352o032j2160J3832
$$ 16 13198 -1199 -8014 8112 4799 -11506 -970 9206 -6223 -7166 10186 4154 -8006 5826
428E826M889j7034J285J3114j0860r398J4182J366j3814P024J2670j0597m524
$$ 5826 10715 -6319 -5034 8080 -2780 -12178 2004 3370 -10444 -3420 9250 -1347 -5871
441e871J4230k222j2967P134P481j2539k000J2930m042r281R863N587j0946J164
$$ -5871 8359 6137 -6830 304 7785 -4754 -6754 6176 2134 -7147 2716 8303 -2643 -1479
455a479R494o946p792P375J131r269K406Q152n181l557Q645J879o645K750N200
$$ -1479 8015 1069 -6723 652 1783 -7486 -5080 3072 -2109 -5666 2979 4858 -1787 963 6163
470F163n224m316M810K11n412J163N843k711k781N335J392n370l99M760l673n695
$$ 6163 939 -3377 1433 1644 -3768 -2605 3238 527 -2254 3081 4473 -897 -1296 3464 -209 -5904
486e904L683K481n369K49P647j721l957O508L304p544m30P671n388p229P092L216
$$ -5904 -2221 260 -5109 -4860 2787 1066 -2891 3617 6921 -623 -1053 6618 1230 -5999 1093 4309
502D309r442J922R916n547o115J0129J124j1952L339Q254j0112n330J1844j062
$$ 4309 -5133 -3211 6705 1158 -4957 5172 6296 -5656 -2317 5937 -4175 -9505 2339 1277
516A277j0536R049Q916j1318j260J3557n260j1484R886M710j4490J161J2906q486
$$ 1277 -9259 -210 8706 -2612 -3872 9685 4425 -7059 2827 7537 -6953 -5792 7114 -1372
530a372p511J3690K601j3471N715J0372j1905n959J3361k884j3024R053Q232j2358
$$ -1372 -8883 4807 7408 -6063 -348 10024 -1881 -7840 5521 2637 -10387 -1334 6898 -5460
544e460l17J4452n196r788J1195L928j3579J734J0025q671o748J0627R86j0386
$$ -5460 -5777 8675 3479 -6309 4886 8814 -4765 -3031 6994 -1677 -8425 2202 3188 -7198
558g198N734Q742q903k750R982k192r600O007M737r081o29Q277k371n245O676
$$ -7198 -1464 7278 -1625 -4375 5607 3415 -6185 -178 4559 -4522 -5151 3126 755 -4490 2186
573B186L557o431J57O116m265n143M276J375n778N06N194k229k637M302K233l808
$$ 2186 5743 -688 -531 5585 1320 -3823 453 1828 -3950 -3444 1750 -479 -3116 1186 3419 -389
589c89j02L274j977m133K300J930l244l65M428K75l690K934L864m651k621M879
$$ -389 -491 2783 806 -3327 -1027 903 -2341 -2706 1722 1997 -1693 1241 5105 454 -2167 2712
605B712j508o323L018M241n498j428P715n40o141N538M636q346q95P385m227o865
$$ 2712 1204 -5119 -2101 2140 -3358 -4786 2929 2389 -3752 1786 6422 -1924 -2819 4566 339 -6526
621f526P043L237q545K382R340n680n813R751P12j0870L260P524r415m044J0751
$$ -6526 517 3754 -4791 -2409 6931 1251 -4562 5189 5901 -4969 -1709 5815 -3600 -7644 3107
636C107j411r166P751O785j0167k33J0783n134r201R014L036j1874K509R932o924
$$ 3107 1696 -7470 281 7066 -3101 -3334 7449 2315 -6886 2128 5164 -6710 -4201 5731 -1193
651a193m978J0917P95j0090M928P561r673l687R770k877q915O435N387q407J44
$$ -1193 -6171 4746 5541 -4549 379 7940 -1733 -5420 4350 1473 -7442 -1007 4380 -4027 -3883
666c883R949m177o191P426K441r394J347O516n586m088P354J069o757L388O050
$$ -3883 6066 1889 -4302 3124 5565 -3829 -2482 4034 -1552 -5640 1714 2783 -3974 -586 5464
681E464n072k631N716r08n992K485L022m821j320N141j57l625L080L361l573j599
$$ 5464 392 -2239 3477 2569 -3423 -938 2084 -2737 -4057 1084 927 -2698 382 3743 170 -1429
697a429M063j264m115J673K292l159r12L974M94l187J909L441l084k035L495m88
$$ -1429 2634 1370 -2745 -1072 1220 -1939 -2851 1123 1617 -1570 339 3780 696 -1339 2156 1668
713A668m355P51L993l335k310N333P20m854K757M192m713k479N408j347o318L578
$$ 1668 -2687 -1936 2057 -1278 -3588 1745 2465 -2389 368 4560 -153 -2632 2776 1429 -4889 -1311
729a311M060n196j166P259j301n757M918L655p353p23O830m095n371O292K135
$$ -1311 2749 -2447 -3613 3646 2345 -3412 1506 5161 -2192 -2915 3915 -180 -5551 741 2876
744B876p009K188P420n038l970P386p0q049L475N030o849k407P948j101p003N797
$$ 2876 -4133 -1945 5475 437 -3533 3853 3783 -4266 -791 4239 -2610 -5017 2931 1830 -5173 624
760F24N093p708m65P896l978o904O489K318q004J325P498m633m236Q056O73o987
$$ 624 5717 -1991 -2456 5440 1462 -5442 1047 3365 -4639 -3314 4184 -449 -4685 3371 4044 -2943
776b943K851N447o284l175O633j288o175L957M331n442l68O268j701n096M216
$$ -2943 -92 5355 -929 -4104 2529 1241 -4934 -977 3354 -2088 -2456 3812 2111 -2985 1231
791A231K619o014m36N107k748l829M525K103m792J190N045k753l554M258N46n195
$$ 1231 3850 -2164 -2600 2507 -241 -4070 455 2558 -2234 -1044 4001 1248 -2306 1952 2498 -2697
807b697P48L548k786k156M036J199l644J333L678k846j813K837M30m282Q59L122
$$ -2697 -1949 1599 -1187 -3343 693 1892 -1752 -419 3259 413 -1400 1437 1867 -2415 -1556 1566
823A566k545j819M200O55l496J783K958l026k287L134L63m258J150L416k972j658
$$ 1566 -979 -2798 1402 2057 -1439 344 3302 276 -2011 1123 1486 -2772 -1622 1794 -1178 -2836
839b836M613O42m392K115L282l862k190M539p69m886K738L257m163q15N662j256
$$ -2836 1777 2419 -1973 142 3424 -438 -2628 1911 1142 -3744 -1006 2251 -1912 -2727 2935 1679
855A679m486L869K558n519k40N083k646m577M704K460n609J479N487l606l434
$$ 1679 -2807 1062 3620 -1899 -2139 2944 298 -4279 425 2885 -2724 -1245 4242 636 -2798
870b798N378N98o340K009M657m965k390O004m44n501L823M174n509j308N722j836
$$ -2798 2580 3178 -3162 -1153 3504 -1461 -3851 2153 1709 -3792 31 4205 -1304 -2612 3110 1274
886A274n461M192K816o201O78N675k798l417N349J535n972J735M555m433l093
$$ 1274 -4187 5 2821 -3380 -2702 2973 175 -3242 2107 3642 -2330 -595 3960 -473 -3566
901c566N233k08m842K438M287m166j609N199o47m415K675K875m930o98M457j711
$$ -3566 1667 1459 -3383 -945 3342 -824 -2433 2766 2119 -2296 379 3254 -1676 -2374 2083 372
917C72l422L569K266m196L38M205k252l223L374J050m399J78L686k315k030L248
$$ 372 -3050 519 2785 -1411 -1073 3132 880 -2343 1031 2081 -2318 -2140 1546 -769 -2799 449
933D49J063k918P53L193j959k657K992M72l080M10K802j754j405K528J158k951
$$ 449 1512 -1406 -653 2540 581 -2076 916 1388 -1692 -1282 1520 -234 -1639 889 2047 -904
949i04P64K668k206j831K378M64l407P57K982k122j590L012J088l641J159K973
$$ -904 -140 2528 322 -1509 869 1333 -2074 -1317 1665 -457 -2047 965 2053 -1588 -429 2544
965B544k753k034L372j1l801K005L046l718j069M704o02m062K876K109m135o91
$$ 2544 -209 -2243 1129 1118 -2683 -678 2368 -1350 -2419 2285 1683 -2379 497 2606 -1529 -2220
981b220M483j494m138L626K625m916M38M898k731l192M588R95n539J609M033l686
$$ -2220 2263 769 -3369 257 2882 -2034 -1596 3302 571 -2621 1967 2962 -2577 -968 3065 -621
997f21k422N345k71m969K798L367m460j374N075j473m743L604K319m396J03M714
$$ -621 -3043 2302 2031 -2938 -140 3227 -1233 -2607 2468 995 -3748 -144 2175 -2221 -2118 2596
1013B596k007l204L902J448n001R71M124l179k506M492J58m462K086L408l384
$$ 2596 589 -2615 1287 2735 -2266 -1295 2829 -350 -2856 1636 1794 -2668 -582 2826 -558
1028e58j111L593m53l714K181K165l365o52L448r60k799K591J855l213m2K918
$$ -558 -1669 1924 1471 -2243 -62 2103 -1262 -1914 1534 574 -2225 366 2221 -992 -1034 1884
1044A884j247k074K008J252l046L9K705j771j786K413R64k393L78K189j195k159
$$ 1884 637 -1437 571 1823 -1223 -1184 1521 -250 -2036 377 1341 -1052 -674 1515 320 -1839
1060a839K044R04k267K50K144q34j901J977Q87k132K53K462j333k197K299O62
$$ -1839 205 1109 -1158 -908 1236 402 -1499 478 1365 -767 -514 1948 615 -1582 717 1379
1076A379k823J62K893j494k301L195O57l208P50K926k530j606L073J78l589J607
$$ 1379 -1444 -1282 1611 117 -2184 1011 1668 -1540 -790 2136 -394 -2000 1073 1251 -2338 -731
1092g31K844l047j081L840j95l949K468K334l520r44M206j366l526L464J617m202
$$ -731 2113 -934 -2015 1825 1630 -2319 149 2483 -1037 -1981 2225 859 -2667 797 2414 -1788
1108a788M34L850k332k798L872P67m302J571L511l385j799M269k29m175K338K703
$$ -1788 -1354 2496 164 -2634 1238 2005 -2297 -726 2785 -600 -2399 1870 1641 -2534 -196 2507
1124B507l611q53L950q42l536K188K691m002J27L626j563k953L097R75l443N19
$$ 2507 -1104 -1957 1993 1151 -2385 -197 2494 -1508 -1381 2245 682 -2271 826 1801 -1642 -1123
1140a123L192k251j858L102M05l172J292K586k660j044K624J33k992J463J801
$$ -1123 2069 -182 -2040 1062 1467 -1705 -413 2173 -487 -1531 1093 1226 -1766 -303 1498
1155A498k045j048K746j39k631J720J493k101q17K435n72j983J377J364k158k95
$$ 1498 -547 -1595 1151 1012 -1619 101 1594 -507 -1324 1111 539 -1444 -67 1297 -861 -1156
1171a156K169m10k063J680J448k345m18K370o99k090J656J129j787n24K373r68
$$ -1156 1013 603 -1460 220 1668 -677 -1095 1275 576 -1514 142 1271 -516 -1040 1333 365
1187C65j973J982Q51k092J2K367j231j827K186N85k391P5K729j646j709K491O58
$$ 365 -1608 374 1225 -867 -855 1512 281 -1546 640 1225 -1166 -1091 1638 -8 -1717 774 1432
1204A432l135R99K745k348j410K788J16l026J611K203k940p26L362r71k718K201
$$ 1432 -1703 -704 2041 -307 -1717 1071 1187 -1839 -228 1975 -965 -1691 1671 700 -2018 183
1220A83J887l128j88L258j356k618K233J563l090J82K902j752k279K762R88l161
$$ 183 2070 -1058 -1246 2012 656 -1962 271 1834 -1256 -1074 1828 76 -2203 559 1547 -1614
1236a614J191K475k186j648K971J64l191J134K559k556q55K999n27k334J648J515
$$ -1614 -423 2052 -134 -1782 1189 1353 -1838 -704 1855 -701 -1556 1443 916 -1418 230 1745
1252A745k351n60K935j398k283J991J518k970K07K994j500j669J897R95k536M75
$$ 1745 -606 -1166 1769 371 -1912 79 1597 -1373 -1166 1828 328 -1341 556 1551 -985 -510
1268e10K009j371j969K359N95k584J011K125j945j118K257K29k403P87J964j768
$$ -510 1499 128 -1841 518 1113 -1471 -460 1665 -280 -1398 859 1088 -1315 -528 1436 -332
1284c32r29K055k50j941J212J780j756n73K082o08j988J218J546k094n42K302
$$ -332 -1261 794 544 -1397 -185 1595 -161 -734 1348 740 -1248 -30 1516 -578 -1120 1182
1300A182q30j791J649J073j736m06K026j054j477J349J109k273n5K446j194j368
$$ 1182 352 -1439 210 1283 -453 -859 1167 113 -1364 -15 1094 -1179 -1234 1212 18 -1350
1316a350J855Q51k207N99J764j697j171K292J29k042L60K018j665j181K447j50
$$ -1350 505 1356 -851 -252 1512 -185 -1356 936 1065 -977 -617 1401 -264 -1445 1002 852
1332H52k007R15J628k042n30J999m42j908J389J458j952m57K398n23k085J538
$$ 852 -1155 -240 1388 -654 -1184 815 373 -1535 -146 1312 -640 -1097 1301 778 -1307 231
1348B31J031k429l7K391j082j798K096J066k291J59K407j592j658K146M18k442
$$ 231 1262 -1167 -1204 1187 105 -1693 403 1469 -822 -663 1744 152 -1506 640 1058 -1384
1364a384Q50J685j369j082K322M55k829J304J726j942j050K500o76k072J345J687
$$ -1384 -534 1151 -218 -1300 1022 1477 -1352 -48 1678 -264 -1314 1186 510 -1562 -217 1470
1380A470k285j43K142o87j898J988J107k749K64K157j534j758K386N72k328M62
$$ 1470 -815 -958 1184 497 -1401 587 1694 -1055 -791 1366 -168 -1926 460 1032 -1296 -834
1396h34K231j106j733K435j42k122R11J585j779r99K204J33j828J199J401j738
$$ -834 1397 291 -1442 993 851 -1271 -360 1225 -554 -1553 651 784 -1044 155 1556 -182
1412a82l76J910p72j720J089J095j517o14J776k60j307J168J098k011n6J591o32
$$ -182 -558 1352 580 -1140 -51 1044 -473 -1087 689 429 -878 290 1388 -623 -679 912 280
1429B80j287R35P67j495J69J612q38r99J199N47j507J77J367p67j067J197M12
$$ 280 -1007 -72 695 -800 -631 981 143 -856 343 890 -617 -440 927 160 -907 290 702
1446G02j676N46J610j172n90J387J03j767N62J366j325j049J527K86j930R74J757
$$ 702 -974 -428 1182 10 -580 807 910 -857 -295 1071 -254 -1303 224 510 -1420 -446 1311
1463A311j545m90J844k0k064J016J230k155m45K204l82j818J432J008j759R7K056
$$ 1311 -234 -724 1120 1100 -964 52 1282 -873 -1318 886 504 -1314 118 1126 -633 -536 1520
1480A520r90j896J803N48k030P1K257j479j038K215L26k155O31J965k009j227
$$ 1520 530 -1366 437 985 -1045 -974 1283 -196 -1234 981 1307 -848 -217 1748 -261 -1488
1496a488K210j51k188J310J465j726j70K126q63j750J756P56k030r3J712r37j480
$$ -1488 722 571 -1617 -307 1158 -568 -738 1388 525 -1225 531 1287 -743 -836 876 -61 -1541
1513a541J762P22j756L38K013j280j019J592j22j759N90J427j605m16J646k84
$$ -1541 221 943 -813 -475 1538 258 -761 831 709 -1050 -460 967 -638 -1054 592 308
1529C08j312J188J106j569k38J286l42j292Q16P14j326P4J261l42r62O41R77j138
$$ 308 -1004 184 1290 -279 -517 769 427 -865 -49 665 -661 -587 674 332 -630 11 988 -150
1547a50k64J186m20j079P66M03j183J46J384n14j106R48Q77j276l4J169p87j215
$$ -150 -414 772 352 -727 39 442 -741 -595 789 275 -831 117 994 -282 -316 853 66 -1149
1565a149J077N38j259K53J385n45j116J503J45j503m0J541j138p98J405K00j565
$$ -1149 -72 466 -793 -540 845 300 -816 687 832 -671 -711 830 -308 -1106 299 499 -1066
1582a066O36J392j182p06J805j76j627O63J247j677q32K528p11j566J425J032
$$ -1066 -430 962 -220 -926 879 703 -924 -261 986 -691 -1523 1005 294 -1272 153 1185
1598A185j607j17J833r82j579J577N99k028R0K079j052r96J539N62j852M81J698
$$ 1185 -422 -539 1294 312 -1267 310 909 -1119 -1029 1050 -2 -998 541 1103 -749 -268 1430
1615A430j622j032J746o9j795J052J468j592n13K025l19j510R80Q09j938K0J460
$$ 1430 -192 -1224 522 453 -1342 -290 1178 -414 -927 1098 779 -731 249 1058 -880 -860 600
1632F00p06j430J587Q81j798P70J173r70p91J190Q5j573P96Q90j053m57J499l00
$$ 600 -106 -1536 51 932 -866 -96 1077 107 -684 506 591 -982 -186 704 -349 -806 693 393
1650C93r57R30P44j194m14J142l84j166O13R22j351L4J382j96r60P97M57j004
$$ 393 -564 366 1110 -84 -498 644 260 -906 -293 629 -722 -688 694 498 -462 335 792 -212
1668b12k94J120l68j032L65R43j297L09J387o47n94P44M62j176j73J043n15p39
$$ -212 -506 614 246 -786 -421 522 -775 -466 921 274 -320 424 886 -290 -463 580 65 -674
1686f74N40O69j252N0J377o60n17P93P10j572J92P40m83q41J098L40j198mJ648
$$ -674 -134 535 -717 -667 710 50 -467 326 1036 -536 -344 396 -87 -928 170 510 -688 -692 956
1705I56o31j080J371Q7j251M02O56r10p32J619J62j778Q46J228j188m35J608n09
$$ 956 325 -755 616 703 -548 -146 510 -400 -1132 487 649 -1129 -283 945 -243 -678 930 421
1723D21j517J066O64j725L62J749q19j151J411O94j735L60J527j373r13J450j1
$$ 421 -1096 -30 634 -1091 -729 1020 201 -950 461 1155 -580 -220 1307 -66 -979 471 460
1740D60j601R58J690j778k36J512l59j402J078P27j816q6J446p04j082J387M65
$$ 460 -1141 -183 1507 -271 -507 1005 646 -756 322 1049 -767 -853 593 -111 -1193 194 659
1757F59j280J26J851j107j126J542L5j602K82J341j004n73J356L71j517N90J230
$$ 659 -621 -495 1356 249 -877 665 700 -902 -620 721 -283 -856 500 871 -646 -56 1174
1774A174j112k57J065p25j136P82N91o52k93R70J22j097R33M22p87m07N57l4q71
$$ 1174 62 -195 870 145 -991 -209 382 -270 -563 407 529 -568 365 787 0 -407 150 116 -755
1793g55N62L07p62L7J073k26o65M77L03l21n53R38k91q30M65O83n19m17J101q8
$$ -755 -193 114 -648 -611 462 236 -429 48 351 30 -523 415 124 -706 -241 442 -77 -494 607 519
1813E19q50Q18L45r07m20J055n98p22P42P66j173O7J111o16q04J000O44j976L98
$$ 519 -331 487 832 -75 -495 560 -38 -760 -18 748 -425 -358 753 137 -667 333 977 -999 -601
1832f01J195p95r27J685J40j752R37J461j450o35J472l72j331O92J253j498k66
$$ -601 594 -201 -1128 557 697 -1055 -118 1343 -107 -742 730 358 -973 -281 972 -526 -792
1849g92J760o85j024J419L42j833M26J153p67j114J682P5j634N72J572j343o79
$$ -792 968 283 -741 678 1020 -813 -387 766 -1 -1115 567 642 -992 -420 1152 -191 -870
1866h70J832k95j650J154O46j454j50J462n35j134J349J07q42NJ417j018q00J236
$$ -870 962 667 -983 171 817 -637 -787 675 140 -994 355 462 -380 -375 1042 24 -776 460
1884D60j97j196L85R23p27l25J314k61n58K97M20n43k96P35k91m25L73K09n51
$$ 460 263 -933 -548 375 -352 -677 637 376 -182 115 535 -8 -304 431 140 -285 88 297 -254
1903b54j76P52Q6k05N7K32o63l30Q05j37q31M23L91j98k19N30J21m87r8M99l39
$$ -254 -430 322 408 203 260 492 -171 -501 304 167 -664 -241 150 -48 -267 263 384 -103 -201 298 -41
1924d1l16N63K14r10j36J214q00QN89J46q83L08O60r24l54J068j67j125N60R16
$$ -41 -357 206 420 -490 -626 588 -212 -204 385 531 -352 -44 616 -308 -662 406 239 -886 -326 590
1944E90j110J14J142k44r88P55N46j466L63Q62o94r21J503L0j423Q09J110j064
$$ 590 -520 -406 736 492 -496 259 805 -661 -298 564 -130 -1051 452 482 -941 -132 978 -86
1962h6l23J294l52j213P26M43j293J7J491n26r46J154L73j474K75J104r92o11
$$ -86 -409 885 533 -680 46 489 -804 -787 704 178 -768 386 759 -715 -440 664 -328 -939
1980i39J318P3j295P83Q35j124r0J139o89p95P67O54j286L43P27k32r00Q14L57
$$ -939 379 452 -843 -60 775 -349 -439 700 11 -784 -17 637 -649 -306 421 189 -711 103 460
1999D60r22L25R13p78l31N50J06j020L86P40p30j13Q97j79n06K93L48l94m86N22
$$ 460 -462 -137 776 -2 -333 217 323 -697 -311 429 -301 -414 483 304 -202 91 439 45 -441 81
2019H1j50m66O60j2l57J44L25Q8m18K28r3O8l07N4K90l21o7L48K83o90O44J13
$$ 81 -69 -535 125 113 -244 -100 225 313 -105 123 30 98 -209 -155 135 -186 -253 95 378 -312 332 445
2041D45p30O5O55k41q92Q92N8l01k20R35n27p42J299k47p83P7J046r91n20R02
$$ 445 -285 -220 435 194 -698 194 252 -49 -269 666 139 -603 696 449 -334 -257 789 -202 -722 180
2061A80J09j187M01J308j054m90J435m27j046J250K98j371K6J187n88p62J076
$$ 180 289 -898 -497 811 -243 -733 702 275 -771 479 777 -594 -568 619 31 -731 345
2078C45j4j134O82J118j143l87J306m95q06N59N24j255K54J298p96p17J157j2
$$ 345 331 -803 -121 997 -146 -533 773 278 -528 31 555 -700 -446 852 56 -661 496 484
2096D84j289M21J092j020j47Q60R4j243Q54O44j044m8J036m19p99L94P33j028
$$ 484 -805 -384 708 -312 -459 401 495 -748 106 750 -294 -342 694 275 -524 -130 603 -425
2114d25L0J113q68l97Q55l5n30K02L74n33j08P65q4o14K51N1j12p1N76m19l3L3
$$ -425 -395 718 -150 -547 308 273 -257 -55 319 -214 -322 443 359 -255 -4 47 -65 -136 440 21 -12 21
2136B1K79l55k50M29J05l89N0K24k18jK51K17m28M7J67j4m89L17M97o36l13M98
$$ 21 300 -55 -305 124 229 -160 -110 114 -104 -105 146 363 -65 -18 149 135 -354 -37 460 -176 -489 9
2158IL3k11K78M02q25K41M55j52o64M41L97p91M03N14o69m04P04K71j011M64P29
$$ 9 42 -169 109 511 -314 -73 382 230 -434 7 404 -387 16 530 -139 -543 161 432 -579 -115 614
2179F14o87n45J083J48j273O80O91r71o5J078n43p48O06M76j188L17R01p77m96
$$ 614 -73 -618 465 613 -660 20 711 -260 -325 753 210 -538 68 544 -644 -327 574 -203 -699
2198f99J034J69j028N30P58p81j29O09q3j265P92P27r87j18J374q60n31Q21kr26
$$ -699 335 504 -524 6 764 -17 -146 463 380 -885 -93 634 -353 -471 903 43 -488 333 331 -595
2218e95M34O65n22l95P21j78n94L90N67n46k36P13l74n67N00N58p32K19M65m91
$$ -595 -161 504 -18 -413 308 130 -464 -74 493 -53 -289 424 50 -517 -17 541 -191 28 493 2
2238Bl91M60J9k35J44L03m13j33L11L10p97L62K31l0k46J60J46l92O4JJ43j15
$$ 2 -389 71 90 -145 -1 302 -111 -244 67 377 -420 -58 173 143 -103 57 203 -189 -125 -124 19 -96
2260i6K0R3K7oJ43j62o2m29O53n6l43P73k00n60R5M20l90k95N73J02m99K39K37
$$ -96 -76 17 44 38 181 19 -43 -472 181 125 -218 555 355 -205 -110 310 -80 -375 198 300 -199 40 277
2283B77m83j15O12r2q40P24M36q09J29P03n41n32O16N40j209K70J021r34l70J036
$$ 277 -206 -321 291 199 -641 83 519 -290 -161 542 1 -531 85 625 -584 -314 707 -227 -597 439
2303D39k86q77P54O40j110J34P46k52p26P16M29j080J15J091q21o72J243p8j017
$$ 439 153 -724 30 670 -440 -306 440 188 -538 178 607 -473 -358 733 -88 -760 483 405 -612
2322f12M34R11j222j21J042q2j031R52K83j103R3R34n31m65O06L28j141P14M27
$$ -612 -178 733 -489 -610 432 350 -681 271 554 -549 -456 478 -53 -518 88 416 -725 -11 416
2341D16o06j85P91k10o40M62N30p87L1O51m72k80M23K71m25j54N23j26n94M37
$$ 416 -190 -375 416 206 -434 28 558 -229 -198 453 -19 -299 124 395 -30 -184 339 213 -381 56
2361E6n7l41J26K81j16J23K68l56PJ38J21l80J20N0j95J36j38n4M59j26L7J10
$$ 56 -1 -342 -216 65 -51 72 340 -16 -9 129 250 -130 -10 40 -155 -19 -157 -211 248 122 159 269
2383B69k55k08K00K78l16l2J90M6m83N46o1l90J09M88j72o28P10r2n91K29K89
$$ 269 14 -194 6 284 -32 -64 126 172 -311 235 174 -216 -107 381 209 -419 291 199 -392 -163 126
2404A26j58k99Q95k31p89O19N99j084O2O42n52m94Q69M41j030J48P75o06n19J218
$$ 126 -32 -331 564 333 -456 163 762 -322 -260 382 -170 -664 205 646 -384 -236 539 -67 -586 632
2424F32n71p26O11P52r42l10J156m45p55J047K4r25K54R18p93l84P25r4r96N58
$$ 632 61 -665 -54 698 -244 -554 602 157 -598 449 473 -452 -198 720 -73 -457 268 174 -822 -264
2444b64O26m47k34R21m83l92M95L78j036M84L01l80m77P47k48k09L60J76l94l4
$$ -264 362 -85 -319 602 119 -273 222 600 -436 48 349 -31 -508 239 -9 -218 142 318 -76 -110
2464a10M66n78p4K20K11k92l9L85j02j50L17j58j13r0L17l01j76L34Q4l53p7J76
$$ -110 356 -222 -296 -76 135 -157 -196 189 87 -63 254 96 -17 -107 210 -91 -267 67 151 -202 -279 -103
2486a03J69j51J1L65q8k08m36L46J51l75J21L13l60P2O45l13k00J41R5k17L01
$$ -103 66 -85 -74 291 203 -5 -441 -95 56 -319 -198 115 -245 -173 472 159 -41 100 195 -22 279
2507B79j9m02j67L53k90L6M35K89m68k0M40n74j51N27n8o99M44K57m24LP30k04
$$ 279 260 -142 -309 44 -246 -210 225 514 46 26 466 -108 -259 268 210 -489 -45 212 -212 -209 521 317
2529C17p26Q13M3o20p6Q62n67p14R20r1m45J34Q73p85m25J152m74o77L85K08n06
$$ 317 -409 404 447 -173 -249 613 46 -668 252 161 -284 -150 723 -62 -487 665 191 -486 -101 107 -399
2550c99j1J023o26p05R89J37p32K44P25p74j12L46p0o18Q43K11o71K30O37m36
$$ -399 -410 613 -13 -718 271 408 -324 -80 645 -129 -241 105 35 -583 260 471 -200 30 667 231
2570B31m09M65J53q47L53M07k79m41N07K07n16K33O6j29j61L08n8l86J9L26l37
$$ 231 -178 287 440 -407 -54 353 74 -367 140 347 -169 64 130 1 -160 148 90 -296 -277 49 -288
2591b88Q8L32j78J67J38L1o5j96K11k73k7l18K11R8k48K57J42o1Jl0L24m13QQ9
$$ -288 -200 132 -46 121 259 290 225 29 240 -33 -60 -378 -167 -69 -317 -60 82 21 22 -8 316 -97 -89 0
2615@j13j37K0M20n40J82M96l30N7L33j72n25J40N65p45j28N18j2k49M67L10r93
$$ 0 -113 -250 -230 190 -350 -168 328 -2 55 388 216 -309 -169 396 -349 -477 41 29 -220 247 557 -436
2637d36M78M62n49l88L13K30n61L54K26j93l67J121l06o88N66J13q13n7Q83o13
$$ -436 42 504 -45 -433 -120 110 -451 -97 129 -64 -431 690 384 -304 262 375 -438 -495 388 -225
2657b25n35P35K35o42M60N51m04k63M88m43n09N81j6o14R5R54n09j21N16J90p24
$$ -225 -760 -25 210 -432 28 579 175 -88 400 -43 -552 29 13 -601 -506 448 -61 -182 334 524 -200
2678b00K58P07o26n56P55l11n69L45L69j71P2M89m12k56J24K21m16J00O6j85j85
$$ -200 58 765 139 -417 338 27 -542 -197 172 1 73 562 150 -106 18 239 -177 -77 -11 -196 -381
2699c81K79QM9J63K37k98RK7k64k06M16j16j26K02n4J30J72m6j81o5J61k25j03
$$ -381 -102 -94 -45 118 355 57 66 93 -171 -377 39 -77 -203 -1 -55 75 247 201 20 -45 116 -109 -212
2722b12J18m89K67L93k4n9L29q5m3K14k82o4l30L28m50O6K81j8k19K54L91j95
$$ -212 -94 -583 -316 77 53 -6 323 238 195 409 127 63 -267 61 -389 -323 -42 -60 -279 -25 366 171
2744A71r4O08o31l41K67M3j79l59O25k29J65K08K83o93L64K53m71k94L17l2m65
$$ 171 77 685 54 -287 -20 23 -156 -515 110 -119 46 254 537 -156 208 461 -10 -304 13 -19 -484
2765d84K68N23l84j42O53j29l78M42O8o75N3J84o9m47O68k07l71L99O31n72k12
$$ -484 -216 307 -77 -219 434 305 -73 369 437 -238 -185 -1 -70 -517 151 -56 -427 -28 603 31 -181
2786a81O43m18o56M63N01p94J10O62k76m72R40j9p09K60L29m47m39O02j40k77
$$ -181 462 44 -612 -149 352 -442 -332 330 54 -418 522 503 -206 54 383 -64 -503 99 -41 -318
2806c18M90n1l99L95O76n89m04M31l43k17J3L44j05l54O83j75j77K56J08j21q2
$$ -318 172 121 -278 117 793 204 -200 231 -112 -329 -316 28 -77 -431 252 77 -100 156 264 143 61
2827F1K19k56l69JL21q0Q6J33Q8L4N6J36l71n1m13K32Q4k91K48mJ65J9K55m5j32
$$ 61 280 24 -345 -344 -23 -103 -17 116 204 238 294 430 59 8 -405 -173 -89 -380 -132 -136 29 48 303 258 126
2852A26J22R2p63l0M63k09j73M90N2k82K59K23m58R8J11o6m74L48R5m13J07M77
$$ 126 248 340 -423 -453 10 -199 -372 118 170 -112 147 370 -88 10 121 55 -419 -71 24 -389 -282 195
2874A95j98k78M41K15l47M9L79o80m70P31l8m62L58L95j65k47P67m24k93L51P
$$ 195 -3 -281 160 375 28 77 456 -224 -694 37 -1 -463 -105 290 125 -122 645 221 -72 279 286
2895B86o97J01N02l05l20P29k48l27M52L90l14m91N80k86o40L49J82k69J82O00
$$ 286 -411 -310 192 -113 -433 296 48 -279 173 563 249 -242 338 52 -588 -239 -57 -326 -144 456
2915D56m46L7K34j9l25J7L72m75j85L66m6m86O05J22p7P2J83k80r6J63j37m64
$$ 456 10 47 281 262 -63 -46 326 -149 -334 32 -14 -500 105 227 150 222 405 125 29 192 55 -409
2937d09J99o6J0L19n8K98l03L84k49K61j75l17J19l80J17j39O50j53j36K58p9
$$ -409 -210 -276 -266 53 -5 293 -10 374 125 386 211 -106 13 -367 -250 -389 261 108 -28 230 151
2958A51L6R5o7l31o0R6j04j65K21L50j70j78M96k59n5J61j88k27J24k0Mj35L86
$$ 151 187 282 215 -116 -176 -80 -184 -349 -128 222 52 -126 370 111 56 217 29 -198 -74 -94 -90 -225 161
2981A61j01l15M58J89k80k08M59l54n34K85K10n42L57M89k20q6L81P1m44K94p8
$$ 161 60 -255 203 392 112 -96 363 9 -525 -240 -30 -572 -215 274 54 -32 349 420 -24 270 192
3002A92k55l54M05j13k58N23J85l98K84L27j92l94K07k5m47NK58j31j98O18K05
$$ 192 -63 -417 -12 -125 -383 140 325 -73 211 538 346 -48 159 134 -313 -308 -50 -181 -379 239 444
3023D44n16M16K75p33O0K60j93l21K62J3m86N11R6j6j69L70m5k26NQ5k53o3k3
$$ 444 -72 344 619 -114 -54 206 13 -308 -46 -33 -519 -8 88 72 -97 273 228 2 7 92 -161 -224 -247
3046b47j05K08J61K55m3r2J43J76k19l56J32k05j25j59K90J05K2M69j84N0J94
$$ -247 -352 -144 17 272 229 137 280 456 237 -119 13 -192 -317 -476 -186 -81 -59 410 226 276 470
3067D70k04n30n1J67j29K40k13K7N05m21K71j5K61m98L73l75J20j56K01m64J93
$$ 470 266 -264 -315 -148 -277 -37 -250 -223 282 -139 132 117 378 -120 253 -122 -2 -158 43 -421 -228
3088b28K98J18j69K52N2k52J09j7m49R2L08n57K31J98L22l15L67K32j20n14K81
$$ -228 70 188 19 271 323 71 180 163 -286 -194 114 -443 -212 -14 308 -7 360 592 472 -42 239
3109B39j70l98J38M08n02J89L37j01j34L59j09m42J69L57m38n53N53K55o48N82
$$ 239 69 -329 -191 217 -285 -96 241 140 6 365 256 -186 -17 340 -98 -651 -98 157 -491 91
3129I1J62j64j08M08p7k78K00m1p82N11N7o2p9K24K49n33L94J68l11K5J65m06
$$ 91 253 89 -19 389 312 34 234 193 -589 -78 -21 -83 -162 62 311 -222 172 340 29 54 219 -187
$$ [...]
8191g
##END NTUPLES=NMR FID
##END=
