##TITLE=1H_UK-24
 CD2Cl2
 8 sc, 
 8.12.2021
##JCAMPDX= 6.0         $$ Bruker NMR JCAMP-DX V2.0
##DATA TYPE= NMR FID
##DATA CLASS= NTUPLES
##ORIGIN= UXNMR, Bruker Analytische Messtechnik GmbH
##OWNER= root
$$ XWIN-NMR		Version 3.5
$$ Wed Dec  8 10:59:54 2021 Russian Standard Time (UT+4h)  she@DPX200
##.OBSERVE FREQUENCY= 200.131346
##.OBSERVE NUCLEUS= ^1H
##.DELAY= (6, 6)
##.ACQUISITION MODE= SIMULTANEOUS
##.ACQUISITION SCHEME= undefined
##.AVERAGES= 8
##.DIGITISER RES= 18
##SPECTROMETER/DATA SYSTEM= spect
##.PULSE SEQUENCE= zg30
##.SOLVENT NAME= CD2Cl2
##.SHIFT REFERENCE= (INTERNAL, CD2Cl2, 0, 15.7039)
##AUDIT TRAIL= $$ (NUMBER, WHEN, WHO, WHERE, WHAT)
$$ ##TITLE= Audit trail, XWIN-NMR		Version 3.5
$$ ##JCAMPDX= 5.01
$$ ##ORIGIN= Bruker BioSpin GmbH
$$ ##OWNER= she
$$ F:/spectra/data/she/nmr/H-F/1/audita.txt
$$ ##AUDIT TRAIL=  $$ (NUMBER, WHEN, WHO, WHERE, WHAT)
(   1,<2021-12-08 10:58:42.53 +0400>,<she>,<DPX200>,
      <created by zg, POWCHK disabled, PULCHK disabled
       configuration hash MD5:
       00 E9 B6 7A A2 85 ED C7 34 08 36 98 17 FE 4E 26
       data hash MD5: 16K
       09 73 CC 86 87 D8 D1 74 A8 63 BE 8C 90 CE 65 31>)
$$ ##END=
$$ 
$$ hash MD5
$$ D3 8E 1F D7 8C 01 14 39 E7 AE 61 8F 15 A9 2D C7
##$RELAX= 
##$RELAX= 
##$RELAX= 
##$RELAX= 
##$RELAX= 
##$RELAX= 
$$ Bruker specific parameters
$$ --------------------------
##$DU= <F:/spectra>
##$EXPNO= 1
##$NAME= <H-F>
##$PROCNO= 1
##$TYPE= <nmr>
##$USER= <she>
##$AMP= (0..31)
100 100 100 100 100 100 100 100 100 100 100 100 100 100 100 100 100 100 
100 100 100 100 100 100 100 100 100 100 100 100 100 100 
##$AQSEQ= 0
##$AQ_mod= 1
##$AUNM= <au_zg>
##$AUTOPOS= <>
##$BF1= 200.13
##$BF2= 200.13
##$BF3= 200.13
##$BF4= 200.13
##$BF5= 200.13
##$BF6= 200.13
##$BF7= 200.13
##$BF8= 200.13
##$BYTORDA= 1
##$CFDGTYP= 0
##$CFRGTYP= 5
##$CHEMSTR= <none>
##$CNST= (0..31)
1 1 145 1 1 1 1 1 1 1 1 1 1 1 1 1 1 1 1 1 1 1 1 1 1 1 1 1 1 1 1 1 
##$CPDPRG= <>
##$CPDPRG1= <>
##$CPDPRG2= <>
##$CPDPRG3= <>
##$CPDPRG4= <mlev>
##$CPDPRG5= <mlev>
##$CPDPRG6= <mlev>
##$CPDPRG7= <mlev>
##$CPDPRG8= <mlev>
##$CPDPRGB= <>
##$CPDPRGT= <>
##$D= (0..31)
0 1.2 0 0 0 0 0 0 0 0.06 0 0.03 0 0 0 0 0.0002 0 0 0 0 0 0 0 0 0 0 0 0 
0 0 0 
##$DATE= 1638946721
##$DBL= (0..7)
120 120 120 120 120 120 120 120 
##$DBP= (0..7)
150 150 150 150 150 150 150 150 
##$DBP07= 0
##$DBPNAM0= <>
##$DBPNAM1= <>
##$DBPNAM2= <>
##$DBPNAM3= <>
##$DBPNAM4= <>
##$DBPNAM5= <>
##$DBPNAM6= <>
##$DBPNAM7= <>
##$DBPOAL= (0..7)
0.5 0.5 0.5 0.5 0.5 0.5 0.5 0.5 
##$DBPOFFS= (0..7)
0 0 0 0 0 0 0 0 
##$DE= 6
##$DECBNUC= <off>
##$DECIM= 32
##$DECNUC= <off>
##$DECSTAT= 4
##$DIGMOD= 1
##$DIGTYP= 9
##$DL= (0..7)
0 120 120 120 120 120 120 120 
##$DP= (0..7)
150 150 150 150 150 150 150 150 
##$DP07= 0
##$DPNAME0= <>
##$DPNAME1= <>
##$DPNAME2= <>
##$DPNAME3= <>
##$DPNAME4= <>
##$DPNAME5= <>
##$DPNAME6= <>
##$DPNAME7= <>
##$DPOAL= (0..7)
0.5 0.5 0.5 0.5 0.5 0.5 0.5 0.5 
##$DPOFFS= (0..7)
0 0 0 0 0 0 0 0 
##$DQDMODE= 0
##$DR= 18
##$DS= 0
##$DSLIST= <SSSSSSSSSSSSSSS>
$$ [...]
##$SUBNAM2= <"">
##$SUBNAM3= <"">
##$SUBNAM4= <"">
##$SUBNAM5= <"">
##$SUBNAM6= <"">
##$SUBNAM7= <"">
##$SUBNAM8= <"">
##$SUBNAM9= <"">
##$SW= 18.0517287032376
##$SWIBOX= (0..15)
0 0 2 0 0 0 0 0 0 0 0 0 0 0 0 0 
##$SW_h= 3612.71676300578
##$TD= 16384
##$TD0= 1
##$TE= 0
##$TE2= 300
##$TE3= 300
##$TEG= 300
##$TL= (0..7)
0 120 120 120 120 120 120 120 
##$TP= (0..7)
150 150 150 150 150 150 150 150 
##$TP07= 0
##$TPNAME0= <>
##$TPNAME1= <>
##$TPNAME2= <>
##$TPNAME3= <>
##$TPNAME4= <>
##$TPNAME5= <>
##$TPNAME6= <>
##$TPNAME7= <>
##$TPOAL= (0..7)
0.5 0.5 0.5 0.5 0.5 0.5 0.5 0.5 
##$TPOFFS= (0..7)
0 0 0 0 0 0 0 0 
##$TUNHIN= 0
##$TUNHOUT= 0
##$TUNXOUT= 0
##$USERA1= <user>
##$USERA2= <user>
##$USERA3= <user>
##$USERA4= <user>
##$USERA5= <user>
##$V9= 5
##$VALIST= <valist>
##$VCLIST= <CCCCCCCCCCCCCCC>
##$VD= 0
##$VDLIST= <DDDDDDDDDDDDDDD>
##$VPLIST= <PPPPPPPPPPPPPPP>
##$VTLIST= <TTTTTTTTTTTTTTT>
##$WBST= 1024
##$WBSW= 4
##$XGAIN= (0..3)
0 0 0 0 
##$XL= 0
##$YL= 0
##$YMAX_a= 222461
##$YMIN_a= -156741
##$ZGOPTNS= <>
##$ZL1= 120
##$ZL2= 120
##$ZL3= 120
##$ZL4= 120
##$ABSF1= 10
##$ABSF2= 0
##$ABSG= 5
##$ABSL= 3
##$ALPHA= 0
##$AQORDER= 0
##$ASSFAC= 0
##$ASSFACI= 0
##$ASSFACX= 0
##$ASSWID= 0
##$AUNMP= <proc_1d>
##$AZFE= 0.1
##$AZFW= 0.1
##$BCFW= 1
##$BC_mod= 2
##$BYTORDP= 1
##$COROFFS= 0
##$CY= 11.3945322036743
##$DATMOD= 1
##$DC= 2
##$DFILT= <>
##$DTYPP= 0
##$F1P= 2.36226072786647
##$F2P= -0.459571619588291
##$FCOR= 0.5
##$FTSIZE= 0
##$FT_mod= 4
##$GAMMA= 1
##$GB= 0.15
##$INTBC= 1
##$INTSCL= 1
##$ISEN= 128
##$LB= 0.24
##$LEV0= 0
##$LPBIN= 0
##$MAXI= 10000
##$MC2= 0
##$MEAN= 0
##$ME_mod= 0
##$MI= 1.114404
##$NCOEF= 0
##$NC_proc= 0
##$NLEV= 6
##$NOISF1= 3.799351
##$NOISF2= 2.8
##$NSP= 1
##$NTH_PI= 0
##$NZP= 0
##$OFFSET= 15.70392
##$PC= 1
##$PHC0= -15515.62
##$PHC1= 13.8008
##$PH_mod= 1
##$PKNL= yes
##$PPARMOD= 0
##$PSCAL= 0
##$PSIGN= 0
##$REVERSE= no
##$SF= 200.130013532006
##$SI= 16384
##$SIGF1= 3
##$SIGF2= 2
##$SINO= 400
##$SIOLD= 16384
##$SREGLST= <1H.CDCl3>
##$SSB= 0
##$STSI= 0
##$STSR= 0
##$SW_p= 3612.71676300578
##$SYMM= 0
##$S_DEV= 0
##$TDeff= 0
##$TDoff= 0
##$TI= <>
##$TILT= no
##$TM1= 0
##$TM2= 0
##$TOPLEV= 0
##$USERP1= <user>
##$USERP2= <user>
##$USERP3= <user>
##$USERP4= <user>
##$USERP5= <user>
##$WDW= 1
##$XDIM= 8192
##$YMAX_p= 0
##$YMIN_p= 0
$$ End of Bruker specific parameters
$$ ---------------------------------
##NTUPLES= NMR FID
##VAR_NAME=  TIME,          FID/REAL,        FID/IMAG
##SYMBOL=    X,             R,               I
##VAR_TYPE=  INDEPENDENT,   DEPENDENT,       DEPENDENT
##VAR_FORM=  AFFN,          ASDF,            ASDF
##VAR_DIM=   8192,          8192,            8192
##UNITS=     SECONDS,       ARBITRARY UNITS, ARBITRARY UNITS
##FACTOR=    0.0002768,     1,               1
##FIRST=     0,             0,               0
##LAST=      2.2672688,     0,               0
##MIN=       0,             -156741,         0
##MAX=       2.2672688,     222461,          0
$$ Real data points
##PAGE= N=1
##DATA TABLE= (X++(R..R)), XYDATA
0 0 0 0 0 0 0 0 0 0 0 0 0 0 -8 8 -8 8 -8 16 -16 24 -24 32 -40 41 -48 57 -70 80 -93 105 -121 137 -158 177
34 177 -200 225 -255 286 -319 355 -395 440 -489 541 -597 659 -729 804 -886 975 -1075 1184
52 1184 -1305 1440 -1591 1760 -1953 2172 -2428 2731 -3090 3530 -4080 4795 -5760 7144 -9305
67 -9305 13188 -22352 94091 11312 -27104 222461 51994 -87511 113869 120574 -123328
78 -123328 -298 138970 -69603 -102484 121183 6355 -149975 40082 72072 -150765
88 -150765 -61396 88735 -92026 -138176 72188 899 -149908 24083 90669 -103489 -33794
99 -33794 132446 -23297 -87321 108869 52687 -111366 33393 100372 -93994 -55358 105485
110 105485 -35939 -116510 73873 43715 -119897 20491 113029 -67298 -36798 134872 11217
121 11217 -81477 96943 83062 -89378 22774 126306 -47834 -46647 128654 25640 -85943
132 -85943 79142 84996 -94160 -13559 92190 -76397 -111261 50482 -29993 -156741 -6449
143 -6449 35093 -125931 -52675 85071 -45704 -82735 84384 34943 -93528 33253 86012
154 86012 -70203 -28438 107026 -5604 -60460 98422 71642 -58392 52257 114279 -38789
165 -38789 -22835 99969 -9947 -89019 47056 29807 -105085 -9968 71227 -64448 -53014
176 -53014 86139 1036 -79175 56078 55256 -81887 -5532 79576 -52477 -64250 72996
187 72996 2569 -90714 38734 57823 -79848 -15692 81506 -41764 -68952 64616 8196
198 8196 -96027 17666 53364 -80300 -33729 77482 -27607 -65812 71478 39421 -66056
209 -66056 37939 89433 -37431 -10915 99280 5138 -55832 65305 43857 -74034 8176
220 8176 68699 -54401 -43915 70950 -6584 -73085 42857 38946 -78117 -11090 58067 -58431
232 -58431 -65976 49931 -13817 -87958 27164 43173 -65880 -1427 82648 -20200 -36137
243 -36137 76977 22384 -65778 31447 51562 -66274 -21158 67369 -28321 -52962 64183
254 64183 27709 -59765 32571 65591 -49232 -22184 66675 -23433 -68039 42100 18203 -76152
266 -76152 8857 59994 -45341 -24590 74956 702 -54039 49374 37645 -66215 -1292
277 -1292 56871 -48348 -46380 57494 -3538 -65892 37005 43698 -56937 -851 67856 -28977
289 -28977 -42968 58478 8550 -66845 24884 43494 -59558 -15386 62543 -24907 -46692 55908
301 55908 20701 -57389 25475 54608 -46104 -17290 62842 -17215 -53958 43877 17550 -65911
313 -65911 8414 47875 -46684 -26162 59890 -6937 -49770 44160 30976 -57639 4238 50525
325 50525 -44422 -38375 49636 -8494 -57867 35342 37912 -47110 9363 68518 -18260 -25310 63110
338 63110 11617 -54471 27583 36142 -57188 -14042 52643 -27290 -42161 51048 15118 -54471
350 -54471 21860 42518 -52241 -24841 44485 -32578 -61344 30017 5891 -64226 9969 46590
362 46590 -36646 -14045 63910 662 -37301 47178 31325 -48448 9989 49720 -34511 -24612
374 -24612 53866 307 -42521 38452 35344 -43449 4545 51255 -29733 -33678 43743 -3834
386 -3834 -55962 20517 26778 -51098 -7977 47966 -23189 -33006 47615 12206 -46821 24096 39518
399 39518 -43445 -13208 46831 -24117 -46232 33291 5404 -58742 6473 33612 -44580 -21767
411 -21767 47977 -12239 -41908 39074 22588 -47105 11127 45886 -31290 -18409 53389 2557
423 2557 -33190 44462 40857 -29500 18993 60448 -15786 -18009 49544 38 -49404 16708 16293
436 16293 -56267 -17444 31255 -34303 -40101 33964 222 -50127 15348 26164 -46923 -16414
448 -16414 36002 -26604 -40391 33367 9711 -42146 21112 44610 -25010 -1241 56792 -3019
460 -3019 -29276 39974 17063 -46129 6977 33612 -37194 -21534 42559 -6286 -36435 36006
472 36006 27558 -36910 11461 45902 -24506 -19762 44559 -473 -39022 27356 26758 -38583 797
485 797 42832 -22053 -27197 37583 356 -46618 12670 18075 -49698 -19573 26298 -32272 -43183
498 -43183 22720 -1358 -48240 10714 30337 -31662 -5437 48560 -3219 -21019 44167 24411
510 24411 -28395 21225 42436 -21893 -7210 46907 -1118 -27113 36396 23649 -33701 10620
522 10620 36775 -28850 -23091 30874 -14374 -47694 12495 8293 -48410 -6697 30970 -25905
534 -25905 -22097 39834 4141 -32902 24694 25118 -36136 -5390 32355 -24074 -31091 29343 2495
547 2495 -38737 17088 28919 -30327 -4550 39188 -13560 -28581 28880 6393 -39504 9586
559 9586 28587 -27773 -7733 43628 171 -18601 40654 26221 -24574 18087 38465 -21545
571 -21545 -13625 34460 -8527 -36519 18952 11205 -41160 -2735 26427 -29714 -25732 27108 -9331
584 -9331 -41000 12720 12045 -40749 -7675 27488 -23085 -24274 32153 5264 -29225 23692 31069
597 31069 -22522 4472 42487 -7153 -17484 35024 10635 -31595 13117 24904 -29886 -10448
609 -10448 32263 -11356 -26138 28032 12251 -30818 10672 28506 -24961 -13666 30151 -9718
621 -9718 -32365 20060 11570 -33894 4967 30941 -19392 -12493 34423 -933 -28672 18811 13577
634 13577 -36753 -7001 21843 -27515 -26563 24875 -2311 -31347 19242 23418 -24466 2460 34977
647 34977 -11653 -18263 29718 5519 -29909 14954 24532 -23733 -1637 36388 -5486 -16544
659 -16544 31924 12480 -27216 10773 22385 -28144 -15190 23416 -15410 -31767 17623 6919
671 6919 -32900 5053 25239 -21317 -11879 30153 -4479 -26705 19162 13061 -30227 1250 26333
684 26333 -19645 -15207 29578 479 -24826 21111 20427 -24480 1930 29489 -15175 -18612 25645
697 25645 534 -30871 12116 17554 -27539 -4455 29030 -11273 -17962 28215 8797 -25446
709 -25446 13346 22760 -23822 -8798 25534 -12609 -25924 19894 6511 -28973 8202 24346
721 24346 -18910 -7534 29361 -4507 -23365 18879 9228 -30526 411 20245 -22030 -14777
733 -14777 26007 -1864 -21568 21268 18659 -21409 4224 27056 -15597 -16636 23319 -2690
745 -2690 -28701 12073 15146 -24983 -746 27613 -10014 -14269 26571 5777 -25176 10717 16567
758 16567 -26623 -9204 22142 -13999 -22561 20574 6387 -24245 10981 23128 -17732 -5640
770 -5640 27238 -5729 -21138 19372 8842 -25948 4628 21269 -17869 -9419 26579 -1044
782 -1044 -19066 19595 14462 -22016 2955 22079 -17311 -16063 20025 -5439 -27374 10330 10081
795 10081 -25499 -2201 22212 -13115 -14401 23547 3451 -22327 12827 16241 -22562 -3962
807 -3962 22569 -11823 -17075 21722 6416 -20562 13321 21976 -15928 -2059 26326 -6704 -18758
820 -18758 17972 4319 -26945 3462 16048 -20396 -9386 23113 -3357 -17366 19899 13031
832 13031 -20055 5376 20894 -16873 -12656 19012 -5806 -23527 12357 10165 -22023 1249
844 1249 21488 -11938 -12157 21029 -715 -23244 8945 9333 -24979 -5745 17636 -13448 -15073
857 -15073 20808 5458 -17178 15194 21289 -13590 1492 25976 -5396 -13809 20106 5848
869 5848 -20801 8084 16870 -17255 -5593 21943 -5856 -17310 16277 6150 -23674 1843
881 1843 13711 -20815 -13809 15385 -9062 -22369 11609 7906 -20687 3413 20994 -11097 -7632
894 -7632 23264 1266 -17023 13898 11420 -20011 -877 18024 -12396 -12711 18792 2146 -17765
907 -17765 12463 15597 -15828 -452 20790 -9007 -14002 16696 2067 -20293 7962 15005 -15391
920 -15391 -1910 23059 -3284 -11243 20442 8012 -18561 6148 13714 -19413 -11097 13889 -10915
933 -10915 -21686 9951 3723 -21807 2013 15859 -14740 -8991 18402 -3990 -18181 11542
945 11542 7574 -19120 1586 18479 -9410 -6651 22795 5530 -11763 17226 16608 -12764 2855
958 2855 19865 -9448 -12707 15005 -1045 -20520 6325 10614 -17964 -3739 17818 -8091 -13702
971 -13702 15933 3320 -19026 5408 11976 -17454 -7207 15837 -7287 -15658 14398 6297 -17229
984 -17229 6353 16990 -12529 -6158 17814 -4639 -16987 10460 4912 -20316 -208 13698
996 13698 -12957 -8690 18381 821 -12924 15027 13504 -12825 3817 19060 -7847 -8826 16725
1009 16725 1046 -16172 9260 11507 -14715 -333 18078 -7223 -11270 14822 1006 -18942
1021 -18942 3508 7538 -19415 -9008 11407 -10510 -16161 11909 4141 -15728 7158 15518 -10845
1034 -10845 -3155 18349 -3190 -13122 12744 6053 -16596 3812 14804 -10746 -5012 18618 131
1047 131 -12032 13522 9151 -15172 1403 13482 -12170 -10791 13188 -2567 -16531 8794 9635
1060 9635 -14235 1247 17158 -6532 -8096 15832 1948 -15401 6483 8761 -16263 -4751
1072 -4751 13240 -8879 -12396 12808 3041 -15020 6667 12132 -12248 -3819 14794 -6255 -13471
1085 -13471 10716 3290 -16642 3553 13195 -10918 -3762 17820 -627 -9569 14347 8847 -12884
1098 -12884 3290 13450 -11405 -8596 13085 -3345 -15310 8917 7531 -14208 1371 14658
1110 14658 -8095 -7979 13873 -296 -15670 6189 6928 -15855 -3101 12792 -8046 -9608 14076
1123 14076 3299 -12066 8802 12594 -10716 -1692 14685 -5746 -11749 10724 2489 -15626 4108
1136 4108 11196 -11048 -3347 15360 -2671 -10007 12058 5693 -14128 1983 10475 -12494 -8256
1149 -8256 11642 -4150 -13689 9332 7094 -12630 3090 14617 -7160 -5614 14337 -299 -13009
1162 -13009 7306 6914 -14352 -1094 12742 -7811 -7601 13852 2505 -11306 8738 10383 -11392
1175 -11392 -1689 12590 -7476 -11169 10120 319 -15026 4351 9700 -11099 -1951 14493 -2950
1188 -2950 -8839 11774 4786 -13296 3095 9649 -12241 -6640 11189 -4787 -11952 9325 5495
1201 5495 -12195 3163 12335 -8190 -5511 12679 -2196 -12876 7529 5536 -13306 750 12324
1214 12324 -6857 -5105 14937 2864 -8826 10672 10552 -9967 446 13024 -7094 -9624 10196
1227 10196 -551 -14155 4361 7177 -12024 -2488 11752 -5657 -10263 9379 1097 -14744 2120
1240 2120 7086 -12734 -5680 10681 -4805 -9723 10882 6072 -9505 6146 13594 -6448 -2773
1253 -2773 13745 -1429 -10546 8497 4412 -13037 1225 10516 -8101 -5097 12967 490 -9824
1266 -9824 8714 7705 -11445 174 10846 -8278 -8295 10561 -395 -11808 7009 8248 -9991
1279 -9991 246 12767 -5001 -7865 10421 433 -13969 2269 5161 -14162 -6019 8526 -7030
1292 -7030 -10447 8688 3129 -10976 4993 10819 -7891 -2175 12793 -1760 -8478 10161 6008
1305 6008 -9487 4866 12946 -5044 -1651 14746 1432 -7818 9661 6429 -11754 -166 8330
1318 8330 -10260 -9252 7534 -3877 -13376 4591 4986 -11866 -1018 10959 -6460 -7263 10251
1331 10251 399 -11715 4889 6623 -11136 -2128 10942 -4864 -7416 11012 3974 -9322 5932
1344 5932 9697 -8773 -2892 10607 -4766 -10132 7758 2521 -11414 2951 10196 -6537 -1751
1357 -1751 13737 1023 -6434 10783 6722 -9256 2482 9323 -7965 -5964 9273 -2274 -11192
1370 -11192 5777 5107 -11171 -408 9087 -8227 -8733 7463 -3242 -13712 2896 3323 -12500
1383 -12500 -2617 9579 -5133 -5879 11840 4284 -7146 8223 10647 -6524 232 12041 -3192
1396 -3192 -6811 9381 2945 -9832 4385 8941 -7704 -2228 11319 -2787 -8313 7878 2519
1409 2519 -11497 685 6499 -9892 -5887 8867 -2703 -9512 7618 5423 -8909 2374 10570
1422 10570 -6267 -5066 9438 -1714 -10804 4472 3647 -11813 -1558 8560 -6674 -6318 9688
1435 9688 1117 -8736 6352 7358 -8614 -603 10036 -4244 -6810 9406 2471 -8542 6140
1448 6140 9646 -5969 935 12853 -1411 -5835 8895 2759 -10528 1546 5465 -10302 -5987
1461 -5987 7326 -4610 -9764 6570 3118 -10136 1819 8222 -7344 -5069 8318 -2461 -9877
1474 -9877 5391 4304 -9706 1245 9809 -4594 -2996 11615 1812 -7086 7259 6497 -8595
1487 -8595 -669 8351 -6204 -7170 7637 226 -9572 4690 7078 -7881 -493 10350 -3370 -6177
1501 -6177 8223 1548 -10042 2624 6056 -8688 -3138 8830 -3283 -7336 8256 3728 -8543
1514 -8543 3334 7894 -7049 -3782 8435 -3108 -9247 5177 2985 -10268 1135 8290 -5851
1527 -5851 -3228 10262 425 -7337 6797 5645 -8201 204 8087 -6241 -6064 8036 -276 -8454
1541 -8454 5451 6526 -7059 435 9565 -3732 -5790 7678 200 -9992 2350 4674 -9255
1554 -9255 -3230 7755 -3665 -6517 8135 3146 -7755 4137 7837 -6708 -2622 8268 -3177
1567 -3177 -7803 6386 3007 -8406 2765 8857 -4734 -1789 10128 -106 -6544 6220 3666
1580 3666 -9209 -330 6125 -7191 -6115 6899 -1617 -8676 5010 4709 -7825 188 7939 -5127
1594 -5127 -5522 7221 -202 -8883 3548 5108 -7876 -927 9175 -2593 -4390 9233 3313 -6570
1608 -6570 4652 7115 -6443 -1897 8133 -3719 -7110 6038 1577 -8725 2216 6733 -6052
1621 -6052 -2074 8752 -1448 -6483 6137 3198 -8683 888 6420 -6908 -4496 7547 -1556
1634 -1556 -7160 5619 4323 -7173 897 7428 -5358 -5526 6447 -1589 -9409 2670 2901 -8693
1648 -8693 -1048 7469 -3500 -4036 9024 3030 -5446 5573 7349 -5501 -383 8589 -2736 -5131
1662 -5131 7413 2619 -6964 4305 7305 -5356 -1321 7956 -2747 -7438 4365 326 -10530
1675 -10530 -1031 3372 -8809 -5388 5626 -2745 -7108 5704 3665 -6660 1842 7397 -4731
1688 -4731 -3267 7663 -701 -6847 5090 4576 -6414 687 8034 -3428 -3029 8260 1026 -6475
1702 -6475 4409 4855 -7084 -1207 6413 -4486 -5212 6465 1321 -6486 4214 6674 -4761 125
1716 125 8611 -1576 -4756 6306 1675 -8463 1110 3965 -7797 -4496 5121 -3709 -7623 4461
1730 4461 1629 -8266 373 5056 -6615 -4497 5687 -2169 -7349 4557 3491 -5898 2256 8900
1744 8900 -1684 -769 10361 3072 -3659 6757 6006 -5636 288 6402 -4430 -5140 5529 -116
1758 -116 -7127 2847 4221 -6704 -1766 6193 -4282 -6601 4185 -655 -8762 1065 3957 -6670
1772 -6670 -2332 6554 -1699 -4574 6712 3365 -5927 2510 5708 -5502 -3154 5805 -2539 -6848
1786 -6848 3932 2199 -6952 1071 6577 -3778 -2063 8009 505 -5048 5690 4644 -5506 944
1800 944 7153 -3016 -2838 7355 1363 -5175 4776 5452 -5411 -73 6420 -3891 -5748 3886 -1646
1815 -1646 -8937 -139 1895 -8219 -3520 4891 -3841 -5721 5347 1713 -6337 2846 5757 -4790
1829 -4790 -1471 6712 -1243 -4710 5580 3719 -4948 3086 7091 -2846 -671 7956 130 -5158 4499
1844 4499 2493 -7026 -645 4442 -5244 -4443 5613 -320 -5691 4290 4345 -5153 741 6648 -3133
1859 -3133 -4158 5246 -604 -6928 1923 3264 -6316 -1267 6017 -3113 -4542 5468 1020 -6373 1700
1874 1700 3506 -6273 -2663 4698 -3032 -5369 4841 2341 -5106 3178 6759 -2889 -250 7783 64
1889 64 -3992 5518 3143 -5637 1195 5246 -4561 -3092 5752 -697 -5414 3897 2717 -6266 -118
1904 -118 4405 -4904 -4635 4375 -1376 -7196 2030 2609 -6064 -355 5809 -2553 -2995 6280 1646 -4849
1920 -4849 3467 4580 -5090 -1156 5457 -2854 -4702 4814 1299 -5580 2720 5309 -4166 -489 6518
1935 6518 -1370 -4674 4144 1591 -6301 495 4280 -4836 -2380 5946 -672 -4441 5155 3148 -4795
1950 -4795 1220 5143 -4146 -3786 4683 -1566 -6481 2471 2289 -5710 20 5728 -2668 -2759 5704 547
1966 547 -4972 3005 3196 -5755 -1032 4764 -2860 -3936 5138 1602 -4647 3216 5185 -3618 -362
1981 -362 5942 -1840 -4176 4081 875 -6137 796 3813 -4795 -2139 5399 -1382 -4207 4725 2196
1996 2196 -4908 1258 4384 -4124 -3017 4936 -1466 -5346 3350 2700 -5183 1196 5668 -2314 -1916
2011 -1916 5890 659 -4352 3237 3024 -4922 -834 4502 -3296 -3672 4433 690 -4967 2905 4108
2026 4108 -4469 -310 4998 -2483 -4685 3634 155 -6067 1114 3503 -4652 -1478 5288 -886 -3213
2041 -3213 4839 2777 -4303 1751 4549 -4100 -2060 4543 -1708 -4800 3562 2351 -4562 1298 5226
2056 5226 -2569 -1990 5425 -350 -4404 2842 2359 -5352 -470 4141 -3267 -3011 5143 593 -4264 3498
2072 3498 3878 -3868 -117 4735 -2539 -4011 3668 -467 -6026 1138 2515 -5012 -1256 4716 -1675
2087 -1675 -3410 4228 1407 -4531 1706 3638 -4107 -1739 5001 -1247 -3506 4395 2763 -3693 2315
2102 2315 5419 -2245 -977 5372 -107 -4243 2599 1735 -5405 -737 3188 -3886 -3301 3845 -616
2117 -616 -4423 2483 2719 -4569 -353 4044 -3175 -3500 3412 -203 -5256 2019 3110 -3884 -62 5578
2133 5578 -1135 -2418 4703 1524 -4470 1804 3106 -4316 -1798 4115 -2173 -3811 3608 1655 -3759
2148 -3759 1990 4585 -2495 -921 5193 -679 -3743 3292 1846 -4632 483 3747 -3455 -1924 4413
2163 4413 -289 -3978 2951 2132 -4682 -502 3057 -3833 -3998 2639 -1228 -5447 1524 1988 -4294 77
2179 77 4632 -1364 -1702 5078 1571 -3474 2597 3565 -3257 -595 4893 -1214 -2556 4349 2001 -3435
2195 -3435 1909 4040 -2924 -1357 4296 -1757 -4176 2355 241 -5358 93 2714 -3835 -1948 4109
2210 4109 -561 -3364 3403 2472 -4069 512 3783 -3109 -2668 3231 -784 -4356 2284 2158 -3802 181
2226 181 4343 -1883 -2292 4248 453 -3889 1910 2264 -3978 -603 3877 -1499 -2492 4305 1714 -2920
2242 -2920 3019 4152 -2489 -294 4502 -1214 -3394 2730 262 -4846 393 2543 -3731 -2053 3774
2257 3774 -1241 -3605 2663 1095 -4430 162 2665 -3733 -2534 3385 -972 -3831 2619 2330 -2909
2272 -2909 1299 4692 -1143 -1044 4408 290 -3406 2328 2079 -3957 -495 3027 -2097 -2322 3748 840
2288 840 -2825 2333 3098 -2835 -612 3574 -1791 -3145 2900 158 -4325 1264 2704 -3081 -851
2303 -851 4108 -877 -2849 3082 1013 -4040 394 2292 -3430 -2444 2814 -1371 -3516 2323 1782 -3446
2319 -3446 1012 3873 -1893 -1466 3927 -127 -3418 2329 2008 -3419 319 3879 -1631 -1559 4012 873
2335 873 -2976 2430 2665 -3083 -628 2993 -2278 -3269 2317 -338 -4372 822 2172 -3381 -549 3922
2351 3922 -1042 -2427 3293 930 -3657 1038 2811 -3379 -1637 3145 -955 -2840 2946 1734 -3037
2366 -3037 1393 3649 -2150 -1155 3657 -799 -3436 1691 1334 -3770 65 2824 -2084 -1510 3760 605
2382 605 -2664 2640 2509 -2875 -62 3068 -2016 -2566 2525 105 -3566 1381 2177 -3098 -175 3724
2398 3724 -1107 -2355 2842 580 -3782 821 2028 -3507 -1553 2880 -1088 -2891 3018 1549 -2512
2413 -2512 1536 3466 -2074 -923 3312 -770 -3261 1845 1141 -3613 361 3043 -1899 -1329 3507
2428 3507 41 -2426 2375 1944 -3155 -159 2644 -2476 -2471 2401 -288 -3356 1557 2080 -2601 -19
2444 -19 3664 -1027 -1735 3030 501 -3327 1027 1855 -3140 -1218 3051 -1237 -2506 3021 1193 -2478
2460 -2478 1382 2933 -2355 -916 2885 -1049 -2828 1944 694 -3700 360 2608 -2114 -1062 3304
2475 3304 62 -2372 2377 1666 -3021 1 2449 -2310 -2245 2567 -357 -2751 1791 2001 -2492 111
2491 111 3184 -1301 -1556 2812 168 -3332 970 1637 -3328 -881 2655 -930 -2129 3108 1039 -2583
2507 -2583 1535 2623 -2394 -907 2680 -1250 -2880 1989 637 -3359 722 2287 -2239 -994 3197
2522 3197 -466 -2476 2219 1371 -3142 148 2076 -2287 -1667 2470 -594 -2981 2105 2005 -2378 717
2538 717 3198 -1210 -1095 3011 370 -2884 1421 1811 -2995 -667 2627 -1470 -1819 3080 634 -2620
2554 -2620 1403 2184 -2399 -517 2375 -1614 -2636 1683 440 -3315 843 2307 -2022 -361 3352
2569 3352 -207 -1820 2304 1093 -2859 162 1838 -2519 -1598 2330 -700 -2294 2044 1563 -2151
2584 -2151 737 3035 -1486 -1326 2540 -454 -2867 1556 1313 -2778 -279 2886 -811 -1172 3202 844
2600 844 -2089 1703 1951 -2413 -647 2064 -1822 -2419 1639 91 -2949 1042 1945 -2455 -727 2840
2616 2840 -797 -2085 2285 697 -2997 682 2041 -2297 -937 2669 -419 -2144 2433 1682 -2146
2631 -2146 1098 2893 -1538 -973 2561 -752 -2724 1301 921 -3066 -204 2033 -1433 -1468 2758 589
2647 589 -2125 1700 1606 -2205 -420 1946 -1736 -2203 1883 -81 -2837 1033 1961 -1896 0 3175
2663 3175 -716 -1725 2262 427 -2875 591 1537 -2578 -1142 2265 -594 -1891 2388 1593 -1846
2678 -1846 1523 2618 -1649 -1148 2438 -586 -2272 1395 987 -2292 444 2504 -1470 -1015 2871 337
2694 337 -2177 1471 1065 -2840 -699 1655 -2031 -2040 1848 -267 -2811 1355 1898 -1880 15 2645
2710 2645 -1078 -1500 2314 299 -2498 940 1636 -2189 -745 2681 -742 -1604 2201 1103 -1821 945
2726 945 2095 -1914 -992 2259 -523 -2419 1500 809 -2608 270 2059 -1550 -932 2551 -223 -1954
2742 -1954 1762 1202 -2404 29 1746 -1701 -1771 1908 -148 -2386 1521 1649 -2067 175 2418 -864
2758 -864 -1381 2000 67 -2552 711 1248 -2419 -744 2323 -736 -1436 2480 1411 -1824 1482 2034
2774 2034 -2027 -815 2094 -1135 -2191 1409 555 -2309 695 2106 -1600 -665 2661 -405 -2202
2789 -2202 1271 1078 -2581 -175 1692 -1746 -1510 1946 0 -1765 1736 1478 -1830 293 2325 -1200
2805 -1200 -1668 1980 -315 -2519 752 1093 -2076 -1 2422 -946 -1487 2309 544 -2027 1011 1570
2821 1570 -2012 -756 1718 -1056 -1896 1588 318 -2452 598 2058 -1482 -488 2503 -428 -1801
2836 -1801 1811 1067 -2428 87 1609 -1540 -1330 2095 -330 -1924 1730 1401 -1783 389 2356 -1115
2852 -1115 -1249 1777 -459 -2387 912 896 -2422 -133 2101 -877 -884 2493 641 -1902 1158 1308 -2137
2869 -2137 -640 1589 -1385 -2010 1294 173 -1822 909 1785 -1619 -361 2286 -463 -1688 1383
2884 1383 194 -2435 149 1509 -1670 -927 2383 143 -1148 2139 1300 -1703 632 2010 -1379
2899 -1379 -1272 1572 -446 -2424 1035 1117 -1910 -44 1969 -950 -1205 2113 297 -2227 1076 1193
2915 1193 -2011 -642 1555 -1144 -1491 1581 438 -1879 1061 1848 -1528 -345 2248 -615 -1624
2930 -1624 1629 672 -2389 325 1357 -1765 -928 1811 -502 -1121 1668 1091 -1583 661 2170 -1174
2946 -1174 -1059 1691 -660 -1722 1089 857 -1979 205 1964 -1096 -856 2307 352 -1835 1048 931
2962 931 -2317 -950 1090 -1819 -1887 1418 164 -1696 1318 1501 -1161 -101 2237 -498 -1494 1492
2978 1492 166 -2267 254 1401 -1394 -177 2302 -197 -954 1969 1042 -1648 355 1334 -1614 -1163
2994 -1163 1423 -649 -2048 991 859 -1861 454 1946 -1035 -729 1943 -222 -1805 1076 899 -2281
3010 -2281 -194 1867 -1129 -1239 1661 203 -1670 1214 1377 -1525 -110 1720 -812 -1217 1615 27
3026 27 -2156 652 1035 -1534 -294 1877 -369 -1117 2096 1027 -1583 887 1662 -1473 -756 1532
3042 1532 -577 -1836 999 447 -1818 417 1772 -1202 -597 1978 -36 -1706 1015 426 -2203 -242
3058 -242 1197 -1436 -1188 1709 175 -1083 1191 1656 -1126 463 2005 -649 -1203 1369 45 -1968
3074 -1968 800 1407 -1339 -478 1921 -71 -915 1687 669 -1669 360 1100 -2083 -1022 1401 -830
3090 -830 -1518 1533 806 -1475 613 1821 -1042 -978 1738 -498 -1612 1123 353 -2028 -118 1450
3106 1450 -1150 -1030 1884 58 -1616 1190 787 -1545 6 1664 -998 -1266 1455 6 -1664 843
3122 843 830 -1467 -165 1793 -626 -934 1802 535 -1664 744 1004 -1761 -805 1396 -1271 -1510 1169
3139 1169 441 -1637 632 1422 -1096 -611 1885 -427 -1543 1156 298 -1958 -32 1224 -1574 -820
3155 -820 1651 53 -1149 1543 1323 -1101 314 1562 -1117 -1220 1106 -343 -1790 493 906 -1470
3171 -1470 66 2047 -390 -761 1604 55 -1660 462 1005 -1794 -889 1247 -412 -1223 1449 604
3187 604 -1358 605 1568 -1149 -389 1637 -773 -1525 970 447 -1418 195 1399 -1101 -567 1801
3203 1801 -7 -1290 1212 746 -1534 206 1187 -1230 -1156 1464 -103 -1503 906 994 -1405 98
3219 98 1662 -526 -865 1803 324 -1465 606 895 -1476 -360 1070 -877 -1370 1047 336 -1711
3235 -1711 830 1384 -1207 -64 1755 -490 -1194 1293 351 -1642 232 1295 -1114 -281 1975 -34
3251 -34 -860 1603 862 -1337 59 1306 -1453 -1197 983 -615 -1867 718 989 -1391 242 1578
3267 1578 -795 -806 1442 -193 -1751 529 671 -1536 -222 1614 -435 -604 1690 871 -966 1047
3283 1047 1371 -1172 -271 1507 -576 -1557 913 207 -1619 287 1310 -1140 -326 1591 -189 -1235
3299 -1235 1099 683 -1475 95 1126 -1133 -659 1299 -325 -1478 934 844 -1238 64 1214 -848
3315 -848 -720 1210 -38 -1628 856 608 -1692 -37 1209 -734 -998 1394 403 -1379 914 1393
3331 1393 -990 173 1676 -384 -1087 1403 363 -1469 426 1325 -1043 -198 1528 -56 -848 1102
3347 1102 215 -1689 37 793 -1746 -1162 1005 -592 -1472 936 964 -1088 482 1611 -589 -426 1480
3364 1480 58 -1427 661 801 -1605 -270 1348 -591 -654 1630 333 -1135 1086 915 -1180 -338
3380 -338 1086 -775 -1094 1348 142 -1346 749 1387 -726 -44 1843 -228 -779 1236 477 -1684
3396 -1684 276 816 -1107 -797 1368 -633 -1225 757 445 -1312 -1 1184 -995 -729 1125 -275
3412 -275 -1416 961 702 -1275 209 1353 -629 -427 1794 629 -819 900 1198 -895 -265 1399
3428 1399 -989 -1081 1108 -406 -1780 372 768 -1194 -201 1269 -298 -1135 1160 424 -1434 197
3444 197 716 -1603 -714 1282 -704 -959 858 792 -1148 641 1309 -1078 -470 1159 -345 -1236 528
3461 528 435 -1622 -71 1231 -828 -219 1679 609 -725 1047 1056 -1210 -123 1223 -891 -718 1021
3478 1021 109 -1191 977 1157 -999 -50 1359 -450 -850 985 -9 -1701 311 846 -1325 -543 1173
3495 1173 -444 -814 1081 496 -914 497 1092 -1135 -397 1385 -297 -1193 981 805 -1482 265
3511 265 1316 -625 -311 1402 43 -1052 867 626 -1111 72 887 -849 -863 1104 -184 -1548
3527 -1548 800 874 -1124 153 1706 -315 -662 1289 176 -1397 367 447 -1460 -204 1206 -640
3543 -640 -764 968 546 -1024 580 1435 -1188 -248 1152 -774 -1226 472 124 -1382 404 1290 -543
3560 -543 -26 1622 61 -973 908 437 -1513 37 618 -935 -707 1049 76 -1105 717 857 -964
3577 -964 129 1451 -774 -1054 968 -30 -1264 495 650 -1124 -149 1350 -398 -748 1259 613 -1082
3594 -1082 918 909 -1092 -585 1037 -613 -796 804 456 -1136 326 1134 -830 -493 1402 -295 -1046
3611 -1046 866 219 -1385 143 835 -1207 -707 814 -98 -1065 821 802 -916 146 1385 -595 -577
3628 -577 1194 -47 -1404 553 510 -1216 -160 1247 -427 -629 1431 663 -870 665 933 -1004
3644 -1004 -397 917 -872 -1176 874 213 -1190 260 1163 -793 -162 1482 -174 -782 773 161 -1376
3661 -1376 117 820 -1178 -518 1128 44 -828 1193 968 -929 242 927 -779 -685 755 -149 -1364
3678 -1364 521 596 -1030 228 1502 -356 -417 1494 383 -1127 677 703 -1130 -217 997 -538 -791
3695 -791 874 249 -1307 380 773 -955 -406 993 -532 -1088 700 -177 -1300 125 957 -1049 -456
3712 -456 1231 -60 -884 990 669 -911 521 1112 -616 -410 996 -349 -1067 538 628 -957 75
3729 75 1079 -750 -460 927 151 -911 549 875 -1036 17 859 -690 -1172 913 1 -790 767
3746 767 1054 -799 62 1021 -589 -754 620 69 -1384 -34 599 -1079 -502 1023 -411 -712 879
3763 879 561 -1039 290 1088 -890 -501 1184 -102 -972 703 724 -749 209 1306 -402 -358 1267
3780 1267 23 -909 560 500 -1208 -389 811 -970 -895 978 197 -946 462 855 -857 -321 967
3797 967 -682 -789 759 53 -1309 78 484 -858 -274 1138 -247 -591 1166 701 -685 291 928
3814 928 -852 -626 970 -346 -1057 762 285 -1075 188 1190 -464 -319 1138 67 -733 922
3830 922 477 -1123 -50 977 -719 -622 880 152 -1042 572 524 -800 -29 983 -389 -964 678
3847 678 -128 -1401 249 359 -949 -90 1039 75 -583 1304 449 -919 141 803 -1099 -674 1072
3864 1072 -245 -734 795 565 -814 345 881 -481 -284 895 -220 -1030 511 402 -1193 -205 673
3881 673 -699 -242 881 101 -739 905 731 -639 -67 754 -684 -821 757 -165 -1283 156 689
3898 689 -929 -225 1010 -376 -910 1171 164 -889 429 680 -778 -303 1076 -451 -882 1033
3914 1033 382 -955 508 1105 -278 -15 1065 -139 -955 542 179 -983 17 535 -769 -490 923
3931 923 134 -754 849 721 -741 198 810 -814 -698 824 -134 -1132 248 421 -1100 38 1057
3948 1057 -354 -641 1031 110 -955 206 321 -979 -709 808 -420 -1007 615 74 -830 391 961
3965 961 -421 -177 953 -123 -985 535 378 -975 152 915 -743 -417 975 79 -497 614 660
3982 660 -797 161 909 -700 -651 827 145 -1193 483 492 -1020 -103 1067 -282 -695 969 182 -984
4000 -984 509 467 -897 -343 641 -411 -991 974 246 -775 477 802 -574 -172 929 -344 -894
4017 -894 631 120 -1117 109 768 -755 -479 955 -206 -556 819 678 -945 64 971 -799 -626
4034 -626 596 -232 -937 653 655 -710 75 1013 -275 -570 927 194 -1123 220 134 -956 -495 716
4052 716 -590 -593 939 609 -854 526 922 -803 -390 918 -307 -696 684 253 -884 247 659
4069 659 -563 -210 1126 173 -288 726 563 -1088 50 822 -885 -669 661 -120 -846 596 661 -1144
4087 -1144 -77 911 -652 -468 943 36 -1020 598 311 -1027 -168 1054 -717 -626 1055 248 -736
4104 -736 378 606 -605 -24 1010 -357 -454 572 257 -1104 -157 763 -886 -25 947 113 -574 704
4122 704 580 -689 301 777 -788 -657 670 -29 -1011 586 587 -878 324 1180 -519 -305 723 -294
4140 -294 -814 277 455 -1200 -16 514 -694 -507 725 293 -794 731 736 -807 -82 729 -577 -560
4158 -560 721 2 -894 485 979 -747 -25 997 -206 -735 921 349 -1021 171 508 -704 -490
4175 -490 790 -25 -718 737 549 -531 246 722 -521 -553 770 -37 -797 495 298 -761 21 767
4193 767 -698 -521 913 104 -980 556 627 -673 -145 884 -806 -817 505 89 -630 334 755 -648
4211 -648 -130 1113 -13 -407 1059 153 -753 97 719 -739 -483 649 -301 -476 848 465 -478 337
4229 337 758 -454 -326 783 -231 -1090 644 148 -977 103 585 -366 -409 813 86 -499 662 703
4247 703 -704 65 675 -718 -556 714 -61 -550 345 599 -516 -13 986 -227 -304 679 117 -803 197
4266 197 401 -406 -308 761 -246 -567 720 508 -689 295 982 -465 -379 813 -333 -869 428 289
4284 289 -686 13 847 -593 -368 989 99 -641 545 472 -832 -135 610 -523 -543 656 -18 -734 754
4303 754 557 -587 -97 1086 -402 -540 929 24 -975 235 410 -663 -122 437 -239 -585 689 456
4321 456 -478 373 820 -448 -352 910 -213 -772 409 203 -758 82 647 -413 -325 943 -172 -698
4339 -698 604 257 -1032 -115 363 -591 -755 577 293 -679 464 618 -566 7 759 -550 -557 618
4357 618 -45 -994 268 314 -860 -203 757 -121 -365 834 289 -582 369 714 -791 -56 879 -343 -508
4376 -508 542 64 -816 216 626 -573 -181 831 153 -375 596 96 -1046 -182 309 -598 -496 562
4394 562 -116 -491 482 583 -523 1 922 -274 -400 821 72 -828 44 238 -833 -144 735 -155 -409
4413 -409 579 309 -473 300 540 -497 -270 725 -132 -712 528 195 -566 196 859 -307 10 909 11
4432 11 -173 575 199 -900 148 344 -941 -490 556 17 -858 701 465 -550 84 472 -567 -370
4450 -370 500 -146 -720 391 297 -644 37 826 -198 -359 688 259 -400 188 556 -620 -102 572 -333
4469 -333 -645 514 158 -661 488 637 -541 23 760 -274 -453 649 141 -1086 113 437 -680
4486 -680 -144 431 23 -648 704 465 -569 139 688 -420 -303 625 -433 -732 69 124 -800 -7 757
4505 757 12 -365 619 324 -354 505 257 -442 18 554 -503 -530 624 51 -494 308 715 -280 -270 633
4525 633 -241 -406 501 12 -926 212 243 -752 -119 541 -78 -347 594 357 -573 449 652 -395 -258
4544 -258 512 -255 -773 395 20 -363 219 802 -356 -206 788 170 -690 515 504 -838 -139 555 -443
4563 -443 -437 639 130 -393 500 414 -360 90 838 -181 -328 502 106 -1002 157 450 -819 -269 621
4582 621 -174 -414 744 260 -497 116 590 -440 -466 362 -206 -765 495 310 -605 170 782 -85 -170 689
4602 689 139 -645 449 245 -637 -298 554 -310 -508 601 -66 -582 273 705 -870 99 591 -177 -379
4621 -379 289 -13 -809 -35 654 -582 -229 578 -158 -456 590 65 -703 -21 445 -595 -347 398 -102
4640 -102 -882 423 304 -771 133 626 -172 -121 636 -49 -399 321 315 -606 212 540 -183 -379 665 123
4660 123 -539 609 644 -480 128 527 -249 -453 420 -152 -924 59 213 -816 -316 855 -253 -334 707
4679 707 227 -607 560 414 -405 -451 364 -178 -483 482 52 -433 162 729 -360 -258 932 -121 -526
4698 -526 502 222 -752 119 397 -440 -455 755 87 -477 680 688 -583 18 484 -357 -765 665 58
4717 58 -535 250 355 -576 -12 434 -180 -356 485 161 -379 360 373 -309 -486 671 -137 -470 333 273 -743
4738 -743 180 726 -518 54 840 -113 -555 294 290 -527 85 395 -490 -339 419 -324 -702 483 433 -333
4758 -333 -70 635 -360 -385 356 -56 -546 94 346 -536 -9 622 130 60 393 199 -567 471 155 -808
4778 -808 -264 653 -229 -246 510 237 -395 249 592 -582 -27 510 -152 -442 397 75 -811 -213 274 -712
4798 -712 -296 670 128 -508 298 326 -649 -74 520 -371 -233 590 -65 -329 333 354 -270 -263 773 -143 -24
4819 -24 668 179 -686 261 204 -633 -212 611 -454 -527 621 -45 -684 290 621 -367 -138 367 -78 -418
4839 -418 396 125 -664 -29 417 -395 -250 560 -94 -377 458 411 -445 142 538 -435 -319 398 109 -645
4859 -645 421 382 -421 362 848 227 -191 856 187 -524 215 240 -356 -5 617 -376 -362 82 186 -533
4879 -533 536 293 -526 -396 432 -121 -691 183 187 -695 185 252 -416 -172 488 18 -105 623 152 -326 -23
4900 -23 419 -487 -320 432 -225 -676 481 256 -170 145 783 -114 -282 645 62 -635 270 372 -648 -229
4920 -229 589 -244 -123 464 173 -448 135 224 -632 -19 388 -305 -618 140 42 -791 316 363 -351 -74 599
4941 599 1 -402 526 172 -667 82 274 -549 -404 300 -33 -550 503 637 -166 132 530 -464 -221 610
4961 610 -120 -379 109 307 -674 -119 289 -515 -137 520 41 -636 384 426 -269 -297 518 -397 -685 466
4981 466 67 -889 188 626 -272 -204 567 -140 -379 534 290 -790 -77 248 -532 -81 367 -141 -267 519
5001 519 227 -213 453 699 -488 -46 548 82 -468 159 167 -367 246 633 -369 -42 615 152 -579 140
5021 140 189 -883 -52 433 -591 -302 433 24 -560 136 313 -349 58 458 152 -277 545 166 -226 179
5041 179 239 -430 -221 627 -360 -256 626 335 -328 300 711 -281 27 324 -479 -341 118 319 -348 125
5061 125 464 -326 -79 696 174 -440 703 256 -625 -98 179 -477 -734 818 -152 -603 190 258 -411 -125
5081 -125 538 -300 -303 259 -157 -581 204 333 -537 -22 503 28 -235 660 423 -161 352 319 -394 -57 450
5102 450 -96 -511 115 140 -516 277 481 -177 -62 592 22 -126 239 219 -588 -320 367 -382 -400 523 -202
5123 -202 -541 519 424 -318 229 626 -241 -209 323 -4 -455 53 312 -487 -311 547 -431 -19 444 339
5143 339 -616 344 422 -247 -162 548 -450 -496 266 11 -570 27 465 -503 -135 478 -147 -233 351 241 -558
5164 -558 221 287 -280 -382 559 -216 -482 320 390 -486 138 748 -421 -332 292 221 -489 226 254 -545 138
5185 138 404 -207 -360 677 401 -228 198 412 -296 -467 558 -420 -438 347 194 -725 42 436 -421 -2
5205 -2 506 14 -293 360 379 -507 143 423 -197 -217 634 -86 -351 554 428 -379 113 439 -127 -389 365
5226 365 70 -505 96 207 -576 -41 476 -146 -325 479 185 -444 202 230 -367 -178 353 -358 -354 -22 154
5247 154 -276 241 316 -393 306 619 57 -246 549 310 -346 117 259 -510 -305 587 -133 -394 165 98 -291
5268 -291 180 543 -522 -294 521 -220 -684 126 117 -651 -111 317 -223 -67 503 131 -413 170 142 -487 -71
5289 -71 206 -444 -253 161 -115 -412 159 397 -319 238 696 14 -495 359 -39 -488 150 535 -431 -141
5309 -141 649 -222 -352 446 3 -261 615 636 -562 -349 288 -167 -403 153 -110 -403 -66 271 -412 -170
5329 -170 421 102 -328 384 333 -342 259 346 -316 -402 406 242 -350 435 283 -302 -165 622 -200 -197 586 87
5351 87 -683 -57 266 -431 -284 436 -163 -260 664 49 -397 239 231 -330 -171 405 -306 -315 186 131 -479 -105
5373 -105 408 -326 -206 378 -110 -218 367 32 -477 -4 263 -225 -402 238 72 -304 495 601 -60 66
5393 66 320 -164 -318 441 72 -433 397 279 -339 -84 395 93 -230 430 125 -408 124 339 -386 -207
5413 -207 194 -340 -708 148 -66 -320 112 503 -290 -47 505 -88 -263 352 40 -575 -135 204 -491 -263
5433 -263 363 -1 -386 340 332 -310 143 547 -108 -152 262 78 -512 235 179 -277 -44 454 31 -334 534
5454 534 198 -363 147 527 -482 -258 104 -304 -431 97 166 -339 -89 285 -591 -62 420 -54 -325 408
5474 408 141 -675 -100 179 -112 -399 568 -63 -563 406 442 -172 166 386 -115 -148 86 -145 -262 -15 366
5495 366 -246 -52 592 -398 -251 715 140 -360 441 100 -550 -217 384 -398 -384 243 -205 -112 249 207 -88
5516 -88 170 482 -111 -463 340 78 -701 -222 379 -325 -244 327 -80 -290 333 274 -477 72 393 -208 -331
5537 -331 406 -401 -485 180 97 -242 336 542 -214 -170 568 -109 -214 244 352 -551 -190 522 -439 -363 312
5558 312 241 -410 259 256 -491 -163 237 -9 -353 151 54 -251 -46 247 -175 8 494 -52 -129 535 236 -311
5580 -311 246 493 -269 -108 381 -11 -322 319 76 -470 172 517 -48 -129 426 33 -450 78 56 -429 -297
5601 -297 570 -237 -242 688 -61 -272 371 488 -218 -210 278 -92 -339 100 9 -258 -36 162 -252 -104 600 -16
5623 -16 -112 457 105 -325 93 475 -546 -265 281 -18 -329 163 217 -353 157 350 18 7 479 -63 -222
5644 -222 125 165 -358 -8 240 -338 -217 374 343 -211 115 296 -190 61 337 -343 -412 343 -154 -398 82
5665 82 489 -436 -3 509 -175 -386 65 -89 -461 187 105 -434 -262 152 -218 -611 273 378 -345 -43 325
5686 325 -154 -156 513 -379 31 230 87 -430 323 221 26 -363 391 4 -336 100 186 -320 137 221 -429
5707 -429 -202 251 -113 -509 146 66 -336 -26 510 138 -58 380 -20 -366 -128 209 -371 -202 124 -456
5727 -456 -281 193 128 -302 46 273 -387 -285 483 56 -239 343 -80 -658 27 250 -216 -316 303 -80
5747 -80 180 356 357 -116 219 437 -310 -246 296 -198 -376 142 261 -426 -245 324 -68 -345 286 190 -311 1
5769 1 169 -417 127 158 -346 -120 84 112 -125 167 445 -431 -187 522 361 -390 117 187 -460 22 370 -250
5791 -250 -326 452 100 -85 294 179 -233 258 356 -469 -78 280 -1 -360 288 218 81 63 361 -180 -188 270
5813 270 81 -264 -16 -28 -501 -92 295 -28 -429 431 100 -309 200 493 -422 -190 485 -188 -81 96
5833 96 219 -108 193 181 8 -41 375 -68 -264 458 220 -518 45 362 -343 -125 140 -95 -475 -7 237
5854 237 -184 -132 454 -93 -237 453 -97 -396 226 208 -299 -385 246 -215 -255 366 58 -422 102 411 -161
5875 -161 -228 190 -37 -309 251 167 -201 3 354 -332 -87 345 -52 -42 201 329 -199 12 17 -470 -193 357
5897 357 -356 -435 332 152 -347 166 402 -247 -142 379 27 -485 199 109 -411 -199 364 -216 -263 359 53
5918 53 -254 204 359 8 -10 289 -278 -264 266 -92 -565 203 348 -147 127 395 -62 -309 269 42 -207
5939 -207 86 203 -185 -310 252 -239 -278 279 349 -92 99 565 16 -137 265 -160 -201 155 61 -428 -6
5960 -6 157 -71 -438 188 470 -152 285 606 -288 39 501 -137 -240 303 -16 -246 68 76 -255 -197 443 -297
5982 -297 -223 382 76 -381 118 -36 -252 -193 257 -375 -540 152 260 -296 -92 446 -282 28 269 183 -593
6003 -593 56 -98 -383 129 21 -224 -73 504 50 -202 25 264 -296 154 407 -498 -327 351 -178 -183 124
6024 124 452 -177 214 382 -258 -180 339 -118 -339 155 154 -186 -293 288 -33 -108 304 247 -228 342 468 -15
6046 -15 -68 368 -196 -246 197 281 -362 120 33 -217 64 398 6 -298 288 260 -229 -82 190 -462 -177 -37
6068 -37 379 -141 437 231 -184 71 312 -106 41 487 -45 -222 -84 267 -538 -105 167 -42 -79 383 146
6089 146 -200 292 260 -152 -74 624 -115 -358 121 158 -321 29 488 -212 -174 500 134 -52 234 30 -342
6110 -342 -203 262 -470 -314 184 227 -322 217 55 -220 57 281 -42 -271 446 83 -265 308 361 -394 -58
6131 -58 271 -233 -310 495 130 -130 256 481 -179 -27 353 173 -265 302 121 -513 152 312 -9 -86 202
6152 202 87 -139 472 179 -375 173 249 -24 -406 325 -331 -206 311 285 -67 -43 612 -158 54 434 -45
6173 -45 -423 -28 18 -589 -31 50 -378 -301 87 313 -314 102 284 -313 -2 357 -265 -231 146 39 -299 300
6195 300 263 -221 -148 409 34 -46 235 -180 -497 -166 148 -287 -169 189 117 -125 113 219 -100 -11 490 -228
6217 -228 -263 237 60 -653 121 81 -510 -30 284 -305 -49 202 280 -150 46 162 -340 -74 186 52 -248
6238 -248 488 154 -239 224 120 -8 110 499 252 -215 380 -93 -416 -85 167 -286 -233 129 -236 -427
6258 -427 268 127 -402 129 125 -219 16 369 -181 -239 121 175 -273 48 417 -117 -63 403 135 -298 241 318
6280 318 -323 -143 355 -168 -81 113 -184 -305 199 193 -166 80 403 -143 -175 310 135 -571 3 157 -104
6301 -104 -7 512 -271 -424 366 133 -278 1 325 -259 -126 118 -205 -420 64 294 -259 33 439 -123
6321 -123 -65 255 7 -193 346 246 -42 134 449 -33 -154 358 155 -259 207 494 -292 103 286 -138
6341 -138 -161 260 25 -477 87 -9 -60 -164 226 -242 -380 152 364 -79 78 379 -86 20 179 -202 -357
6362 -357 171 -28 -277 59 479 122 -120 362 224 -75 124 169 -344 97 92 -376 -85 127 48 -195 272
6383 272 308 -31 -126 198 -93 -85 436 36 -335 329 88 -345 19 536 -76 -267 165 196 -325 -41 193 -667
6405 -667 -77 220 -305 -209 260 71 -357 53 181 -182 126 355 133 -210 133 -179 -338 -53 201 -359
6425 -359 -143 50 102 -153 405 138 -228 218 -51 -127 -261 141 -70 -127 233 184 -463 -162 242 4 36 508
6447 508 -1 -362 394 237 -360 -49 271 -202 -291 180 -71 -353 291 216 -36 219 166 -177 -105 213 -105
6468 -105 -343 -86 -77 -523 -154 123 72 -101 283 74 -197 -7 209 -146 -255 82 -2 -63 126 249 -99 35
6490 35 350 180 -187 361 1 -364 90 226 -389 -276 231 -134 -489 157 83 -153 147 324 178 -15 255
6511 255 -28 -268 221 157 -273 22 60 -112 -126 332 11 -225 134 321 -193 37 243 -245 -149 30 19 -330
6533 -330 36 207 -97 -15 575 4 -9 435 -7 -163 309 203 -339 -110 284 -225 -165 260 80 -349 58
6554 58 183 -243 -100 207 -132 -72 119 -138 -363 114 39 -366 138 194 -111 -271 368 223 -239 142 343
6575 343 -317 -150 322 35 -209 31 29 -78 121 311 127 -88 96 -187 -378 56 190 -63 -50 84 -240
6596 -240 -62 301 71 -98 239 -75 -217 232 186 -235 -25 165 85 -329 133 -153 -325 -310 75 64 57 339
6618 339 48 -219 332 300 -140 -149 93 71 -168 275 227 97 75 359 -82 -167 200 44 -41 57 257 -389 94
6641 94 212 -259 -298 86 36 -219 212 186 -232 141 386 -153 -155 132 -163 -381 -4 175 -351 2 313 -83
6663 -83 -24 116 139 28 233 56 -338 -84 83 -273 -138 309 219 59 119 449 -40 -92 134 98 43 129 -161
6686 -161 -91 -43 59 -171 -98 152 -58 -309 285 189 -363 -71 -17 -224 -336 261 -266 -234 137 296 -282 51
6708 51 304 44 -108 401 205 -265 -8 131 -21 -177 319 37 -21 130 203 -74 276 168 -226 -256 427
6729 427 301 -282 163 86 -27 37 291 -158 -222 302 -58 -142 175 224 -107 -63 484 -137 -183 108 -68 -186
6751 -186 -131 -4 -542 -29 129 -209 -125 211 -84 -186 -52 105 -200 -30 186 -302 -65 12 176 -175 260
6772 260 313 -129 57 311 -30 -503 180 26 -341 -272 198 -100 4 232 -175 -116 183 88 39 -55 -38 -491
6794 -491 -142 287 -65 -245 175 263 -181 89 104 -87 9 147 -214 -287 69 190 -165 -65 124 169 -68 182
6816 182 -127 -202 192 64 -30 -140 173 -76 -299 -79 -55 -235 252 120 -188 -79 344 -66 -199 139 109
6837 109 -257 9 69 -54 -261 371 13 -155 394 58 11 160 411 -116 -160 370 77 -153 218 103 -109
6858 -109 -48 247 -79 -302 108 131 -249 62 247 -65 -261 169 -203 -157 89 75 -267 -139 450 -241 -31
6879 -31 425 97 -95 364 -132 -229 24 118 -304 -177 26 -37 -259 165 209 118 82 299 -132 -119 339 -118 -108
6902 -108 -120 -104 -175 -139 38 -226 -34 223 70 -274 -25 186 -301 -7 29 -133 -82 231 -121 -139 48 79 -128
6925 -128 -41 309 112 -54 252 145 -221 103 315 -185 -276 55 -132 -172 107 148 -219 40 122 -256 -17 378
6947 378 22 -311 -2 85 -430 -272 68 -226 -362 229 -181 -29 312 176 -76 -286 295 -152 -84 204 -85
6968 -85 -107 290 185 -115 83 288 -47 86 294 277 -225 140 99 -207 -157 110 -53 -84 77 244 -222 259
6990 259 104 -158 -428 64 -133 -411 81 150 -370 -151 159 -163 -36 246 -186 -241 144 257 -162 -88 -64
7011 -64 53 -265 160 427 -219 269 254 -63 287 425 177 -299 189 -164 -182 113 93 -134 -75 121 -327 -246
7033 -246 338 399 31 97 163 82 -13 -3 199 -344 -205 -55 -357 76 50 -304 -190 454 -35 -375 96 176 -297
7056 -297 109 -121 -422 -155 -88 162 -167 -28 91 -240 -71 249 46 -164 221 -85 -305 240 276 -72 -322
7077 -322 128 -62 -111 131 -10 -43 194 77 -204 -132 -12 59 -261 83 -61 -278 -69 262 -233 0 221
7098 221 -109 1 10 214 31 -78 -122 -241 -49 214 66 -77 -172 14 113 55 123 35 -102 187 35 -155 358
7121 358 255 -252 3 361 88 25 384 140 -121 49 301 -292 -82 -45 -232 -302 25 169 -141 -173 104
7142 104 -167 -126 585 116 -27 260 -203 -133 -238 213 -141 -91 134 -228 -126 259 381 59 -14 262 -53
7163 -53 26 138 -199 -279 156 105 -82 79 162 213 -79 154 -47 -102 33 90 -129 -227 206 -123 -101 80 -45
7186 -45 -268 -29 -1 -92 -421 328 17 -57 252 -5 -86 27 34 -258 -94 261 78 -44 238 51 -171 111
7208 111 124 -17 -142 138 -19 -114 -9 58 -182 66 283 30 -116 55 -294 -134 -5 29 -166 -173 128 -170
7230 -170 -271 154 -209 15 129 42 -37 49 -13 -159 -249 -3 115 -283 -20 39 -242 -323 128 -123 -247 126
7252 126 214 85 176 258 -100 -76 203 -42 -244 -107 16 -152 153 145 -174 35 191 22 43 183 185 -399 -74
7275 -74 168 -222 11 212 -132 -190 379 254 -117 137 161 -24 -242 0 -199 -79 116 244 -297 -7 181
7296 181 44 -123 -11 45 -206 219 -7 -239 -352 -97 -59 -155 30 101 77 -9 248 19 82 224 5 -195
7318 -195 227 315 -135 240 162 -141 -262 65 44 -57 94 2 -302 132 83 156 -169 257 -51 -230 -76 160
7340 160 -293 28 36 -131 -49 225 165 -76 94 419 8 -430 34 -199 -338 27 111 -344 -62 109 -168 -120
7362 -120 285 52 -116 128 296 -162 108 53 -300 -115 85 112 63 131 210 -82 66 263 19 -148 135 -19
7384 -19 -71 156 243 -329 -2 28 77 16 19 135 -23 44 281 -236 72 194 -173 -391 227 200 -310 39 -94
7407 -94 -96 -127 259 -391 -14 63 -112 -226 -87 322 49 -164 -63 -2 -238 377 119 119 106 104 123 -242 14 55
7431 55 -401 46 154 -107 89 192 37 -208 162 50 -205 61 -21 -128 -126 60 -260 -32 34 227 -323 109
7453 109 108 41 3 82 -82 69 102 -46 -224 13 -16 -100 -20 102 -147 -91 104 -29 -212 -272 290 -197 -81 -7
7477 -7 26 36 206 172 -25 122 247 -105 67 57 49 -195 -109 115 -223 19 -31 -260 -233 -33 -51 -170 -41 112
7501 112 -186 211 300 -135 -316 383 163 -301 -136 -22 -65 -39 368 -184 72 464 -147 -17 148 294 -67
7522 -67 -224 71 -82 -118 257 -154 -159 255 48 -181 -348 174 9 -216 219 183 46 -37 66 -244 -244 25 -133
7545 -133 -172 113 132 -122 -93 158 56 -330 120 -75 -297 -81 146 -218 -19 138 203 186 31 146 -56 125
7567 125 28 -289 -20 162 -296 -225 259 -46 -101 -86 366 -20 -196 -30 -56 -147 21 185 -382 -192 204 78
7589 78 50 -3 -97 -191 -209 47 -179 101 242 -35 104 -56 133 -57 -156 55 -378 -218 59 -59 82 186
7611 186 390 -25 -21 -75 -145 -64 499 134 -84 14 -256 -5 114 107 20 -105 105 -20 41 281 -13 50 -72 -53
7635 -53 -129 -214 215 177 -155 260 131 -9 240 161 -3 -295 195 155 -172 -123 -43 -225 -83 229 15 119 112
7658 112 8 28 31 -14 -234 -114 -102 -92 -164 -49 -113 -372 203 35 -37 -18 191 -116 -250 -117 24 -167 142
7681 142 156 -113 75 298 -58 -51 271 377 -208 366 315 -217 95 189 120 -218 13 -64 -301 -227 188 -58 -52
7704 -52 45 91 -166 -7 -103 -213 -187 181 -98 -74 206 -8 62 -81 109 195 -57 177 -49 -6 -34 -61 -300 -84
7728 -84 147 -136 -181 238 38 -95 95 196 -205 -139 114 55 -229 178 -1 -168 1 -10 92 -30 75 -221
7750 -221 3 88 108 -220 -16 -232 -147 -110 -42 -105 -5 2 -142 -348 192 36 -240 16 142 -117 -130 297 -134
7773 -134 -166 194 -60 -31 22 224 -248 -198 -71 197 -192 -10 164 -37 -28 -107 -187 -295 -221 191 -222 94 31
7796 31 -96 140 324 62 -156 133 54 -16 -77 17 -166 -299 98 -23 120 23 -94 -147 -12 253 -188 -58
7818 -58 19 33 -33 -84 -91 -295 -3 377 176 6 275 282 -101 73 121 -123 -104 304 -35 -205 161 118 -29 14
7842 14 101 -89 -131 141 99 -178 -298 116 -245 -57 -123 -206 -54 24 237 51 247 52 -369 33 17 -199 -101
7865 -101 110 18 -21 90 38 -95 1 343 -30 -103 182 211 -51 4 -198 -231 -230 58 -264 -118 171 91 111 70
7889 70 168 114 -100 55 -83 -174 35 318 64 -155 -12 -241 -49 130 -44 -161 30 -57 -145 -113 101 -42
7911 -42 -66 -16 -34 -112 -105 257 -81 -31 145 143 123 -123 -24 -256 36 155 -7 -132 -56 32 62 -93 -2 -114 19
7936 19 174 -79 -280 178 107 -374 53 -42 -52 128 117 -62 41 131 -159 154 104 137 -147 -189 -106 -189 -86 214
7960 214 12 -149 197 -96 -3 -33 112 143 -59 286 385 -7 13 -41 -93 -77 112 -49 -218 186 42 22 -172
7983 -172 110 220 -5 -25 -246 -176 -165 -112 -220 -36 156 124 -188 129 -19 -32 110 150 -139 -150 -8 -52 -59 214
8007 214 -5 -403 95 -9 -262 364 75 21 -9 99 90 -175 97 -157 -220 -90 55 -69 -177 99 -20 29
8029 29 -127 73 -237 5 -123 1 -392 100 133 -116 -45 93 36 279 50 -63 50 201 151 -208 -65 -131
8051 -131 -193 -128 86 -170 -195 117 20 -164 66 -16 61 -381 31 77 64 -70 54 -271 -18 106 -74 -210 4
8074 4 32 -304 211 27 -98 158 -17 -341 -205 -98 100 -204 -141 193 -44 19 292 101 -76 206 -165 -64
8096 -64 -55 91 -151 95 262 126 306 162 98 -92 266 140 -96 269 238 136 -65 188 56 -221 42 159
8118 159 -86 101 -21 11 -141 -145 -20 -51 -69 31 -218 196 235 202 -269 -136 115 -115 169 -75 -243 86
8140 86 307 63 65 -39 -100 83 52 37 29 106 -33 -66 -38 94 -10 -121 -14 144 -297 -140 99 133 -218 -276
8164 -276 171 -4 -86 265 -72 -278 71 265 -137 77 -113 -292 -102 -80 -156 130 -104 -64 69 67 166 4
8186 4 -85 -164 -243 -57 96
8191I6
$$ Imaginary data points
##PAGE= N=2
##DATA TABLE= (X++(I..I)), XYDATA
0 0 0 0 0 0 0 0 0 0 0 0 0 0 0 0 0 -8 8 -8 8 -8 16 -16 16 -24 24 -32 32 -40 46 -50 57 -66 76 -86 95 -109 120
37 120 -135 150 -166 187 -206 228 -252 279 -308 340 -375 413 -455 500 -553 611 -673 745 -825
56 -825 919 -1029 1154 -1305 1490 -1720 2015 -2410 2968 -3806 5210 -7967 15297 -73381 -151399
71 -151399 120832 51750 -121948 79777 171706 -61507 4583 198295 21704 -77860 143682
82 143682 92020 -110083 45390 143430 -75397 -44573 147363 2496 -107188 89164 64760
93 64760 -134392 -17177 88364 -110673 -109651 81359 -29793 -140539 56355 71990 -105850
104 -105850 7219 131866 -46449 -65523 112518 8647 -128391 36539 56344 -133152
114 -133152 -43943 92622 -71010 -97018 93564 17858 -116578 43205 84400 -99643 -34535
125 -34535 109171 -39549 -89390 99525 52511 -88264 62699 132669 -40505 3733 153575
136 153575 20163 -59597 103584 68278 -95311 12772 89224 -83768 -74249 77121 -32843
147 -32843 -124294 32721 27393 -124546 -29541 66300 -80350 -85190 68615 -11234 -109385 36786
159 36786 55314 -90443 -10791 97391 -32591 -49006 101180 39264 -65050 62465 91098
170 91098 -56847 -5494 99752 -28703 -71340 68676 16393 -97783 21093 67019 -70152
181 -70152 -24706 95688 -11280 -61835 77346 42861 -82134 18272 73568 -68563 -45251
192 -45251 78798 -17014 -78231 60102 47181 -76400 11200 80569 -54466 -55832 65197
203 65197 -21306 -104449 20293 23927 -100186 -22495 66798 -45623 -50234 80818 23137 -63253
215 -63253 50433 70204 -57229 -5960 85002 -24443 -51168 74255 29583 -62939 40744
226 40744 75224 -46186 -10188 84380 -15863 -61903 53345 17546 -87357 2477 46775
237 46775 -71092 -43483 61117 -22282 -69415 47805 31952 -70428 10078 66641 -46811
248 -46811 -35893 69897 -5939 -67031 43914 37593 -67727 2058 67728 -37753 -38257 70026
260 70026 9451 -61366 41677 49770 -61364 -7750 65300 -37262 -53422 54131 6131
271 6131 -71201 25790 52279 -52659 -9904 75771 -14099 -45915 60147 22655 -68767 13919
283 13919 47246 -59984 -32972 58264 -18159 -57072 50755 34552 -56527 17456 64539 -41306
295 -41306 -31747 58833 -13534 -67692 31182 25385 -65996 83 61061 -31009 -28129 68457 11663
308 11663 -51176 39270 40103 -58759 -9301 52445 -37252 -45953 50209 7067 -56692 30341 48425
321 48425 -45995 -7063 61476 -23344 -48021 43654 6443 -68197 10069 37436 -53996 -23314
333 -23314 55918 -14763 -45980 49258 28053 -52130 18427 56263 -37367 -20622 61364 -4741
345 -4741 -47103 43351 33131 -50494 9701 58389 -30532 -26872 58487 1676 -53270 31230
357 31230 29331 -59203 -11477 41717 -41792 -48871 36808 -5270 -62383 19258 34948 -47769
369 -47769 -6676 57251 -17471 -34174 49310 14048 -50803 18507 39698 -42883 -13955 54214
381 54214 -10678 -34732 49494 27048 -42157 20359 47789 -36907 -21759 44977 -16777 -51674
393 -51674 28739 17998 -51340 8303 51657 -25670 -15431 59724 5642 -40027 35091 27988
405 27988 -51386 -6144 39311 -37055 -39211 39365 -2454 -52888 22363 30018 -49206 -11266
417 -11266 41208 -32063 -44897 31784 -2245 -57183 12815 33430 -39120 -6441 57475 -3311
429 -3311 -22423 55297 31206 -30867 28059 51006 -25481 -8425 51771 -6005 -36394 34639
441 34639 19596 -46007 5182 37104 -36256 -26800 37640 -12851 -49594 20120 13262 -53446
453 -53446 -7932 32334 -35384 -32400 38172 -1601 -42769 28001 32223 -36034 3466 48861
465 48861 -18486 -26936 40242 3495 -47534 14770 26175 -44143 -12328 42165 -16905 -29782
477 -29782 42551 17787 -35651 22301 40954 -29544 -9798 45758 -8467 -32308 37233 22361
489 22361 -34202 18381 46742 -20693 -9223 46625 -4328 -39444 20260 8478 -54825 -14029
501 -14029 19821 -43331 -38221 25854 -11625 -45514 19348 20564 -39618 -1695 37039 -22398
513 -22398 -25702 36894 5172 -35150 25770 35523 -25003 7604 53145 -4008 -14790 46359
525 46359 16538 -32510 18521 29754 -34999 -14224 33653 -18692 -36424 27527 8808 -40955
537 -40955 9879 31442 -29776 -13309 38213 -8375 -33089 26773 14579 -39722 3264 30755
549 30755 -29096 -21188 33782 -6335 -36333 21611 17402 -37769 -1753 30265 -26110 -27486 28135
562 28135 -5151 -41048 15301 20573 -33400 287 41686 -8311 -12567 45136 18870 -22169
574 -22169 26985 35352 -24015 -2880 37901 -13068 -27454 29664 8496 -35224 12248 28038
586 28038 -29177 -13495 30287 -16178 -38410 15652 866 -47292 -4250 20038 -32825 -18678
598 -18678 33121 -3359 -25574 29195 22661 -27056 7680 34124 -19732 -17725 31971 -1742
610 -1742 -32183 20322 21087 -28482 3080 35804 -13394 -17229 32661 4204 -32023 14833 20517
623 20517 -31589 -7095 31106 -14587 -22283 30833 10408 -27323 17118 28738 -23067 -6067
635 -6067 32896 -11317 -28439 21737 5030 -37821 2421 19941 -30737 -16740 27271 -10147
647 -10147 -29306 21433 12767 -31250 4544 27598 -21803 -15529 30056 -3197 -27181 21803
659 21803 19252 -24826 7110 35192 -10808 -9743 35002 6361 -25169 18229 18399 -30309 -6462
672 -6462 23921 -19785 -24308 23623 2194 -29251 13578 22840 -24171 -5288 29375 -12809 -25531
685 -25531 21027 2817 -33931 6294 21156 -24260 -7795 32104 -4032 -19742 26762 14340
697 14340 -27223 6601 23737 -24561 -15940 24797 -8368 -28276 18968 14248 -25565 6182
709 6182 29884 -14431 -12306 29318 -71 -26804 15260 14131 -28776 -2490 25007 -15697 -16908
722 -16908 26549 4468 -24163 15593 20453 -23264 -3759 25928 -14247 -22061 20759 2301
734 2301 -29509 8758 18801 -22919 -6131 27910 -6845 -19126 23937 10361 -25147 8052
746 8052 21892 -22018 -10972 24547 -7649 -23737 18924 11630 -24686 6677 26492 -15258
758 -15258 -10088 27431 -1975 -24612 14960 10541 -28692 -2864 20201 -18325 -16943 23221 1234
771 1234 -22630 15925 18792 -21765 -818 24695 -13513 -18690 19901 1175 -25788 10347 18493
784 18493 -19043 -1258 29364 -3990 -13505 25032 9543 -23051 7599 16923 -23008 -11565
796 -11565 19519 -10215 -22725 16661 8674 -23699 6072 21552 -17303 -10556 22198 -6703
808 -6703 -24230 13180 7684 -26096 792 21017 -14593 -10254 26192 2992 -18412 18145 16504
821 16504 -20447 803 22137 -14460 -15975 19332 -128 -23571 10913 15515 -19723 -1363
833 -1363 24649 -7860 -13725 22077 5918 -21407 9448 16645 -19392 -6368 21122 -8119 -17754
846 -17754 18395 7804 -20777 7401 19037 -17050 -8704 19725 -8395 -22989 10816 3216
858 3216 -26894 -1334 15336 -17792 -11081 21960 -621 -16492 18364 15361 -17122 4831 22424
871 22424 -11199 -10534 21641 1561 -18315 14660 16348 -15768 3177 24981 -7614 -11463 20201
884 20201 1481 -23044 5947 9435 -23914 -9177 15502 -12217 -17781 16727 5022 -19472
896 -19472 8989 17602 -15547 -5286 19878 -7101 -18130 13757 4928 -21739 3540 16850
908 16850 -14672 -6816 21605 -2187 -15896 15277 8973 -20258 1330 16251 -15237 -11600 17970
921 17970 -1328 -17484 14997 14518 -14507 5900 23773 -6569 -7284 22124 3062 -17749 10065
934 10065 11305 -19927 -4653 16088 -12243 -15877 14891 651 -21117 5990 11381 -19588 -7402
947 -7402 14911 -11041 -18736 11730 1964 -20905 5022 15668 -13038 -2652 22998 345 -9995
960 -9995 19411 11591 -14927 6049 17106 -13155 -8775 17105 -3323 -16787 12758 9757 -16702
973 -16702 3330 18432 -10360 -9273 17108 -1533 -18842 8106 8438 -19542 -2564 16675 -9763
986 -9763 -10556 18230 3700 -15124 10379 12693 -16209 -4192 14651 -10928 -17019 10970 -357
999 -357 -20827 4181 11977 -14626 -3831 18682 -3623 -11785 15404 7365 -16053 5216 15145
1012 15145 -11954 -5244 18674 -1264 -11724 15806 11168 -12411 6447 18052 -9134 -7490
1024 -7490 15795 -2966 -18489 7005 5041 -20034 -3522 12333 -12674 -11339 14646 48
1036 48 -15607 9240 10560 -15066 -2087 15143 -9445 -12501 13712 1636 -16002 8138 12948
1049 12948 -12264 -333 18608 -3564 -10193 14882 4678 -16324 4146 10755 -14958 -6882
1061 -6882 14605 -5106 -12945 13215 7650 -13082 6166 16185 -9195 -5368 15462 -2817 -15480
1074 -15480 9085 5598 -16701 344 13531 -10135 -7776 15720 228 -13652 9151 8736 -15815
1087 -15815 -2404 12160 -11524 -12518 11912 -695 -15625 8084 11513 -11552 671 17555
1099 17555 -3901 -8436 15190 4061 -14839 5582 10585 -13496 -4118 14516 -4939 -10912 13150
1112 13150 5961 -13277 5344 12846 -11195 -6136 13157 -5228 -15204 8191 3715 -16099 1273
1125 1273 12543 -9337 -6047 15411 395 -11273 10494 8554 -13581 95 12644 -9851
1137 -9851 -9300 12523 -218 -13312 8322 10203 -11094 903 15378 -5512 -8719 12870 1287
1150 1287 -15111 4211 7616 -14411 -4412 12294 -6271 -10127 12307 4671 -12524 6134 11758
1163 11758 -10690 -4547 13017 -5278 -12752 9330 3715 -13777 3253 12218 -8507 -3583 15351
1176 15351 -389 -10367 10521 6579 -13876 529 10626 -10586 -8364 11543 -1458 -12360
1188 -12360 8555 9004 -10747 1763 14318 -6313 -7544 12431 80 -13616 5318 7031 -13335
1201 -13335 -2957 11860 -6375 -8887 11767 3037 -12423 5529 9157 -12447 -4728 10629 -7152
1214 -7152 -12561 8442 2268 -13292 4111 11817 -8023 -1850 15859 185 -7732 12278 7078
1227 7078 -11288 3367 11522 -8830 -5673 12369 -1448 -10685 9032 7154 -11475 1170 11518
1240 11518 -8626 -8553 9573 -3282 -14964 3806 4178 -14295 -2544 10955 -6604 -7624 12543
1253 12543 2986 -10371 7372 9596 -10316 -2030 11802 -5687 -9403 9710 2368 -12288 5225
1266 5225 10299 -8856 -2089 13693 -2704 -8891 10131 4091 -12379 2568 9350 -9422 -4386
1279 -4386 12309 -942 -8708 10823 7901 -9374 4219 12313 -7467 -5787 10567 -3124 -13512
1292 -13512 4109 2738 -14611 -2753 8407 -9065 -8780 9857 -346 -11958 5581 6387 -11392
1305 -11392 -2031 10270 -6259 -7847 11028 2996 -8931 8255 12204 -5684 2053 15527 -625
1318 -625 -5768 11745 3767 -11530 2914 7563 -10837 -5320 9962 -4231 -10038 8769 4331
1331 4331 -11413 2361 9251 -9187 -6005 9192 -3584 -11894 6278 3999 -11423 1245 10879
1344 10879 -6540 -4705 11696 225 -9744 6324 5405 -11723 -2110 8391 -8207 -8795 8679
1357 8679 352 -10756 6375 9069 -7554 1150 13783 -2192 -5184 11976 4079 -9290 5531
1370 5531 9317 -8116 -1525 12194 -2600 -7346 10038 3877 -10548 2860 7531 -10539 -6686
1383 -6686 7083 -6567 -13615 3826 1109 -13550 -261 8183 -7766 -4343 11561 -3 -8201
1396 -8201 8407 6478 -9484 1124 10255 -6042 -5411 10943 1446 -8351 8069 8516 -7202 1399
1410 1399 11453 -4583 -6511 8538 -5 -11711 3075 5777 -10031 -2426 10397 -3509 -6119
1423 -6119 10395 3980 -8476 4639 8359 -8269 -3873 8757 -4639 -10046 6061 1900 -11542
1436 -11542 1724 8062 -7948 -3981 9650 -2435 -9437 5935 2903 -11027 -139 7806 -7112
1449 -7112 -4759 10511 875 -7009 8950 8559 -6182 3271 11685 -3394 -4588 9742 619 -9681
1463 -9681 4510 5636 -9845 -1708 8981 -5336 -7040 8164 969 -10162 3399 5908 -9625
1476 -9625 -4012 7377 -5511 -9116 6777 1740 -9652 3383 8611 -6097 -1358 11132 -1122
1489 -1122 -6826 7474 3562 -10048 989 7159 -7756 -4615 9064 -1541 -7634 7540 5996
1502 5996 -7510 1990 9289 -5541 -5044 8269 -1188 -9884 4702 4863 -9157 30 9642 -3923
1516 -3923 -4475 9663 1776 -8396 4662 5761 -9342 -2650 7356 -5651 -8141 6873 979
1529 979 -8999 3886 7733 -6651 -1462 9534 -2680 -6924 6889 2269 -9715 1772 6944
1542 6944 -7180 -3056 9399 -774 -6429 7934 5218 -7812 2336 8111 -6303 -4897 7691
1555 7691 -2379 -9294 4307 3554 -9147 -143 8033 -5237 -4673 8508 357 -8264 4670 4897
1569 4897 -8762 -1431 7441 -4832 -6181 7715 1363 -7488 5240 8061 -5500 29 10190
1582 10190 -2145 -5711 7437 1984 -9300 1841 5644 -7702 -3274 7783 -2914 -6803 6493
1595 6493 3066 -8358 1459 6547 -7453 -5123 6645 -3111 -9031 4843 3035 -7840 1610 8878
1609 8878 -3899 -2500 9722 971 -6553 5824 4593 -8434 -421 6905 -5626 -5064 7719 493
1623 493 -7218 5272 6537 -6403 99 8534 -3656 -6005 6532 464 -8735 2865 5790 -6750
1637 -6750 -1272 8784 -1836 -5041 7547 2877 -8007 2040 5627 -8053 -4799 5678 -4438
1650 -4438 -8779 3779 1542 -8877 662 6765 -5229 -3312 8462 -425 -6740 6020 4655 -6753
1664 -6753 1603 8152 -3413 -2694 9297 2195 -5116 6996 6691 -5319 1093 8054 -4058 -5588
1678 -5588 5501 -1198 -9744 1477 2920 -8786 -2772 6251 -4025 -6148 6590 1458 -7567 2482
1692 2482 5160 -7063 -2763 6758 -3039 -6552 6013 2908 -6655 2778 7312 -4499 -1836 8282
1706 8282 -1122 -6468 4849 2134 -8422 302 5823 -5376 -3307 7686 820 -4623 7159 6200
1720 6200 -4676 2210 8597 -3380 -3524 7121 61 -7195 3578 3973 -7238 -1204 6196 -4310
1734 -4310 -5861 5165 -760 -9483 647 2067 -9095 -4456 4268 -4616 -6947 5215 1911 -6362
1748 -6362 3639 7345 -3439 8 9193 93 -3660 7257 4318 -5628 2514 6908 -4038 -2410
1762 -2410 7838 -284 -5416 5304 3703 -6922 497 5624 -5528 -5011 4978 -1844 -7851 3047
1776 3047 3181 -6882 303 7218 -2991 -3487 7143 907 -6327 3077 3588 -7423 -2396 4848 -4739
1791 -4739 -6375 4626 583 -7103 2587 5260 -5413 -1042 7171 -2097 -5134 5515 2222 -6215
1805 -6215 2516 6626 -3342 -429 9172 1209 -2718 7484 5026 -5038 1951 5956 -5111 -4279
1819 -4279 4334 -2473 -8042 2259 1850 -7790 -1144 4833 -5218 -4767 4992 -814 -7509 2240 3163
1834 3163 -7104 -1160 5893 -3183 -3678 6833 2343 -4724 4650 6338 -3940 -14 7333 -2184
1848 -2184 -4911 5101 1082 -6919 1494 4655 -5520 -1894 6593 -1536 -4250 5891 2885 -5274
1862 -5274 1961 5570 -4583 -2760 5578 -1383 -5728 4012 3013 -5938 1195 5635 -3888 -3342 5563
1877 5563 -1201 -7067 2279 1767 -7792 -1823 4140 -4709 -4420 5493 568 -5172 4317 5446 -4230
1892 -4230 557 7087 -1803 -3554 5837 1613 -5552 2805 5280 -4346 -599 7013 -1237 -3756 5628
1907 5628 1945 -6140 1087 3594 -6063 -3495 4344 -2958 -6161 3742 1991 -5994 1569 5652 -3520
1922 -3520 -2186 5935 -564 -5450 3483 2687 -6191 -206 5082 -3417 -3036 6166 590 -4765 4260
1937 4260 3915 -4959 -409 5462 -3377 -4224 4818 203 -5770 2684 3980 -4792 -130 6380 -1334
1952 -1334 -3200 5580 1899 -5455 1886 4179 -5051 -2034 4912 -2429 -5158 4106 1840 -5344 1761
1967 1761 4880 -4207 -2361 5361 -1142 -5463 3399 1651 -6171 149 4359 -4068 -2433 5860 405
1982 405 -3706 4467 4066 -4291 441 5214 -3269 -3599 4612 -286 -5874 2547 3271 -4576 -67 5662
1998 5662 -2127 -3112 5140 893 -5512 1640 3031 -5830 -2178 4325 -2367 -4322 4425 2129 -4448
2013 -4448 2659 5181 -3348 -993 5674 -1346 -4568 3605 1667 -5500 1151 4534 -3566 -1827 5493
2028 5493 -101 -3945 3974 2778 -5116 -52 4062 -4189 -4005 3965 -978 -5462 2759 2876 -4574
2043 -4574 524 5379 -1953 -2866 4992 1016 -5248 2351 3092 -5036 -1068 4674 -2207 -3544 4710
2058 4710 1511 -4330 2568 4549 -3604 -921 5363 -1923 -4539 3564 1029 -5342 1102 4190 -3556
2073 -3556 -1165 5704 -325 -3296 4570 2976 -4223 912 3812 -4092 -3143 3802 -1508 -5379 2588
2088 2588 2092 -4793 8 4430 -3036 -2895 4228 -365 -5523 1765 1887 -5179 -851 4500 -2223 -2564
2104 -2564 5295 2075 -3250 3705 5032 -2927 245 5067 -1637 -3555 3629 757 -4941 1162 3695
2119 3695 -3847 -1331 4765 -1154 -3967 3210 1329 -5393 133 3057 -4368 -2936 3620 -1383 -4631
2134 -4631 3037 2566 -3836 1178 4911 -2564 -2058 4573 -130 -4658 2021 1964 -5115 -639 3765 -2753
2150 -2753 -2865 4733 929 -3892 3117 3797 -3260 -82 4518 -1838 -2952 3979 1137 -3916 2122
2165 2122 3947 -2695 -284 5315 -731 -2720 3869 1104 -4842 446 2376 -5177 -3094 2917 -2541
2180 -2541 -5093 2261 1352 -4525 726 3889 -2703 -1833 4030 -636 -3981 2940 2199 -4009 690 4718
2196 4718 -1751 -1412 5318 1465 -2885 3623 3357 -3436 -62 3717 -2767 -3533 3192 -64 -4771 1588
2212 1588 2881 -3614 -580 4735 -1247 -2956 3742 939 -4325 1081 2510 -4088 -1564 3666 -1876
2227 -1876 -3504 3217 1588 -4133 1151 3338 -3308 -2039 3564 -1524 -4289 2082 1215 -4526 323
2242 323 3933 -2022 -1187 5014 1138 -2511 3947 3329 -2830 609 4037 -2147 -2673 3782 231 -3882
2258 -3882 2056 2632 -3635 -307 3917 -1986 -3118 3000 -272 -4804 419 1716 -4518 -1844 2974
2273 2974 -1683 -3228 3747 1631 -3154 1919 3723 -2540 -1079 3892 -1115 -3463 2799 1577 -4039
2288 -4039 755 3395 -2166 -1117 4434 83 -2957 2998 2168 -3555 259 3176 -2520 -2640 3491
2303 3491 -74 -3361 2786 2758 -2947 353 4048 -1635 -2261 3359 39 -4219 980 1696 -4122 -1644
2319 -1644 2714 -2350 -2881 2944 837 -3535 1417 3050 -2911 -1046 3293 -1537 -3080 2643 1343
2334 1343 -3407 1129 3759 -1976 -506 4441 483 -2373 3185 1869 -3696 265 2454 -3069 -2502
2349 -2502 2827 -790 -3615 1998 2190 -3062 314 3784 -1790 -2025 3124 -193 -4082 1284 2066 -3650
2365 -3650 -390 3525 -1476 -1894 3693 1281 -3126 1717 2757 -3163 -975 3212 -1577 -3267 2341
2380 2341 614 -3677 1053 3000 -2448 -632 3828 -461 -2466 2881 1510 -3144 491 2659 -2868
2395 -2868 -1776 3086 -535 -2848 2573 2035 -2768 478 3109 -2040 -2097 2817 -434 -3763 1310 1218
2411 1218 -3576 -599 2853 -1775 -1706 3248 735 -2644 1848 2506 -2853 -879 3004 -1716 -2635 2689
2427 2689 698 -3367 1488 2975 -2071 -208 3592 -759 -2473 2467 866 -3677 252 2012 -3087
2442 -3087 -1880 2772 -468 -2277 2652 1755 -2486 746 3232 -2159 -1606 3041 -583 -3343 1356
2457 1356 1112 -3377 97 3317 -1439 -1424 3317 578 -2573 1833 2279 -3055 -603 2669 -1990 -2359
2473 -2359 2697 280 -2975 1543 2578 -2457 -325 3502 -690 -2110 2638 657 -3690 429 2363
2488 2363 -2787 -1540 2945 -689 -2435 2565 1532 -2485 992 2951 -2136 -1274 2790 -874 -3060
2503 -3060 1492 1134 -3087 311 2790 -1546 -1188 3458 256 -2366 1967 1875 -2767 -149 2520 -2133
2519 -2133 -2363 2543 272 -3060 1598 2223 -2053 70 3385 -1215 -2200 2288 204 -3599 104 1413
2535 1413 -2874 -979 2637 -931 -2126 2874 1251 -2128 1067 2875 -2050 -1418 2578 -656 -2611
2550 -2611 1664 1273 -2439 652 2814 -1629 -1123 3485 144 -2572 1768 1104 -2956 -291 2077 -2058
2566 -2058 -2102 2522 119 -2706 1854 1825 -2273 184 2943 -1426 -1556 2181 70 -3105 821 1358
2582 1358 -2716 -536 2729 -1075 -1848 2623 1119 -2485 1145 2144 -2258 -1040 2549 -857 -2550
2597 -2550 1808 952 -2321 972 2645 -1428 -450 3278 372 -2090 2291 1419 -2811 -70 1982 -2335
2613 -2335 -1968 2270 -265 -2737 1723 1738 -2498 -30 2887 -1751 -2017 2086 -292 -3114 869 1428
2629 1428 -2566 -453 2783 -726 -1180 2968 1116 -2133 1453 2173 -2364 -1089 2386 -1009 -2562
2644 -2562 1957 759 -2329 1199 2579 -1789 -692 2805 -621 -2168 1807 658 -3000 -61 2048
2659 2048 -2197 -1182 2474 -70 -2148 2214 1843 -2286 197 2201 -1669 -1656 2135 -553 -2761 941
2675 941 1253 -2625 -174 2654 -1162 -1568 2629 792 -2215 1426 2017 -2014 -433 2518 -988 -1909
2691 -1909 1939 714 -2274 1215 2468 -1666 -332 2910 -549 -1927 1892 683 -2891 -275 1566
2706 1566 -2351 -1529 2278 -412 -2067 1836 1553 -2128 387 2432 -1671 -1385 1796 -500 -2487 1254
2722 1254 1063 -2292 85 2549 -571 -857 2864 361 -1968 1315 1498 -2527 -806 1798 -1439 -1861
2738 -1861 2155 641 -2069 1457 2303 -1486 -241 2449 -1029 -1954 1543 263 -2884 298 1973
2753 1973 -2054 -702 2309 -322 -1850 1919 1457 -2208 306 2102 -1759 -1375 1583 -514 -2494
2768 -2494 1252 1146 -2363 247 2548 -1132 -994 2473 58 -2014 1298 1226 -2227 -503 2242 -1222
2784 -1222 -1630 1918 241 -2180 1343 1614 -1512 -403 2299 -688 -1626 1591 367 -2586 259 1467
2800 1467 -1779 -914 2286 -419 -1428 2108 1153 -1841 624 2152 -1729 -1294 2031 -709 -2288 1325
2816 1325 833 -1987 665 2391 -718 -596 2371 121 -2086 1236 834 -2435 -554 1614 -1869 -1618
2832 -1618 1977 459 -1863 1322 1975 -1680 74 2232 -1157 -1819 1547 -161 -2617 714 1683 -1886
2848 -1886 -306 2581 -650 -1121 2130 886 -2180 541 1603 -1924 -939 1870 -755 -1839 1444
2863 1444 967 -1691 639 2194 -1186 -706 2230 -211 -1748 1441 845 -2450 -184 1846 -1612 -1217
2879 -1217 1994 -104 -2097 1150 1463 -1856 -89 1933 -1261 -1766 1417 -177 -2446 496 1289 -1861
2895 -1861 -377 2574 -721 -1114 2350 1084 -1710 1264 1866 -1513 -802 1883 -870 -1993 1513 677
2911 677 -1813 930 1832 -1138 -502 1998 -86 -1953 1034 325 -2679 -223 1554 -1397 -1029 2075
2927 2075 123 -1324 1863 1571 -1897 54 1795 -1334 -1525 1532 -151 -2035 897 1272 -1636 244
2943 244 2668 -534 -1084 1796 373 -1878 464 1427 -1801 -659 1984 -827 -1521 1919 760 -1582
2959 -1582 788 2084 -1271 -722 1824 -401 -1902 1050 416 -2623 87 1214 -1589 -1349 1762 -283
2975 -283 -1723 1082 771 -1861 98 1785 -1153 -1097 1515 -143 -1806 1080 1384 -1367 218 2316
2991 2316 -602 -1088 2016 562 -1662 475 1333 -1914 -685 1293 -1134 -1457 1653 416 -1588 780
3007 780 1657 -1244 -274 1850 -496 -2056 1147 352 -2250 391 1217 -1371 -854 2219 144 -1161
3023 -1161 1624 874 -2347 -245 1241 -1544 -1391 1008 -580 -1748 957 1048 -1367 513 2328 -628
3039 -628 -789 2016 287 -1867 673 809 -1690 -315 1896 -819 -1189 1945 571 -1689 1082 1279
3055 1279 -1771 -518 1459 -879 -2057 996 33 -2170 443 1386 -1321 -893 1903 -309 -1356 1504
3071 1504 843 -1722 494 1437 -1349 -976 1715 -363 -1797 1135 1032 -1513 369 1834 -839 -669
3087 -669 1772 209 -1516 850 815 -1889 -501 1501 -1166 -1119 1625 359 -1163 1166 1610 -1321
3103 -1321 -165 1738 -803 -1441 1088 -70 -1980 379 1322 -1510 -236 1985 -239 -1060 1637 787
3119 787 -1681 256 1123 -1654 -995 1354 -418 -1496 1425 1105 -1562 608 1986 -707 -802 1715
3135 1715 -132 -1722 962 665 -1821 -321 1609 -870 -887 1612 230 -1271 684 1168 -1503 -422
3151 -422 1466 -1050 -1466 1172 205 -1621 594 1449 -1087 -230 1912 -323 -1256 1377 617 -1659 315
3168 315 1135 -1331 -883 1647 -607 -1271 1123 784 -1492 269 1611 -1031 -760 1761 -174 -1613
3184 -1613 860 694 -1834 -102 1315 -1214 -1022 1689 111 -1188 1168 1199 -1438 -66 1436 -1043
3200 -1043 -1191 1056 34 -1794 466 1200 -1346 -212 1959 -378 -966 1509 459 -1762 -36 818
3216 818 -1642 -985 1390 -488 -1142 1556 932 -1183 736 1482 -1090 -698 1261 -628 -1925 599
3232 599 383 -1818 -177 1627 -825 -765 1810 58 -1354 754 966 -1630 -269 1253 -1207 -1196 1316
3249 1316 230 -1311 926 1274 -1372 -224 2067 -301 -974 1463 190 -1639 403 968 -1604 -756
3265 -756 1509 -757 -1169 1036 528 -1547 114 1443 -1146 -824 1161 -493 -1451 787 420 -1625
3281 -1625 2 1297 -1026 -735 1614 159 -845 1285 1030 -1400 41 1129 -1038 -1011 1269 -160
3297 -160 -1453 922 923 -1168 148 1729 -409 -739 1197 309 -1421 192 703 -1793 -314 1540 -322
3314 -322 -1186 1454 898 -1210 552 1282 -1046 -763 626 -802 -1884 507 151 -1796 146 1353
3330 1353 -852 -710 1791 69 -1190 832 835 -1452 -36 1102 -981 -559 1644 523 -867 1108
3346 1108 1464 -840 128 1440 -763 -953 1203 12 -1743 104 898 -1168 -459 1271 -583 -919
3362 -919 1065 425 -1561 508 1062 -1014 -602 1166 -704 -1375 1095 260 -1530 109 1416 -1017
3378 -1017 -428 1434 -164 -1037 1255 677 -1488 -68 1065 -989 -1058 1169 -47 -1348 1133 1123 -1008
3395 -1008 560 1596 -256 -750 1547 77 -1450 556 525 -1318 -392 1141 -693 -929 1363 331
3411 331 -1203 508 757 -1338 -652 798 -1062 -1596 900 390 -1333 428 1841 -470 -85 1882
3427 1882 -127 -818 1078 394 -1393 273 1457 -1122 -667 1594 -163 -1000 1208 743 -1291 263
3443 263 1219 -1125 -1033 1004 -114 -1673 531 668 -1593 -43 1110 -587 -816 1279 430 -1320 597
3460 597 905 -1054 -276 1255 -710 -1179 934 290 -1347 179 1095 -991 -465 1449 -290 -1030 1280
3477 1280 582 -1164 527 1051 -1247 -456 1557 -259 -899 1179 815 -786 635 1486 -837 -844 951
3494 951 -376 -1596 447 566 -1476 -128 1207 -601 -526 1446 222 -1177 640 970 -1455 -450
3510 -450 768 -1035 -936 1169 403 -977 754 1117 -794 34 1583 -438 -953 848 280 -1394 192
3527 192 773 -1087 -401 1629 -284 -887 1276 855 -1086 251 1169 -1086 -817 989 -33 -1389 873
3544 873 415 -1034 391 1218 -733 -608 1020 132 -1255 615 697 -1472 -332 1114 -693 -930 827
3561 827 247 -1175 608 973 -1049 -32 1529 -577 -937 944 426 -1279 -68 858 -1014 -506 1240
3578 1240 -290 -840 977 712 -1070 403 1100 -1235 -637 940 -285 -1313 570 572 -1081 208 1313
3595 1313 -369 -346 1355 190 -833 706 490 -1310 -329 901 -745 -891 1300 281 -933 930
3611 930 1192 -871 -47 1192 -607 -980 779 168 -1371 428 646 -1033 -427 1154 -417 -833 1171
3628 1171 544 -891 389 659 -1125 -958 832 -374 -1130 787 578 -720 349 1499 -534 -585 1408
3645 1408 -187 -1024 223 579 -1282 -60 1129 -715 -754 1168 3 -1189 631 761 -960 80
3661 80 1107 -512 -886 640 30 -1501 440 635 -1004 -446 1212 -327 -677 925 377 -990 321
3678 321 822 -987 -797 1040 -397 -1274 777 379 -1007 560 1166 -451 -221 1301 106 -968 1004
3695 1004 749 -1455 82 1162 -898 -794 1453 -19 -790 905 708 -843 120 920 -997 -1300 629
3712 629 -295 -1704 306 717 -997 102 1207 -363 -633 1050 218 -927 409 944 -898 -596 1194
3729 1194 -268 -674 1061 401 -840 687 1124 -717 -324 1017 -320 -1061 541 471 -1123 2 1044
3746 1044 -861 -711 1147 123 -821 794 753 -1105 73 1040 -878 -681 902 -467 -1236 150 599
3763 599 -1048 -83 886 -651 -617 993 332 -1243 502 737 -983 -432 877 -780 -964 1147 282
3780 282 -812 776 1222 -580 10 1323 -176 -986 678 -29 -1086 149 714 -1001 -364 1097 -149
3797 -149 -1015 767 586 -1271 -101 789 -871 -956 562 -278 -1259 537 664 -784 36 1273 -68
3814 -68 -548 1248 -125 -1341 247 661 -1354 -612 709 -650 -673 1158 501 -847 717 1014 -570
3831 -570 -279 1165 -173 -848 623 387 -1102 352 950 -765 -419 1252 -302 -876 500 544 -1110
3848 -1110 0 899 -1145 -894 806 -443 -1209 473 508 -1123 167 1123 -548 -439 1204 -58 -970
3865 -970 719 796 -1019 -24 950 -415 -661 1184 486 -806 579 828 -644 -225 1233 -372 -983
3882 -983 607 -10 -1190 184 706 -554 -274 1191 -48 -615 775 528 -890 221 639 -725 -705
3899 -705 634 -61 -960 493 481 -806 307 1112 -652 -643 1040 26 -880 402 475 -1221 -293 953
3917 953 -291 -555 1274 398 -698 646 775 -916 -240 1169 -652 -1158 760 212 -1230 362 836
3934 836 -861 -105 1252 -231 -510 445 271 -980 -47 618 -901 -228 788 -152 -1042 653 409 -886
3952 -886 35 881 -568 -577 1058 -93 -989 603 501 -914 -143 827 -525 -620 782 308 -618 691
3970 691 834 -935 -107 759 -604 -851 720 128 -1185 511 745 -767 -169 1309 -140 -659 907
3987 907 352 -913 118 772 -987 -520 614 -185 -944 710 557 -496 389 1227 -616 -451 800
4004 800 -238 -980 246 288 -1112 -46 1014 -265 -319 1030 47 -549 431 661 -813 -129 673 -634
4022 -634 -782 703 -1 -750 473 701 -738 -33 1355 -410 -735 972 119 -1168 207 879 -845
4039 -845 -201 1002 -270 -810 832 632 -851 115 848 -555 -330 832 -79 -928 349 200 -1061
4056 -1061 111 916 -486 -456 1060 128 -899 454 665 -1128 45 480 -862 -844 752 17 -1219
4073 -1219 420 759 -854 -49 1109 -198 -381 1031 199 -827 168 601 -727 -356 881 -289 -608
4090 -608 714 513 -826 413 1037 -898 -586 832 -570 -1071 527 246 -1081 383 800 -357 -298
4107 -298 996 -121 -586 763 516 -970 -235 705 -677 -747 725 -10 -890 665 789 -671 75 1149
4125 1149 -249 -551 1194 155 -1101 296 753 -873 -107 792 -581 -392 772 576 -621 458
4141 458 635 -768 -415 801 -475 -1079 513 46 -945 175 633 -425 -390 1039 -194 -727 869
4158 869 292 -652 -113 717 -694 -512 779 -198 -893 627 554 -309 223 833 -347 -465 931 158 -1193
4177 -1193 186 183 -1014 -129 900 -623 -585 871 141 -384 482 635 -598 -382 607 -458 -810 668
4195 668 207 -985 201 789 -689 -61 977 -126 -637 745 298 -1088 -87 599 -532 -473 858
4212 858 -166 -791 849 538 -682 -29 938 -187 -479 873 22 -820 285 501 -584 -10 794 -256
4230 -256 -477 735 59 -567 249 444 -618 -418 683 -648 -744 558 106 -880 308 673 -604 -39
4248 -39 1059 -169 -441 605 221 -779 155 641 -766 -357 582 125 -701 703 573 -379 136 966
4266 966 -474 -471 857 -278 -1039 268 452 -911 66 806 -365 -439 1140 104 -552 522 433 -529
4284 -529 -82 472 -324 -578 429 199 -685 485 682 -592 14 774 -185 -778 762 171 -747 106 395
4303 395 -815 -237 726 -33 -599 876 586 -733 82 634 -698 -258 704 -311 -830 419 382 -886
4321 -886 42 771 -245 -531 1012 157 -663 386 282 -854 -153 797 -479 -581 757 470 -785 467
4339 467 715 -626 -102 855 -350 -409 605 205 -679 341 704 -707 -254 855 -200 -438 784 456
4357 456 -524 59 840 -538 -640 692 -186 -871 255 326 -720 44 742 -361 -175 984 133 -606
4375 -606 501 211 -759 -141 599 -466 -568 693 71 -528 294 691 -642 156 937 -186 -301 132
4393 132 174 -826 96 367 -636 -133 834 -362 -306 879 271 -667 287 409 -428 -481 484 -261 -692 541
4413 541 148 -708 258 845 -347 -22 606 1 -648 324 105 -695 -356 443 -446 -626 539 73 -650
4432 -650 317 541 -562 30 651 -290 -573 725 75 -939 282 324 -928 -59 668 -240 -639 687
4450 687 197 -719 154 433 -663 -509 773 -391 -647 395 177 -773 321 567 -481 3 617 -55
4468 -55 -289 538 346 -788 91 533 -495 -483 642 144 -870 410 478 -562 -60 665 -480 -502 411
4487 411 291 -787 228 397 -657 -22 821 -132 -448 909 77 -774 165 318 -539 -402 339 -204 -746
4506 -746 529 243 -604 249 630 -295 -83 778 -51 -433 576 91 -498 31 485 -349 -360 853 118
4525 118 -467 561 363 -648 92 615 -380 -493 351 -143 -698 178 181 -696 -88 780 38 -496 735 225
4545 225 -734 7 394 -633 -200 579 -416 -568 705 358 -536 453 855 -459 -102 676 -352 -479 387
4564 387 91 -787 61 482 -280 -458 582 403 -252 922 588 -194 126 630 -323 -155 525 -15 -497
4583 -497 233 275 -816 130 406 -263 -342 509 -122 -696 -73 336 -768 -291 511 -380 -756 506 274 -607
4603 -607 503 658 -405 -195 780 -44 -752 386 68 -767 -136 463 -501 -330 956 -37 -389 758
4621 758 444 -423 121 554 -464 -589 542 -234 -413 588 253 -472 -65 776 -272 -383 906 47
4639 47 -766 361 218 -590 -328 508 -590 -661 562 1 -417 177 414 -460 -223 453 -546 -777 581
4658 581 202 -990 154 473 -261 -313 931 -62 -500 462 320 -572 -76 511 -527 -410 415 -128 -389
4677 -389 481 369 -774 -36 614 -292 -141 579 -143 -737 77 273 -760 -134 511 -378 -484 756 -21
4696 -21 -254 399 410 -363 -342 743 -332 -508 306 34 -729 81 527 -466 -41 550 199 -208 601 419
4716 419 -536 247 413 -727 -457 429 -327 -707 433 411 -102 255 939 -96 -489 345 193 -586 146
4735 146 238 -693 -74 612 -107 -394 467 221 -350 412 491 -594 -203 790 -566 -634 300 -217 -339 332
4755 332 595 -501 -219 423 -10 -408 682 320 -455 21 693 -700 -380 542 -187 -690 405 367 -644
4774 -644 360 458 -239 -385 542 -58 -685 332 91 -673 51 564 -469 -79 599 55 -616 458 304
4793 304 -412 -71 266 -585 -433 290 -333 -556 236 598 -402 -40 610 264 -441 643 334 -545 -118
4812 -118 79 -704 -410 731 36 -537 641 314 -229 298 634 -434 -306 593 138 -547 391 -91 -836
4831 -836 210 328 -623 -100 954 109 -364 259 360 -642 190 220 -492 -421 380 -47 -767 122 188 -507
4851 -507 -170 472 -349 -344 375 -180 -638 -124 295 -542 -295 442 -220 -353 762 411 -404 281 636 -347
4871 -347 -99 592 -79 -352 503 279 -757 -21 401 -213 -117 612 0 -393 649 288 -586 -12 319 -494
4891 -494 -356 383 60 -694 395 332 -804 177 560 -59 -339 707 -74 -641 183 445 -448 -124 607
4910 607 -131 -278 516 209 -453 321 749 -435 67 569 -125 -485 231 -82 -408 169 409 -192 -195 600
4930 600 59 -393 613 328 -624 -126 39 -501 -489 438 -197 -709 226 192 -631 -69 551 -328 -407 592 -129
4951 -129 -376 84 105 -693 -163 589 12 -286 421 420 -218 333 658 -371 -252 486 -56 -636 308 -37 -540
4972 -540 262 778 -174 -101 664 -39 -489 250 233 -582 25 350 -632 -359 366 91 -556 442 311 -473 116
4993 116 643 -468 -309 416 -90 -619 125 111 -705 -180 386 -180 -289 415 370 -489 401 642 -426 -18
5013 -18 502 -213 -232 312 170 -451 293 639 -154 -26 573 -192 -230 125 44 -781 -313 254 -696 -479 313
5034 313 -82 -434 417 155 -607 94 629 -168 -408 248 -285 -849 225 199 -610 223 587 67 30 269
5054 269 144 -646 426 329 -337 -338 238 -146 -533 224 326 -356 322 597 -267 1 527 -92 -250 267 243
5075 243 -529 176 247 -571 -218 505 -116 -220 474 514 -671 87 646 -382 -456 395 -271 -753 340 78
5095 78 -275 49 528 -126 29 966 220 -224 414 250 -423 -29 473 -336 -263 214 6 -433 448 491 -147
5116 -147 -233 778 -65 -357 123 176 -527 97 158 -529 -43 465 30 -435 430 339 -157 113 433 -176 -312
5137 -312 268 -363 -686 151 0 -581 167 270 -53 -44 500 -41 -488 128 197 -506 -107 253 -355 -297 450
5158 450 -70 -331 283 419 -401 162 929 -536 -294 258 3 -507 298 337 -659 -156 531 -341 -198 553
5178 553 371 -358 301 455 -405 -285 633 -257 -829 235 103 -370 298 490 -123 -161 528 60 -435 243
5198 243 407 -635 -190 309 -438 -184 261 118 -240 190 358 -294 266 764 -150 -451 432 -122 -649 200
5218 200 249 -290 -305 412 20 -234 406 597 -392 267 210 -397 -173 307 -304 -630 332 60 -423 58 380
5239 380 -155 -70 544 6 -613 277 128 -674 -96 234 -288 -298 305 32 -295 250 553 -91 188 801 -36
5260 -36 -125 396 -53 -455 186 47 -637 -300 676 -158 -154 397 277 -641 129 443 -555 -291 529 -140 -419
5281 -419 427 243 -310 -73 495 -355 -274 754 -83 -360 384 44 -495 29 352 -536 -284 373 -223 -425
5301 -425 144 270 -485 42 498 -372 -490 432 12 -416 279 475 -412 87 656 128 89 661 204 -490
5321 -490 316 261 -342 -193 283 -542 -424 254 52 -474 163 278 -306 -289 301 -140 -547 283 -194 -678 -115
5342 -115 251 -199 -292 322 81 -32 496 560 -374 8 391 79 -368 312 100 -455 308 351 -270 165 634
5363 634 30 -156 588 277 -322 243 466 -510 154 222 -258 -198 347 61 -144 52 634 -478 -264 574
5383 574 -234 -322 238 124 -646 -238 171 -263 -142 430 -190 -454 707 215 -451 262 522 -335 -225 569
5403 569 -165 -487 420 236 -326 194 820 -92 -199 426 23 -659 37 273 -527 -80 322 -416 -547 495
5423 495 -21 -334 338 484 -260 20 488 -323 -415 268 -135 -594 44 147 -355 -154 324 -90 -445 544
5443 544 -96 -292 268 453 -398 -190 344 -351 -407 197 340 -358 142 502 72 51 788 114 -374 292 68
5464 68 -478 -159 183 -68 -97 88 127 -226 139 255 -316 -107 275 -112 -434 135 11 -525 58 294 -293
5485 -293 -168 619 -18 -5 437 15 -227 -124 319 -299 -246 373 -223 -390 325 313 -160 186 364 -28 -269
5506 -269 618 -431 -439 267 -64 -512 -197 18 -411 -363 382 125 -111 164 402 -229 -25 390 -447 -430 119
5527 119 -212 -673 -74 106 -480 -142 478 7 -233 351 255 -263 319 269 -594 174 629 -95 -416 314 231
5548 231 -236 340 398 -133 -134 687 -227 -537 -76 150 -262 -99 203 -106 -98 607 -52 -326 431 415 -271 44
5570 44 355 -183 -414 319 109 -497 254 146 -295 -50 297 -147 -307 536 83 -158 234 181 -554 -256 582
5591 582 -133 -418 402 200 -161 242 241 -305 -44 310 -322 -380 184 163 -415 71 405 -384 -261 396 67
5612 67 -324 330 472 -252 184 221 -182 -334 181 -229 -495 199 463 -302 88 416 -131 -130 267 152 -444
5633 -444 245 24 -414 -56 60 -450 -225 602 66 -256 273 585 -512 -231 485 -197 -296 58 36 -489
5653 -489 245 533 -246 -187 272 -79 -191 287 298 -290 -56 346 -360 -207 194 66 -222 296 12 -264 105
5674 105 430 -126 -167 511 58 -615 141 272 -246 -7 -25 -46 -377 120 284 -395 -66 413 -255 -236 389
5695 389 -267 -336 341 131 -528 62 306 94 99 339 -162 -255 367 335 -431 65 315 -497 -156 469 32 -422
5717 -422 247 444 -242 -59 515 1 -390 592 -106 -533 416 343 -553 -193 257 -392 -228 135 192 -367 227
5738 227 113 -199 -154 323 -343 -486 1 -117 -648 158 377 -367 91 574 -192 -269 353 319 -399 299 206
5759 206 -336 -25 272 -62 -546 390 -97 -314 77 346 -335 -52 220 12 -421 146 74 -383 -242 487
5779 487 -213 -2 641 -110 -206 180 323 -307 -117 408 -580 -335 271 57 -370 306 469 -231 45 480
5799 480 215 -193 387 -111 -285 194 338 -319 -243 390 210 -75 301 236 -247 81 262 -100 -1 164 -7
5820 -7 -469 80 127 -337 -197 186 -118 -192 366 -97 -434 481 187 -424 -177 270 -200 -329 354 4 -128
5841 -128 193 407 -56 -29 585 27 -369 335 46 -427 60 114 -278 -132 279 -354 -210 236 247 -308 -7
5862 -7 514 -366 -148 438 23 -253 0 -29 -508 224 157 -117 -83 115 224 -384 201 237 -289 -57 282 -281
5884 -281 -283 167 -169 -161 144 138 -375 58 631 -72 -199 240 262 -261 200 5 -421 72 402 174 -255 261
5906 261 282 -285 90 473 -132 -223 304 -126 -433 198 31 -513 58 499 -40 -118 462 168 -28 329 221
5927 221 -485 47 153 -326 -195 101 133 -179 246 515 -138 112 556 112 -87 317 -97 -450 200 140 -321
5948 -321 -154 375 -93 -224 328 43 -372 229 114 -145 -51 212 -454 -253 176 289 -450 51 153 -265
5968 -265 -14 270 148 -238 158 291 -487 262 228 -426 -239 121 -13 -203 260 327 -265 -102 580 81 -185
5989 -185 403 -86 -315 326 -49 -599 -146 422 16 -93 363 -15 -434 233 273 -276 49 186 -328 -304 90
6010 90 143 58 213 152 -201 -77 659 47 -441 174 -34 -383 -156 -90 -260 -196 214 134 -279 265 280 -283 -41
6033 -41 310 -332 -264 533 -39 -408 228 -64 -559 9 441 -162 153 385 0 -226 271 318 -384 -254 49
6054 49 -325 -279 163 38 -331 246 257 -148 -25 242 -185 -73 291 199 -413 -119 14 -213 -47 341 -177
6075 -177 -254 441 253 -177 68 367 -48 -341 35 -253 -384 106 291 -261 -83 321 -231 -50 204 -184
6095 -184 -289 235 25 -187 -28 231 -192 -235 120 62 -222 315 326 58 133 592 -48 -169 369 -86 -474
6116 -474 -31 -69 -281 -278 166 33 -106 140 247 -246 -155 318 -345 -164 200 -80 -121 2 -178 -302 83 249
6138 249 125 74 384 195 -314 -32 246 -145 20 188 -248 -69 390 133 -174 300 339 -164 226 443 -11
6159 -11 -336 220 66 -219 267 335 -232 -213 478 -175 -295 352 223 -148 -7 146 -425 -163 218 -308 -397
6180 -397 61 145 -133 -177 534 -32 -103 253 158 -250 56 372 -64 121 145 -248 -232 403 -24 31 320 593
6202 593 -58 84 360 -238 -84 250 -13 -238 23 109 -194 -229 534 -192 -160 121 -29 -631 13 156 -213
6223 -213 -167 79 41 -136 113 97 -134 19 454 -251 115 457 100 -219 125 298 -442 -236 212 -246 -283
6244 -283 324 255 -273 370 524 25 179 140 -156 -329 -29 -176 -412 143 124 -322 -140 350 151 -91 392
6265 392 -93 -315 -316 359 -243 -104 90 -268 -120 70 56 -77 60 310 -20 -161 373 -120 -273 333 385
6286 385 -358 143 127 -124 -137 280 -46 -418 253 222 -34 -7 223 -315 -73 297 -126 -389 12 150 -405
6307 -405 7 477 -7 -202 209 164 -460 -122 51 -207 -152 269 -186 -318 252 99 -69 43 362 -156 70
6328 70 233 -75 48 241 107 -363 -85 121 50 -140 455 184 -8 299 249 -233 -61 132 -440 -208 176
6349 176 -79 -382 5 17 -200 -88 85 -204 -198 350 101 -279 85 167 -257 -30 309 -253 72 362 234
6370 234 -361 26 309 -218 24 341 -301 -295 139 94 -401 -134 169 60 65 415 -44 31 237 86 -172 164
6392 164 214 -206 -214 247 -41 -386 287 30 -152 41 278 -226 -118 237 102 -450 382 250 -277 -1 171
6413 171 -228 -343 239 228 -358 299 370 -100 -158 313 -150 -201 284 -36 -304 185 201 -365 158 260 34 -255
6435 -255 320 100 -536 124 -93 -271 -27 41 -85 -271 -1 -101 -198 4 169 -108 -123 506 -24 -11 73 313
6457 313 -260 190 115 -240 -285 259 103 -62 149 292 -279 -37 306 -220 -121 245 -77 -404 50 491 -232
6478 -232 -99 422 -63 -122 314 225 -152 54 266 -216 -122 191 -9 -124 114 56 54 143 239 170 -96 178 -115
6501 -115 -226 184 162 -410 97 130 -254 -226 275 59 -36 122 514 -196 48 143 -185 -183 55 175 -227 -206 107
6524 107 -281 207 314 -118 10 118 34 -294 170 113 -324 -117 40 -102 -74 162 78 -68 448 460 -106 201
6546 201 234 -7 -364 205 149 -307 -28 357 -293 49 357 65 17 226 431 -244 -100 248 3 -72 149
6567 149 -227 -142 180 15 -50 -62 289 -127 -122 89 92 -233 48 110 -296 -36 298 -93 -211 283 94 22 81
6590 81 370 -192 78 282 40 -416 252 -52 -329 -113 -25 -180 -96 145 -18 -31 181 325 -199 205 -13
6611 -13 -264 -365 370 -23 -485 235 88 -367 -145 316 -189 -21 108 67 -415 139 -106 -251 -190 57 90
6632 90 -215 198 269 -47 228 191 -250 100 285 -299 -616 -43 207 -210 -211 455 -68 54 222 -11 -147 165
6654 165 277 -155 94 192 -158 -415 232 -165 -220 105 200 2 170 135 -152 -388 54 -15 -519 70 -3 -226
6676 -226 -106 181 -274 -288 391 52 -224 61 423 -268 71 180 -25 45 84 96 -126 193 184 -302 39 240
6698 240 -27 -277 154 -70 -290 148 36 -230 -392 -181 -112 -467 124 117 -341 -30 246 -145 -181 369 -58
6719 -58 -346 252 158 -353 -87 297 -116 -141 160 236 -145 358 123 1 68 370 -57 -101 -105 -108 -28 208 422 44
6743 44 -127 312 -124 46 276 52 -141 78 -16 -460 -108 240 0 -250 152 189 -269 -221 123 -249 -263 329
6765 329 -190 -610 -25 288 -104 51 27 -127 -151 262 88 -125 306 442 -27 266 193 -96 -302 127 43
6786 43 -338 40 -61 80 -44 374 -46 -302 44 240 -65 228 31 -365 -345 106 109 -241 184 27 -116
6807 -116 181 246 -51 1 238 107 -369 59 53 -557 13 226 35 54 149 19 -106 156 166 -175 55 318
6829 318 -249 -39 130 63 -126 -8 180 -348 -20 188 173 -139 241 111 -368 -145 28 -180 -278 264 -27
6850 -27 -277 381 156 -128 -75 229 -439 -121 126 -118 -159 329 86 -164 45 245 -163 -246 338 -146 -84 165
6872 165 207 -83 -23 -22 -235 -153 99 -98 -361 280 166 -241 167 158 -22 -62 216 -84 -271 64 -31 -145 -67
6895 -67 271 -358 -151 374 -95 -232 366 316 15 -123 177 -238 -361 -103 101 13 -81 473 -270 -139 165
6916 165 147 -186 306 -83 -16 -69 284 125 21 161 68 42 81 201 -301 4 517 -149 64 2 110 -372
6938 -372 -17 90 -362 -87 315 148 -88 239 -94 116 -39 299 -432 19 179 2 -41 -58 -214 -313 -75
6959 -75 403 139 -184 275 165 -133 298 124 -133 12 123 -206 14 17 -108 -260 196 113 -104 98 308
6980 308 -81 -131 230 -211 -252 -145 -45 -133 146 160 114 -13 100 98 -138 32 -4 68 -25 239 -247 -183 -201 -88
7004 -88 -126 -83 116 -111 -141 -25 25 -223 -269 41 -343 -11 5 -219 -34 -97 97 -359 345 159 -312 376 271
7027 271 -126 -17 295 -322 -262 55 -6 -285 120 250 -281 47 185 98 -273 157 264 -269 115 156 -238
7048 -238 -211 -36 97 -215 -21 155 -110 1 280 -83 -68 -42 -4 -291 -59 -193 20 -31 101 -106 -145 179
7070 179 -77 30 389 222 -49 205 270 52 -261 -40 260 -117 -136 25 -117 -125 563 -274 -302 47 87 -283
7092 -283 -218 -85 -211 -330 11 -98 -132 3 183 0 -141 410 -104 -24 -91 -19 -182 -68 101 -230 -91 340
7114 340 110 -63 245 402 -31 42 143 -236 -35 416 -14 -242 -93 256 -133 -31 79 -127 11 277
7134 277 188 -139 106 216 -310 180 52 -198 -90 118 -81 -135 209 117 -195 22 215 48 -108 -93 25
7155 25 -367 -96 32 -281 -2 304 -43 -234 415 110 -345 109 156 77 -62 252 -65 -415 93 12 -241
7176 -241 178 301 -22 53 305 224 -80 70 116 -233 21 -13 -281 239 158 -105 -272 54 213 -202 -162 141
7198 141 -142 -134 -149 -118 -69 247 -40 -292 155 15 31 63 225 91 82 88 178 -129 -221 244 -134 -186 274 194 -240
7223 -240 -144 203 -17 -22 277 -133 -187 147 -131 -275 -103 316 -242 -115 329 -78 82 202 232 -247 -66 164
7245 164 -380 -20 16 -187 -626 -141 177 -29 -37 36 -166 55 60 42 -26 150 80 -70 -100 223 -65 -150 231 68
7269 68 -260 -34 272 51 -213 197 -179 -187 41 151 -187 -171 60 -168 -199 361 89 -256 412 238 48 -3
7291 -3 98 -63 -138 96 -73 -313 262 160 -220 -6 232 -269 -162 -6 -24 13 81 191 -551 105 -35 -149
7313 -149 6 244 178 -663 132 21 -193 -153 243 82 -47 -19 -108 -508 140 105 -458 -40 97 -18 -211 104
7335 104 133 -262 280 204 -129 -204 81 -15 -183 317 -50 -312 157 193 -31 34 32 18 -57 80 -1 -38 131 183
7359 183 -168 -223 312 287 -21 74 189 -62 118 113 -96 -42 166 215 -449 -22 143 -233 169 192 39 129 101
7382 101 71 -216 76 311 -124 -82 105 -110 -211 74 51 -141 6 104 -15 -65 150 -143 -14 -11 -71 -444 -27
7405 -27 302 -14 -197 136 190 -95 134 163 77 -181 171 16 -430 -32 49 -68 -117 129 -127 -88 181 -64
7427 -64 -292 275 78 -122 40 -59 164 54 51 -51 -246 161 -12 206 -47 302 -64 -201 70 -127 -290
7448 -290 -27 176 -158 4 115 -170 -64 38 -96 -110 127 391 -291 -19 123 -48 -369 223 -94 -399
7468 -399 38 262 -79 -22 122 -96 -26 303 -91 -206 64 107 -17 -176 13 -81 -179 231 28 -140 -17 141
7490 141 -318 101 178 -98 -443 223 145 -188 119 311 -233 -152 136 161 -155 383 38 -204 144 215 -136 -85
7512 -85 90 6 -121 241 338 -146 -43 298 -133 -92 121 -289 -171 62 2 -169 -139 198 -72 -226 -28 58
7534 58 6 61 -58 -199 106 10 -172 -141 17 159 -184 -83 -38 -198 -176 210 -99 -11 -28 153 4 -23 156
7557 156 -187 -90 -273 54 -329 144 62 -244 93 216 60 -64 177 224 -348 211 293 -211 -71 24 165 -192
7579 -192 248 64 -81 255 173 -231 -191 255 -351 -115 -27 53 -189 65 91 -153 -124 450 129 83 182 10 -44
7602 -44 186 287 -153 -372 233 104 -7 177 -24 -229 249 312 -169 163 27 144 -195 83 295 -364 37
7623 37 135 -96 -34 7 -56 81 19 138 -178 -40 -53 234 -216 -207 194 -365 -96 92 -24 -123 152 -32 -10 166
7647 166 -83 24 107 244 -325 -272 203 -11 -207 149 286 17 164 45 -144 68 33 -5 -64 68 42 34 -48
7670 -48 -52 -198 -240 262 251 -46 172 -4 60 288 172 81 -52 141 98 -196 65 71 -443 53 357 52 -12 -34
7694 -34 51 -50 221 150 -43 -169 216 157 -136 32 153 -101 51 224 -130 -61 263 155 -305 228 -22 -422
7716 -422 187 91 -65 38 181 17 138 -11 -81 -263 10 262 13 102 237 45 -136 1 133 26 -36
7737 -36 188 -150 24 209 -34 -97 12 211 8 134 267 30 -66 86 25 -243 162 232 -189 -27 184 -49
7759 -49 -342 -151 -19 -471 67 129 -78 -257 -5 -37 -168 -25 -79 -142 -12 -137 31 -179 226 -91 -147 15
7781 15 120 -61 1 45 35 184 27 190 2 171 46 -91 -256 286 117 -77 9 61 72 246 90 -12
7803 -12 -97 179 -73 -229 8 -134 0 185 285 -9 144 48 72 64 202 -303 -31 -44 138 -51 86 48 -139
7826 -139 -249 137 148 -340 -141 118 -251 53 101 78 -221 133 268 -157 -57 158 -2 -74 207 277 -152 215
7848 215 192 -10 27 170 127 -290 -231 78 90 65 215 78 -22 87 28 -11 -76 49 -106 30 175 -197 -392
7871 -392 -8 -141 -280 120 436 -151 80 210 -205 -136 126 9 -197 218 -208 -303 -20 195 -68 172 203
7892 203 92 -131 -105 242 -64 -46 -11 28 119 45 -37 -39 15 244 -221 64 184 -51 -231 227 214 -67 53 36
7916 36 -189 -217 -162 125 -28 212 175 119 207 278 -34 -66 291 -78 -205 27 -10 -351 -52 203 -65 -155 -52
7939 -52 209 -78 139 76 -359 161 -108 -106 -84 267 152 -64 73 172 35 67 165 84 -54 279 235 -48 129
7962 129 177 -228 138 305 152 -236 149 79 82 201 55 -166 -84 94 56 -93 -144 -32 -125 -76 29 -115 -50
7985 -50 278 -1 74 381 76 -230 81 -115 -190 -141 -36 6 -26 402 -24 -40 -362 190 80 -72 104 -27
8007 -27 -70 60 -77 -25 -57 73 -106 -159 217 362 -15 4 28 -30 -28 195 11 14 214 25 -52 151 64 -95 35
8032 35 182 -250 -115 171 154 -117 -35 124 -80 -263 17 -11 -185 66 -54 206 127 71 61 -35 -74 -112 -185 -37
8056 -37 -71 -4 -141 158 -51 -204 98 -130 -2 33 82 -213 95 201 -64 -119 46 74 -79 49 182 -51
8078 -51 -16 -44 51 268 20 217 -9 -76 356 -108 -124 292 -3 -14 125 49 4 108 155 -73 1 -103 124 49
8102 49 115 139 -207 -70 93 -168 65 272 -38 37 232 219 -131 158 211 8 95 -47 -217 -120 85 309 -216
8125 -216 137 -12 63 -1 8 204 99 72 65 -342 150 151 121 95 185 250 185 92 42 -64 -130 34 -88 -78 67 -168
8151 -168 -175 -45 266 145 -306 189 144 -79 95 246 21 84 124 -209 -283 178 -27 -146 -161 274 -316 202
8173 202 175 -33 86 113 89 -54 -37 56 -79 27 108 65 -24 133 110 -206 170 163
8191A63
##END NTUPLES=NMR FID
##END=
