##TITLE=1H_UK-23_9-7
 CD2Cl2+CF3COOD+CsF
 128 sc, 
 21.12.2022
##JCAMPDX= 6.0         $$ Bruker NMR JCAMP-DX V2.0
##DATA TYPE= NMR FID
##DATA CLASS= NTUPLES
##ORIGIN= UXNMR, Bruker Analytische Messtechnik GmbH
##OWNER= root
$$ XWIN-NMR		Version 3.5
$$ Wed Dec 21 13:56:54 2022 Russian Standard Time (UT+4h)  she@DPX200
##.OBSERVE FREQUENCY= 200.13135
##.OBSERVE NUCLEUS= ^1H
##.DELAY= (6, 6)
##.ACQUISITION MODE= SIMULTANEOUS
##.ACQUISITION SCHEME= undefined
##.AVERAGES= 128
##.DIGITISER RES= 18
##SPECTROMETER/DATA SYSTEM= spect
##.PULSE SEQUENCE= zg30
##.SOLVENT NAME= CD2Cl2
##.SHIFT REFERENCE= (INTERNAL, CD2Cl2, 0, 15.7039)
##AUDIT TRAIL= $$ (NUMBER, WHEN, WHO, WHERE, WHAT)
$$ ##TITLE= Audit trail, XWIN-NMR		Version 3.5
$$ ##JCAMPDX= 5.01
$$ ##ORIGIN= Bruker BioSpin GmbH
$$ ##OWNER= she
$$ F:/spectra/data/she/nmr/H-F/1/audita.txt
$$ ##AUDIT TRAIL=  $$ (NUMBER, WHEN, WHO, WHERE, WHAT)
(   1,<2022-12-21 13:55:32.68 +0400>,<she>,<DPX200>,
      <continue with go, POWCHK disabled, PULCHK disabled
       configuration hash MD5:
       00 E9 B6 7A A2 85 ED C7 34 08 36 98 17 FE 4E 26
       data hash MD5: 16K
       0A 7F 21 FF 2A F8 28 C6 D4 C8 B5 AE EC FF 47 1C>)
$$ ##END=
$$ 
$$ hash MD5
$$ DF 18 0D E2 21 91 95 78 52 25 B0 CF DE 32 E2 E1
##$RELAX= 
##$RELAX= 
##$RELAX= 
##$RELAX= 
##$RELAX= 
##$RELAX= 
$$ Bruker specific parameters
$$ --------------------------
##$DU= <F:/spectra>
##$EXPNO= 1
##$NAME= <H-F>
##$PROCNO= 1
##$TYPE= <nmr>
##$USER= <she>
##$AMP= (0..31)
100 100 100 100 100 100 100 100 100 100 100 100 100 100 100 100 100 100 
100 100 100 100 100 100 100 100 100 100 100 100 100 100 
##$AQSEQ= 0
##$AQ_mod= 1
##$AUNM= <au_zg>
##$AUTOPOS= <>
##$BF1= 200.13
##$BF2= 200.13
##$BF3= 200.13
##$BF4= 200.13
##$BF5= 200.13
##$BF6= 200.13
##$BF7= 200.13
##$BF8= 200.13
##$BYTORDA= 1
##$CFDGTYP= 0
##$CFRGTYP= 5
##$CHEMSTR= <none>
##$CNST= (0..31)
1 1 145 1 1 1 1 1 1 1 1 1 1 1 1 1 1 1 1 1 1 1 1 1 1 1 1 1 1 1 1 1 
##$CPDPRG= <>
##$CPDPRG1= <>
##$CPDPRG2= <>
##$CPDPRG3= <>
##$CPDPRG4= <mlev>
##$CPDPRG5= <mlev>
##$CPDPRG6= <mlev>
##$CPDPRG7= <mlev>
##$CPDPRG8= <mlev>
##$CPDPRGB= <>
##$CPDPRGT= <>
##$D= (0..31)
0 1.2 0 0 0 0 0 0 0 0.06 0 0.03 0 0 0 0 0.0002 0 0 0 0 0 0 0 0 0 0 0 0 
0 0 0 
##$DATE= 1671616058
##$DBL= (0..7)
120 120 120 120 120 120 120 120 
##$DBP= (0..7)
150 150 150 150 150 150 150 150 
##$DBP07= 0
##$DBPNAM0= <>
##$DBPNAM1= <>
##$DBPNAM2= <>
##$DBPNAM3= <>
##$DBPNAM4= <>
##$DBPNAM5= <>
##$DBPNAM6= <>
##$DBPNAM7= <>
##$DBPOAL= (0..7)
0.5 0.5 0.5 0.5 0.5 0.5 0.5 0.5 
##$DBPOFFS= (0..7)
0 0 0 0 0 0 0 0 
##$DE= 6
##$DECBNUC= <off>
##$DECIM= 32
##$DECNUC= <off>
##$DECSTAT= 4
##$DIGMOD= 1
##$DIGTYP= 9
##$DL= (0..7)
0 120 120 120 120 120 120 120 
##$DP= (0..7)
150 150 150 150 150 150 150 150 
##$DP07= 0
##$DPNAME0= <>
##$DPNAME1= <>
##$DPNAME2= <>
##$DPNAME3= <>
##$DPNAME4= <>
##$DPNAME5= <>
##$DPNAME6= <>
##$DPNAME7= <>
##$DPOAL= (0..7)
0.5 0.5 0.5 0.5 0.5 0.5 0.5 0.5 
##$DPOFFS= (0..7)
0 0 0 0 0 0 0 0 
##$DQDMODE= 0
##$DR= 18
##$DS= 0
$$ [...]
##$SUBNAM2= <"">
##$SUBNAM3= <"">
##$SUBNAM4= <"">
##$SUBNAM5= <"">
##$SUBNAM6= <"">
##$SUBNAM7= <"">
##$SUBNAM8= <"">
##$SUBNAM9= <"">
##$SW= 18.05172834244
##$SWIBOX= (0..15)
0 0 2 0 0 0 0 0 0 0 0 0 0 0 0 0 
##$SW_h= 3612.71676300578
##$TD= 16384
##$TD0= 1
##$TE= 0
##$TE2= 300
##$TE3= 300
##$TEG= 300
##$TL= (0..7)
0 120 120 120 120 120 120 120 
##$TP= (0..7)
150 150 150 150 150 150 150 150 
##$TP07= 0
##$TPNAME0= <>
##$TPNAME1= <>
##$TPNAME2= <>
##$TPNAME3= <>
##$TPNAME4= <>
##$TPNAME5= <>
##$TPNAME6= <>
##$TPNAME7= <>
##$TPOAL= (0..7)
0.5 0.5 0.5 0.5 0.5 0.5 0.5 0.5 
##$TPOFFS= (0..7)
0 0 0 0 0 0 0 0 
##$TUNHIN= 0
##$TUNHOUT= 0
##$TUNXOUT= 0
##$USERA1= <user>
##$USERA2= <user>
##$USERA3= <user>
##$USERA4= <user>
##$USERA5= <user>
##$V9= 5
##$VALIST= <valist>
##$VCLIST= <CCCCCCCCCCCCCCC>
##$VD= 0
##$VDLIST= <DDDDDDDDDDDDDDD>
##$VPLIST= <PPPPPPPPPPPPPPP>
##$VTLIST= <TTTTTTTTTTTTTTT>
##$WBST= 1024
##$WBSW= 4
##$XGAIN= (0..3)
0 0 0 0 
##$XL= 0
##$YL= 0
##$YMAX_a= 845993
##$YMIN_a= -860875
##$ZGOPTNS= <>
##$ZL1= 120
##$ZL2= 120
##$ZL3= 120
##$ZL4= 120
##$ABSF1= 10
##$ABSF2= 0
##$ABSG= 5
##$ABSL= 3
##$ALPHA= 0
##$AQORDER= 0
##$ASSFAC= 0
##$ASSFACI= 0
##$ASSFACX= 0
##$ASSWID= 0
##$AUNMP= <proc_1d>
##$AZFE= 0.1
##$AZFW= 0.1
##$BCFW= 1
##$BC_mod= 2
##$BYTORDP= 1
##$COROFFS= 0
##$CY= 11.3945322036743
##$DATMOD= 1
##$DC= 2
##$DFILT= <>
##$DTYPP= 0
##$F1P= 2.36226072786647
##$F2P= -0.459571619588291
##$FCOR= 0.5
##$FTSIZE= 0
##$FT_mod= 4
##$GAMMA= 1
##$GB= 0.15
##$INTBC= 1
##$INTSCL= 1
##$ISEN= 128
##$LB= 0.24
##$LEV0= 0
##$LPBIN= 0
##$MAXI= 10000
##$MC2= 0
##$MEAN= 0
##$ME_mod= 0
##$MI= 1.114404
##$NCOEF= 0
##$NC_proc= 0
##$NLEV= 6
##$NOISF1= 3.799351
##$NOISF2= 2.8
##$NSP= 1
##$NTH_PI= 0
##$NZP= 0
##$OFFSET= 15.70392
##$PC= 1
##$PHC0= -19117.98
##$PHC1= 22.00072
##$PH_mod= 1
##$PKNL= yes
##$PPARMOD= 0
##$PSCAL= 0
##$PSIGN= 0
##$REVERSE= no
##$SF= 200.130013532006
##$SI= 16384
##$SIGF1= 3
##$SIGF2= 2
##$SINO= 400
##$SIOLD= 16384
##$SREGLST= <1H.CDCl3>
##$SSB= 0
##$STSI= 0
##$STSR= 0
##$SW_p= 3612.71676300578
##$SYMM= 0
##$S_DEV= 0
##$TDeff= 0
##$TDoff= 0
##$TI= <>
##$TILT= no
##$TM1= 0
##$TM2= 0
##$TOPLEV= 0
##$USERP1= <user>
##$USERP2= <user>
##$USERP3= <user>
##$USERP4= <user>
##$USERP5= <user>
##$WDW= 1
##$XDIM= 8192
##$YMAX_p= 0
##$YMIN_p= 0
$$ End of Bruker specific parameters
$$ ---------------------------------
##NTUPLES= NMR FID
##VAR_NAME=  TIME,          FID/REAL,        FID/IMAG
##SYMBOL=    X,             R,               I
##VAR_TYPE=  INDEPENDENT,   DEPENDENT,       DEPENDENT
##VAR_FORM=  AFFN,          ASDF,            ASDF
##VAR_DIM=   8192,          8192,            8192
##UNITS=     SECONDS,       ARBITRARY UNITS, ARBITRARY UNITS
##FACTOR=    0.0002768,     1,               1
##FIRST=     0,             0,               0
##LAST=      2.2672688,     0,               0
##MIN=       0,             -860875,         0
##MAX=       2.2672688,     845993,          0
$$ Real data points
##PAGE= N=1
##DATA TABLE= (X++(R..R)), XYDATA
$$ [...]
$$ plain form
2791 1785 933 -407 63 -2155 -1012 -2070 -1199 -1552 414 784 436 1925 2230 403 668 423 -832
2808 -832 -1993 -2087 -703 -2522 -1066 776 620 1027 1992 743 796 91 674 -1913 -1395 -1594 -1243 -1264 748
2827 748 465 851 2071 1999 809 786 -185 -1505 -1920 -1511 -157 -1303 -790 696 943 1977 3586 1809
2845 1809 1007 189 -827 -1443 -1782 -1114 -2654 -1140 641 987 375 1482 2261 506 1013 284 -1484
2862 -1484 -1331 -562 -1037 -823 278 920 397 2383 1650 774 -90 -204 -586 -2145 -2054 -1043 -694 142 1206
2881 1206 1300 948 2532 1777 -294 298 -680 -1884 -1438 -1138 -1498 -1255 1889 963 1310 1128 2291 -456
2899 -456 -1008 -656 -1952 -2595 -354 -1085 -1222 1966 2346 1568 1091 1550 1799 -835 -886 -1546 -2311 -1941 -595
2918 -595 -1284 157 2214 1620 1585 2853 1829 -1165 -229 -1021 -2995 -2211 -679 -367 -30 1333 2793
$$ packed form
2791A785q52j340M70k218J143j058Q71l53J966L70l48J489L05j827K65k45j255
2808h32j161r4J384j819J456J842j56M07R65j249N3p05N83k587N18j99L51k1K012
2827G48k83L86J220p2j190k3r71j320m15M09J354j146N13J486K47J034J609j777
2845A809q02q18j016o16l39O68j540J514J781L46o12J107P79j755N07p29j768
2862a484J53P69m75K14J101O42n23J986p33q76q64j14l82j559R1J011L49Q36J064
2881A206R4l52J584p55k071N92r78j204M46L00l60K43L144r26L47j82J163k747
2899d56n52L52j296o43K241p31j37L188L80p78m77M59K49k634n1o60p65L70J346
2918e95o89J441K057n94l5J268j024k994R36p92j974P84J532L12L37J363J460
$$ plain form
2935 2793 1189 822 2488 -170 -1004 313 -1585 -1859 -1387 -858 -1021 1219 2207 1791 2716 1978 565
2952 565 -2048 -502 -823 -2096 -2451 -355 -266 -554 2530 1660 622 1629 617 -1535 -1236 -965 -2732
2969 -2732 -1862 -535 63 -1399 1870 3129 1947 951 731 -129 -2054 -1079 -1737 -3342 -1209 417 -13
2986 -13 654 2953 2712 1493 2040 296 -1224 -1803 -971 -2771 -1270 737 629 66 2840 3232 1531
3003 1531 1869 909 -2097 -1764 -1531 -1832 -1581 -19 99 512 2403 2752 1051 1015 687 -256 -2605 -1285
3021 -1285 -1689 -2414 -1123 1307 741 1406 4338 2300 1283 2131 446 -1986 -2032 -1699 -2142 -2041 1110
3038 1110 493 -321 2578 2655 499 438 650 -324 -2542 -834 -1291 -2169 -435 430 294 1610 3064 1951
3056 1951 956 1187 -805 -2134 -572 -825 -1916 -765 328 924 901 2502 1615 -303 910 835 -3090
$$ packed form
2935B793j604l67J666k658q34J317j898k74M72N29j63K240R88m16R25p38j413
2952E65k613J546l21j273l55K096Q9k88L084q70j038J007j012k152K99K71j767
2969b732Q70J327N98j462L269J259j182r96k20q60j925R75o58j605K133J626m30
2986a3O67K299k41j219N47j744j520n79Q32j800J501K007j08n63K774L92j701
3003A531L38r60l006L33K33l01K51J562J18M13J891L49j701l6l28r43k349J320
3021a285m04p25J291K430n66O65K932k038j017Q48j685k432m6L33m43J01L151
3038A110o17q14K899P7k156o1K12r74k218J708m57q78J734Q65j36J316J454j113
3056A951r95K31j992j329J562k53j091J151J093N96k3J601q87j918J213p5l925
$$ plain form
3073 -3090 -1491 -886 -2026 -2270 1720 594 217 3006 3062 973 -169 1553 -684 -2198 -876 -634
3089 -634 -1974 891 1272 530 2013 3275 1144 287 1237 -824 -4543 -2294 -1581 -2001 -1245 688 548
3106 548 1601 2511 2197 551 -305 668 -1818 -2676 -963 -1356 -714 424 1249 1194 2939 2750 334 -77
3124 -77 305 -1541 -2283 -877 299 -1629 1027 1648 1532 1797 2619 1584 -179 -638 -693 -3096 -2362 189
3142 189 -996 -378 1886 1080 200 3351 2372 266 -360 50 -1928 -1796 215 -764 -1079 85 2504
3159 2504 779 1079 2889 146 -397 -271 -1751 -3051 -842 -1311 -1131 1235 1815 1775 571 2069 971
3176 971 -417 39 50 -2234 -1797 -1420 -1261 -1169 1395 1978 1048 2157 1310 -748 -1495 -1165 -1621 -2125 29
3195 29 -1884 -134 1509 2421 507 1522 2212 752 -958 -1196 -2932 -3207 -1413 -1340 -799 1267 2106
$$ packed form
3073c090J599O05j140k44L990j126l77K789N6k089j142J722k237j514J322K42
3089f34j340K865L81p42J483J262k131q57R50k061l719K249P13m20P56J933j40
3106E48J053R10l14j646q56R73k486q58J713l93O42J138Q25n5J745j89k416m11
3124g7L82j846p42J406J176j928K656O21j16K65Q22j035j763m59n5k403P34K551
3142A89j185O18K264q06q80L151r79k106o26M10j978J32K011r79l15J164K419
3159B504j725L00J810k743n43J26j480j300K209m69J80K366N80m0j204J498j098
3176I71j388M56J1k284M37L77J59R2K564N83r30J109q47k058p47L30m56n04K154
3195B9j913J750J643R12j914J015O90j460j710k38j736k75J794P3N41K066Q39
$$ plain form
3212 2106 1015 1975 2831 1062 -468 59 -1605 -1634 -1216 -390 -545 -533 2120 2082 1411 1805 1852 -1042 -846
3231 -846 406 -2201 -1908 -407 -455 -46 1969 2179 838 1185 1801 -251 -1186 -649 -851 -1943 -1330 -926
3249 -926 -677 588 2853 2594 1740 1401 1420 -626 -1821 -1503 -2223 -2039 -382 247 -639 2375 2116 1231
3267 1231 352 892 -1074 -2095 -774 -1467 -1662 -449 895 -805 660 3531 628 1006 670 -53 -1985
3284 -1985 -718 -858 -1513 -274 1398 -183 837 1922 1603 282 693 822 -1955 -1876 -366 -1794 -2442
3301 -2442 -751 592 904 1547 1759 430 113 832 -985 -2685 -1472 -1375 -1838 -451 1213 905 1403
3318 1403 3231 1323 807 1429 776 -1734 -1334 -1430 -1098 -1211 1161 942 1261 2705 1686 122 568 374
3336 374 -1573 -2458 -778 -2284 -1119 -325 242 603 1882 1707 981 120 760 -953 -2400 -1125 -714
$$ packed form
3212B106j091R60Q56j769j530N27j664k9M18Q26j55J2K653l8o71L94M7k894J96
3231h46J252k607K93J501m8M09K015K10j341L47O16k052r35N37k02j092O13M04
3249i26K49J265K265k59q54l39J9k046j195L18p20J84J657O29q86L014k59q85
3267A231q79N40j966j021J321o93j95J213J344j700J465K871k903L78l36p23j932
3284a985J267j40o55J239J672j581J020J085l19j321M11J29k777P9J510j428o48
3301b442J691J343L12O43K12j329l17P19j817j700J213R7m63J387J664l08M98
3318A403J828j908n16O22o53k510M00r6L32j13K372k19L19J444j019j564M46j94
3336C74j947q85J680j506J165P94N67L61J279j75p26q61O40j713j447J275M11
$$ plain form
3353 -714 -3028 -1030 998 -190 931 2626 1090 -712 -199 -511 -1739 -905 -189 -585 -711 1172 1334
3370 1334 122 2089 3163 689 -382 1759 -1670 -1861 -397 -1720 -2037 -196 909 703 1823 1745
3386 1745 515 -232 198 -1051 -3463 -1534 -1378 -1348 -551 258 1510 392 2006 2739 358 -670 179
3403 179 -2968 -1325 -696 -370 -531 -300 2166 1623 1222 1634 -1000 179 457 -768 -2152 -1269 -763 -1265
3421 -1265 764 1173 73 1766 1691 366 -709 -409 140 -2013 -1244 -874 -1983 -349 1567 1338 472
3438 472 846 551 -218 701 -889 -1063 -1749 -680 -602 -1887 1193 895 1819 660 1946 651 -1136 -296
3456 -296 -1381 -1962 -1022 756 -660 116 2230 1305 719 2342 584 -343 -240 -479 -2326 -2104 779
3473 779 -170 279 1420 1725 1137 367 465 -1228 -1088 -423 -3125 -1866 472 -949 -585 2550 1924 2030
$$ packed form
3353g14k314J998K028j188J121J695j536j802N13l12j228Q34P16l96j26J883J62
3370A334j212J967J074k474j071K141l429j91J464j323l17J841J105k06J120p8
3386A745j230p47M30j249k412J929J56L0P97Q09J252j118J614P33k381j028Q49
3403A79l147J643O29L26j61K31K466n43m01M12k634J179K78j225j384Q83N06n02
3421a265K029M09j100J693p5j325j075L00N49k153P69L70j109J634J916k29q66
3438D72L74k95p69R19j590j74o86J069P8j285L080k98R24j159J286j295j787Q40
3456b96j085n81R40J778j416P76K114r25n86J623j758r27J03k39j847K22K883
3473G79r49M49J141L05n88p70R8j693J40O65k702J259K338j421L64L135o26J06
$$ plain form
3491 2030 981 2201 -557 -333 -543 -1118 -1942 -222 417 -308 67 1938 1722 2019 1189 986 -950 -1356
3509 -1356 -285 -2200 -1366 -210 911 172 1698 1478 1449 1105 1505 -2000 -1528 -344 -961 -1985 49
3526 49 293 131 1317 2192 1143 517 1172 937 -369 -783 -909 -1497 -546 673 487 928 1651 1283 75
3545 75 588 86 -641 -1365 180 -1184 -1205 847 314 10 665 1569 242 136 14 -566 -965 -508 -952
3564 -952 -2420 100 1545 710 1157 2468 492 -75 50 -394 -1933 -525 -1047 -2119 -514 341 1867
3581 1867 663 1580 1132 880 290 -1632 -1316 -1612 -490 -1189 -1274 -398 752 158 1170 1691 858 794 561
3600 561 -1026 -1767 -1277 -1006 -486 -586 462 -233 1596 1956 2241 171 -107 -36 -1207 -1077 -600 -676 -656
3619 -656 1271 393 18 936 951 24 -44 -617 -547 -1201 -1203 -1516 -1200 1141 1608 -512 1443 1178 -842 -921
$$ packed form
3491B030j049J220k758K24k10n75q24J720O39p25L75J871k16K97q30k03j936m06
3509a356J071j915Q34J156J121p39J526k20k9l44M00l505M72J184o17j024K034
3526D9K44j62J186Q75j049o26O55k35j306m14j26n88R51J219j86M41P23l68j208
3545G5N13n02p27p24J545j364k1K052n33l04O55R04j327j06j22n80l99M57m44
3564i52j468K520J445q35M47J311j976n67J25m44j539J408n22j072J605Q55J526
3581A867j204R17m48k52n90j922L16k96J122o99q5Q76J150n94J012N21q33o4k33
3600E61j587p41M90K71N20j00J048o95J829L60K85k070k78P1j171J30M77p6K0
3619f56J927q78l75R18J5r27o8n73P0o54kl13L16K341M67k120J955k65k020p9
$$ plain form
3639 -921 145 -1875 -1828 -49 -1091 -293 -352 1815 449 1315 1726 768 -559 299 -341 -1844 -392 -30
3657 -30 -739 -144 1481 -376 595 1126 2428 -87 -263 300 -1547 -1496 -1308 586 -961 611 1358 -281
3675 -281 451 1680 137 -1053 866 -524 -1989 -597 -223 -604 -322 1571 150 1088 1580 1233 -740
3692 -740 -167 -546 -2296 -1144 -572 -917 -452 1110 926 754 1275 1519 -479 -361 -479 -125 -558 -363 -337
3711 -337 60 740 844 1614 689 1579 995 -1338 179 -295 -1658 -1210 818 -125 -127 1175 556 -164 1621
3730 1621 972 -1634 -565 -825 -2247 -1497 355 111 420 273 2137 171 165 983 -475 -921 -231 -1132
3748 -1132 -1999 707 453 -69 443 2304 998 -589 393 -535 -1713 979 -88 -2513 -354 -285 -240
3765 -240 -149 2187 279 259 320 864 -477 -318 140 -570 -1026 -328 501 -767 1569 1112 -747 377 1876
$$ packed form
3639i21J066k020M7J779j042P98n9K167j366Q66M11r58j327Q58o40j503J452L62
3657c0p09N95J625j857R71N31J302k515j76N63j847N1J88J894j547J572P47j639
3675b81P32J229j543j190J919j390j465J392L74l81K82J893j421R38M92l47j973
3692g40N73l79j750J152N72l45M65J562j84j72N21K44j998J18j18L54m33J95K6
3711c37L97O80J04P70r25Q90n84k333J517m74j363M48K028r43kJ302o19p20J785
3730A621o49k606J069k60j422P50J852k44L09j47J864j966oQ18j458m46O90r01
3748a132q67K706k54n22N12J861j306j587R82r28j178K692j067k425K159O9M5
3765b40R1K336j908k0O1N44j341J59M58p10m56O98Q29j268K336m57j859J124J499
$$ plain form
3784 1876 691 -895 1102 -1282 -1554 -792 614 -120 279 911 408 53 915 -174 -270 -1248 -463 -1750
3802 -1750 -1017 1263 330 808 1105 1047 1080 991 1229 -465 -1351 371 -1566 -1425 520 -783 -301 1366
3820 1366 624 621 711 602 -43 -1924 -832 -78 -2556 -520 1521 306 506 1335 -78 337 369 854 -812
3839 -812 -132 -913 -2142 -95 1024 1727 -448 1070 1387 14 171 483 -912 -824 -398 157 -1061 -99
3857 -99 1160 58 1412 1715 779 -382 -30 -785 -834 -1168 16 -1457 177 251 786 11 2187 653
3875 653 -891 427 113 -1011 -1188 -1161 -457 -222 471 861 1013 121 1320 -883 -302 677 -219 -932 -140
3894 -140 -962 -1723 -555 856 -345 985 979 1711 -750 329 -415 -2059 -1076 -118 -1181 -489 1091 486
3912 486 57 1035 1713 -635 -56 -155 -869 -635 430 -2001 -861 342 1361 -608 1343 472 -16 -646
$$ packed form
3784A876j185j586J997k384k72P62J406p34L99O32n03l55Q62j089r6r78P85j287
3802a750P33K280r33M78K97n8L3q9K38j694q86J722j937J41J945j303M82J667
3820A366p42lR0j09o45j881J092P54k478K036K041j215K00Q29j413M15L2M85j666
3839h12O80p81j229K047J119P03k175J518L17j373J57L12j395Q8M26N55j218R62
3857i9J259j102J354L03r36j161L52p55m9l34J184j473J634P4N35p75K176j534
3875F53j544J318l14j124j77K7P04K35O93L90J52q92J199k203N81R79q96p13P92
3894a40q22p61J168J411j201J330oP32k461J079p44j644R83R58j063O92J580o05
3912D86m29R78O78k348N79r9p14K34J065k431J140J203J019j969J951q71m88o30
$$ plain form
3930 -646 -493 443 -1249 -128 -235 206 -575 1094 521 1068 665 147 -1170 -896 522 -1434 -104 -529
3948 -529 -769 -14 924 1177 915 1587 1080 101 441 -15 -797 -1096 -165 -413 203 944 917 586 -449 1015
3968 1015 1226 -536 -103 -1355 -1235 -722 -383 599 -285 1758 689 818 802 -507 -498 -404 -789 -1457 -1208
3987 -1208 -125 -444 -253 1199 1482 -456 -81 1566 -50 -1738 66 -531 -847 1114 -376 113 547
4004 547 633 -97 -70 153 294 180 4 -392 -1462 -1365 164 -272 369 598 1670 -93 819 404 -963
4023 -963 -253 78 -986 -640 571 438 -1029 491 650 -430 673 1789 -904 -762 -493 -1223 -1433
4040 -1433 -44 799 -384 -482 494 -9 -10 1109 -125 -471 317 -209 -995 -40 498 -73 686 474 1317
4059 1317 751 170 478 319 -961 -191 -1382 -1288 518 476 745 626 217 177 899 -773 -643 -566 20 -580
$$ packed form
3930f46J53R36j692J121j07M41p81J669n73N47m03n18j317K74J418j956J330m25
3948e29k40P55R38K53k62O72n07r79L40m56p82k99R31k48O16P41k7l31j035J464
3968A015K11j762M33j252J20N13L39R82q84K043j069J29j6j309RR4l85o68K49
3987a208J083l19J91J452K83j938L75J647j616j688J804n97l16J961j490M89M34
4004E47Q6p30K7K23J41j14j76l96j070R7J529m36O41K29J072j763R12m15j367
4023i63P10L31j064L46J211j33j467J520J59j080J103J116k693J42K69p30k10
4040a433J389Q43j183r8R76n03jJ119j234l46P88n26p86R55N38n71P59k12Q43
4059A317n66n81L08j59j280P70j191R4J806m2K69j19m09m0P22j672J30P7N86o00
$$ plain form
4079 -580 -868 -1030 1102 -594 737 1639 660 378 517 1074 -239 -645 141 -1234 -447 -148 1506 -973
4097 -973 137 1499 -114 87 408 -195 -736 389 -710 -534 422 1188 -649 -118 1775 -99 -325
4114 -325 449 -338 -948 -650 -947 -1265 -339 -470 246 -9 384 590 -909 -118 -411 -710 -823 1234 464
4133 464 -1277 254 1391 119 690 1725 -158 -483 -419 -271 -265 -634 364 -117 -655 290 0 104 1464
4152 1464 -314 -429 777 -720 -490 258 -190 -1220 -1022 605 -1181 -125 1658 154 738 407 678
4169 678 -507 -528 82 -3 -1125 -102 -52 -689 1002 229 -1017 44 258 54 -127 642 268 -415 -9
4188 -9 94 632 662 438 509 -593 -708 -191 -743 185 212 -360 630 -213 -159 -270 -19 23 -183 -937 184 -1050
4210 -1050 -312 -229 -829 -323 648 1032 -293 1000 -264 -454 36 1622 -560 -342 -845 -117 -82 276 280
$$ packed form
4079e80k88j62K132j696J331R02r79k82J39N57j313m06P86j375P87K99J654k479
4097i73J110J362j613K01L21o03n41J125j099J76R56P66j837N31J893j874k26
4114c25P74p87o10K98k97l18R26j31P16k55L93K06j499P91k93k99j13K057p70
4133D64j741J531J137j272N71J035j883l25O4J48Ol69R98m81n38R45k90J04J360
4152A464j778j15J206j497K30P48m48j030J98J627j786J056J783j504N84l31K71
4169F78j185k1O10q5j122J023N0o37J691p73j246J061K14k04j81P69l74o83M06
4188iJ03N38L0k24P1j102j15N17n52R28K7n72R90q43N4j11K51M2k06p54J121j234
4210a050P38Q3o00N06R71L84j325J293j264j90M90J586k182K18n03P28L5L58M
$$ plain form
4229 280 128 344 1160 -655 -276 281 -714 -650 -484 -347 -920 198 732 772 -656 615 910 -768 736
4248 736 -157 413 -164 942 732 -438 948 1422 658 -110 329 251 -514 333 634 -1309 -699 232 -811
4267 -811 1300 -111 -519 -1474 -195 318 -571 -187 241 -718 -642 1083 -250 -648 881 533 -440 -49
4285 -49 656 -492 -354 686 -943 117 -407 1202 -570 562 961 144 -6 -30 276 658 -97 -605
4303 -605 -719 194 112 -503 839 1039 -1117 -629 -299 -34 -879 422 -532 550 481 1010 -406 -894 -167
4322 -167 106 149 -162 1092 -263 -1520 -75 99 -1288 759 42 -1097 274 1321 -732 -35 787
4339 787 -595 -36 999 -117 -1166 -540 145 205 660 1030 -263 -149 -161 430 -299 -1252 1210 -949
4357 -949 290 986 -1182 52 -346 1299 -284 937 357 -1143 -183 -156 -218 87 -381 -156 -502 228
$$ packed form
4229B80j52K16Q16j815L79N57r95O4J66J37n73J118N34M0j428J271K95j678J504
4248G36q93N70n77J106k10j170J386M74p64p68M39p8p65Q47L01j943O10R31j043
4267h11K111j411m08r55J279N13q89L84M28r59P6J725j333l98J529l48r73L91
4285d9P05j148J38J040j629J060n24J609j772J132L99q17j50k4L06L82p55n08
4303f05j14R13q2o15J342K00k156M88L30K65q45J301r54J082o9N29j416m88P27
4322a67K73M3l11J254j355j257J445J74j387K047p17j139J371J047k053O97Q22
4339G87j382N59J035j116j049O26O85O0M55L70j293J14j2N91p29r53K462k159
4357i49J239O96k168J234l98J645j583J221n80j500R60K7o2L05m68K25l46P30
$$ plain form
4375 228 -365 516 -627 573 474 -183 216 -792 255 -310 515 -939 -46 374 1017 474 763 247 -248
4394 -248 660 288 -135 495 785 921 261 816 1226 194 -553 188 92 -157 818 -366 -702 -498 1135
4413 1135 -551 266 374 -680 114 744 864 15 -45 449 -522 -1326 938 650 184 324 -534 -888 717
4432 717 24 274 517 98 466 99 -51 -580 -1150 1104 -748 -393 -408 -76 779 -975 39 -461 738
4451 738 -173 1037 -519 -59 814 89 29 565 327 -459 -622 -367 -168 -107 1528 715 322 917 293 -125
4471 -125 -382 293 -410 -501 715 642 -372 596 1125 -270 1035 691 -356 -196 430 154 -485 -560 156
4490 156 -451 -442 217 -3 721 887 1414 -109 365 -438 -892 -179 -170 -426 513 -103 -879 -1363 417 1070 -691
4511 -691 -743 435 -47 -81 469 756 915 376 1037 -635 507 511 373 -124 -261 166 -1092 444 729 259
$$ packed form
4375B28n93Q81j143J200r9o57L99j008J047n65Q25j454Q93M20O43n43K89n16m95
4394b48R08l72m23O30K90J36o60N55M10j032p47P41r6k49R75j184l36K04J633
4413A135j686Q17J08j054P94O30J20q49o0M94r71q04K264k88m66J40q58l54J605
4432G17o93K50K43m19L68l67j50n29n70K254j852L55j5L32Q55j754J014n00J199
4451G38r11J210j556M60Q73p25o0N36k38p86j63K55J99O1J635q13l93N95o24m18
4471a25k57O75p03r1J216p3j014R68N29j395J305l44j047J60O26k76o39p5P16
4490A56o07RO59k20P24J66N27j523M74q03m54P13Rk56R39o16p76m84J780O53j761
4511f91n2J178m82l4N50K87J59n39O61j672J142Mj38m97j37M27j258J536K85m70
$$ plain form
4531 259 893 53 822 -580 -149 334 -380 -719 -556 -713 135 -7 -53 -772 -370 443 -1513 -326 1026
4550 1026 -533 -740 -7 -391 -988 501 121 -957 238 -248 -417 -1009 -33 -1618 -319 -103 1072
4567 1072 758 231 177 -68 -778 870 -1005 -961 929 -204 -44 60 -131 -245 -502 -175 -173 -705 -114 543
4587 543 -282 -180 401 264 58 361 437 -1456 116 169 304 702 -1037 -191 -1263 -647 838 929 287
4606 287 329 -404 1026 106 8 -1558 339 -368 3 832 -214 147 -453 360 109 -214 1202 384 -109
4625 -109 1223 692 116 -184 122 -12 -10 -397 -531 -370 -443 -373 119 313 -96 119 455 -32 969 172 738
4646 738 1461 21 -202 -426 -606 -765 -1210 271 -552 108 526 -755 206 1133 318 -1191 -251 -187 82
4665 82 -466 -493 -267 -270 -430 947 -613 -25 -136 15 146 347 -255 -413 -317 250 890 867 -55 375 -98
$$ packed form
4531B59O34q40P69j402M31M83p14l39J63j57Q48j42m6p19M02Q13j956J187J352
4550A026j559k07P33l84n97J489l80j078J195m86j69n92R76j585J299K16J175
4567A072l14n27n4k45p10J648j875M4J890j133J60J04j91j14k57L27Kn32N91O57
4587E43q25J02N81j37k06L03P6j893J572N3J35L98j739Q46j072O16J485R1o42
4606B87M2p33J430r20r8j566J897p07L71Q29j046L61o00Q13k51l23J416q18m93
4625a09J332n31n76l00L06j34Kl87j34J61p3P0M92J94m09K15L36m87J001p97N66
4646G38P23j440k23k24j80j59m45J481q23O60M18j281R61R27q15j509R40O4K69
4665H2n48k7K26lj60J377j560N88j11J51J31K01o02j58R6N67O40k3r22M30m73
$$ plain form
4686 -98 404 1223 -258 611 213 311 50 -75 -42 -535 207 -954 -558 -366 635 -254 331 518 233 -161
4706 -161 -270 -727 -15 659 -237 -201 -376 499 -34 556 320 -297 132 362 148 127 -813 1230 -301 -39
4726 -39 500 -748 -1110 1311 -398 -505 -34 -811 393 292 741 694 403 441 251 -1205 -471 52 120 -1079
4746 -1079 1486 -304 -84 3 193 -724 -42 296 -165 -378 727 -451 -522 -249 539 557 479 420 -479 587
4766 587 162 86 -1338 507 -419 -1071 -351 629 779 -730 800 746 -103 391 727 -271 -354 270 -80 9
4786 9 409 -697 311 412 237 -242 -539 -379 -253 455 614 -376 -376 219 -404 -589 -160 1302 -239 1183
4806 1183 -149 88 -359 304 256 -675 492 370 -422 -561 -570 473 368 -1041 404 601 -461 288 -1511
4825 -1511 -833 -183 476 -575 157 888 -874 536 328 77 -646 -173 -658 153 71 -421 -111 -580 -672
$$ packed form
4686i8N02Q19j481Q69l98R8k61j25L3m93P42j161L96J92J001q89N85J87k85l94
4706a61j09m57P12O74q96L6j75Q75n33N90k36o17M29K30k14k1r40K043j531K62
4726c9N39j248l62K421j709j07M71p77J204j01M49m7k91L8j90j456P34N23O8j199
4746a079K565j790K20Q7J90r17O82L38m61k13J105j178p1K73P88J8p8n9q99J066
4766E87m25p6j424J845r26o52P20R80J50j509J530n4q49M94L36r98q3O24l50Q9
4786IM00j106J008J01j75m79k97J60J26P08J59r90%N95o23j85M29J462j541J422
4806A183j332K37m47O63m8r31J167j22p92j39rJ043j05j409J445J97j062P49j799
4825a511O78O50O59j051P32P31j762J410k08k51p23M73m85Q11q2m92L10m69r2
$$ plain form
4844 -672 -200 551 232 -582 76 -16 -432 -709 -358 299 585 128 658 869 -536 -782 192 -1312 -434 542
4864 542 819 -877 -194 200 -554 18 183 -367 -912 510 -314 -912 -23 122 -763 -99 -264 -568 99
4883 99 348 1605 633 716 -87 -104 -173 -77 18 -1176 -125 -364 -383 738 -545 -1176 -1035 701 -802 -858
4903 -858 -16 -497 -1137 20 -161 -93 590 576 -1307 -51 442 -386 -548 145 -437 -393 -497 79 -126 -47
4923 -47 12 -5 -91 -355 -622 -42 -287 -711 -128 31 370 478 458 -56 798 -292 -783 385 506 -414 -384
4944 -384 495 -374 433 97 -518 -29 362 -468 -444 -336 -1159 -155 585 454 -403 395 -605 290 -912
4963 -912 128 825 -236 -96 -596 316 -387 557 523 508 -272 1044 26 -380 12 -312 -1575 619 -320
4982 -320 -918 38 -1115 -343 -1475 474 -857 -224 234 -408 107 911 829 422 229 -39 -1123 -334 340
$$ packed form
4844f72M72P51l19q14O58r2m16k77L51O57K86m57N30K11j405k46R74j504Q78R76
4864E42K77j696O83L94p54N72J65n50n45J422q24n98Q89J45q85O64j65l04O67
4883I9K49J257r72Q3q03j7o9R6R5j194J051k39j9J121j283o31J41J736j503n6
4903h58Q42m81o40J157j81O8O83j4j883J256M93q28j62O93n82M4j04N76k05P9
4923d7N9j7q6k64k67N80k45m24N83J59L39J08k0n14Q54j090m91J168J21r20L0
4944c84Q79q69Q07l36o15M89L91q30K4J08q23J004P40j31q57P98j000Q95j202
4963i12J040O97j061J40n00R12p03R44l4j5p80J316j018m06L92l24j263K194r39
4982c20n98R56j153P72j132J949j331O33M58o42N15Q04q2m07j93k68j084P89O74
$$ plain form
5001 340 -82 -144 225 338 278 -563 -350 1520 752 914 206 -1668 -305 339 -1021 -528 -423 26 354
5020 354 540 603 -886 460 723 -45 -807 613 466 -238 499 -217 404 -75 -48 -567 195 -154 -564 -1260
5040 -1260 97 772 -392 -266 95 -505 -50 711 -543 -557 288 -184 -261 9 -114 62 1135 1017 -1262
5059 -1262 218 -320 -506 298 134 1214 201 176 309 556 -643 -96 699 217 -231 -432 -339 -432 -368 447
5079 447 338 95 376 442 213 -1007 -675 339 13 219 413 806 -583 -887 -553 313 388 -410 -117 -260
5099 -260 201 512 -52 -132 1011 -632 -28 -529 317 -190 -98 144 -556 -5 84 -249 -585 84 -805 42
5119 42 728 -87 624 -214 -1015 451 -171 -785 -83 600 -497 442 462 -716 366 208 -936 51 100
5138 100 -581 -201 -24 -580 -968 646 288 -210 -364 816 944 -493 -332 -348 -424 -360 -75 -706 -1046 288
$$ packed form
5001C40m22o2L69J13o0q41K13J870p68J62p08j874J363O44j360M93J05M49L28
5020C54J86O3j489J346K63p68p62J420j47p04P37p16O21m79K7n19P62l49m10o96
5040a260J357O75j164J26L61o00M55P61j254j4Q45m72p7K70j23J76J073j18k279
5059a262J480n38j86Q04j64J080j013k5J33K47j199N47P95m82m48k01R3r3O4Q15
5079D47j09k43K81O6k29j220L32J014l26K06J94L93j389l04L34Q66P5p98K93j43
5099b60M61L11n64q0J143j643O04n01Q46n07R2K42p00N51Q9l33l36O69q89Q47
5119D2O86q15P11q38q01J466o22o14P02O83j097R39K0j178J082j58j144R87M9
5138A00o81L80J77n56l88J614l58m98j54J180J28j437J61j6p6O4K85o31l40J334
$$ plain form
5158 288 173 99 174 -678 456 -585 -378 379 -525 -722 -250 -1056 -82 609 -87 -716 601 510 -356 69
5178 69 -1298 -459 -544 579 -1016 860 764 495 -244 817 4 -92 475 623 229 -1156 310 663 -156
5197 -156 -202 410 96 -201 462 -72 -101 268 -275 99 -356 -627 -527 -292 344 -386 41 229 -1164 -839
5217 -839 505 -189 -1082 -341 -12 -445 -564 -176 -767 -963 248 598 38 227 -357 -18 -195 442 -521
5236 -521 -816 174 11 232 -1023 617 -34 -37 87 -61 -372 -953 -562 -385 712 -254 -165 283 2 376
5256 376 -532 -1003 350 -477 226 301 -88 -1054 1177 857 -405 -353 314 1039 989 1000 -609 123 -82 287
5276 287 172 159 964 -331 -213 195 -213 -622 -441 -51 -46 39 16 -319 210 -16 -164 -100 -466 631 -65
5297 -65 -234 629 -414 -345 228 119 474 186 679 38 1088 442 1096 1087 284 327 710 1094 173 -51 -548
$$ packed form
5158B88j15p4P5q52J134j041K07P57r04j97M72q06R74O91o96o29J317r1q66M25
5178F9j367Q39q5J123j595J876r6k69p39J061q13r6N67J48l94j385J466L53q19
5197a56m6O12l14k97O63n34k9L69n43L74m55k71J00K35O36p30M27J88j393L25
5217h39J344o94q93P41L29m33j19L88n91j96J211L50n60J89n84L39j77O37r63
5236e21k95R90j63K21j255J640o51lJ24j48l11n81L91J77J097r66Q9M48k81L74
5256C76r08m71J353q27P03P5l89r66K231l20j262N2O67P25n0J1j609P32k05L69
5276B87j15j3Q05j295J18M08m08m09J81L90NQ5k3l35N29k26j48O4l66J097o96
5297f5j69Q63j043O9N73j09L55k88M93o41J050o46O54rq03M3L83L84r21k24m97
$$ plain form
5318 -548 682 180 -254 67 426 -603 -565 -202 -218 105 587 1006 690 467 56 -585 -335 -199 -985 -1154
5338 -1154 -461 -227 -276 87 273 -65 -1085 -4 -313 -327 1645 -283 -442 883 -576 -905 196 482
5356 482 275 -333 -590 -609 358 256 782 704 300 -222 -1103 43 -544 158 449 275 833 361 167 924
5376 924 -61 305 -159 232 873 504 1033 675 725 -745 -564 -252 -491 -435 -427 1200 37 651 133 -79
5396 -79 -762 -105 -1002 176 381 971 139 48 -491 729 11 20 26 255 -56 119 373 368 205 686 182 -580
5418 -580 -309 12 -190 -1006 -169 1 772 1065 -296 -178 -460 714 -529 831 175 -1069 -96 265
5436 265 -294 449 -43 659 -280 79 325 -285 -559 -1173 -858 155 309 254 -65 335 831 -76 -748 173
5456 173 368 243 -268 -635 -1323 93 -104 411 -953 279 643 -37 210 96 403 -524 -164 -416 411
$$ packed form
5318e48J230n02m34L21L59j029L8L63j6L23M82M19l16k23m11o41K50J36p86j69
5338a154O93K34m9L63J86l38j020J081l09j4J972j928j59J325j459l29J101K86
5356D82k07o08k57j9R67j02N26p8m04n22q81J146n87P02K91j74N58m72j94P57
5376I24r85L66m64L91O41l69N29l58N0j470J81L12k39N6QJ627j163O14n18k12
5396g9o83O57q97J178K05N90q32r1n39J220p18ROK29l11J75K54nj63M81n04p62
5418e80K71L21k02q16Q37J70P71K93j361J18k82J174j243J360o56j244R73L61
5436B65n59P43m92P02r39L59K46o10k74o14L15J013J54n5l19M00M96r07o72R21
5456A73J95j25n11l67o88J416j97N15j364J232L64o80K47j14L07r27L60k52Q27
$$ plain form
5475 411 531 652 408 38 -483 179 241 -313 587 466 -105 -809 -435 73 618 -1534 453 -451 -901 35
5495 35 773 423 -192 248 368 -412 1350 260 -1075 591 794 -547 50 -29 239 -669 212 -466 -555
5514 -555 -419 155 80 -153 -330 448 31 201 -153 -354 -146 272 215 -777 285 936 10 987 36 761
5534 761 -205 153 -465 -675 -671 25 -927 -41 -384 129 -1084 -248 1060 -1617 90 328 85 -598 -14
5553 -14 -194 377 534 236 408 -50 197 -718 -484 1168 -128 110 196 148 -509 -350 -113 -431 -521 -802 -50
5574 -50 -1 325 147 -24 -459 226 -430 354 -390 213 598 -195 -68 -103 -933 -479 -548 317 955 -532 -800
5595 -800 258 269 -245 -318 -412 -261 501 -878 173 546 621 472 -229 -717 -442 203 205 200 94 380 -524 520
5617 520 -627 663 388 -605 -108 20 506 -179 427 -169 -754 -7 137 -523 350 281 631 -604 406
$$ packed form
5475D11J20J21k44l70n21O62O2n54R00j21n71p04L74N08N45k152J987r04m50R36
5495C5P38l50o15M40J20p80J762j090j335J666K03j341N97p9K68r08Q81o78q9
5514e55J36N74p5k33j77P78m17J70l54k01K08M18n7r92J062O51r26R77r51P25
5534G61r66L58o18k10MO96r52Q86l43N13j213Q36J308k677J707K38k43o83N84
5553a4j80N71J57k98J72m58K47r15K34J652j296K38Q6m8o57J59K37l18r0k81P52
5574e0M9L26j78j71m35O85o56P84p44O03L85p93J27l5q30M54o9Q65O38j487k68
5595h00J058J1n14p3r4J51P62j379J051L73P5j49p01m88K75O45Knj06K86r04J044
5617E20j147J290k75r93M97J28M86o85O06n96n85P47J44o60Q73o9L50j235J010
$$ plain form
5636 406 -282 376 -377 -583 -317 -128 601 713 -119 554 76 774 1035 -48 -36 800 297 138 -473 -164
5656 -164 763 -398 -809 112 -133 336 869 64 475 -210 132 206 -749 1067 -97 263 514 -294 431
5675 431 631 185 343 362 -161 70 441 317 339 671 -90 -121 256 451 -165 9 -21 -538 -561 -75 389 -254
5697 -254 -30 -609 385 289 -897 37 -53 -448 -42 -164 -115 -409 77 484 -142 -23 660 -727 79 -925
5717 -925 77 380 1038 519 -289 -280 -93 -486 -315 -432 -527 -383 453 138 -604 625 1 750 119 857
5737 857 -261 -395 94 -151 -57 -38 581 427 560 355 -169 -735 -359 22 -452 959 538 -199 664 307
5757 307 -109 837 444 189 651 82 16 -192 -550 1362 -1222 -362 304 -732 -456 -196 886 -607 -173
5776 -173 664 -814 -871 265 -479 67 342 326 586 177 423 -183 -433 269 228 86 -309 -575 -128 -667
$$ packed form
5636D06o88O58p53k06K66J89P29J12q32O73m78O98K61j083J2Q36n03j59o11L09
5656a64R27j161m11R21k45M69N33q05M11o85L42P4r55J816j164L60K51q08P25
5675D31K00m46J58J9n23K31L71j24K2L32p61l1L77J95o16J74l0n17k3M86M64o43
5697b54K24n79R94r6j186R34r0l95M06j22M9k94M86M07o26J19O83j387Q06j004
5717i25J002L03O58n19q08RJ87l93J71j17r5J44Q36l15p42J229o24P49o31P38
5737H57j118j34M89k45R4J9O19j54J33k05n24n66L76L81m74J411m21p37Q63l57
5757C07m16R46l93k55M62n69o6k08l58J912k584Q60O66j036K76K60J082j493M34
5776a73Q37j478n7J136p44N46K75j6K60m09K46o06k50P02m1j42l95k66M47n39
$$ plain form
5796 -667 -421 -379 203 -315 -416 -616 881 618 733 748 -137 -163 -536 338 -143 -2 -25 183 91 536 741
5817 741 -251 -48 339 -643 604 187 -392 -512 -293 291 -344 -244 -720 1408 214 -706 -796 -1232 -138
5836 -138 -279 613 -159 -599 -130 -263 -776 -157 -170 242 -333 -494 -764 1524 1054 -207 206 -732 -121 -1025
5856 -1025 381 520 -457 644 -373 279 231 1068 578 -752 1922 -351 648 326 106 -162 -207 415
5874 415 -789 846 440 -692 243 -524 512 184 76 850 -156 -89 1 -409 -303 -408 -567 135 628
5893 628 -489 84 139 -370 -441 -441 750 79 -94 -540 -356 263 1076 810 -743 -882 1222 -604 -752 82
5913 82 -92 55 413 107 119 134 644 1062 -711 -1069 -82 -480 -137 377 365 -637 -209 5 721 -158 560
5934 560 594 -89 450 -191 -782 151 -894 -215 745 -709 -290 267 -71 -9 144 502 338 732 -504 182
$$ packed form
5796f67K46M2N82n18j01k00J497k63J15J5q85k6l73Q74m81J41k3K08r2M45K05
5817G41r92K03L87r82J247m17n79j20K19N84o35J00m76K128j194r20r0m36J094
5836a38j41Q92p72m40M69j33n13O19j3M12n75j61k70K288m70j261M13r38O11r04
5856a025J406J39r77J101j017O52m8Q37m90j330K674k273R99l22k20k68m5O22
5874D15j204J635m06j132R35p67J036l28j08P74j006O7R0m10J06j05j59P02M93
5893F28j117N73N5n09p1%J191o71j73m46J84O19Q13k66j553j39K104j826j48Q34
5913H2j74J47L58l06J2J5N10M18j773l58R87l98L43N14j2j002M28K14P16q79P18
5934E60L4o83N39o41n91R33j045O79R60j454M19N57l38O2J53L58j64L94j236O86
$$ plain form
5954 182 -475 389 55 -387 1184 1204 1156 -45 -1092 -720 -374 203 231 246 -778 589 410 -264 118 -396
5974 -396 484 -524 -711 144 129 352 99 294 1360 -1088 -353 608 141 240 -633 209 -828 872 -52
5993 -52 -39 -301 379 101 -116 -744 -437 668 154 -84 230 431 -505 28 460 -275 770 -340 -269 -237
6013 -237 -13 -376 147 -524 -185 453 -1021 -82 -484 -423 431 -79 976 530 586 -1028 373 912 -1178
6032 -1178 -772 -779 -744 32 -545 1155 669 449 938 -978 -405 -129 287 -104 942 646 -750 -209 206
6051 206 -398 869 923 -168 11 59 268 652 273 308 -250 -725 391 10 209 -515 -576 -345 -480 720
6071 720 -606 346 128 35 459 721 153 159 -1308 319 467 22 31 663 -237 152 -298 -824 -892 287 480
6092 480 535 103 -88 83 -883 -185 -448 1339 833 -199 856 -498 499 1088 954 423 -273 31 62
$$ packed form
5954A82o57Q64l34m42J571K0m8j201j047L72L46N77K8J5j024J367j79o74L82n14
5974c96Q80j008j87Q55j5K23k53J95J066k448P35R61m67R9q73Q42j037J700r24
5993e2J3k62O80k78k17o28L07J105n14k38L14K01r36N33M32p35J045j110P1L2
6013b37K24l63N23o71L39O38j474R39m02O1Q54n10J055m46N6j614J401N39k090
6032a178M06pL5P76n77J700m86k20M89j916N73K76M16l91J046k96j396N41M15
6051B06o04J267N4j091J79M8K09L84l79L5n58m75J116l81J99p24o1K31j35J200
6071G20j326R52k18r3M24K62n68Oj467J627J48m45RO32r00L89m50n26o8J179J93
6092D80N5m32j91J71r66O98k63J787n06j032J055j354R97N89j34n31o96L04L1
$$ plain form
6111 62 -65 -634 -364 1423 138 455 697 -955 -42 138 -387 -84 -148 -688 559 98 688 -251 -5
6130 -5 1092 -290 -463 1025 -395 -817 874 233 -280 -131 284 -263 534 596 530 -150 264 -829 -236
6149 -236 283 -133 -474 28 565 488 228 -38 855 -437 132 411 -599 -743 -1307 -714 -64 313 -565 -297
6169 -297 -217 -441 535 -248 971 -328 617 -124 -134 -206 449 94 520 282 118 218 347 -835 1438 -559
6189 -559 -554 465 -504 80 -944 134 572 706 -524 367 -444 577 -623 -41 -671 782 484 -285
6207 -285 123 498 241 -592 129 -58 599 -494 193 -705 116 -84 103 -517 -82 380 -105 932 380
6226 380 1131 -1777 67 592 -335 -179 -357 -72 928 419 246 594 836 -1358 -359 229 -442 -172 519
6245 519 1452 414 -545 271 -365 -247 -1249 283 15 348 503 -862 151 -420 -494 456 577 622 -57
$$ packed form
6111F2j27n69K70J787j285L17K42j652R13J80n25L03o4n40J247m61N90r39K46
6130eJ097j382j73J488j420m22J691o41n13J49M15n47P97O2o6o80M14j093N93
6149b36N19m16l41N02N37p7k60k66Q93j292N69K79j010j44n64N93O50L77q78K68
6169b97Q0k24R76p83J219j299R45p41j0p2O55l55M26k38j64J00J29j182K273j997
6189e59NJ019r69N84j024J078M38J34j230Q91q11J021j200N82o30J453k98p69
6207b85M08L75k57q33P21j87O57j093O87q98Q21k00J87o20M35M62m85J037n52
6226C80P51k908J844N25r27J56j78K85J000n09j73L48K42k194R99N88o71K70O91
6245E19R33j038r59Q16o36J18j002J532k68L33J55j365J013n71p4R50J21M5o79
$$ plain form
6264 -57 665 505 -1039 239 86 450 -839 -696 577 -765 -193 539 450 -446 15 416 -49 -31 176
6283 176 87 183 62 97 -70 -26 -82 830 -319 -580 -1416 492 397 694 28 -164 177 134 -181 389 -356 17
6305 17 87 -947 168 211 -780 -264 -71 739 292 540 234 -59 -9 -234 292 -304 -157 717 138 -52 327
6326 327 539 1018 -506 212 767 19 503 -286 -831 26 -523 859 -5 -61 73 348 -866 71 714
6345 714 88 -163 -721 -421 -1036 -306 -376 275 247 -237 132 461 7 -476 211 413 -233 -1017 418 -98
6365 -98 -646 15 850 -113 3 81 357 -504 -241 -90 -1 -41 733 28 666 251 144 452 -494 -361 370
6386 370 200 464 -293 401 321 -2 661 -361 194 169 -155 763 439 142 -638 -977 249 125 -821 -369
6406 -369 772 -767 -753 293 -289 244 -655 102 -902 -1054 -206 -224 138 897 1107 815 117 -486 212
$$ packed form
6264e7P22j60j544J278j53L64j289J43J273j342N72P32q9q96M61M01m65J8K07
6283A76q9R6j21L5j67M4n6R12j149k61q36J908r5K97o66j92L41m3l15N70p45L73
6305A7P0j034J115M3r91N16J93Q10m47K48l06k93N0k25N26n96J47Q74n79j90L79
6326C27K12M79j524P18N55p48M84p89n45Q57n49J382q64n6J34K75j214R37O43
6345G14o26k51n58L00o15P30p0O51k8m84L69L29m54m83O87K02o46p84J435n16
6365i8n48O61Q35r63J16P8K76q61K63J51Q9m0P74p05O38m15j07L08r46J33P31
6386C70j70K64p57O94q0l23O63j022N55k5l24R18l24k97p80l39J226j24r46M52
6406c69J141j539J4J046n82N33q99P57j004j52Q48j8L62P59K10k92o98o03O98
$$ plain form
6425 212 -553 -352 -633 428 -31 -702 589 678 1 -79 154 10 -1007 -168 -36 -500 790 740 -353
6444 -353 611 926 15 193 998 121 -786 28 227 36 -417 70 1066 -39 -362 -188 -296 -459 162 126
6464 126 -542 -55 43 -334 341 436 263 -537 -21 509 457 132 244 418 31 753 -119 -634 -531 -541 344
6485 344 1636 96 -516 -239 458 31 212 493 -357 288 -757 -190 -547 1685 228 765 1750 -320
6503 -320 1 -134 7 85 139 -728 874 -1139 1113 147 27 874 198 -158 -909 -178 31 -36 401 -404
6523 -404 167 390 -381 1042 201 269 947 373 -343 873 -186 -437 531 67 -136 321 73 1524 -266
6542 -266 769 497 217 -336 -888 -78 1465 369 -548 413 -45 1254 -508 537 -524 -678 570
6559 570 -172 -604 -206 -331 -258 668 516 304 481 -28 455 -211 -629 140 -631 -940 408 -116 320 549
$$ packed form
6425B12p65K01k81J061m59o71J291Q9o77q0K33j44j017Q39J32m64J290n0j093
6444c53R64L15r11J78Q05q77r07Q14J99j91m53M87R96j105l23J74j08j63O21l6
6464A26o68M87R8l77O75R5j73q00N16N30n2l25J12J74l87P22q72n15J03j0Q85
6485C44J292j540o12K77O97m27J81K81q50O45j045N67l57K232j457N37R85k070
6503c20L21j35J41P8N4q67J602k013K252r66j20Q47o76l56p51P31K09o7M37q05
6523d04N71K23p71J423q41O8O78n74p16J216j059k51R68m64k03M57k48J451j790
6542b66J035k72k80n53n52Q10J543j096r17R61m58J299j762J045j061j54J248
6559E70p42m32L98j25P3R26j52k12J77n09M83o66m18P69p71l09J348n24M36K29
$$ plain form
6579 549 -94 -116 426 -495 300 -582 132 384 -190 -286 -43 16 1288 550 863 -505 50 702 -758 -333
6599 -333 -265 201 -890 463 -633 508 367 -1067 267 -10 566 -936 -637 181 -664 -502 124 1201
6617 1201 -467 -834 322 -197 505 -895 -872 -42 -774 424 821 -623 -399 965 546 305 676 -275
6635 -275 1387 71 -535 -551 -471 -675 427 50 165 1096 1521 488 570 416 -734 -715 -317 174 410 -1048
6655 -1048 -151 -906 -1135 -1020 40 424 246 506 -236 61 -3 -408 -47 -276 -720 485 292 -813 -256
6674 -256 -698 135 344 65 73 298 36 162 441 915 982 289 1483 462 -201 173 -1120 138 -599 632
6694 632 -1203 465 652 378 1099 849 -441 159 315 45 -170 -800 151 774 -190 1298 -154 46
6712 46 140 332 -136 -703 -703 222 -210 -375 471 -750 -479 -235 -146 -623 404 296 1462 21 -89 -446
$$ packed form
6579E49o43k2N42r21P95q82P14K52n74r6K43N9J272p38L13j368N55O52j460M25
6599c33O8M66j091J353j096J141j41j434J334k77N76j502K99Q18q45J62O26J077
6617A201j668l67J156n19P02j400K3Q30p32J198L97j444K24J364m19k41L71r51
6635b75J662j316o06j6Q0k04J102l77J15R31M25j033Q2j54j150J9L98M91K36j458
6655a048Q97p55k29J15J060L84j78K60p42K97o4m05L61k29m44J205j93j105N57
6674b56m42Q33K09k79QK25k62J26K79M74O7o93J194j021o63L74j293J258p37J231
6694F32j835J668J87k74P21k50j290O00J56k70k15o30R51O23r64J488j452K00
6712D6R4J92m68n67%R25m32j65Q46j221K71K44Q9m77J027j08J166j441j10l57
$$ plain form
6732 -446 651 415 -446 -132 -73 -798 847 1198 -40 -808 -712 -668 125 -523 -25 114 912 -51 306 -274
6752 -274 499 430 728 270 389 308 -432 589 -863 502 -439 186 435 900 -269 191 -55 -303 1
6771 1 -661 -457 -158 -293 415 1440 149 293 -367 -1330 -1157 -564 -159 6 211 499 -20 383 -213 918
6791 918 -354 -843 254 -163 429 -73 -1146 -309 -233 442 -685 1057 -1 933 593 518 194 411 -349
6810 -349 -1354 1682 -399 -360 102 -675 115 740 -611 -286 579 -626 -297 175 936 -321 331 125
6828 125 318 -182 -1609 1151 -825 -124 14 -304 -39 -1764 160 -41 1505 688 -44 106 -1322 573
6846 573 220 251 70 21 -143 138 -547 204 1231 -37 -476 639 372 240 298 -877 408 551 20
6865 20 -835 -560 -280 50 -288 -202 -634 -370 -243 -407 -414 604 -134 -42 490 334 483 -185 112 -126 -371
$$ packed form
6732d46J097k36q61L14N9p25J645L51j238p68R6M4P93o48M98J39P98r63L57n80
6752b74P73o9K98m58J19q1p40J021j452J365r41O25K49M65j169M60k46k48L04
6771Ao62K04K99j35P08J025j291J44o60r63J73N93M05J65K05K88n19M03n96J131
6791I18j272m89J097m17N92n02j073Q37P6O75j127J742j058R34l40p5l24K17p60
6810c49j005L036k081L9M62p77P90O25j351L25Q65j205L29M72P61j257O52k06
6828A25J93n00j427K760j976P01J38l18K65j725J924k01J546q17p32J50j428J895
6846E73l53L1j81m9j64K81o85P51J027j268m39J115k67j32N8j175J285J43n31
6865B0q55K75K80L30l38Q6m32K64J27j64pJ018p38R2N32j56J49o68K97k38k45
$$ plain form
6886 -371 -779 -368 -30 817 475 480 -581 790 -63 187 -424 338 -15 263 -123 -320 -100 -263 315 -217
6906 -217 -39 -341 1104 -426 -154 352 -495 -146 -340 493 309 -731 -583 298 -390 857 -83 1360
6924 1360 260 -366 284 -783 262 -439 196 -191 -323 -715 181 386 -906 796 421 -117 -964 -181
6942 -181 856 96 -114 -534 -439 151 1503 472 -242 -797 1331 287 -289 546 -18 -1298 -75 -737
6960 -737 -74 467 -29 40 131 330 -424 -1063 87 881 -106 573 1001 -213 216 114 -104 929 -1035
6979 -1035 1007 102 135 271 144 550 -31 -301 566 1264 426 -362 -1141 -123 -708 -93 801 -474 103
6998 103 515 -199 1163 -69 278 -573 184 -799 -171 113 113 490 484 -113 -194 -529 -460 492 598 -555 -78
7019 -78 356 -305 -1316 -612 -528 -104 539 339 307 895 -211 -197 -206 276 -94 -659 276 -330 -1038 -365 1002
$$ packed form
6886c71m08M11L38Q47l42Nj061J371q53K50o11P62l53K78l86j97K20j63N78n32
6906b17J78l02J445j530K72N06q47L49j94Q33j84j040J48Q81o88J247r40J443
6924A360j100o26O50j067J045p01O35l87j32l92Q96K05j292J702l75n38q47P83
6942a81J037p60k10m20R5N90J352j031p14n55K128j044n76Q35n64j280J223o62
6960g37O63N41m96O9R1J99p54o39J150P94r87O79M28j214M29j02k18J033j964
6979a035K042r05L3J36j27M06n81k70Q67O98q38p88p79J018n85O15Q94j275N77
6998A03M12p14J362j232L47q51P57r83O28K84%L77on97q1l35O9R52J06j153M77
7019g8M34o61j011P04Q4M24O43k00l2N88j106J4rM82l70n65R35o06p08O73J367
$$ plain form
7040 1002 -393 -189 -401 235 763 111 -787 316 -211 113 -372 231 -632 -609 192 -223 580 -797 -1099
7059 -1099 -286 -289 14 253 -293 -908 -467 329 68 125 190 422 248 -71 -1259 -756 -393 825 325 -463
7079 -463 353 216 79 -28 352 -15 -1061 -124 -35 -677 298 457 880 68 44 -275 -127 -495 364 321 79
7100 79 727 -36 802 -262 83 35 827 1083 32 356 -274 324 -216 551 -472 145 -1105 593 983
7119 983 37 1133 415 -8 -206 959 202 -116 -189 -532 -417 -515 -149 -31 -464 776 227 -9 431 786
7139 786 456 50 -97 46 255 1076 -257 -494 731 -202 775 6 426 164 36 -306 245 1063 -616
7158 -616 -517 -501 574 -29 461 219 187 61 645 84 189 -504 -50 -80 730 153 209 724 -880 141 7
7179 7 250 369 415 -502 600 537 438 166 226 -644 -528 -778 803 276 426 -880 -1227 6 -988 1243
$$ packed form
7040A002j395K04k12O36N28o52q98J103n27L24m85O03q63K3Q01m15Q03j377l02
7059a099Q13lL03K39n46o15M41P96k61N7O5K32j74l19j188N03L63J218n00p88
7079d63Q16j37j37j07L80l67j046R37Q9o42R75J59M23q12k4l19J48l68Q59m3k42
7100G9O48p63Q38j064L45m8P92K56j051L24o30N98n40P67j023O17j250J698L90
7119I83r46J096p18m23j98J165p57l18p3l43J15r8L66J18m33J240n49k36M40L55
7139G86l30m06j47J43K09Q21j333k37J225r33R77p69M20k62j28l42N51Q18j679
7158f16R9J6J075o03M90k42l2j26N84n61J05o93M54l0Q10n77N6N15j604J021j34
7179GK43J19M6r17J102o3r9k72O0q70J16k50J581n27J50j306l47J233r94K231
$$ plain form
7199 1243 -161 401 122 -35 -561 -974 -239 -154 185 -1056 51 345 -83 1443 247 525 149 -513
7217 -513 -405 -526 173 -168 -520 -304 41 -531 -618 328 -313 -17 440 -341 -903 -913 -342 -823 -593 344 -674
7238 -674 28 672 961 -403 -777 -759 1307 -1225 213 510 -88 -470 919 -775 340 -188 358 1331
7256 1331 -350 -449 -639 535 29 1289 -363 -114 127 -1188 -421 -218 294 -520 262 311 308 577 -306
7275 -306 351 -1098 -408 -540 91 794 -453 -712 757 141 155 -36 772 667 328 377 -473 61 256 -245
7295 -245 417 -303 -396 331 -920 -1114 175 56 308 859 809 352 -727 152 -99 528 -198 744 842 -477
7315 -477 -389 420 637 949 557 429 62 -827 -89 -233 -317 255 -747 -1201 461 -245 796 -188 -412 164
7335 164 299 844 -51 -1140 739 -694 -1132 -714 -635 -238 431 -767 448 55 -1225 -10 -1531 162
$$ packed form
7199A243j404N62k79j57n26m13P35Q5L39j241J107K94m28J526j196K78l76o62
7217e13J08j21O99l41l52K16L45n72q7R46o41K96M57p81n62j0N71m81K30R37j018
7238f74P02O44K89j364l74J8K066k532J438K97n98l82J389j694J115n28N46R73
7256A331j681r9j90J174n06J260j652K49K41j315P67K03N12q14P82M9lK69q83
7275c06O57j449O90j32O31P03j247k59J469o16J4j91Q08j05l39M9q50N34J95n01
7295b45O62p20r3P27j251j94J289j19K52N51n0m57j079Q79k51O27p26R42R8j319
7315d77Q8Q09K17L12l92j28l67q89P38j44q4N72j002m54J662p06J041r84k24N76
7335A64J35N45q95j089J879j433m38M18P9L97O69j198J215l93j280J215j521J693
$$ plain form
7353 162 -21 614 312 -80 113 -734 396 456 847 -194 -514 795 -14 -94 516 -171 491 -5 -420 997
7373 997 109 983 252 -599 -1018 -369 -4 913 -276 -778 171 1191 -632 136 -171 -491 32 -125 -1221
7392 -1221 -1214 -575 -1069 171 500 495 -134 -649 -43 -602 -596 1058 -729 -785 -484 1 -284 234 -507 391 -413
7413 -413 -576 -425 -575 -428 -552 281 -523 -943 -427 -526 -461 -595 868 480 -429 1050 585 -822 -68 698
7433 698 33 398 -1022 -615 799 679 360 520 -512 -851 -464 -805 -118 -705 84 143 315 -734 279
7452 279 702 -987 -993 -707 -552 245 479 -564 -723 -437 1015 -313 333 -45 -339 691 830 657 -166
7471 -166 247 -534 116 -57 -424 -574 -343 711 -1013 -190 479 693 401 -755 -362 -983 -103 -690 211
7490 211 735 547 -239 273 -1025 -146 236 235 -677 -286 -336 644 -8 168 377 -265 -300 -125 -414 -473 -15
$$ packed form
7353A62j83O35l02l92J93q47J130O0L91j041l20J309q09q0O10o87O62m96m15J417
7373I97q88Q74p31q51m19O49L65R17j189n02R49J020j823P68l07l20N23j57j096
7392a221PO39m94J240L29no29n15O06n59OJ654j787n6L01M85k85N18p41Q98q04
7413d13j63J51j50J47j24Q33q04m20N16r9O5j34J463l88r09J479m65j407P54P66
7433F98o65L65j420M07J414j20l19J60j032l39L87l41O87n87P89N9J72j049J013
7452B79M23j689oK86J55P97K34j043j59K86J452j328O46l78k94J030J39j73q23
7471a66M13p81O50j73l67j50K31J054j724Q23O69K14k92j156L93o21Q80n87R01
7490B11N24j88p86N12j298Q79L82jr12L91n0R80o52J76K09o42l5J75k89n9M58
$$ plain form
7511 -15 -119 610 752 680 -225 -349 -944 -987 -458 -131 123 -471 -331 -136 -558 113 -841 188 -187 326 986
7532 986 174 647 192 1336 462 -824 -500 802 -358 -1509 -634 -564 331 -239 717 -262 -1314 9
7550 9 -1446 820 52 60 156 210 -170 -60 -809 -68 -278 -771 -145 -675 1089 452 -221 283 376 -297 -259 460
7572 460 582 -346 827 636 -77 -900 175 -626 -158 1224 -616 924 570 -74 926 -466 859
7589 859 194 54 637 -448 764 -719 535 -13 -469 -94 -504 -378 3 -308 121 -629 110 69 1106
7608 1106 -409 -302 752 255 175 535 364 -151 -758 -50 174 100 703 646 698 57 365 98 -74 446
7628 446 -277 -743 240 466 -96 -771 95 -104 -85 4 503 630 250 -316 -69 464 -1087 -651 553 319
7648 319 155 -577 371 792 -167 114 766 117 -658 -209 304 317 968 243 529 -1157 879 -1222 -133
$$ packed form
7511a5j04P29J42p2r05j24n95m3N29L27K54n94J40J95m22O71r54J029l75N13O60
7532I86q12M73m55J144q74j286L24J302j160j151Q75P0Q95n70R56r79j052J323
7550Ij455K266p68QR6N4l80J10p49P41k10m93O26n30J764o37o73N04R3o73L8P19
7572D60J22r28J173j91p13q23J075q01M68J382j840J540l54o44J000j392J325
7589H59o65j40N83j085J212j483J254n48m56L75m10J26L81l11M29p50P39m1J037
7608A106j515J07J054m97q0L60j71n15o07P08K24p4O03n7N2o41L08k67j72N20
7628D46p23m66R83K26n62o75Q66j99J9Q9M99J27l80n66K47N33j551M36J204k34
7648C19j64p32R48M21r59K81O52o49p75M49N13J3O51p25K86j686K036k101J089
$$ plain form
7667 -133 -648 -73 -745 -178 608 371 -630 -692 500 442 -288 -182 74 20 413 462 -89 -276 645 -647
7687 -647 -149 -23 444 -144 -589 62 430 -189 -584 120 414 -398 -177 -143 -237 -574 -446 668 -226 -343
7707 -343 305 -104 -478 -171 213 26 -997 561 770 41 922 -448 -556 -62 -193 -665 -297 -171 -454
7726 -454 -415 -549 615 1191 -190 21 -323 423 651 -1002 -143 -604 10 166 -712 -21 -379 784 -1222
7745 -1222 -417 391 -586 447 1271 -375 352 552 -185 307 52 173 -315 65 -35 125 -875 -820 194
7764 194 511 639 324 1199 -37 -447 359 -782 -988 940 21 645 -115 279 -118 -451 516 -555 -98
7783 -98 -678 356 -403 -89 -64 591 625 -473 278 -299 561 569 -550 -27 918 -325 -783 821 353 -49
7803 -49 492 -477 292 204 -24 24 301 -42 319 -391 -8 151 -237 -189 -71 112 -875 -197 -43 1168 -435
$$ packed form
7667a33n15N75o72N67P86k37j001o2J192n8p30J06K56n4L93M9n51j87R21j292
7687f47M98J26M67n88m45O51L68o19l95P04K94q12K21L4r4l37J28J114q94j17
7707c43O48m09l74L07L84j87j023J558K09p29Q81j370j08M94j31m72L68J26k83
7726d54L9j34J164N76j381K11l44P46K28j653Q59m61O14J56q78O91l58J163k006
7745a222Q05Q08r77J033Q24j646P27K00p37M92k55J21m88L80j00J60j000N5J014
7764A94L17J28l15Q75j236m10Q06j141k06J928r19O24p60L94l97l33R67j071M57
7783i8n80J034p59L14K5O55L4j098P51n77Q60Qj119N23R45j243m58J604m68m02
7803d9N41r69P69q8k28M8K77l43L61p10L83J59l88M8J18J83r87O78J54J211j603
$$ plain form
7824 -435 -1045 -390 306 -146 833 412 400 143 1396 309 -1393 152 382 52 -175 -915 -176 188 -103
7843 -103 -798 -758 -308 -961 383 81 -444 1480 693 -383 417 1148 -232 -1306 48 187 91 376 -426
7862 -426 80 -91 -174 183 -580 -633 -505 243 420 296 374 1048 -104 -178 -325 -860 -15 -820 -986 256 180
7883 180 -520 1049 248 327 -397 329 324 95 43 1114 -1166 -60 -497 -327 -754 729 1421 333 511
7902 511 -695 400 -273 290 -84 -458 555 250 -402 277 1726 -43 64 -881 -580 169 -693 -815
7920 -815 185 455 354 -495 511 -778 236 229 356 219 98 304 -108 423 -605 666 135 943 -173
7939 -173 -97 -413 575 -849 172 -425 262 729 129 238 502 -169 203 -112 932 355 -47 482 31
7958 31 -846 131 -68 375 203 241 9 606 479 -498 400 -1330 -372 512 -110 -139 324 822 1372 434 -66
$$ packed form
7824d35o10O55O96m52R79m21j2k57J253j087j702J545K30l30k27p40P39L64k91
7843a03o95M0M50o53J344l02n25J924p87j076Q00P31j380j074J354J39r6K85q02
7862d26N06j71q3L57p63n3J28P48J77j24P8O74j152p4j47n35Q45q05j66J242p6
7883A80p00J569q01P9p24P26nk29n2J071k280J106m37J70m27J483O92j088J78
7902E11j206J095o73N63l74l74J013l05o52O79J449j769J07r45L01P49q62j22
7920h15J000K70j01q49J006j289J014pJ27j37j21K06m12N31j028J271n31Q08j116
7939a73P6l16R88j424J021n97O87M67o00J09K64o71L72l15J044n77m02N29m51
7958C1q77R77j99M43j72L8k32N97j27r77Q98j730R58Q84o22k9M63M98N50r38n00
$$ plain form
7979 -66 -376 526 -143 -467 -1123 1109 -487 408 -107 -590 537 -316 -55 -329 839 -1177 -905 -145 -130
7998 -130 -544 727 798 -59 404 616 -38 255 91 -73 -202 103 -444 748 802 345 -708 -437 1105
8017 1105 765 83 332 207 469 596 -13 492 693 197 -721 73 227 781 305 -244 -609 -318 1052
8036 1052 295 -921 983 -718 504 482 -339 -511 538 -364 -187 -863 111 -355 38 1488 304 -721
8054 -721 345 -564 -756 -225 -1044 684 -997 362 361 854 220 -932 -713 -583 122 1007 -424 -560 -230
8073 -230 -340 483 295 -651 174 172 -438 -718 296 280 959 11 1140 1291 -163 -418 -615 -393 -573 -268
8093 -268 -422 1312 -119 -69 -282 -786 228 -172 -133 179 240 462 -1047 109 -59 -883 359 -86 -13
8112 -13 -117 -102 26 622 540 50 88 -443 597 212 -804 377 -341 558 -206 554 -25 -592 1 -266
$$ packed form
7979f6l10R02o69l24o56K232j596Q95n15m83J127q53K61k74J168k016K72P60J5
7998a30m14J271P1q57M63K12o54K93j64j64j29L05n47J192N4m57j053K71J542
8017A105l40o82K49j25K62J27o09N05K01m96r18P94J54N54m76n49l65K91J370
8036A052p57j216J904j701J222k2q21j72J049r02J77o76R74m66L93J450j184j025
8054g21J066r09j92N31q19J728j681J359jM93o34j152K19J30P05Q85j431j36L30
8073b30j10Q23j88r46Q25ko10k80J014j6O79r48J129J51j454k55j97K22j80L05
8093b68j54J734j431N0k13n04J014m00L9L12O1K22j509J156j68q24J242m45P3
8112a3j04J5J28N96q2m90L8n31J040l85j016J181p18Q99p64P60n79n67N93k67
$$ plain form
8132 -266 230 905 45 108 238 209 626 637 192 375 822 -329 -329 85 73 -26 181 -523 954 400 129 -536
8154 -536 204 -446 -414 -137 206 594 -952 -124 -389 361 423 -9 93 743 -266 -155 286 275 -12 1122
8174 1122 629 -603 -907 -331 931 -33 -352 -361 549 -204 -495 337 -180 334 -183 -226 -572
$$ packed form
8132b66M96O75q60O3J30k9M17J1m45J83M47j151%M14j2r9K07p04J477n54k71o65
8154e36P40o50L2K77L43L88j546Q28k65P50O2m32J02O50j009J11M41j1k87J134
8174A122m93j232l04N76J262r64l19rR10p53k91Q32n17N14n17m3l46
8191e72
$$ Imaginary data points
##PAGE= N=2
##DATA TABLE= (X++(I..I)), XYDATA
$$ plain form
0 0 0 0 0 0 0 0 0 0 0 0 0 0 0 0 0 0 0 0 0 0 20 -128 128 -128 128 -128 128 -141 245 -256 256 -284 374 -384 431
35 431 -506 550 -628 685 -770 853 -950 1057 -1169 1287 -1420 1567 -1721 1901 -2078 2298
51 2298 -2542 2795 -3088 3415 -3798 4222 -4722 5304 -6003 6857 -7917 9300 -11130 13730
65 13730 -17680 24308 -37474 73073 -362216 -860875 393862 157501 -720500 183689 716581
76 716581 -271449 -3442 845993 135217 -322007 474638 261084 -515829 -31023 352397
86 352397 -334504 -292339 382322 74255 -321356 238235 323443 -291780 -117826 281545
96 281545 -223443 -411681 133594 -9898 -408935 69910 283028 -186887 4750 396063
106 396063 -30389 -170483 236723 -9569 -332472 39504 55944 -289844 -1518 224968
$$ packed form
0@%%%%%%%%%%%%%%%%%%%%K0j48K56k56K56k56K56k69L86n01N12n40O58p58Q15
35D31r37J056j178J313j455J623j803K007k226K456k707K987l288L622l979M376
51B298m840N337n883O503p213Q020q944J0026j1307J2860j4774J7217k0430K4860
65A3730l1410M1988o1782J10547m35289m98659J254737k36361q78001R04189N32892
76G16581r88030K68007Q49435p10776m57224P96645k13554p76913M84806L83420
86C52397o86901M2165O74661l08067l95611N59591Q5208o15223J73954L99371
96B81545n04988j88238N45275j43492l99037M78845K13118m69915J91637L91313
106C96063m26452j40094M07206k46292l22903L71976J6440l45788K88326K26486
$$ plain form
116 224968 -96667 2817 297727 16374 -107960 164685 -1918 -248120 -4268 28053
126 28053 -219119 -28937 183218 -33265 -811 275239 106155 -85616 154876 125271
136 125271 -205225 -65367 139621 -155391 -179926 201008 71029 -182971 160541 234497
146 234497 -200314 -71643 212057 -199808 -330281 120055 -42173 -376632 67991 232599
156 232599 -219358 -24436 371134 -43811 -208276 255315 81705 -332808 40895 224245
166 224245 -220410 -88200 346024 48085 -148189 282187 226243 -208547 10592 221135
176 221135 -200048 -246571 152903 -25656 -283238 98658 209303 -161909 -14772 278934
186 278934 -58795 -208719 134435 9169 -309516 -30259 127119 -181906 -78251 240637
$$ packed form
116B24968l21635R9484K94910k81353j24334K72645j66603k46202K43852L2321
126B8053k47172J90182K12155k16483L2454K76050j69084j91771K40492k9605
136A25271l30496J39858K04988k95012k4535L80934j29979k54000L43512P3956
146B34497m34811J28671K83700m11865j30473M50336j62228l34459M44623J64608
156B32599m51957J94922L95570m14945j64465M63591j73610m14513L73703J83350
166B24245m44655J32210M34224k97939j96274M30376n5944m34790K19139K10543
176B21135m21183m6523L99474j78559k57582L81896J10645l71212J47137K93706
186B78934l37729j49924L43154j25266l18685K79257J57378l09025J03655L18888
$$ plain form
196 240637 39863 -84674 198000 135853 -139559 3476 93149 -157870 -138778 67190
206 67190 -42077 -110039 99141 112580 -24896 71295 135146 -24538 -51293 36208 -57524
217 -57524 -124763 -15330 -2899 -60482 36111 97950 32488 59193 106554 12371 -26592 16276
229 16276 -59909 -114089 -26362 -30683 -87823 20651 79797 -12347 32165 116774 -6864 -64125
241 -64125 39675 -32645 -150772 -28296 25659 -101918 -18103 135823 23700 -16882 147192
252 147192 82522 -88117 17986 66832 -128155 -101881 76409 -31130 -104409 106326 120425
263 120425 -57525 46611 155836 -51784 -102774 65266 -37481 -188758 -9917 60517
273 60517 -108291 -20450 164177 26322 -51876 128971 76780 -124697 -23929 60654 -127161
$$ packed form
196B40637k00774j24537K82674o2147k75412J43035Q9673k51019J9092K05968
206F7190j09267o7962K09180J3439j37476R6191O3851j59684k6755Q7501r3732
217e7524o7239J09433J2431n7583R6593O1839o5462K6705M7361r4183l8963M2868
229A6276p6185n4180Q7727m321n7140J08474N9146r2144M4512Q4609j23638n7261
241f4125J03800p2320j18127J22476N3955j27577Q3815J53926j12123m0582J64074
252A47192o4670j70639J06103M8846j94987K6274J78290j07539p3279K10735J4099
263A20425j77950J04136J09225k07620n0990J68040j02747j51277J78841P0434
273F0517j68808Q7841J84627j37855p8198J80847n2191k01477J00768Q4583j87815
$$ plain form
284 -127161 -123384 72808 2109 -92498 90466 139599 -30658 21263 136304 -24003 -110411
295 -110411 29842 -12980 -149863 -31790 66954 -48636 -19466 132632 63054 -29519 71025
306 71025 65901 -84889 -61573 15971 -79000 -105442 19069 24629 -36018 45702 104567 22277
318 22277 4873 59262 31 -74997 -32517 -18587 -73430 -41240 30041 16210 11149 67992
330 67992 68847 17605 20257 22957 -30083 -53723 -33363 -37422 -44348 -9835 19278 25664 37176
343 37176 45330 37795 17513 -7361 -25707 -35182 -51135 -55431 -25536 -6976 -6159 26168 59284
356 59284 37597 23052 40947 12543 -42471 -30758 -18197 -60062 -48424 15530 12395 -5613
368 -5613 56110 74968 11674 15073 48059 -21270 -69945 -12085 -17835 -79514 -19493 49629 -3001
$$ packed form
284a27161L777J96192p0699r4607J82964M9133j70257N1921J15041j60307q6408
295a10411J40253m2822j36883J18073R8744j15590K9170J52098o9578r2573J00544
306G1025n124j50790K3316P7544r4971k6442J24511N560o0647Q1720N8865q2290
318B2277j7404N4389n9231p5028M2480J3930n4843L2190P1281j3831n061N6843
330F7992Q55n1242K652K700n3040k3640K0360m059o926L4513K9113O386J1512
343C7176Q154p535k0282k4874j8346r475j5953m296K9895J8560Q17L2327L3116
356E9284k1687j4545J7895k8404n5014J1713J2561m1865J1638O3954l135j8008
368e613O1723J8858o3294L399L2986o9329m8675N7860n750o1679O0021O9122n2630
$$ plain form
381 -3001 2284 92791 54959 -25657 31421 36846 -75944 -68846 11495 -51363 -84981 32498
393 32498 47755 -30924 37772 105147 144 -32404 54124 -8635 -106819 -21770 17377 -81931
405 -81931 -37004 82719 18199 -24751 93218 80987 -45378 6167 62336 -66020 -85106
416 -85106 31112 -15540 -87846 32311 76972 -27449 15424 103939 3349 -54363 39162
427 39162 -495 -105123 -29269 27499 -61383 -36383 74930 28855 -23708 66802 61979 -43800
439 -43800 -14408 33266 -57569 -71928 18701 -6506 -51761 33857 61607 -7357 21780 67362
451 67362 -9104 -39306 14623 -23462 -71348 -9688 10241 -34925 13046 62815 14708 16831
463 16831 61245 11146 -31241 8242 -14514 -64750 -17817 9213 -34840 4338 58675 13992
$$ packed form
381c001N285R0507l7832q0616N7078N425j12790P098Q0341o2858l3618J17479
393C2498J5257p8679O8696O7375j05003l2548Q6528o2759r8184Q5049L9147r9308
405h1931M4927J19723o4520m2950J17969j2231j26365N1545N6169j28356j9086
416h5106J16218m6652p2306J20157M4661j04421M2873Q8515j00590n7712R3525
427C9162l9657j04628P5854N6768q8882K5000J11313m6075n2563R0510m823j05779
439d3800K9392M7674r0835j4359R0629k5207m5255Q5618K7750o8964K9137M5582
451F7362p6466l0202N3929l8085m7886O1660J9929m5166M7971M9769m8107K123
463A6831M4414n0099m2387L9483k2756n0236M6933K7030m4053L9178N4337m4683
$$ plain form
475 13992 7278 59054 14256 -45170 602 -6822 -81048 -41565 18290 -37788 -30109 65619 37671
488 37671 -18013 58493 63166 -44694 -17754 42212 -54909 -76269 35381 7914 -64787 44859
500 44859 87905 -27180 8584 96932 -16455 -73785 37659 -4744 -116469 -13864 49884
511 49884 -66378 -28501 101507 15948 -47899 77089 53966 -82558 -10633 56461 -74192
522 -74192 -71051 65560 5398 -67235 65975 85932 -43847 10992 95120 -36438 -74038
533 -74038 45566 -11217 -108918 5637 52669 -62575 -10586 95267 -1810 -44902 66422
544 66422 21752 -85034 -4075 33988 -75677 -38696 65062 -5639 -31085 80011 56368
555 56368 -33395 32549 53868 -53089 -39220 31004 -41354 -63872 33239 17764 -40049 38795
$$ packed form
475A3992o714N1776m4798n9426M5772p424p4226L9483N9855n6078P679R5728k7948
488C7671n5684P6506M673j07860K6940N9966r7121k1360J11650k7467p2701J09646
500D4859M3046j15085L5764Q8348j13387n7330J11444m2403j11725J02605O3748
511D9884j16262L7877J30008q5559o3847J24988k3123j36524P1925O7094j30653
522g4192L141J36611o0162p2633J33210J9957j29779N4839Q4128j31558l7600
533g4038J19604n6783r7701J14555M7032j15244N1989J05853r7077m3092J11324
544F6422m4670j06786Q0959L8063j09665L6981J03758p0701k5446J11096k3643
555E6368q9763O5944K1319j06957J3869P0224p2358k2518R7111j5475n7813P8844
$$ plain form
567 38795 62353 -22581 -247 47734 -33371 -60050 14458 -20450 -70518 12565 36576 -30174
579 -30174 21649 82543 2715 -12143 60965 1442 -65866 9203 11561 -75734 -17302 53548
591 53548 -27017 -19521 83800 23609 -47445 42716 32393 -84479 -28235 34995 -68605 -62406
603 -62406 58931 7581 -52527 65952 74334 -43240 12266 78634 -41001 -61564 50614
614 50614 -5909 -85532 30056 60905 -48933 5214 97231 -7895 -48993 61126 10688
625 10688 -97158 -5457 35811 -81716 -42693 72729 -8748 -52290 73675 50677 -62953
636 -62953 15111 61623 -65468 -52558 54624 -20018 -68131 53642 50404 -44283 32167 84193
648 84193 -26321 -26693 56877 -17861 -77607 14126 12440 -68376 -1905 58236 -18326 -12536 66580
$$ packed form
567C8795K3558q4934K2334M7981q1105k6679P4508l4908n0068Q3083K4011o6750
579c0174N1823O0894p9828j4858P3108n9523o7308P5069K358q7295N8432P0850
591E3548q0565P496J03321o0191p1054R0161j0323j16872N6244O3230j03600O199
603f2406J21337n1350o0108J18479Q382j17574N5506O6368j19635k0563J12178
614E0614n6523p9623J15588L0849j09838N4147R2017j05126m1098J10119n0438
625A0688j07846R1701M1268j17527L9023J15422q1477m3542J25965k2998j13630
636f2953P8064M6512j27091J2910J07182p4642m8113J21773l238r4687P6450N2026
648H4193j10514l72Q3570p4738n9746R1733j686q0816O6471O0141p6562N790P9116
$$ plain form
661 66580 13940 -43713 24081 14314 -66198 -21739 25876 -40029 -27627 54141 17972 -17544
673 -17544 54917 44982 -31811 4731 32059 -49539 -43941 22312 -24829 -49217 35906 28821 -27827
686 -27827 31789 55992 -25624 -14701 38658 -32036 -59989 17412 -2519 -56264 17488 49665
698 49665 -21565 7710 70966 2223 -32067 38418 7206 -65337 -5273 26765 -47266 -24072
710 -24072 56846 2736 -31622 53718 35902 -49876 3000 36483 -54886 -48254 36739 -17298
722 -17298 -55806 39320 41639 -38731 19528 66650 -25534 -31360 45308 -11509 -66201 17674
734 17674 25506 -49893 1987 62891 -9591 -16749 58677 14734 -48215 12192 19251 -57414 -27119
747 -27119 32193 -22365 -32122 44290 26892 -27759 24729 41954 -31812 -22035 27521 -26519
$$ packed form
661F6580n2640n7653O7794r767q0512M4459M7615o5905J2402Q1768l6169l5516
673a7544P2461r935p6793L6542K7328q1598N598O6253m7141k4388Q5123p085n6648
686b7827N9616K4203q1616J0923N3359p0694k7953P7401j9931n3745P3752L2177
698D9665p1230K9275O3256o8743l4290P0485l1212p2543O0064L2038p4031K3194
710b4072Q0918n4110l4358Q5340j7816q5778N2876L3483r1369O632Q4993n4037
722a7298l8508R5126K319q0370N8259M7122r2184n826P6668n6817n4692Q3875
734A7674P832p5399N1880O0904p2482p158P5426m3943o2949O0407P059p6665L0295
747b7119N9312n4558r757P6412j7398n4651N2488J7225p3766R777M9556n4040
$$ plain form
759 -26519 -50300 16704 10981 -33771 18393 48320 -8460 3576 47219 -2756 -32049 14296
771 14296 -3156 -47185 -6233 15234 -25119 -2248 40102 6504 -6505 33815 12012 -27400
783 -27400 299 3406 -39639 -20622 13078 -15394 -14223 29037 18764 -8812 24629 26289 -21310
796 -21310 -8764 14328 -24861 -30544 14244 -22 -24386 19768 32663 -8602 8783 36046
808 36046 -8478 -22510 18139 -5610 -41505 2844 15495 -26488 -822 39512 -309 -11919
820 -11919 33019 11127 -32372 2818 13663 -34507 -19963 23336 -8138 -21304 30242 22052
832 22052 -18365 11970 28409 -21509 -22385 15440 -12744 -35881 10214 16378 -22478 5610 37789
845 37789 -976 -11023 25907 3850 -31932 600 9668 -29539 -13024 24238 -2271 -9845
$$ packed form
759b6519k3781O7004n723m4752N2164K9927n6780J2036M3643m9975k9293M6345
771A4296j7452m4029M0952K1467m0353K2871M2350l3598j3009M0320k1803l9412
783b7400K7699L107m3045J9017L3700k8472J171M3260j0273k7576L3441J660m7599
796b1310J2546K3092l9189n683M4788j4266k4364M4154J2895m1265J7385K7263
808C6046m4524j4032M0649k3749l5895M4349J2651m1983K5666M0334l9821j1610
820a1919M4938k1892m3499L5190J0845m8170J4544M3299l1474j3166N1546q190
832B2052m0417L0335J6439m9918q76L7825k8184k3137M6095O164l8856K8088L2179
845C7789l8765j0047L6930k2057l5782L2532R068l9207J6515L7262k6509p574
$$ plain form
857 -9845 30654 22163 -12341 10995 21102 -19601 -18249 9951 -14765 -26867 9045 10692 -12965
870 -12965 8822 27985 -1933 -6391 15435 -4606 -25108 -5209 -2662 -23604 -9385 10677
882 10677 -3106 -1485 22164 12420 -4887 10610 10526 -14635 -8065 3531 -11386 -11807 9666 6558
896 6558 -3128 14918 18257 -876 4724 11263 -8696 -11398 1576 -7302 -15393 2328 5297 -7629
910 -7629 5658 15516 -2603 -4513 8710 -4689 -17431 -778 513 -16805 -3386 12260 -4154
923 -4154 -2401 17555 5864 -9873 6519 7454 -16720 -7672 9143 -9364 -11857 14759 8485
936 8485 -9240 11491 19274 -8905 -5385 14677 -7655 -20831 8131 4865 -18670 3253 20887
949 20887 -5108 -2966 23114 4332 -16961 6424 7015 -25186 -9113 11794 -12633 -14597 17371
$$ packed form
857i845M0499q491l4504K3336J0107m0703J352K8200k4716j2102L5912J647k3657
870a2965K1787J9163k9918m458K1826k0041k0502J9899K547k0942J4219K0062
882A0677j3783J621K3649r744j7307J5497q4k5161O570J1596j4917m21K1473l108
896F558r686J8046L339j9133N600O539j9959k702J2974q878q091J7721K969j2926
910g629J3287R858j8119j910J3223j3399j2742J6653J291j7318J3419J5646j6414
923d154J753J9956j1691j5737J6392R35k4174R048J6815j8507k493K6616o274
936H485j7725K0731P783k8179L520K0062k2332j3176K8962l266k3535K1923J7634
949B0887k5995K142K6080j8782k1293K3385N91l2201J6073K0907k4427j964L1968
$$ plain form
962 17371 8484 -13433 10726 18832 -14590 -8625 14975 -10211 -23541 6436 4922 -21353 3695
975 3695 21620 -6730 -3316 24129 3904 -15597 10997 9017 -20817 -4484 14679 -11634 -10436
988 -10436 20550 6091 -11832 14120 16116 -13265 -2307 14718 -11309 -16537 10230 406 -17110
1001 -17110 7122 12812 -10533 -3 16693 -7346 -12517 10276 -541 -18258 3373 9623
1013 9623 -12533 -2280 16410 -2948 -8500 14313 3643 -15465 4824 8526 -14658 -2817
1025 -2817 15727 -5003 -7905 18893 6451 -13640 11429 11869 -17072 -3155 13386 -12400 -12479
1038 -12479 15414 2132 -14455 12207 14274 -13783 -69 17558 -11330 -16415 13699 -2045
1050 -2045 -22193 6920 13084 -15651 -297 24845 -4807 -12798 20474 5411 -24283 3822
$$ packed form
962A7371q887k1917K4159Q106l3422N965K3600k5186j3330K9977j514k6275K5048
975C695J7925k8350L414K7445k0225j9501K6594j980k9834J6333J9163k6313J198
988a0436L0986j4459j7923K5952J996k9381J0958J7025k6027n228K6767r824j7516
1001a7110K4232N690k3345J0530J6696k4039n171K2793j0817j7717K1631O250
1013I623k2156J0253J8690j9358n552K2813j0670j9108K0289L702k3184J1841
1025b817J8544k0730k902K6798j2442k0091K5069M40k8941J3917J6541k5786p9
1038a2479K7893j3282j6587K6662K067k8057J3714J7627k8888n085L0114j5744
1050b045k0148K9113O164k8735J5354K5142k9652p991L3272j5063k9694K8105
$$ plain form
1062 3822 14350 -22506 -9630 22003 -4779 -15615 22112 12216 -20002 8643 20794 -18992
1074 -18992 -9993 21005 -8861 -21578 16150 9636 -22223 6556 22127 -14013 -8694 23746
1086 23746 -3007 -21362 13169 8889 -23565 -87 19584 -13369 -10792 21556 184 -19856
1098 -19856 13574 12131 -21104 -1411 18710 -13470 -12571 20138 366 -19830 12680 12949 -18826
1111 -18826 163 18757 -11674 -12337 18113 394 -18003 12235 13025 -16589 2343 19058 -10882
1124 -10882 -11159 17264 -2212 -18564 9960 9049 -18016 1821 18222 -8914 -7801 18567 -1241
1137 -1241 -17662 10387 8391 -21160 -1265 14137 -12530 -9681 20044 1546 -15793 14637
1149 14637 13926 -18299 1421 19813 -14417 -13472 18875 -496 -19706 14530 14221 -18044 2869
$$ packed form
1062C822J0528l6856J2876L1633k6782j0836L7727r896l2218K8645J2151l9786
1074a8992Q999L0998k9866j2717L7728o514l1859K8779J5571l6140N319L2440
1086B3746k6753j8355L4531m280l2454K3478J9671l2953K577L2348k1372k0040
1098a9856L3430j443l3235J9693K0121l2180Q99L2709j9772k0196L2510K69l1775
1111a8826J8989J8594l0431o63L0450j7719j8397L0238P90k9614J8932J6715k9940
1124a0882k77K8423j9476j6352K8524r11k7065J9837J6401k7136J113K6368j9808
1137a241j6421K8049j996k9551J9895J5402k6667K849K9725j8498j7339L0430
1149A4637p11l2225J9720J8392l4230R45L2347j9371j9210L4236l09l2265K0913
$$ plain form
1162 2869 23510 -12261 -12242 20584 -1526 -23009 9797 10513 -22799 -3111 20280 -11133 -13617
1175 -13617 19988 1991 -20733 10791 14154 -18821 -3944 20783 -9691 -15097 19501 5800
1187 5800 -19377 8845 16860 -16229 -4292 20913 -7340 -15689 16733 4729 -22097 5680
1199 5680 15448 -17814 -7221 18388 -7544 -17212 16028 5585 -18339 6017 16654 -14647
1211 -14647 -4776 19659 -4052 -13616 14186 5046 -17679 4477 14129 -13517 -5177 17050 -3780
1224 -3780 -12822 13494 4951 -17428 2839 10359 -14178 -8839 14191 -5737 -13505 12219 5102
1237 5102 -15009 5903 14980 -10427 -3042 17306 -2158 -11182 12918 6462 -14187 5585 13871
1250 13871 -11731 -3729 16244 -5720 -14003 11791 3145 -17772 3240 10604 -15718 -6964 13419
$$ packed form
1162B869K0641l5771J9L2826k2110k1483L2806P16l3312J9688K3391l1413k484
1175a3617L3605j7997k2724L1524L363l2975J4877K4727l0474n406L4598j3701
1187E800k5177K8222Q015l3089J1937K5205k8253q349L2422j2004k6826K7777
1199E680R768l3262J0593K5609k5932r668L3240j0443k3924K4356J0637l1301
1211a4647R871K4435k3711r564K7802r140k2725K2156R652k7646Q340K2227k0830
1224c780r042K6316q543k2379K0267P520k4537N339K3030j9928p768K5724p117
1237E102k0111K0912R077k5407P385K0348j9464r024K4100o456k0649J9772Q286
1250A3871k5602Q002J9973k1964q283K5794q646k0917K1012P364k6322Q754K0383
$$ plain form
1263 13419 -6813 -16258 10027 4034 -16576 4101 13315 -10416 -4112 18507 -485 -10675 13647
1276 13647 8398 -14651 3610 15584 -11185 -7324 16112 120 -13431 11963 9854 -14654
1288 -14654 -52 13093 -11260 -10192 11971 -3706 -16534 6532 7823 -13842 639 15761
1300 15761 -6081 -5823 15926 1502 -12448 7595 7312 -13440 -1697 11495 -6968 -8433 11480
1313 11480 3001 -11165 5807 8396 -12533 -3366 8324 -8499 -11499 7103 479 -10857 4889
1326 4889 9632 -6201 977 13574 -1672 -5110 11231 4215 -8251 6511 8061 -6713 1389
1339 1389 12096 -3008 -7200 9883 1100 -11513 1860 3161 -11765 -4344 5872 -5442 -7784
1352 -7784 4824 -1029 -9053 2980 5305 -9538 -2427 7759 -3878 -5586 9135 4263 -6236
$$ packed form
1263A3419k0232r445K6285n993k0610K0677R214k3731O304K2619j8992j0190K4322
1276A3647n249k3049J8261J1974k6769L861K3436j5992j3551K5394k109k4508
1288a4654J4602J3145k4353J068K2163j5677j2828K3066J291k1665J4481J5122
1300A5761k1842K58K1749j4424j3950K0043k83k0752J1743J3192j8463j465J9913
1313A1480q479j4166J6972K589k0929R167J1690j6823l000J8602o624j1336J5746
1326D889M743j5833P178J2597j5246l438J6341p016j2466J4762J550j4774Q102
1339A389J0707j5104m192J7083q783j2613J3373J301j4926P421J0216j1314k342
1352g784J2608n853q024J2033K325j4843P111J0186j1637j708J4721m872j0499
$$ plain form
1365 -6236 6716 10545 -4035 897 10179 -3019 -7703 6237 1367 -9924 3673 8175 -5225
1378 -5225 -1314 10961 -1237 -7644 6322 907 -11427 -1394 4381 -9192 -4985 8761 -773
1391 -773 -5351 9303 6846 -4716 1721 6864 -7396 -7379 4817 -4283 -11238 1963 5924 -5946
1405 -5946 32 9044 -1602 -4423 7636 85 -8744 -347 1829 -8401 -2679 7842 -327 -2189
1419 -2189 9529 6265 -2582 4947 6666 -4936 -3273 5718 -3208 -6051 3385 2162 -4817 2294
1433 2294 6195 -3122 -3655 3940 -3412 -8823 -772 -1216 -7285 -1640 3274 -2707 -1136 5800 1239
1448 1239 -3312 2377 1904 -5529 -2061 4199 -2568 -1944 7281 3669 -330 4965 5864 -3037 230 3466
1464 3466 -5532 -5138 1490 -1973 -4840 3048 4989 -1707 2739 6322 -316 -4320 2721 -2437 -8852
$$ packed form
1365f236J2952L829j4580M932R282j3198m684J3940m870j1291J3597M502j3400
1378e225L911J2275j2198o407J3966n415j2334J0033N775j3573M207J3746r534
1391g73m578J4654k457j1562O437N143j4260J7J2196r100o955J3201L961j1870
1405e946N978R012j0646k821J2059p551q829Q397K176j0230N722J0521q169j862
1419b189J1718l264q847P529J719j1602J663Q991q926k843R436j223o979P111
1433B294L901r317n33P595p352n411Q051m44o069N645M914n981J571O936m561
1448A239m551N689m73p433L468O260o767O24R225l612l999N295Q99q901L267L236
1464C466q998L94O628l463k867P888J941o696M446L583o638m004P041n158o415
$$ plain form
1479 -8852 -1704 790 -5062 -1047 6803 647 -921 6206 3722 -4016 1092 944 -7831 -5467 1172
1494 1172 -3818 -4933 5450 5203 -1072 5310 8371 -1246 -2283 4485 -3055 -8617 998 1067 -5801
1509 -5801 946 8021 -456 384 8637 2218 -5414 2162 880 -8155 -3424 3044 -4695 -4465 6058
1524 6058 2175 -3264 3998 5780 -4333 -2505 4007 -5335 -7454 2794 726 -5938 2290 7072
1538 7072 -1919 95 8178 27 -4976 2307 -50 -7875 -170 4737 -4435 -1018 8144 2136 -1584
1553 -1584 5964 4091 -7007 -872 2954 -6810 -4247 4075 -1374 -4519 5753 5194 -2124 2440 6560
1568 6560 -5284 -5265 1396 -4140 -7923 1686 2662 -4542 2815 9017 234 -138 6452 672 -6464 903
1584 903 169 -8263 -73 5415 -2551 -1614 9510 3559 -1712 5586 4740 -7208 -2888 1490 -8496
$$ packed form
1479h852P148K494n852M015P850o156j568P127k484p738N108j48q775K364O639
1494A172m990j115J0383k47o275O382L061r617j037O768p540n562R615O9o868
1509e801O747P075q477Q40Q253o419p632P576j282r035M731O468p739K30J0523
1524F058l883n439P262J782j0113J828O512r342k119J0248k068o664Q228M782
1538G072q991K014Q083q151n003P283k357p825P705M907r172L417R162o008l720
1553a584P548j873j1098O135L826r764K563Q322n449l145J0272n59p318M564M120
1568F560j1844J9O661n536l783R609R76p204P357O202q783l72O590n780p136P367
1584I03p34q432Q190N488p966R37J1124n951n271P298q46j1948M320M378r986
$$ plain form
1599 -8496 -6647 3049 -521 -5440 4625 6375 -3583 2546 6434 -3917 -4638 3589 -2422 -9053 1559
1614 1559 3535 -4639 1992 9865 -254 -1450 8790 1914 -7165 1698 3010 -8290 -3636 7422
1628 7422 -2122 -3614 8144 3690 -5640 4337 5717 -7551 -3405 4514 -5760 -7077 4197 1871
1642 1871 -6452 4031 8179 -4188 -1526 6926 -3487 -7981 2223 512 -8927 1006 7372 -1541
1656 -1541 544 9230 1744 -4061 4594 1628 -8548 -300 3387 -5723 -2833 8159 1777 -1736
1670 -1736 8518 6062 -4307 1340 4598 -5511 -5980 2591 -3661 -7650 2963 2949 -4197 3116 8141
1685 8141 -2914 -1855 5457 -3367 -8300 2013 -565 -8680 803 5578 -2125 241 9378 1892
1699 1892 -3264 5304 2601 -8207 -1096 2020 -6626 -2783 5711 866 -2752 7711 5867 -3819
$$ packed form
1599h496J849R696l570m919J0065J750r958O129L888j0351p21Q227o011o631J0612
1614A559J976q174O631P873j0119j196J0240o876r079Q863J312j1300M654J1058
1628G422r544j492J1758m454r330R977J380j3268M146P919j0274j317J1274k326
1642A871q323J0483M148j2367K662Q452j0413m494J0204j711r439R933O366q913
1656a541K085Q686p486n805Q655k966j0176Q248L687r110K890J0992o382l513
1670a736J0254k456j0369N647L258j0109m69Q571o252l989J0613j4p146P313N025
1685H141j1055J059P312q824m933J0313k578q115R483M775p703K366R137p486
1699A892n156Q568k703j0808P111L116q646L843Q494m845l618J0463j844r686
$$ plain form
1713 -3819 1643 5547 -5834 -5571 4250 -2702 -7051 4083 4431 -4285 2648 7634 -3280 -4261 5216
1728 5216 -2990 -8303 1175 1046 -8013 -368 6714 -2840 -2849 7284 824 -6422 1154 1880 -7898 -2051
1744 -2051 4563 -3856 -3076 7522 4506 -1816 5876 6901 -3686 289 5161 -5028 -5516 4110 -445
1759 -445 -5607 3244 5425 -3430 869 6349 -2474 -6098 1864 -1902 -10062 -1760 848 -6114 148
1774 148 6613 573 -213 6069 3120 -4216 1844 1913 -5990 -3696 3323 -2270 -1718 5800 3197 -2210
1790 -2210 5009 5427 -3621 -927 2125 -4816 -6477 1835 -752 -5406 3036 3800 -817 1709 6688
1805 6688 -92 -3300 2715 -630 -5966 878 3478 -3114 1057 5958 837 -1809 5506 1029 -5148
1820 -5148 -964 612 -7140 -3902 1966 -3412 -4131 3832 1370 -2873 2576 4001 -3797 -2485 3212
$$ packed form
1713c819N462L904j1381K63R821o952m349J1134L48q716O933M986j0914r81R477
1728E216q206n313R478j29r059P645P082r554rJ0133o460p246P576P26r778N847
1744b051O614q419P80J0598l016o322P692J025j0587L975M872j0189m88R626m555
1759d45n162Q851K181q855M299N480q823l624P962l766q160Q302K608o962O262
1774A48O465o040p86O282k949p336O060O9p903K294P019n593N52P518k603n407
1790b210P219M18r048K694L052o941j661Q312k587m654Q442P64m617K526M979
1805F688o780l208O015l345n336O844K600o592M171M901n121k646P315m477o177
1820e148M184J576p752L238N868n378p19P963k462m243N449J425p798J312N697
$$ plain form
1835 3212 -2947 -3797 2989 2629 -1825 3983 7023 -380 1709 5523 -1521 -4483 895 -820 -6336
1850 -6336 -1426 2099 -3155 -541 4544 181 -2988 2734 117 -5473 -1170 -175 -4891 -3375 2391
1865 2391 187 -453 4912 4901 1766 2885 4862 -2078 -2488 405 -2240 -4716 -663 520 -1805 1520
1881 1520 4523 -66 181 2563 -1 -4615 -1827 -2013 -4633 -2829 1583 -845 441 4137 3717 775
1897 775 3461 2240 -2255 -383 492 -2942 -2725 1590 433 -1391 2066 2044 -1055 -549 2143 -2504
1913 -2504 -3402 -1499 -2900 -3942 -1460 1461 -1384 1859 3484 -6 550 1405 948 -4183 257 536
1929 536 -1483 -608 1724 1114 758 3242 3134 -503 1215 878 -3571 -3499 -1730 -3384 -3066 1013 1064 -783
1947 -783 1797 2635 -697 138 1126 -776 -3914 -261 -1975 -2562 437 2809 792 1661 4014 1907
$$ packed form
1835C212o159q50O786l60m454N808L040p403K089L814p044k962N378j715n516
1850f336M910L525n254K614N085m363l169N722k617n590M303R95m716J516N766
1865B391k204o40N365j1l135J119J977o940m10K893k645k476M053J183k325L325
1881A520L003m589K47K382k564m614K788j86k620J804M412k428J286L696m20k942
1897G75K686j221m495J872Q75l434K17M315j157j824L457k2l099N06K692m647
1913b504q98J903j401j042K482K921k845L243J625l490N56Q55m57n131M440K79
1929E36k019Q75K332o10l56K484j08l637J718l37m449P2J769j654L18M079N1j847
1947g83K580Q38l332Q35R88j902l138L653j714n87K999K372k017Q69K353k107
$$ plain form
1963 1907 -532 776 -425 -2950 -2794 -1127 -2124 -2060 1013 1748 541 2969 2650 -249 -241 268 -1423
1980 -1423 -3189 -578 -1253 -1586 572 1809 1031 1462 4132 2772 1141 1373 -248 -2785 -1705 -957
1996 -957 -1192 -1513 1201 573 130 2035 1067 -1072 -920 1029 -2451 -2475 -395 -884 -1497 208 1197 999
2014 999 1167 2046 1209 -387 -370 -739 -1062 -135 -495 -857 312 2139 1135 10 1506 1080 -273 -1158
2032 -1158 -811 -3070 -1891 635 -1163 -2044 1768 2074 1752 1726 2130 -987 -1579 -195 -1134 -3671 379
2049 379 -693 -1096 1135 3303 814 773 2054 812 -1665 132 -23 -2972 -1748 835 -830 -613
2065 -613 3037 1649 770 1807 3057 -267 -1299 -1058 -2320 -3026 -729 65 -2062 808 2167 -255
2081 -255 842 1969 6 -2320 611 -791 -1994 -479 1101 -178 -438 2272 1989 25 1593 1830
$$ packed form
1963A907k439J308j201k525J56J667r97O4L073P35j207K428l19k899QN09j691
1980a423j766K611o75l33K158J237p78M31K670j360j631K32j621k537J080P48
1996i57k35l21K714o28m43J905r68k139J52J949l480k4K080m89o13J705R89j98
2014I99J68Q79q37j596J7l69l23R27l60l62J169J827j004j125J496m26j353q85
2032a158L47k259J179K526j798q81L812L06l22k6M04l117n92J384r39k537M050
2049C79j072m03K231K168k489m1J281j242k477J797j55k949J224K583j665K17
2065f13L650j388q79J037J250l324j032K41j262p06K297P94k127K870J359k422
2081b55J097J127j963k326K931j402j203J515J580j279k60K710k83j964J568K37
$$ plain form
2097 1830 -118 -523 1783 -1742 -2181 938 576 -2017 1749 1421 -49 484 1718 -977 -1554 40
2113 40 60 -2090 698 828 -413 -403 2200 -834 -122 1020 -460 -3132 -843 62 -1762 -535 2053
2130 2053 -119 -364 2145 286 -820 139 494 -3309 -696 492 -985 -1890 1451 877 -194 1173
2146 1173 2336 -112 652 1791 -804 -2421 -150 -104 -1398 864 1671 -172 -3 2776 -285 134
2162 134 1551 27 -1589 -591 -290 -3372 -2044 1230 -886 -100 1560 1709 -765 1377 1530 -938
2178 -938 79 1733 -434 -969 1471 1063 308 2312 2252 -1125 -438 2102 272 -1986 750 839 -2190
2195 -2190 -20 719 -688 -361 2187 -533 -1478 306 -176 -1322 -7 1144 -1349 -933 1503 -75
2211 -75 -1434 1017 853 -2310 -86 1140 -267 -1078 1613 -709 -1419 232 2190 -1470 -476 697
$$ packed form
2097A830j948m05K306l525m39L119l62k593L766l28j470N33J234k695n77J594
2113D0K0k150K788J30j241J0K603l034P12J142j480k672K289R05j824J227K588
2130B053k172k45K509j859j106R59L55l803K613J188j477r05L341n74j071J367
2146A173J163k448P64J139k595j617K271M6j294K262Q07j843J69K779l061M19
2162A34J417j524j616R98L01l082J328L274k116P86J660J49k474K142J53k468
2178i38J017J654k167n35K440m08p55K004o0l377O87K540j830k258K736Q9l029
2195b190K170P39j407L27K548k720r45J784m82j146J315J151k493M16K436j578
2211g5j359K451j64l163K224J226j407q11K691k322p10J651J958l660R94J173
$$ plain form
2227 697 -784 -832 864 -71 -2192 903 620 -309 861 2052 323 580 3035 -436 -446 1021 42
2244 42 -2609 -665 289 -1010 -520 530 125 -1397 1564 1666 -1443 69 1694 -990 -760 376 323
2261 323 -982 1526 1529 -33 603 1899 -17 382 1016 305 -1293 281 -155 -698 -313 580 188 -773
2279 -773 1097 342 -1237 -213 995 -379 201 1967 -439 -857 667 -291 -3298 445 -29 -1109
2295 -1109 213 1019 -826 -1888 1691 204 -774 455 910 -1926 -352 108 -1491 45 791 -141
2311 -141 -510 1047 1332 -303 1223 788 -1698 -441 634 674 -892 478 1661 480 321 1047 1287
2328 1287 233 349 432 -1183 -329 -972 -2026 -323 42 -485 -912 270 -333 -1291 469 719 -370 237
2346 237 691 -802 -194 218 -307 236 -184 760 -60 942 411 -532 463 1335 849 -125 -305 -282 18 1223
$$ packed form
2227F97j481m8J696r35k121L095k83r29J170J191j729K57K455l471j0J467r79
2244D2k651J944R54j299M90J050m05j522K961J02l109J512J625k684K30J136n3
2261C23j305K508Lj562O36J296j916L99O34p11j598J574m36n43L85Q93l92r61
2279g73J870p55j579J024J208j374N80J766k406m18J524r58l007L743m74j080
2295a109J322Q06j845j062L579j487r78J229M55k836J574M60j599J536P46r32
2311a41l69J557K85j635J526m35k486J257J075M0j566J370J183j181j59P26K40
2328A287j054J16Q3j615Q54o43j054J703L65n27m27J182o03r58J760K50j089O07
2346B37M54j493O08M12n25N43m20R44q20J002n31r43R95Q72m86r74j80K3L00J205
$$ plain form
2366 1223 1014 272 138 49 -521 -1058 1098 519 -507 59 679 327 -243 -203 -577 -1336 503 -378 -2027
2385 -2027 -825 520 -554 267 767 385 -36 -268 -359 874 -521 -16 -628 -1257 -605 -304 -586 634
2403 634 944 1362 539 676 -175 624 600 36 385 -1064 -1174 -35 1159 982 -284 713 209 -883 369
2422 369 -1442 -895 50 -1579 -176 55 4 373 -51 838 302 156 338 589 -123 -226 -847 -68 -51 110
2442 110 -557 656 861 722 -478 -686 38 -632 -234 -198 306 -445 174 909 -1012 337 94 537 -285
2461 -285 94 -385 -400 1140 120 163 898 1902 1454 -165 864 -150 -40 -816 -513 -973 -1268 -406 -237
2480 -237 -135 1236 9 414 1731 275 -1304 -993 -403 -977 -1838 588 -1005 -126 1202 1485 1428 1196
2498 1196 1544 734 -653 -1088 -381 -955 -195 -667 -879 1433 1116 370 864 726 -327 -1219 -502 -772 -1750
$$ packed form
2366A223k09p42j34q9n70n37K156n79j026N66O20l52n70M0l74p59J839q81j649
2385b027J202J345j074Q21N00l82m21k32r1J233j395N05o12o29O52L01k82J220
2403F34L10M18q23J37q51P99k4n64L49j449j10J139J194j77j266R97n04j092J252
2422C69j811N47R45j629J403K31n1L69m24Q89n36j46J82K51p12j03o21P79J7J61
2442A10o67J213K05j39j200k08P24o70L98L6N04p51O19P35j921J349k43M43q22
2461b85L79m79j5J540j020M3P35J004m48j619J029j014J10p76L03m60k95Q62J69
2480b37J02J371j227M05J317j456j579L11N90n74q61K426j593Q79J328K83n7k32
2498A196L48q10j387m35P07n74P60m72k12K312l17p46M94j38j053q92P17k70r78
$$ plain form
2517 -1750 -1181 781 -769 -623 996 1376 729 1257 773 -90 -1064 -547 -1136 -547 945 453 -697 1637
2535 1637 623 757 506 857 -664 -531 -986 -371 -1770 580 555 -1125 904 1540 -196 173 1418
2552 1418 -179 -1442 -727 274 -1580 209 1033 -228 151 1612 916 39 759 1059 -2215 -1600 44
2569 44 -936 -1760 840 480 693 774 2770 336 950 1693 -136 -1885 -971 -871 -2381 -345 -207 -1215
2587 -1215 416 2020 319 243 1186 -136 -2578 -1353 -1137 -1780 -1191 531 102 437 2494 1908 528
2604 528 1414 -290 -1957 -1046 -301 -1201 -1601 279 1345 156 542 2711 410 -1 2175 -635 -2202
2621 -2202 -319 -991 -2034 -382 256 498 324 2095 959 944 861 -96 -1507 -1357 -576 -701 -293 327
2639 327 246 -1242 1672 1481 -301 1291 1056 -1559 -1237 -877 -1875 -1026 1221 550 1446 1308 1688 -106
$$ packed form
2517a750N69J962j550J46J619L80o47N28m84q63r74N17n89N89J492m92j150K334
2535A637j014J34k51L51j521J33m55O15j399K350k5j680K029O36j736L69J245
2552A418j597j263P15J001j854J789Q24j261L79J461o96q77P20L00l274O15J644
2569D4r80q24K600l60K13Q1J996k434O14P43j829j749R14J00j510K036J38j008
2587a215J631J604j701p6R43j322k442J225K16o43N89J722m29L35K057n86j380
2604E28Q86j704j667R11P45r00m00J880J066j189L86K169k301m11K176k810j567
2621b202J883o72j043J652O38K42j74J771j136j5q3r57j411J50P81j25M08O20
2639C27q1j488K914j91j782J592k35k615L22L60r98Q49K247o71Q96j38L80j794
$$ plain form
2657 -106 -290 377 -1874 -2195 -1049 -951 -339 -551 2228 871 1401 1756 498 -160 767 -633 -2416 -2272
2675 -2272 -621 -2126 -679 1908 -61 241 1253 1877 -205 -310 -974 -1134 -2169 -1265 -1825 -920 778
2692 778 1654 1122 2330 2504 890 -823 -72 -1138 -2301 -1069 -587 -2318 -293 1044 509 707 2205
2709 2205 1601 122 370 7 -2135 -2053 -37 -1433 -1358 1084 1447 618 1240 2268 -519 -374 925 -1659
2727 -1659 -2602 -1173 -415 -744 119 2640 -159 595 2056 160 -1674 69 -124 -2284 -2161 -470 -231
2744 -231 984 987 1510 165 1808 1041 -473 -368 -995 -2044 -1937 -642 -924 506 1710 1697 1063 1582
2762 1582 1612 242 -1554 -560 -2071 -3190 -2056 -25 -989 1164 2158 2196 945 1195 1690 -1821 -1078
2779 -1078 -1894 -2575 -1160 -322 -1682 1150 2973 2116 748 1873 438 14 -352 -1340 -1911 -2673 -898
$$ packed form
2657a06j84O67k251l21J146R8O12k12K779j357N30L55j258o58R27j400j783J44
2675b272J651j505J447K587j969L02J012O24k082j05o64j60j035R04n60R05J698
2692G78Q76n32J208J74j614j713P51j066j163J232M82j731K025J337n35J98J498
2709B205o04j479K48l63k142Q2K016j396P5K442L63q29O22J028k787J45J299k584
2727a659r43J429P58l29Q63K521k799P54J461j896j834J743j93k160J23J691K39
2744b31J215LN23j345J643p67j514J05o27j049J07J295k82J430J204j3o34N19
2762A582L0j370j796R94j511j119J134K031r64K153R94L8j251K50M95l511P43
2779a078q16o81J415Q38j360K832J823q57j368J125j435m24l66r88n71p62J775
$$ plain form
2796 -898 -1204 274 1594 1785 901 1767 1331 -68 -1289 -144 -1422 -2395 -1319 -64 -748 709 2496
2813 2496 830 378 380 32 -934 -792 -765 -1852 -1360 -245 -947 869 1655 1591 927 610 -162 -85 -1711 -873
2833 -873 -1263 -1600 -543 827 449 1626 2556 1822 1384 869 -186 -2011 -1201 -1493 -3104 -1112 111
2850 111 -203 701 2065 2195 544 998 439 -145 -1344 -1239 -1487 -1590 -358 330 241 2379 3160 1635
2868 1635 790 927 -1152 -1847 -648 -1957 -3344 437 1140 790 1610 1846 751 1052 829 -693 -1979
2885 -1979 -2673 -1081 -1519 -1482 85 257 792 1242 2035 92 775 -453 -903 -2094 -1632 -1579 -1856 -282
2903 -282 1277 57 1964 1869 1493 -765 50 -415 -3004 -1672 -399 -2504 -226 813 2192 1179
2919 1179 2296 2266 927 -276 -628 -2107 -2211 -1318 -1414 -958 900 1215 1486 2407 1715 889 236 -736 -2070
$$ packed form
2796h98l06J478J320J91q84Q66m36j399j221J145j278r73J076J255o84J457J787
2813B496j666m52Kl48r66J42K7j087M92J115p02J816P86o4o64l17p72P7j626Q38
2833h73l90l37J057J370l78J177R30p34m38n15j055j825Q10k92j611J992J223
2850A11l14R04J364J30j651M54n59n84j199J05k48j03J232O88q9K138P81j525
2868A635q45J37k079o95J199j309j387L781P03l50Q20K36j095L01k23j522j286
2885a979o94J592m38L7J567J72N35M50P93j943O83j228m50j191M62N3k77J574
2903b82J559j220J907r5l76k258Q15m65k589J332J273k105K278J039J379j013
2919A179J117l0j339j203l52j479j04Q93r6M56J858L15K71R21o92q26o53r72j334
$$ plain form
2938 -2070 -3017 -1405 -1686 -1017 -300 1746 1235 391 3095 121 -149 632 -758 -1582 -1046 -662 -1307 85
2956 85 2002 1624 2018 2466 1376 -569 -889 -159 -2454 -2926 -441 -1102 -509 1277 1970 1464 2064 3129
2974 3129 240 -1220 -238 -1369 -2853 -947 -619 195 1190 2234 1971 363 1871 733 -981 -707
2990 -707 -483 -2054 -3350 -1184 -915 949 2614 2403 490 1405 2219 -1037 -1541 -210 -2262 -3316 -1198
3007 -1198 -435 -566 1774 2872 1204 736 1518 289 -1563 -934 -2151 -1834 -1650 -95 242 -65 1122
3024 1122 1256 710 1700 308 -1337 -711 -747 -3153 -1548 -433 -184 -401 1936 2056 1021 1307 2012 -922
3042 -922 -1763 -1547 -1402 -1623 -701 -8 -43 1342 2720 873 505 974 -206 -1218 -1407 -1577 -2589 -1021
3060 -1021 1124 213 1375 2934 1654 1062 2055 1402 -1967 -1457 -2367 -2432 -1614 -948 208 31 2513 2410
$$ packed form
2938b070r47J612k81O69P17K046n11q44K704k974k70P81j390q24N36L84o45J392
2956H5J917l78L94M48j090j945l20P30k295m72K485o61N93J786O93n06O00J065
2974C129k889j460R82j131j484J906L28Q14R95J044k63j608J508j138j714K74
2990g07K24j571j296K166K69J864J665k11j913R15Q14l256n04J331k052j054K118
3007a198P63j31K340J098j668m68P82j229j852O29j217L17J84J555L37l07J187
3024A122J34n46R90j392j645O26l6k406J605J115K49k17K337J20j035K86P05k934
3042i22q41K16J45k21R22O93l5J385J378j847l68M69j180j012j89j70j012J568
3060a021K145r11J162J559j280n92R93o53l369N10r10o5Q18O66J156j77K482j03
$$ plain form
3078 2410 -375 1257 260 -1135 -1008 -682 -2937 -2287 -850 -3 316 1110 2255 1394 88 1173 -318
3095 -318 -2611 -1067 -2002 -2023 -756 838 -326 480 2285 1080 -54 590 324 -1854 -1468 -1851 -2689
3112 -2689 -2133 1054 -197 -123 1670 2429 1094 -109 2151 -1274 -2854 -840 -1982 -2433 458 1393
3128 1393 1039 1220 2847 1487 -400 891 -1339 -1600 -1269 -2244 -3044 -572 1094 524 442 2463 1797
3145 1797 585 -186 1084 -868 -2576 -1021 -1855 -2345 109 2159 116 1937 2315 409 519 179
3161 179 -1757 -2459 -1161 -1715 -1932 -550 1716 1068 1739 2967 1705 513 1193 -573 -2681 -926 -1766
3178 -1766 -1306 -975 1637 2114 1425 1898 1683 174 774 151 -1863 -1770 -189 -1401 -1026 -45 2182 1018
3196 1018 1459 2850 541 -40 -200 -2370 -1929 -413 -1690 -1673 133 760 226 687 2237 1675 -798
$$ packed form
3078B410k785J632r97j395J27L26k255O50J437Q47L19P94J145q61j306J085j491
3095c18k293J544r35k1J267J594j164Q06J805j205j134O44k66k178L86l83q38
3112b689N56L187j251P4J793P59j335j203K260l425j580K014j142m51K891R35
3128A393l54J81J627j360j887J291k230k61L31r75q00K472J666n70q2K021o66
3145A797j212p71J270j952j708J555q34m90K454K050k043J821L78j906J10l40
3161A79j936p02J298n54k17J382K266o48O71J228j262j192O80j766k108J755q40
3178a766M60L31K612M77o89M73k15j509O00o23k014R3J581j212L75R81K227j164
3196A018M41J391k309n81j60k170M41J516j277J7J806O27n34M61J550n62k473
$$ plain form
3213 -798 -433 -588 -2371 -1833 -1591 -1490 -7 946 808 776 1697 2521 737 -208 147 -2292 -2274 -566 -581
3232 -581 -1603 1087 2287 1258 1782 1043 242 -63 -276 -751 -2090 -1210 -460 -363 217 2445 1246 896
3250 896 2249 300 -174 104 -604 -2877 -1722 -492 451 -707 1861 1162 1977 2264 1407 -775 -89
3267 -89 172 -2675 -2818 -1001 -992 -1096 1532 1179 1391 763 1866 -223 -1308 298 -799 -1710 -1427 12
3285 12 -1325 548 1546 2594 1379 1229 1099 -1302 -383 -893 -2567 -994 -129 -892 -476 2641 2141 1127
3303 1127 1803 750 -648 -421 -634 -1844 -2268 -1170 512 228 1792 1269 1384 -169 2458 -115 -1457
3320 -1457 -1647 -1773 -2976 -2387 533 -210 1762 1204 1245 482 1918 878 -1355 -498 -1472 -2260 -1710 -351
3338 -351 110 -357 2314 2875 881 994 2330 174 -1659 -663 -1344 -2048 -549 431 -663 1192 1855
$$ packed form
3213g98L65j55j783N38K42J01J483R53j38l2R21Q24j784r45L55k439J8J708j5
3232e81j022K690J200j029N24p39q01l05k13m75j339Q80P50R7N80K228j199l50
3250H96J353j949m74K78p08k273J155J230R43j158K568o99Q15K87q57k182O86
3267h9K61k847j43J817Rj04K628l53K12o28J103k089j085J606j097r11K83J439
3285A2j337J873R98J048j215j50j30k401R19n10j674J573Q65p63M16L117n00j014
3303A127O76j053j398K27k13j210m24J098J682k84J564n23J15j553K627k573j342
3320a457j90j26j203N89K920p43J972n58M1p63J436j040k233Q57r74p88N50J359
3338c51M61m67K671N61j994J13J336k156j833R96o81p04J499R80j094J855O63
$$ plain form
3355 1855 917 1490 1445 420 -2737 -2009 -142 -1686 -1349 831 936 113 1471 1377 542 -320 899 -923
3373 -923 -1168 -1302 -1636 -2567 254 684 992 1438 2061 1447 -369 1506 -149 -1039 -90 -524 -1663 -968
3391 -968 1032 39 562 2114 1141 874 456 -469 -1963 -1234 -974 -2115 -1131 542 628 799 1741 2068 619
3410 619 -122 -243 -906 -1787 -1416 -382 -2252 -937 1149 363 1370 1562 613 -138 649 132 -1780 -947
3428 -947 -946 -1428 -962 1657 1261 1083 2965 1936 1102 -635 585 -1401 -1149 -691 -1417 -635 877 1270
3446 1270 523 1461 2110 102 -781 951 -2055 -2257 -541 -584 -1097 -15 1614 -87 490 1427 744 -741
3464 -741 -577 -161 -2954 -2071 -1276 -1639 -315 1299 1203 641 2163 1675 572 -340 -346 -945 -2124 -611 -628
3483 -628 -1381 1222 747 147 1078 1930 33 -585 -858 -1 -1765 -1256 -74 -1341 -461 1720 1187 406
$$ packed form
3355A855r38N73m5j025l157P28J867j544L37K180J05q23J358r4q35q62J219j822
3373i23k45j34l34r31K821M30L08M46O23o14j816J875j655q90R49m34j139O95
3391i68K000r93N23J552r73k67m18r25j494P29K60j141R84J673Q6J71R42L27j449
3410F19p41j21o63q81L71J034j870J315K086p86J007J92r49p51P87n17j912Q33
3428i47Jm82M66K619l96j78J882j029q34j737J220j986K52M58p26P82J512L93
3446A270p47R38O49k008q83J732l006k02J716m3n13J082J629j701N77R37o83j485
3464g41J64M16k793Q83P95l63J324J614r6n62J522m88j103r12on99j179J513j7
3483f28p53K603m75o00R31Q52j897o18k73Q57j764N09J182j267Q80K181n33p81
$$ plain form
3501 406 1495 -77 -751 -371 -1152 -1789 -1918 -320 -691 -1415 1891 309 706 1375 1775 -152 -35 -130
3519 -130 -528 -1527 205 -21 -229 789 2297 586 -208 2817 593 -1821 -1184 -780 -2147 -748 -637
3536 -637 -543 976 1939 1886 1139 1628 653 -1103 -140 -428 -1781 -1376 45 34 -464 2475 665 509 1229
3555 1229 1423 -541 -495 -1007 -1012 -1934 -531 -133 -741 764 1877 1783 1443 534 88 -873 -1425 -1492 -1735 -1409
3575 -1409 802 615 1804 2198 1155 886 608 1961 -360 -1444 311 -1463 -2572 442 -249 150
3591 150 1858 2006 -59 773 1727 -306 -2230 -270 -1235 -1750 -924 1101 -124 980 1284 515 -310
3608 -310 646 153 -1027 -964 -1486 -1674 -1455 1118 1036 393 1564 1314 -293 145 -118 -821 -1218 -800 -1556
3627 -1556 -613 357 644 434 1123 1344 199 719 1095 -91 -791 -940 -496 -704 315 1282 -612 425
$$ packed form
3501D06J089j572o74L80p81o37j29J598l71p24L306j582L97O69M00j927J17r5
3519a30l98r99J732k26k08J018J508j711p94L025k224k414O37M04j367J399J11
3536f37R4J519R63n3p47M89r75j756R63k88j353M05J421j1m98K939j810j56P20
3555A229J94j964M6n12nr22J403L98o08J505J113r4l40r09m46r61n52o7k43L26
3575a409K211j87J189L94j043k69k78J353k321j084J755j774j109L014o91L99
3591A50J708J48k065Q32R54k033j924J960r65n15Q26K025j225J104L04p69q25
3608c10R56m93j180O3n22j88K19K573q2o43J171k50j607M38k63p03l97M18p56
3627a556R43R70K87k10O89K21j145N20L76j186p00j49M44k08J019R67j894J037
$$ plain form
3645 425 2213 194 775 1198 -90 -1273 -1592 -1753 -1572 -1425 1393 426 161 1936 1368 1450 1006 327
3663 327 -1661 -845 -630 -178 -713 1369 1401 413 1807 2335 522 -102 134 -493 -1723 -413 -927 -1255
3681 -1255 -308 1044 409 526 1459 207 588 231 533 -483 -563 -701 -277 -1066 446 487 114 1517 863
3700 863 -360 23 -421 -989 -1010 -347 -408 -1131 1403 556 -267 295 1837 459 -591 283 -1221 -2346
3718 -2346 -1240 203 -1224 -7 1543 489 -103 2848 353 -1204 -928 -511 -1612 -2063 -682 -741
3734 -741 89 793 474 -930 1529 2572 -267 -1008 509 -861 -1549 -675 -457 -824 1142 1243 782 575
3752 575 1001 814 -1784 -183 -465 -2095 808 139 -1583 -123 292 613 405 861 470 -111 249 -261
3770 -261 -1897 -848 -365 -700 -421 695 555 -979 1168 676 867 -712 658 -1608 -764 102 -902
$$ packed form
3645D25J788k019N81M23j288j183l19j61J81J47K818r67k65J775n68Q2m44o79
3663C27j988Q16K15M52n35K082L2r88J394N28j813o24K36o27j230J310n14l28
3681a255R47J352o35J17R33j252L81l57L02j016q0j38M24p89J512M1l73J403o54
3700H63j223L83m44n68k1O63o1p23K534q47q23N62J542j378j050Q74j504j125
3718b346J106J443j427J217J550j054n92K951k495j557K76M17j101m51J381n9
3734g41Q30P04l19j404K459J043k839p41J517j370o88Q74K18l67J966J01m61k07
3752E75M26j87k598J601k82j630K903o69j722J460M15L21k08M56l91n81L60n10
3770b61j636J049M83l35K79J116j40j534K147m92J91j579J370k266Q44Q66j004
$$ plain form
3787 -902 -1328 368 1149 -846 1049 1779 -703 -919 -768 -901 -1854 -1256 719 -1000 -559 916 1078 39
3805 39 1152 1604 -745 -997 141 81 -445 550 139 -798 917 1300 589 601 1836 55 -1418 -850 -17
3824 -17 -1498 -82 513 -49 -214 837 989 341 20 -167 -788 -351 -1078 -1805 -928 80 147 -80 410
3843 410 380 -254 1148 -448 -29 -1093 -273 -1558 -976 -677 -236 440 542 1002 578 1456 471 -1090 -2001
3862 -2001 -380 111 -1604 57 -93 -905 -301 1283 379 -77 -194 1556 -211 -645 -587 -1211 226 133
3880 133 83 -292 1085 593 73 602 173 240 109 806 -448 -1436 343 144 674 1019 1316 -748 -263
3899 -263 -170 338 -364 -956 -524 -573 -465 -23 499 1006 1302 704 -775 1296 732 -760 -1442 -306 -634
3918 -634 -898 843 839 -94 454 1310 -66 449 637 -1017 -596 -350 -1141 -1647 -248 636 -733 -181 497
$$ packed form
3787i02m26J696P81j995J895P30k482k16J51j33r53N98J975j719M41J475J62j039
3805C9J113M52k349k52J138o0n26R95m11r37J715L83p11J2J235j781j473N68Q33
3824a7j481J416N95n62j65J051J52o48l21j87o21M37p27p27Q77J008O7k27M90
3843D10l0o34J402j596M19j064Q20j285N82K99M41O76J02M60m24Q78r85j561r11
3862b001J621M91j715J661j50q12O04J584r04m56j17J750j767m34N8o24J437r3
3880A33n0l75J377m92n20N29m29O7j31O97j254r88J779j99N30L45K97k064M85
3899b63R3N08p02n92M32m9J08M42N22N07K96n98j479K071n64j492o82J136l28
3918f34k64J741mr33N48Q56j376N15J88j654M21K46p91n06J399Q84j369N52O78
$$ plain form
3937 497 763 -1143 1121 -815 -1079 208 -590 -976 -256 632 652 814 772 423 -86 496 629 -799 -143
3956 -143 739 -103 -43 46 830 -188 1004 266 -602 -373 540 -726 -1090 -1129 657 -601 837 1057 -419
3975 -419 434 286 -648 -505 155 439 -467 -184 705 -778 28 1277 1043 -771 997 568 -1040 627
3993 627 -456 80 -509 375 -364 -30 668 1259 -772 -1217 1522 251 -668 272 -443 -925 67 494 -888
4012 -888 -308 956 -308 637 1072 307 -422 -919 -891 -1044 -1250 13 -102 -501 1019 280 119 235 109
4031 109 -12 -706 303 -266 -1429 -14 532 -515 560 1444 -229 2024 -197 -230 -189 33 -1029 -519
4049 -519 -37 310 691 -315 9 410 779 444 55 -471 887 -105 -932 -300 533 -432 -261 519 1604
4068 1604 309 138 1287 154 -230 -474 -1276 -885 -399 867 -566 -199 774 -389 291 223 -269 -1366
$$ packed form
3937D97K66j906K264j936k64J287p98l86P20Q88K0J62m2l49n09N82J33j428O56
3956a43Q82q42O0Q9P84j018J192p38q68K29R13j266l64l9J786j258J438K20j476
3975d19Q53j48r34J43O60K84r06K83Q89j483Q06J249k34j814J768m29j608J667
3993F27j083N36n89Q84p39L34O98N91k031m45K739j271r19R40p15m82R92M27j382
4012h88N80J264j264R45M35p65p29m97K8j53k06J263j15l99J520p39j61J16j26
4031A09j21o94J009n69j163J415N46j047J075Q84j673K253k221l3M1K22j062N10
4049e19M82L47L81j006L24M01L69l35l89n26J358r92q27O32Q33r65J71P80J085
4068A604j295j71J149j133l84k44q02L91M86J266j433L67R73j163O80o8m92j097
$$ plain form
4086 -1366 -139 504 -1170 -215 -80 338 320 1282 912 534 99 338 -784 -1060 -407 -921 -1676 -254 -54
4105 -54 254 1038 947 292 98 1112 55 -687 -8 41 -1737 -401 486 138 945 1223 -348 -45 324
4124 324 633 -2128 -421 -512 -615 -811 892 -180 96 765 -43 -1247 545 829 -1051 684 -227 -447
4142 -447 -332 144 761 203 606 1062 -268 -923 1068 104 -732 -937 14 -64 -938 471 575 152 715
4161 715 30 -11 320 126 -1016 -450 323 -1156 587 540 -158 -31 497 1124 -528 66 477 -761 -120
4180 -120 -92 -187 -1472 139 426 439 869 604 -873 588 1345 -421 -81 -545 330 -584 -280 8 136
4199 136 -260 172 872 -77 -212 643 -775 -584 345 259 96 949 668 92 529 1372 -380 647 829
4218 829 181 1224 -83 9 -1460 -624 -486 -206 113 1152 1156 655 67 -298 -1252 138 367 -991 151
$$ packed form
4086a366J227O43j674R55J35M18j8R62l70l78m35K39j122k76O53n14p55J422K00
4105e4L08P84r1o55j94J014j057p42O79M9j778J336Q87l48Q07K78j571L03L69
4124C24L09k761J707r1j03j96J703j072K76O69q08j204J792K84j880J735r11k20
4142d47J15M76O17n58M03M56j330o55J991r64q36k05R51p8q74J409J04m23N63
4161G15o85m1L31j94j142N66P73j479J743m7o98J27N28O27j652N94M11j238O41
4180a20K8r5j285J611K87J3M30k65j477J461P57j766L40m64Q75r14L04K88J28
4199A36l96M32P00r49j35Q55j418J91R29q6j63Q53k81n76M37Q43j752J027J82
4218H29o48J043j307R2j469Q36J38K80L19J039Mn01n88l65r54J390K29j358J142
$$ plain form
4237 151 1036 -1014 722 902 -285 -630 518 210 -426 -643 225 -1170 -212 250 -160 -337 -1052 934
4255 934 611 -270 1081 -236 -1366 -294 407 -697 310 847 -256 -211 -423 -43 -389 376 -186 -378
4273 -378 199 157 134 -479 -658 -297 -1129 118 710 -589 598 17 -176 -802 -526 698 -764 104 66
4292 66 -149 -311 403 -253 196 -1095 728 -894 544 236 -1268 742 392 415 -928 291 -1411 -364
4310 -364 622 -462 -18 -314 -378 -1113 -60 -35 54 -1328 746 353 -766 -38 -249 -102 324 149 -50
4329 -50 -562 -359 -771 -975 889 719 393 280 295 -292 -452 -316 692 -47 4 685 499 -497 682 604
4349 604 -219 109 524 -491 -636 337 -1054 -108 -248 -323 57 -243 48 112 979 201 -952 -1350 -337
4368 -337 -580 -635 -253 639 671 -469 527 -301 41 -608 757 -382 -263 -78 -91 -249 425 1081 -1345 612
$$ packed form
4237A51Q85k050J736J80j187l45J148l08o36k17Q68j395R58M62m10j77p15J986
4255I34l23q81J351j317j130J072P01j104J007N37j103M5k12L80l46P65n62j92
4273c78N77m2k3o13j79L61q32J247N92j299J187n81j93o26K76J224j462Q68l8
4292F6k15j62P14o56M49j291J823j622J438l08j504K010l50K3j343J219j702J047
4310c64R86j084M44k96o4p35J053K5Q9j382K074l93j119P28k11J47M26j75j99
4329e0n12K03m12k04J864j70l26j13J5n87j60J36J008p39N1O81j86r96J179p8
4349F04q23L28M15j015j45R73j391R46j40p5L80l00K91O4Q67p78j153l98J013
4368c37k43n5L82Q92L2j140R96q28L42o49J365j139J19J85j3j58O74O56k426J957
$$ plain form
4388 612 -1 -252 337 126 -714 -884 -186 103 192 -128 1132 924 -30 -95 -371 -329 -176 -397 340 -173 378
4409 378 21 166 761 255 -682 -28 41 621 387 -485 -714 -394 200 -31 -887 -37 375 798 74 -251
4429 -251 -248 -1572 547 -65 -848 909 497 -491 -295 341 -992 -392 790 -710 -467 -652 -66 -235 221
4448 221 430 -558 -167 -646 -122 80 960 428 -1345 46 -861 -1020 368 741 -292 -381 474 254 487
4467 487 1273 559 -1072 304 -477 83 -95 122 306 -298 -360 1216 265 -75 -555 63 159 192 160 318
4487 318 341 -106 918 -1254 1083 -116 563 -64 -1369 -480 265 136 -66 -240 -90 149 -793 772
4505 772 -204 182 -180 57 -1289 -210 491 884 -641 750 911 108 -428 1085 810 208 166 -712 -237
4524 -237 -59 440 -503 -415 -191 39 -108 -458 1122 -412 -1084 739 -168 717 1311 199 -279 416 -755
$$ packed form
4388F12o13k51N89k11q40j70O98K89Q9l20J260k08r54o5k76M2J53k21P37n13N51
4409C78l57J45N95n06r37O54O9N80k34q72k29L20N94k31q56Q50M12M23p24l25
4429b51Lj324K119o12p83J757m12r88J96O36j333O00J182j500K43j85N86j69M56
4448B21K09r88L91m79N24K02Q80n32j773J391r07j59J388L73j033q9Q55k20K33
4467D87P86p14j631J376p81N60j78K17J84o04o2J576r51l40m80O18R6L3l2J58
4487C18K3m47J024k172K337j199O79o27j305Q89P45j29k02j74J50K39r42J565
4505G72r76L86l62K37j346J079P01L93j525J391J61q03n36J513k75o02m2q78M75
4524b37J78M99r43Q8K24K30j47l50J580j534o72J823r07Q85N94j112m78O95j171
$$ plain form
4543 -755 -369 -257 1344 86 708 376 -572 217 -562 177 244 -466 -218 199 -1314 1281 399 166 -516
$$ packed form
4543g55L86J12J601j258O22l32r48P89p79P39O7p10K48M17j513K595q82k33o82
$$ [...]
8191g32
##END NTUPLES=NMR FID
##END=
