##TITLE=1H_UK-23_9_6
 CD2CL2
 128 sc, 
 20.12.2022
##JCAMPDX= 6.0         $$ Bruker NMR JCAMP-DX V2.0
##DATA TYPE= NMR FID
##DATA CLASS= NTUPLES
##ORIGIN= UXNMR, Bruker Analytische Messtechnik GmbH
##OWNER= root
$$ XWIN-NMR		Version 3.5
$$ Tue Dec 20 13:56:28 2022 Russian Standard Time (UT+4h)  she@DPX200
##.OBSERVE FREQUENCY= 200.13135
##.OBSERVE NUCLEUS= ^1H
##.DELAY= (6, 6)
##.ACQUISITION MODE= SIMULTANEOUS
##.ACQUISITION SCHEME= undefined
##.AVERAGES= 128
##.DIGITISER RES= 18
##SPECTROMETER/DATA SYSTEM= spect
##.PULSE SEQUENCE= zg30
##.SOLVENT NAME= CD2Cl2
##.SHIFT REFERENCE= (INTERNAL, CD2Cl2, 0, 15.7039)
##AUDIT TRAIL= $$ (NUMBER, WHEN, WHO, WHERE, WHAT)
$$ ##TITLE= Audit trail, XWIN-NMR		Version 3.5
$$ ##JCAMPDX= 5.01
$$ ##ORIGIN= Bruker BioSpin GmbH
$$ ##OWNER= she
$$ F:/spectra/data/she/nmr/H-F/1/audita.txt
$$ ##AUDIT TRAIL=  $$ (NUMBER, WHEN, WHO, WHERE, WHAT)
(   1,<2022-12-20 13:54:43.46 +0400>,<she>,<DPX200>,
      <continue with go, POWCHK disabled, PULCHK disabled
       configuration hash MD5:
       00 E9 B6 7A A2 85 ED C7 34 08 36 98 17 FE 4E 26
       data hash MD5: 16K
       18 69 36 AE 5E 84 92 E6 A2 CF 9A 44 EF 0E B0 8E>)
$$ ##END=
$$ 
$$ hash MD5
$$ D0 0E BE 2E 6C DF CF 0D 12 E7 5C 4E 75 EF C9 72
##$RELAX= 
##$RELAX= 
##$RELAX= 
##$RELAX= 
##$RELAX= 
##$RELAX= 
$$ Bruker specific parameters
$$ --------------------------
##$DU= <F:/spectra>
##$EXPNO= 1
##$NAME= <H-F>
##$PROCNO= 1
##$TYPE= <nmr>
##$USER= <she>
##$AMP= (0..31)
100 100 100 100 100 100 100 100 100 100 100 100 100 100 100 100 100 100 
100 100 100 100 100 100 100 100 100 100 100 100 100 100 
##$AQSEQ= 0
##$AQ_mod= 1
##$AUNM= <au_zg>
##$AUTOPOS= <>
##$BF1= 200.13
##$BF2= 200.13
##$BF3= 200.13
##$BF4= 200.13
##$BF5= 200.13
##$BF6= 200.13
##$BF7= 200.13
##$BF8= 200.13
##$BYTORDA= 1
##$CFDGTYP= 0
##$CFRGTYP= 5
##$CHEMSTR= <none>
##$CNST= (0..31)
1 1 145 1 1 1 1 1 1 1 1 1 1 1 1 1 1 1 1 1 1 1 1 1 1 1 1 1 1 1 1 1 
##$CPDPRG= <>
##$CPDPRG1= <>
##$CPDPRG2= <>
##$CPDPRG3= <>
##$CPDPRG4= <mlev>
##$CPDPRG5= <mlev>
##$CPDPRG6= <mlev>
##$CPDPRG7= <mlev>
##$CPDPRG8= <mlev>
##$CPDPRGB= <>
##$CPDPRGT= <>
##$D= (0..31)
0 1.2 0 0 0 0 0 0 0 0.06 0 0.03 0 0 0 0 0.0002 0 0 0 0 0 0 0 0 0 0 0 0 
0 0 0 
##$DATE= 1671529589
##$DBL= (0..7)
120 120 120 120 120 120 120 120 
##$DBP= (0..7)
150 150 150 150 150 150 150 150 
##$DBP07= 0
##$DBPNAM0= <>
##$DBPNAM1= <>
##$DBPNAM2= <>
##$DBPNAM3= <>
##$DBPNAM4= <>
##$DBPNAM5= <>
##$DBPNAM6= <>
##$DBPNAM7= <>
##$DBPOAL= (0..7)
0.5 0.5 0.5 0.5 0.5 0.5 0.5 0.5 
##$DBPOFFS= (0..7)
0 0 0 0 0 0 0 0 
##$DE= 6
##$DECBNUC= <off>
##$DECIM= 32
##$DECNUC= <off>
##$DECSTAT= 4
##$DIGMOD= 1
##$DIGTYP= 9
##$DL= (0..7)
0 120 120 120 120 120 120 120 
##$DP= (0..7)
150 150 150 150 150 150 150 150 
##$DP07= 0
##$DPNAME0= <>
##$DPNAME1= <>
##$DPNAME2= <>
##$DPNAME3= <>
##$DPNAME4= <>
##$DPNAME5= <>
##$DPNAME6= <>
##$DPNAME7= <>
##$DPOAL= (0..7)
0.5 0.5 0.5 0.5 0.5 0.5 0.5 0.5 
##$DPOFFS= (0..7)
0 0 0 0 0 0 0 0 
##$DQDMODE= 0
##$DR= 18
##$DS= 0
$$ [...]
##$SUBNAM2= <"">
##$SUBNAM3= <"">
##$SUBNAM4= <"">
##$SUBNAM5= <"">
##$SUBNAM6= <"">
##$SUBNAM7= <"">
##$SUBNAM8= <"">
##$SUBNAM9= <"">
##$SW= 18.05172834244
##$SWIBOX= (0..15)
0 0 2 0 0 0 0 0 0 0 0 0 0 0 0 0 
##$SW_h= 3612.71676300578
##$TD= 16384
##$TD0= 1
##$TE= 0
##$TE2= 300
##$TE3= 300
##$TEG= 300
##$TL= (0..7)
0 120 120 120 120 120 120 120 
##$TP= (0..7)
150 150 150 150 150 150 150 150 
##$TP07= 0
##$TPNAME0= <>
##$TPNAME1= <>
##$TPNAME2= <>
##$TPNAME3= <>
##$TPNAME4= <>
##$TPNAME5= <>
##$TPNAME6= <>
##$TPNAME7= <>
##$TPOAL= (0..7)
0.5 0.5 0.5 0.5 0.5 0.5 0.5 0.5 
##$TPOFFS= (0..7)
0 0 0 0 0 0 0 0 
##$TUNHIN= 0
##$TUNHOUT= 0
##$TUNXOUT= 0
##$USERA1= <user>
##$USERA2= <user>
##$USERA3= <user>
##$USERA4= <user>
##$USERA5= <user>
##$V9= 5
##$VALIST= <valist>
##$VCLIST= <CCCCCCCCCCCCCCC>
##$VD= 0
##$VDLIST= <DDDDDDDDDDDDDDD>
##$VPLIST= <PPPPPPPPPPPPPPP>
##$VTLIST= <TTTTTTTTTTTTTTT>
##$WBST= 1024
##$WBSW= 4
##$XGAIN= (0..3)
0 0 0 0 
##$XL= 0
##$YL= 0
##$YMAX_a= 612765
##$YMIN_a= -698182
##$ZGOPTNS= <>
##$ZL1= 120
##$ZL2= 120
##$ZL3= 120
##$ZL4= 120
##$ABSF1= 10
##$ABSF2= 0
##$ABSG= 5
##$ABSL= 3
##$ALPHA= 0
##$AQORDER= 0
##$ASSFAC= 0
##$ASSFACI= 0
##$ASSFACX= 0
##$ASSWID= 0
##$AUNMP= <proc_1d>
##$AZFE= 0.1
##$AZFW= 0.1
##$BCFW= 1
##$BC_mod= 2
##$BYTORDP= 1
##$COROFFS= 0
##$CY= 11.3945322036743
##$DATMOD= 1
##$DC= 2
##$DFILT= <>
##$DTYPP= 0
##$F1P= 2.36226072786647
##$F2P= -0.459571619588291
##$FCOR= 0.5
##$FTSIZE= 0
##$FT_mod= 4
##$GAMMA= 1
##$GB= 0.15
##$INTBC= 1
##$INTSCL= 1
##$ISEN= 128
##$LB= 0.24
##$LEV0= 0
##$LPBIN= 0
##$MAXI= 10000
##$MC2= 0
##$MEAN= 0
##$ME_mod= 0
##$MI= 1.114404
##$NCOEF= 0
##$NC_proc= 0
##$NLEV= 6
##$NOISF1= 3.799351
##$NOISF2= 2.8
##$NSP= 1
##$NTH_PI= 0
##$NZP= 0
##$OFFSET= 15.70392
##$PC= 1
##$PHC0= -19113.02
##$PHC1= 16.20072
##$PH_mod= 1
##$PKNL= yes
##$PPARMOD= 0
##$PSCAL= 0
##$PSIGN= 0
##$REVERSE= no
##$SF= 200.130013532006
##$SI= 16384
##$SIGF1= 3
##$SIGF2= 2
##$SINO= 400
##$SIOLD= 16384
##$SREGLST= <1H.CDCl3>
##$SSB= 0
##$STSI= 0
##$STSR= 0
##$SW_p= 3612.71676300578
##$SYMM= 0
##$S_DEV= 0
##$TDeff= 0
##$TDoff= 0
##$TI= <>
##$TILT= no
##$TM1= 0
##$TM2= 0
##$TOPLEV= 0
##$USERP1= <user>
##$USERP2= <user>
##$USERP3= <user>
##$USERP4= <user>
##$USERP5= <user>
##$WDW= 1
##$XDIM= 8192
##$YMAX_p= 0
##$YMIN_p= 0
$$ End of Bruker specific parameters
$$ ---------------------------------
##NTUPLES= NMR FID
##VAR_NAME=  TIME,          FID/REAL,        FID/IMAG
##SYMBOL=    X,             R,               I
##VAR_TYPE=  INDEPENDENT,   DEPENDENT,       DEPENDENT
##VAR_FORM=  AFFN,          ASDF,            ASDF
##VAR_DIM=   8192,          8192,            8192
##UNITS=     SECONDS,       ARBITRARY UNITS, ARBITRARY UNITS
##FACTOR=    0.0002768,     1,               1
##FIRST=     0,             0,               0
##LAST=      2.2672688,     0,               0
##MIN=       0,             -698182,         0
##MAX=       2.2672688,     612765,          0
$$ Real data points
##PAGE= N=1
##DATA TABLE= (X++(R..R)), XYDATA
0@%%%%%%%%%%%%%%%%%J28k56K56k56K56k57L85n12N12o27P55q18R46j102J233
32F43j412J644j844K054k311K600k913L252l622M027m470M957n486O065o696P391
48C879q151Q980r893J0902j2009J3236j4617J6162j7911J9910k2214K4906k8104
61a4924L1985l6797M2930n1092O2567p9950J09867j75619O42158m64035m14617
72c47527R20932n37814m66805O11539J9789o93996N18870L98690n85445J2169
82a49598O00458l96701l62815M37428k9160n35055K49201L04170l79151k5345
92b86568N06169j37395k85989L79919J14915m63601J17360L05125m03510j43912
102b97487M62385j43726l16527M41722J43840m40452K19015L18278m59443r3702
$$ y = [0, 0, 0, 0, 0, 0, 0, 0, 0, 0, 0, 0, 0, 0, 0, 0, 0, 0, 128, -128, 128, -128, 128, -129, 256, -256, 256, -371, 384, -434, 512, -590, 643, -769, 875, -969, 1085, -1226, 1374, -1539, 1713, -1909, 2118, -2352, 2605, -2881, 3184, -3512, 3879, -4272, 4708, -5185, 5717, -6292, 6944, -7673, 8489, -9422, 10488, -11726, 13180, -14924, 17061, -19736, 23194, -27898, 34669, -45281, 64586, -111033, 531125, 67090, -347527, 573405, 35591, -431214, 180325, 200114, -493882, 24988, 423678, -161767, -149598, 450860, 54159, -308656, 128772, 99612, -435443, -186242, 117928, -261223, -286568, 219601, 82206, -203783, 176136, 291051, -172550, -55190, 249935, -153575, -297487, 164898, 21172, -295355, 146367, 290207, -150245, 68770, 387048, -72395, -166097]
112a66097M08130k98508l08161M33914J6236l93473L18899K84746l79954M2645
122d1623L83029k79474k47330L28250n6278l63987K11320K12171l00715L1076
132a23561L58421j56088k01210L01965J1394l72706J12119K04371l36877q2324
142b84496L63117j16434k38247L54522J26528l40790J49263K71737l40469j11639
152a66908L35705j73042k75580L26129R0810l14498J94236K83750k79327m9629
162b8354L10686j71340k65177K29196J6586l15403J12457K17597k14430l2947
172a41129K91640p2364j91988K00071N5729k74339L6975J74117k02760q8011K51215
183C9156k8701j66156K14832J18735k20832N8141J86138k05245j13205K04909
$$ y = [-166097, 242033, -56475, -364636, 69278, 85514, -307959, 10940, 295686, -84268, -41623, 341406, 61932, -185398, 142852, 86574, -277413, -66093, 146078, -154637, -123561, 234860, 78772, -122438, 179527, 190921, -181785, -69666, 134705, -202172, -284496, 78621, -37813, -276060, 78462, 204990, -135800, 13463, 285200, -55269, -166908, 168797, -4245, -279825, 46304, 137114, -177384, 16852, 300602, 21275, -28354, 282332, 110992, -154185, 75011, 91597, -223806, -111349, 106248, -108182, -141129, 150511, 78147, -113841, 86230, 141959, -132380, -95405, 78712, -124048, -212059, 39156, 10455, -155701, 59131, 177866, -42966, 15175, 201313, -3932, -117137, 87772]
193H7772q0147j96787J89061R2211j95503R5713J94749j65145o2114J91248r8130
204E2928j86718J39526L1346j99033P8548J64653j28240j8220K06563m9028j40744
215d8419J33186K7852k03955K4643J21115j45724n6179J87519j6236j17477J55378
226F1703Q2559j68547K4535J26373j56572r9192J47963m2046j48343J39730J01871
237G0034j34825N3882J70257j05896q3930J41442m4434j72085Q0251O5240j50150
248a10214K2307J58083o3564n3748J56541N704j36891O1234N5672j55873l0729
259i1478J06374p5540p1614J34167L5137r1966Q6168R0096j07490k3471R0672
270H1055q2045r8600Q1967P130r8312O5889R7799o5917P167J13635m2560p9137
$$ y = [87772, 7625, -189162, -101, 92110, -103393, -7680, 187069, 21924, -40190, 151058, 52928, -133790, 5736, 37082, -161951, -83403, 81250, -46990, -65210, 141353, 92325, -48419, 84767, 112619, -91336, -66693, 54422, -91302, -147481, 40038, 23802, -93675, 61703, 144262, -24285, 250, 126623, -29949, -129141, 18822, -23224, -171567, -31837, 70034, -64791, -10909, 159348, 53452, -30478, 110964, 66530, -105555, -25304, 39936, -110214, -87907, 70176, 6612, -47136, 109405, 115109, -21782, 39452, 95124, -60749, -91478, 14896, -60644, -132258, 1909, 37046, -54920, 31248, 121344, 13854, -9617, 81055, -990, -99590, -17623, -10493, -108805, -42916, 54883, -11034, -3867, 109768, 67208, -11929]
282a1929O5359p135j17785K1702N6952p6864m514J10300j2012m5636R0654K3299
294I2391r6563J5317M4136r7241m1398P4310k8827n3816R0523M7730o0842M4550
306C0270O9133p1306m0162N5537m8089q4210N0241K7389o4660L9516Q7647k9956
318B1350j0697P9917j6024p9450K7456Q416r1020q858N8722l3908k2491Q6277
330A9690K4921m4994M6891M0241p1570k7587M0486n3767o4050N1364J5091n0304
342g3588M8205P3570l1651j553O8289k8255o7181K7829j082p8787N285N2501l3083
355c9501n448Q0555J2005l6805M3842K3564o8997j8126L0298n0939m4661M7038
367b7175J1943l7211M9157N5571l3847M0M8769l4022n5333K6803q491o3370J7426
$$ y = [-11929, 53430, 46295, -71490, -49788, 7164, -69700, -74214, 36086, 24074, -21562, 69092, 92391, -4172, 11145, 55281, -41960, -83358, -9048, -37875, -91691, -1168, 46562, -14280, 30270, 99403, 28097, -12065, 43472, -4617, -88827, -38586, -11197, -75857, -36341, 51306, 21350, 10653, 90570, 74546, -4904, 22552, 30968, -60052, -68910, -10188, -44096, -66587, 19690, 44611, -383, 46508, 86749, 15179, -12408, 28078, -25689, -89739, -38375, -23284, -73588, -25383, 48187, 16536, 14983, 83272, 55017, -12164, 15665, 14583, -64204, -58919, -6418, -39501, -44949, 35606, 47611, 10806, 54648, 78212, 9215, -8911, 21387, -29552, -74213, -27175, -15232, -52443, -3286, 52285, 18438, 18478, 67247, 33225, -22108, 4695, -3796, -67166, -49740]
380d9740M5121l1232O316P1381l977l1324M0445N502o7191l755K3046n2607k0119
393f8134N5264j01k4903N9578L6166m1552J1604L9057n3009m2206L5824k1646
405a4058n2710L9583M0152l8932K3116O9076k6075l0563M7886j5819p5972J5686
417a8630J9781o5992k002O8596j9730k0254P5667J5803n5774K9119L0708p5007
429a7715k6345M8925l9023m5421O4875K6325m4918M4356O1925m5952j8212N5729
441F4549l7249o9289L7128R594p0421K2932O8809m0474q268Q3640j0339o0560
453i948M7829J5266q8532J304N1502o0004k7507Q3430k145n0399O9795L7899p3403
466d913Q854N3660o9368m6700O3894j9167o3924O0506M7832o0025K4495P5898
$$ y = [-49740, -4619, -35851, -29535, 41846, 37869, 6545, 46990, 52492, -14699, -18454, 4592, -48015, -68134, -12870, -12971, -37874, 21704, 57870, 16318, 27922, 66979, 13970, -28236, 7588, -14058, -66768, -27185, 12967, -25965, -2849, 66227, 40152, 9589, 57475, 41656, -34316, -18630, 1151, -64841, -66843, 1753, -17977, -38231, 37436, 53239, -2535, 26584, 57292, -17715, -44060, 4865, -34158, -79579, -14704, 11621, -33297, 11059, 72984, 27032, 8820, 64549, 27300, -41989, -4861, 4733, -65688, -42756, 26053, -14421, -22689, 60951, 50612, -9948, 37881, 53147, -35385, -34081, 17421, -42583, -70090, 13340, 11195, -39204, 30591, 68490, -4913, 3941, 57601, -11767, -58467, 5427, -13740, -77664, -17158, 30674, -29351, -4856, 71042]
478G1042n0386l9490O4077k1743q2839M0956L3460p1340J3071Q5817l3631k9108
490b0114Q1428Q10p7549L8416L1537r1405j1339O9747m8778m2583Q9244J3194
502C2608o6038N7034N1830q2903j0046O7401o5084o1464P3544j247p4955O2156
514a7164O6559o7033J0226Q8121m7492o1945O8743r675r5747L7206N2437p6593
526e2357K742R7225l1092m5842Q5336J0467r2931L2066M7834r3039k3179Q3019
538B0249l9790n3998Q9555L0017p7262M8217O6609q2745k5116P8222n1208p6209
550g3459P3037J7654q4604M7638P9562o8538j1298R1823l9622p6489O6939P322
562B9965j01164K9863O8751p2939r648J02180k4271n8350Q0403K0686r6366K4780
$$ y = [71042, 20656, -18834, 45243, 23500, -59339, -18383, 15077, -56263, -43192, 42625, 8994, -20114, 61314, 62124, -15425, 22991, 54528, -36877, -48216, 21531, -27247, -69830, 19414, 32608, -33430, 23604, 75434, -7469, -17515, 49886, -15198, -76662, -3118, -4365, -79320, -17164, 49395, -17638, -7412, 80709, 33217, -28728, 40015, 30340, -65407, -28201, 24236, -52357, -49615, 47610, 16518, -29324, 56012, 66479, -26452, 5614, 53448, -39591, -62770, 20249, -19541, -73539, 16016, 46033, -31229, 16988, 83597, 852, -24264, 53958, 2750, -73459, -422, 17232, -67372, -19734, 59828, -8710, -20008, 71815, 32193, -44296, 22643, 29965, -71199, -41336, 27415, -45524, -55172, 47008, 22737, -35613, 44790, 65476, -30890, -6110]
574f110N7123q4124k7490Q8073k7074o0231Q4199L5718q0988L3786P1134q2552
586A464m0846P9939l9680q4047P1569L2454q5403M0215Q7219o6221k2003R3390
598F8050l4477q5490O4869J8320j01288K6519P7458o6180j6292J04020j7568o4874
610b6933P4869K2029r7993J4285N9998p9421l6644Q5972j6892o3531P6807M5145
622E7691p9614K2941P1526p0244m6591P5590k7004q3631O4673M3527q0010K6060
634b5086R2550n7359l4559R0847k1681q9885N5865K9477r8256J4586Q0252n9073
646b2322l0098R8031r271p2409O4286L3310r4508O828O4504o7495l9199Q4718
658A6375o945o5014O6699M6913p3305J1725P0939o0032m9999O9294j3305p7880
$$ y = [-6110, 51013, -33111, -60601, 27472, 398, -59833, 24366, 60084, -20904, 12882, 84016, 1464, -39382, 40557, 877, -83170, -11601, 20853, -64550, -24335, 62884, -3337, -25340, 68050, 33573, -51917, 12952, 31272, -70016, -43497, 33961, -32219, -48511, 55509, 37941, -26933, 47936, 69965, -28028, -13743, 46255, -33166, -69810, 16162, -730, -64261, 12546, 57691, -21923, 1018, 72544, 2300, -44291, 31299, 4295, -79336, -14663, 28864, -51146, -25086, 67464, 10105, -24454, 66393, 44712, -45173, 10692, 40169, -58087, -43501, 36751, -22322, -52420, 45611, 36340, -36069, 28217, 61527, -32981, -26153, 38351, -29144, -68343, 16375, 9430, -55584, 11115, 58028, -15277, -3552, 67387, 7355, -42644, 26650, 13345, -64535]
670f4535N2559M7249p0308J3198Q4189m7244m4610P7387j1005q6668M2669L7745
682C0626q6387O921Q1772m5775l3661Q9876m62p3471N1355L7100q5563k631O5872
695C5572n5730m3211Q0011K510o2431N6290M8099p0366K778O5483n2336n1997
707d5328O0183m491p3807M2529N2228o0386M289P7520l4874m5566O4670k02p8572
720d1807L0863M2539p1414m648P5289l1794l9103P5669Q846o7631L5595M0631
732E3035p3459j1283O2526m1239m4174O4406J0212n7901M0545M7557n7634o939
744a4348N8340l7315m8469N0378M305o1779L2672M9256m8912n243O6589k4376
756B1098m8973N1845Q029o8352K0365M3666n4986j1595O7546j9391m1189N8018
$$ y = [-64535, -11976, 35273, -35035, -21837, 62352, 15108, -29502, 47885, 36880, -49788, -7119, 30626, -55761, -48840, 32932, -12843, -46504, 43372, 42910, -30561, 20794, 57894, -27669, -30300, 35572, -20158, -63369, 16642, 19152, -43279, 13011, 61110, -9256, -6478, 59005, 6669, -45328, 14855, 10364, -63443, -20914, 31314, -29072, -24783, 52737, 17863, -27703, 36967, 36765, -41807, -10944, 31595, -39819, -44467, 30822, -972, -40075, 35594, 44440, -23191, 12404, 53035, -20424, -31707, 30819, -10420, -54594, 9812, 20024, -37877, 2668, 50225, -7409, -14348, 43992, 6677, -41792, 8586, 12891, -48888, -16216, 33040, -15872, -21115, 45474, 21098, -27875, 23970, 31999, -36353, -15988, 27678, -27308, -38903, 28643, 9252, -31937, 26081]
768B6081J5950o3713K1347M0441n8007j7921N5392k4555m1990N5518J7393n1140
780b5204K7348M3478m6772j6114M9391k6605m7058M0568J2869n1800K2794M7368
792C0263l5266j0039N3220j3161m5947L6530J1190n4791P348M0874m0348j4181
804c4308N5519o626l6780M0174K0687n0225O853L6220m1760k4439M4607j0968
816a046m0170M0592K3383m0718J5367M0078l2764k1792L9967j3519m1479K7729
828d372J9469m0106Q717M2162k3602j5478L9954l765l9406K1311J6735m2582p63
841b1726L4307k1826j8254M0706M210l3431K4819K0958l8575l130L0457k3168
853d653k6060L3840L056l0437K3061K8309l0318j40L3232k0748k6488K6983j121
$$ y = [26081, 42031, -21682, -335, 40106, -17901, -35822, 19570, -4985, -46975, 8543, 25936, -25204, 2144, 45622, -1150, -17264, 32127, 5522, -41536, -968, 11901, -39899, -17105, 30263, -5003, -15042, 38178, 25017, -20930, 15600, 26790, -28001, -20653, 20221, -20127, -34308, 21211, 14585, -22195, 17979, 38666, -11559, -4706, 31514, -10246, -34685, 9922, -1046, -41216, -624, 22759, -17959, -2592, 37486, 4722, -17070, 22897, 9378, -32101, -4372, 15097, -25009, -16292, 25870, 2268, -13210, 26744, 22979, -16427, 4884, 21619, -20963, -21726, 12581, -9245, -27499, 13207, 17417, -16014, 8805, 29763, -8812, -11942, 18515, -4653, -30713, 3127, 6183, -24254, -1193, 27116, -3202, -3342, 29890, 9142, -17346, 9637, 8516]
866H516l5693J4599K3223k8326L86L7458j1352k0872K8281L741l4916Q810J8369
879A2224k9225q043L1244q460j7552K8785J2929k5205J0929K2145k5145j3570
891h944K3395j2584k5048K0055J1469k5912R547K8653j6455j1547K7609q587k7370
904a5719J5087P145k8567K219K3467j3401q824K9615J113k1183J6577J4095k6221
917d597k730K0066j7008j4621K2860J490j9929J7240J7475j9414k127K2054j5178
930E581j9172J7412J313k5351J0350J8704j9138j235K6597p392j6573J9119M325
943A4540k5329N999J4514k0066n773K4600n580j4212K0019R645k1220K901J7010
956A7048j9915j1538J7927n068k0558J6174J4085j9468N064K2400j2657j1302
$$ y = [8516, -27177, -12578, 10645, -17681, -17295, 20163, 8811, -12061, 16220, 19961, -14955, -6145, 12224, -17001, -25044, 6200, -2260, -19812, 8973, 21902, -3303, 7626, 29771, 4626, -8944, 14451, 1867, -23181, -3126, 8343, -17569, -8022, 20631, 4176, -7371, 20238, 11651, -15719, -632, 6513, -22054, -19835, 3632, -9769, -18593, 11022, 12135, -9048, 7529, 21624, -4597, -7327, 12739, -4269, -18890, 3970, 5460, -14469, 2771, 20246, 832, -1295, 20759, 5581, -13591, 3821, 5134, -20217, -9867, 8837, -10301, -11536, 15061, 7669, -8904, 10215, 14540, -10789, -4790, 9724, -10342, -16115, 8485, 2905, -11307, 8712, 18357, -2863, 38, 17048, -2867, -14405, 3522, -1546, -22104, -5930, 8155, -11313, -6249, 16151, 3494, -7808]
968g808K0123l205k2696J0138J2235k2162J349K3758q913j2167K4973K037k1225
981c563J0569J2152k4531o053J9584j2425j7067K2422M736k0669J3629J8665k0588
994c139n287K3106j2736j9719J7743M863k4400J0339J9355j6823k387K4386n562
1007I739j7437J7121N283k3234L760J7587j8111r293K3617k652j9344J8440J1274
1020A6750k4398L118K1330j8611j4122K2978k390k2398J6103J4919k2760K628
1032f853K5903j8158j3349K3649k337k5614J5734J4888k6112K060K6625j6518
1044h2j3462K5909j92k6812J4853J3728k6186j571K5459j4164j4802K4908M307
1057A1893k4300J3772J8524k4223n237K5630j4100k0125K3925N613k7478J3560
$$ y = [-7808, 12315, 9110, -13586, -3448, 8787, -13375, -12026, 11732, 2819, -9348, 15625, 17662, -3563, 7006, 19158, -5373, -11426, 8158, -4267, -21334, 1088, 5824, -14845, -1216, 17449, -3139, -8426, 14680, 1944, -17775, -32, 4831, -19569, -9230, 10125, -6698, -9085, 15301, 9739, -7698, 9423, 14706, -8528, -4768, 12819, -5292, -14585, 9032, 6380, -12964, 5476, 16750, -7648, -4530, 16800, -1811, -15933, 7045, 4655, -17743, -1640, 13279, -9481, -6853, 19050, 892, -12457, 11192, 8855, -16759, -1025, 13863, -12249, -10189, 16436, -82, -13544, 12365, 12173, -14639, 214, 13942, -12244, -13815, 11644, -2520, -17322, 7586, 11893, -12407, 1365, 19889, -4334, -9571, 16059, 1959, -18166, 5759, 11372, -16106, -2546]
1069b546K2491k4923l721K7980j2888k3200K4035M328l0124J1161K2284k6531
1081a1654m403L0413j1437j9705K5340O490l0148J1432K1329k5235p670K8791
1093A3543r646k1602K2240J1229k8384R335K3079k3036j0568K9107q960k5094
1105a8757K2309J0733k9671Q195K4967k2800j1254L1848r059k6591K4273J0941
1117A5134k9977P212K6210k3384j2019L1451o754k6324K4365J0081l0772P264
1129g513K5455k2914j1696L0102m731k6074K2327J1682k7976M196K5875k2450
1141c717j4586K9350k719k8033K1148J5977k9439M634K7339j9349j5531K8805
1153A3879l490k9912K0464J5637l1432L320K9326k1321j4680L1660k527k9120
$$ y = [-2546, 19945, -4978, -8699, 19281, 6393, -16807, 7228, 11556, -18568, -7407, 14877, -11654, -16057, 14356, 2919, -16786, 8554, 15044, -15104, -3672, 17657, -7578, -15248, 13543, 3897, -17705, 4535, 15764, -12620, -3285, 19794, -3242, -13810, 15297, 6337, -18757, 3552, 14285, -15386, -7191, 17776, -5024, -16278, 15570, 6511, -20080, 4193, 15134, -14843, -7631, 18579, -4805, -16824, 14627, 7873, -18451, 5914, 15995, -14777, -7513, 17942, -4972, -16668, 13434, 8703, -17371, 4956, 16638, -11338, -7142, 18733, -3717, -18303, 11047, 8328, -19705, 1443, 17420, -12019, -7385, 19954, 605, -14926, 13879, 10389, -19523, 941, 16578, -14854, -11534, 17792, -3529, -18209, 13451, 10924, -18196]
1165a8196K1291J5793l3270L622K7687j9468j6668K9811q09k7690J8820J8630
1177A9553k9407K437K7606j9450j8228K9160n66k9521J8559J7261k8693j338K9636
1190A7009j6951j8180K9090j09k9580J6761J8814k8929K8K8235j7163j9141K9288
1203I172K126l1149J8315J9448k8884j448L1152j4731k1534K8818K593l0726J6176
1216f72J8803k7042k937K9127j5719j9881K7354L507k8900J4611K0194k5887m845
1229a2287K8274j2960k1148K5911M127k8407J3803J8900k4699m456K9253j2050
1241D261k0912K3620N531k8209J1252K1026k4764n938K7672j0621k1454K4703
1253F167P823k9132J1925K0417k4607n078K7339j0078k1193K4096N817k6991R954
$$ y = [-18196, 3095, 18888, -14382, -10760, 16927, -2541, -19209, 10602, 9793, -17897, 923, 19553, -9854, -7417, 20189, 739, -17489, 11671, 11105, -18416, 143, 17404, -11289, -12627, 17009, 58, -18122, 10968, 10859, -18721, -1960, 16854, -12075, -12047, 16188, -975, -20116, 9172, 11298, -19851, -1536, 17912, -10972, -12420, 18732, 4001, -17533, 11285, 13878, -16848, -672, 18131, -8911, -11848, 17279, 1560, -18321, 9033, 12540, -16360, -1749, 18445, -7442, -12287, 15987, 3027, -18121, 7790, 11917, -16490, -2687, 16213, -8486, -12942, 16311, 4261, -16651, 6969, 12500, -15709, -4457, 16569, -8195, -14133, 13539, 2918, -18536, 6167, 13990, -15142, -3217, 17200, -7407, -12485, 14854, 4776, -16417, 7679, 13496, -13495, -3541]
1266c541K1937k2881p018K5251q011k0883K2467O971k5910Q437K0915k2741q593
1279a3600K5747q959k0551J9537R212k5797O331K2914j9108r351K5917o713k2302
1292a6723J9731Q021k6135O295K1707j8595q018K6300n664j9228K0476Q581k4138
1305g390M903J9650j8764j1279K2447n324k1278J8587J0963k1183N303J9118j5435
1318C18j2566K2264m203k1200J2562J2525k2509L423K1396j4093r972K2263k587
1331G621k0317J5343J0492k3372J661K1206j6253j0720K2024j50j9704J5073J0843
1344A3747k0413L53J9044j5060j1029K0156j628j7777J2316J3195j8521P68J7475
1357A2626j0415j2613J7389j079j8812J2075J1018j7136J05J8677r335j1946J7528
$$ y = [-3541, 18396, -4485, -11503, 13748, 5737, -15146, 7321, 14292, -11618, -3181, 17734, -5007, -13600, 12147, 3188, -17363, 2174, 11386, -14411, -8080, 14834, -4274, -13625, 12292, 5579, -16723, 3008, 11029, -15106, -8811, 12896, -5699, -13717, 12583, 6919, -12309, 8167, 16748, -7390, -2487, 17163, -1601, -12880, 9567, 4243, -17035, 1552, 12515, -8668, -3365, 15753, 318, -12248, 10016, 5813, -15387, -2825, 9700, -12809, -9386, 12010, -2083, -12055, 10208, 7621, -12696, 2647, 13139, -10233, -8572, 12634, -3619, -14339, 7685, 7535, -12169, 2904, 13747, -6666, -6313, 12731, -2329, -13358, 6798, 5170, -12607, -291, 12904, -5617, -4849, 12626, 2211, -10402, 6987, 5908, -12904, -829, 10189, -6947, -6842, 11835, 2500, -9446, 8082]
1370H082R85k0014R338J0912j8952j779J9401r720j1062J7657M153j7653Q962
1383C10J2404j6535l924J6103r047j3733J7560K623j5278Q869J3443j3920j699
1396b824J6158o261j4558J2694J670j6653N030J1697j1850m131J6975m268j2014
1409h335J2142O038j5720K717J0844j4281n255J4285k773j1676J2976O961j3301
1422e378M175J2796j1444o701J2974k152j3964J0420N346j3187L761J2417q696
1435C67n980J4737k476j4078Q349M852j4644L722J0251p945n379J3760m82j0986
1449e932Q396P061j2848r81J1470q973q270J2918J809j1688P953Q934j1924l79
1463b454J1310p657q963Q928K103j4199O299J0042j0207N99J1898l886p443R474
$$ y = [8082, 9067, -10947, -1609, 9303, -9649, -11428, 7973, -1747, -12809, 4848, 9001, -8652, 310, 12714, -3821, -7745, 8358, -689, -14422, 3138, 5761, -9517, -648, 12795, -1125, -2824, 13334, 7073, -7485, 5209, 6879, -9774, -4744, 6953, -4897, -9028, 7947, 3679, -8335, 3807, 9845, -5875, -3158, 7686, -6595, -11850, 2435, -338, -12014, 962, 7923, -5378, -1203, 11593, 149, -6552, 6422, 4270, -9694, 726, 6072, -7115, -3354, 9063, 367, -5613, 9124, 6648, -7430, 919, 5771, -8873, -5151, 5100, -2845, -8224, 5536, 5054, -5932, 2464, 9525, -3323, -4304, 7166, -1807, -10077, 2841, 4650, -7038, 915, 9849, -2075, -2454, 8856, 1199, -7764, 1164, 3267, -10932, -4633, 5409, -4798, -4199, 7699, 3813, -3630, 5844]
1477E844R09j3089M623N856r039k512J1849k163p124R751L370r391L296Q801j1505
1492e24o050R549l245r427Q370M190r077M099J0412p397n164J0165k963r012L383
1507b691M996j0009P22J2184p070n471J3628j051q844P666L645j1266K82Q541
1521E262o348o242R590K065r681O372P472r908q40R683q907n818P609J940j0454
1536h205N961P631q409n48J1059m063q696Q685N57j0506L450P144q932j400J1348
1551E076k560n641P773L702j0689M95Q182r831m328R795k622q822R746N487q062
1566b299K508Q764q158m472P527m208q602O378M430q474K486J0551n427m653J0442
1581F793O56j0062N154L517j0558j767P759m455n960J1258K360r189O598P765
$$ y = [5844, 6753, -6336, -1713, 4143, -4896, -7408, 4441, 2278, -4846, 4905, 8275, -1116, 2180, 10981, -524, -6574, 2975, -270, -9697, -1327, 2863, -6214, -2115, 8297, 900, -4264, 5901, 2938, -6074, -2691, 2305, -7704, -6982, 5202, -1868, -7339, 6289, 5238, -3606, 4060, 7705, -3561, -3279, 5262, -1086, -7328, 2262, 4327, -5354, 1018, 8490, -1418, -2258, 7425, -1482, -7300, 309, 2249, -8205, -2244, 5387, -3022, -3570, 7489, 3426, -5270, 3415, 3972, -6534, -3084, 4060, -4872, -6272, 5076, 2516, -3125, 4648, 8350, -2339, -1844, 6338, -3493, -7821, 1974, -648, -9470, 276, 5763, -2299, 209, 8973, 815, -3657, 3870, -338, -8940, -2562, 1868, -6606, -4120, 6431, 1004, -3649, 6793, 7449, -2613, 2541, 6058, -4500, -6267, 1492, -2963, -8923, 2335, 4695, -4494, 2104, 9869]
1595I869j0808j458R223q122q056R733P50j0736Q424Q204r132n24J2513o502p794
1610d416Q310j174j0490M526R163j1130j7J1273m180n211Q487J757j2102M724
1624d80N446j0086m143J2336l422r054J1385M757j0955M972Q191j0639l158R231
1638D381l801j0761R492M836j0703M995J1590r211k424J0402n294r402P480K691
1652D271j3318L798R372p536k264J1644j235q602Q019M130j2539K68Q733r344
1666d603m550J1079q28r631J0612O950r797R80J0375r004p523J0491k687j2957
1680a1093Q423O389q418J116J1844o481m589J0411k449j0552N529M954j2606J906
1694e616R623p741l626J2920K02j0012O864O431j2156R7P851p445n575J0001M73
$$ y = [9869, -939, -2397, 6826, -1296, -9352, 381, 1131, -9605, -1181, 7023, -2109, -2633, 9880, 3378, -4416, 3894, 2720, -7770, -3244, 5919, -5211, -5228, 6045, 1865, -3346, 5141, 6898, -5204, -480, 4966, -5120, -9263, 3073, -349, -9403, 1982, 6739, -4216, 756, 8947, -1692, -4850, 4381, 580, -10181, -689, 4147, -6556, -1561, 10029, 818, -1606, 8796, 3502, -5900, 1580, 4271, -9047, -5249, 4123, -3413, -5677, 5967, 4732, -3870, 4149, 8279, -4260, -3992, 4741, -4603, -9153, 1926, 1098, -8533, 2079, 9029, -768, 212, 10587, 1583, -5940, 4551, 1864, -11093, -2670, 3719, -4699, -3583, 8261, 1780, -2809, 7602, 5153, -5399, 130, 5084, -7522, -5616, 4007, -3734, -7360, 5560, 5762, -4250, 2614, 9045, -3111, -3014, 4837, -2608, -8183, 1818, 2291]
1709B291q853P909P113j0331q90J1120p109q955Q228J765j2289O930P694r497
1723d874L42J2200m569p757J0114r81j1854O490N322j1240N22J1799m265p024
1737e775J2369K034j2479O764O199j1821l821J0852n994p290R910M051j1380O396
1751A5R654j0665j565R773o163r448P972K835j1956M546J0209q306j117J1833
1765G617l339r124R253K000j2232J883Q281r650k049J1982l221p234R439M833
1779H439j1687L304Q798j0758l976R896m804r247J0569M299j1323N629R487q306
1793C20l442J0451m425j0520Q021L225j0315K382R885o131m305J1294j735r937
1807e232P672K064j0110J318P808o991l871J1231r42r107Q656M562r964J573P607
$$ y = [2291, -6562, 1347, 8460, -1871, -2761, 8359, 1250, -7705, 523, 2288, -10001, -3071, 4623, -4874, -4532, 7668, 3099, -4658, 5456, 4475, -7379, -889, 4433, -6807, -6285, 5514, 1249, -5775, 6594, 8628, -3851, 2913, 9112, -2709, -6530, 4322, -1672, -8962, 948, 4999, -6381, 15, 9669, -996, -2561, 7212, 1049, -8399, -427, 2408, -9548, -5002, 5207, -3099, -4216, 7617, 4278, -4846, 4407, 6407, -5825, -3942, 4339, -5311, -7360, 4622, 1401, -5833, 3606, 8439, -3248, 56, 8854, -1904, -5880, 4016, -788, -10035, 534, 4833, -6490, -861, 8626, 320, -3122, 7329, 2904, -7616, 405, 3630, -6685, -4303, 5582, -549, -4854, 6440, 4705, -5232, 2440, 4504, -5606, -4288, 3520, -3471, -7342, 3889, 2947, -6160, 2496, 7058, -2906, -1333, 6274]
1822F274q401m159Q995k078q023P995O001r371K480Q635o747n175Q557k251r711
1837f979O054M811q993K099Q763o249l762J0601k424r404O511L535r910j686R712
1852B679n978l734J0049J913r419P632M784q579n42O669o582n468P255J22q084
1867g283P014N668p316P45R080m802p754Q088r33r130M532N229q997J763Q420
1882D324k798m235P177J077r006L673L570p549j408P109k947n040P971J259p160
1897c983N106N623p971k222P354m778n979O145J276n572N233N540p503k93Q499
1912F475m829n408N987o6q589K685P173n561r04R837l859o078P717J531r004K79
1928b614O395p726j171O271j226n003O573M333p252J342N389o091k519M435k917
$$ y = [6274, -2127, -6286, 2709, 631, -7392, 603, 6604, -2767, -287, 8348, 1601, -3574, 4983, 2732, -6979, -925, 3886, -5107, -3008, 5755, -494, -4256, 6345, 3921, -5483, 1028, 4563, -5347, -7033, 2679, -3299, -7033, 3016, 4929, -4490, 3142, 7926, -653, -1195, 5474, -1108, -6576, 679, 801, -7283, -269, 5399, -1917, -1172, 7908, 3106, -4648, 3440, 2507, -6623, -2091, 3138, -5859, -4096, 4324, 1526, -2709, 4468, 5545, -3461, 212, 3782, -3767, -5175, 1934, -1013, -6053, 1918, 3177, -3983, 1123, 6746, -1225, -3447, 3907, -871, -6850, -705, 571, -5001, 232, 5772, -1731, -2024, 6475, 1646, -3762, 2225, 2159, -6430, -3745, 3428, -2133, -3037, 6800, 2941, -3137, 4580, 6111, -2893, -2614, 3781, -3945, -5116, 1155, -71, -5074, 1499, 5832, -1420, -78, 5311, -780, -3299, 1136, -1781]
1943a781n615N988M510p835L540Q015n591j730N690j559o258M075J732q186J375
1958c630N708l980p34O710M86p760O465J628o272q11N095n809l359N496M82l516
1974c801M195M622o032P24N847n438l561M506o48m969L512K774m930Q67O055k650
1990A073k714M419o02n098J532K983n420J15M140j13k469N247P79o333K810L829
2006D178n294j3L782l579l495N181J700o017L727M836m120k568N141k841n221
2021d603M083J041l930R56N172l631k04M800j155l588L522L44m384j36L534l037
2037a216k229M508J26l816N280J685m605j41L530l412m217N338j365l377L399
2052e12K022k290L81M447k984j825L436K83n540K689J391m537Q3N305j875k512
$$ y = [-1781, -7396, -1408, 3102, -4733, -1193, 6822, 1231, -499, 5191, 3632, -2626, 1449, 3181, -5005, -3630, 2078, -1902, -2636, 4074, 4560, -3200, 3265, 4893, -1379, -2190, 2905, -2904, -6263, -767, -285, -3801, 394, 5016, -1016, -292, 5555, 117, -3444, 1062, 414, -4555, -1043, 1731, -3199, -2332, 3723, 1073, -1641, 2778, 2176, -2922, -1390, 1593, -3827, -3712, 428, 315, -2154, 3093, 3872, -2461, 349, 4178, -1116, -1129, 2653, -926, -4421, 760, 2460, -3557, 170, 5006, 886, -1682, 3459, 618, -4603, -520, 521, -3409, -2453, 2719, -912, -1116, 3684, 2529, -1059, 2463, 2807, -1577, -1713, 1821, -1216, -3445, 1063, 1189, -2627, 2653, 4338, -267, -408, 3122, -290, -4507, 831, -534, -3911, -512, 1510, -780, -399, 4048, 1064, -761, 2675, 2958, -2582, 107, 1498, -3039, -2956, 2349, 474, -2038]
2068b038M664K97m601L325J797m963j283M622k676j590K737J859m240J771L018
2083B699k845l29K762j693l414L639P57m458J813L647k763m84K685j174l559L956
2099A239j03l973N59L406k050j832M656j438k076L079J287m563L16L557k779k113
2115b828L984m71l298L426J953l209R22L531l502j970L106o02l934K536J397l657
2131b616J518L901k023k742L026j19k442K356L40l960K26K810j607j415L350J094
2147A697k572J047K293j865j880L149j326k445J725K443l906L72N250l612j103
2162g33M410k796j861J719R14l556J349K057k912j693M837%n173M765R42l596
2178a327J011K488l783k77L873j504l321M136M29l963J766J870j394k810L988
$$ y = [-2038, 2626, 2923, -1678, 1647, 3444, -1519, -2802, 1820, -856, -2446, 291, 2150, -2090, -319, 2699, -146, -475, 2287, 594, -2820, 819, 1576, -2882, -1069, 2578, -185, -669, 2016, 842, -2717, 1239, 1136, -2837, -2278, 1128, -922, -2754, 1902, 464, -1612, 1467, 2754, -1809, -1493, 2064, -715, -2828, 1156, 685, -2613, 813, 2766, -443, 479, 4010, 508, -1462, 1644, 1042, -2892, -356, 1041, -2616, -1098, 2803, 780, -1962, 1064, 945, -1497, 859, 1199, -2761, -2535, 275, -1332, -2747, 603, 1697, -875, 172, 2465, 600, -1280, 1869, 543, -1902, -177, 2266, -1640, -1268, 3982, 370, -733, 3677, 881, -980, 739, 1653, -1903, -554, 1503, -1409, -3102, 1735, 1735, -3438, 1327, 2269, -1327, -316, 2172, -1611, -1888, 1985, 481, -2840, 1296, 1725, -2238, -472, 1398, 4, -2806, 1182]
2193A182r99l569L339J622k981J02L573k158j243L339k70m196K264K415m186L60
2209a406M068k416q48L925q93m777L913Q27m183R33K935l308j512L955r64l513
2225c264L392K240l211j076M157k949j410L355p84m018L398K011k878j486N717
2240C194k540k330L645O11l896J105K955m184j26M321k809k729M760N88m314J661
2256h8L104m338P3L142k343l162M716O37m377J837L074l503j62L795j544m039
2272c178N231o29l637J008L800m446K82L533k535k219L423J906m948J527L324
2287B442l195j095M631j549l693L726J336m430J749L467l780j522M760j846l764
2302b763M594K06l502J184K143l089j356L649n90l361L169J489n463K474L207
$$ y = [1182, 183, -3386, -47, 1575, -1406, -1304, 2269, 111, -1132, 2207, 1937, -2259, 5, 2420, -1766, -1406, 2662, 246, -602, 3323, 2430, -2347, 1566, 2393, -1790, -857, 2078, -1230, -2742, 1213, 249, -3264, 128, 2368, -843, -1919, 2238, -711, -2121, 1234, 450, -3568, -170, 1841, -1037, -2523, 3194, 654, -1676, 1969, 2580, -1316, -211, 2744, -1440, -1566, 2755, -54, -2783, 1977, 2565, -1749, -88, 3016, -1322, -1249, 1893, -450, -3612, 1104, 1741, -2636, -799, 2275, -1228, -1390, 2405, 861, -3178, 2053, 1424, -2213, -1205, 2595, -1851, -1569, 1964, -571, -2790, 633, 2539, -2409, -882, 2442, -753, -1848, 2783, 1234, -2459, 1267, 2603, -1827, -78, 3389, -391, -1913, 2847, 1001, -2763, 1831, 2037, -1465, -281, 1862, -1227, -2583, 1066, 476, -2885, 284, 1773, -3690, -1216, 1991]
2317A991k085j905L308J56m547L775J524n041K649L229l394k439M609j131l545
2332b846K187K701l363R76L365l805k99L172L78m323J397K854m687J034L193k765
2348h31j642M209j015j491J433J570l173m20L686l370l68J591J94l469K576K204
2364A684j614p65L909k706j836K948k28m267J988K553l143j9L796k262k873N058
2380B223p76l139K781J119l149j408K424r38j982L908P71l301J501K878l214n07
2396h09K816j458k632K463M7k706J189K891k271k18M413k228k497J406J77k910
2412b327J710J849j686j364N075k387l500M423M77l998Q72L118l999L71K529j783
2428f20j339K833J391m110J513L061l685j018L093j760r34J925M24j147J336P76
$$ y = [1991, -94, -1999, 1309, 1465, -3082, 693, 2217, -2824, -175, 3054, -340, -2779, 1830, 699, -2846, -659, 2042, -1321, -345, 3020, -785, -1084, 2088, 2466, -1857, -460, 2394, -2293, -1259, 1934, -831, -2473, 1736, 721, -770, 663, 2233, -940, -1360, 2326, -1044, -1412, 179, 373, -3096, -520, 1684, 70, -695, 3214, 508, -1328, 1620, 1392, -2875, -887, 1666, -1477, -1496, 2300, 38, -2835, 2223, 1447, -1692, 1089, 2208, -941, -2349, 75, -863, -2845, 1063, 1834, -1467, 34, 2912, -302, -809, 2007, 549, -2083, 380, 427, -2279, -1090, 1801, -470, -688, 3725, 1497, -1000, 406, 583, -2327, -617, 1232, -454, -1818, 3257, 870, -2630, 1793, 2270, -1728, -856, 2262, -1737, -1366, 1163, -620, -1959, 874, 2265, -1845, -332, 2729, -956, -1974, 1119, -641, -1575, 350, 774, -373, 963, 1739]
2444A739k624O19K007p13k763K122M89l195O37J872k034n24M817j098k391J503
2460D63J705k755M51K149l617l2K377o13k381L291Q11k248o4K804k281j562K251
2477G49j479j844K363Q04k877J764J159o76m23J585M34l242J473K216l254l23
2493a571K875j221q24K235J95j586K75J327k788RK445k825K48J250j18j786K440
2510E80K154l742J435J060j155j063J124j835j029K137J003r85m40K746j399j269
2526f78J786o10j672P24J263k050r7K535j567j033L033q07m37J98L74j665j219
2543a922K387j922j515J940J903j656J647J552j358p06J915j285k798Q51J85k747
2559c529K803J015j652J560J761r69n67k23J320k480j76K015l182Q49K052k05
$$ y = [1739, -885, -266, 1741, 1028, -1735, 387, 876, -2319, -1682, 190, -1844, -2368, 2449, 1351, -1040, 463, 2168, -587, -136, 2013, -1604, -1636, 741, 128, -2253, 1038, 1849, -399, -463, 2341, 60, -1502, 749, -730, -2574, -211, 593, -2284, -520, 639, -37, -460, 1125, 1559, -1683, -210, 2006, -1248, -1571, 1304, 83, -741, 1494, 1689, 103, 378, 1705, -1083, -1074, 1371, -1454, -1206, 44, -74, -1860, 580, 2734, -1008, 427, 1487, 332, -731, 393, -1442, -2471, -334, 669, -316, -756, 1990, 591, -678, 1108, 498, -1174, -450, 813, -1237, -1334, 1201, -366, -1399, 1634, 827, 390, 588, 962, -703, -1922, 465, -1457, -2972, -1032, 871, -785, 862, 2414, 1056, 350, 2265, 980, -1818, -967, -782, -3529, -726, 289, -1363, 197, 1958, 989, 422, 199, 1519, -961, -1137, 878, -2304, -1455, 597, 392]
2575C92r79K456M43j957J010P4j820m07K209k405r47K141R48j853J121J267l06
2592A387j325M48n49j418N61J654k846Q00L172j647l75K174o4k254J209l23k700
2609b096Q35O66m34j146J994J591q82K81J352k355R9J363k456q61j28Q13K6R68
2627c70J050L70j98J348k61k287J249R1k522K16J194p08m93K713o99n15J406l85
2645A199l52p65J504k101q59J44m56m61K232P43J84K56O10J9j364M55o03k225
2663a840Q13k98o23P44J030J547J02M65k84j263j110R99k068n02J180o49L52K484
2681A079R03j125J221p18j033r98O54p67l13j42J190j227L79K117n4k12J220j098
2699A076j854%N06j636o64J677R9O12K093m24k20J382j258k207M04J080k554O80
$$ y = [392, -587, 1869, 2312, 355, 1365, 1439, -381, -788, 1421, -984, -1931, 210, 1158, -695, 426, 1693, 1387, 62, 510, -39, -1457, -896, 758, -2088, -1288, 1884, 237, -138, 2036, 1972, -282, 927, 604, -2096, -1261, -595, -1029, -2175, -181, 1410, 528, 809, 2161, -194, -95, 1268, -1188, -2049, -2177, -1364, -1338, -370, 680, 1050, 852, 2200, 1939, -348, 901, 992, -1530, -1314, -120, -828, -1321, 1392, 693, 178, 1584, 1199, 847, 82, 1586, -515, -1374, -1230, -1686, -2147, 85, 828, 1012, 1268, 1878, 1897, 533, 988, 385, -1840, -1027, -1325, -1948, -1204, -174, 1373, 1475, 1940, 1656, 393, -717, 282, -1786, -2288, -1108, -1757, -1405, 1079, 1982, 857, 2078, 1360, 327, -671, -17, -784, -1097, -1239, -49, -1276, -897, 1220, 1166, 954, 2174, 1076, -778, -778, -272, -1908, -2572, -895, -796, -184, 1909, 1485, 1265, 2647, 1389, -818, -414, 666, -1888, -1208]
2717a208J003N90q12J826J46o19J638o24j507j737K04k33j022J246q9J106N42
2734D50mJ13N58N09n26k293O39l55j915J668Q9M49K29J173J084o88N13J483l280
2753a04N02K33j991j288K003j12Q9P57J377K13k74L6p32k010K91J93k455O52L122
2772E02j219J50J906M30o99M1l86p61o46O47j754j076K271O35L9J029O23q91J74
2791A015O02j256k393J643j879j33K559L11n26L53K039k62n68Q5j521j466P04
2808f93O64k753R27K324q06J069R72R49j735N21K44k760N0K15j180n12J802K192
2826A490j025J649P51j141p80K58k442j40r2n69r97K557J263n01K3J886j404j41
2844F45Q37j806j304K7Qr81J453J472o50J153J299k87j629J420j062k090L55J336
$$ y = [-1208, -205, 385, -427, 1399, 1545, 926, 2564, 1940, 433, -1304, -1100, -1333, -2355, -1109, -1198, -92, 450, 446, 559, 1117, 1626, 1100, -1193, -554, -909, -2824, -1156, -1067, -618, -389, 784, 1868, 1180, 1693, 3176, -104, 398, 631, -1360, -2648, -645, -757, -668, 89, 1466, 1679, 1405, 1441, 709, -1301, -1010, -817, -3272, -2620, 502, -717, -567, 1339, 1769, 1070, 1111, 725, -36, -682, -35, -1789, -2865, -594, 41, 80, 1109, 1732, 841, 1015, 1617, 361, -2032, -389, -2268, -2401, 158, 469, -57, 296, 2335, 2073, 1505, 1590, 69, -1397, -693, -29, -2782, -1855, 469, -337, 732, 1704, 2653, 918, 1439, 1683, -1077, -1027, -812, -1992, -2504, -702, 1490, 465, 2114, 2865, 1724, 944, 1202, -1240, -1380, -1472, -2041, -3038, -481, 782, 281, 304, 2190, 786, 645, 1482, -324, -1628, -1601, -1593, -2574, -1121, 351, -299, 854, 2153, 1866, 237, 1657, 595, -1495, -1140, 196]
2862A96j429n36K273m3m3J408O72j682M5O24k148p49Q4m91j675K648J978j742
2880f10K509o50k73K40L04j414k643Q43N9k95M71K916k40n49J453o06p84o16l77
2899b62j643p23J364N82j524L287L92m53Q12K73j568K94j053j263m12Q51K00q77
2917a723J798N94K36R31J662j738j763M58j945J84j007L19m71J660J298O78K17
2934A388R88J14k651Q62j072l110J145R36N69m49J231Q25j16K576j330n07j769
2951c70o83Q6q37J254N58r16J358M43K08J03R06l69j121p26k55j738L98P09o9
2970a061J49K126l16P41Q0l8j247o23M47k286j41J709m56O4K033j35J073k35K13
2989B097j303r15K10p69k291P20J387q4O32J412N34j44J322j985j488Q72j641
$$ y = [196, -1233, -1769, 504, 461, 418, 1826, 2498, 816, 861, 1485, -663, -1412, -1328, -1819, -3494, -846, 1132, -610, 1899, 1249, 976, 1216, 1520, 106, -2537, -1694, -1635, -1930, -1459, 1457, 1217, 668, 2121, 1515, 731, 115, -262, -1905, -2628, -1264, -682, -2206, 1081, 1473, 1020, 1832, 2105, 537, 831, -222, -1485, -1897, -1046, -846, -1723, 75, 669, 905, 1836, 3498, 1760, -3, 455, -1490, -1306, -2313, -1994, -2465, -805, 493, 1171, 1388, 2376, 2490, -161, 701, -371, -3481, -2336, -1400, -831, -1280, -49, 776, 660, 3236, 1906, 1399, -370, -1053, -967, -1804, -550, 8, -908, 450, 893, 1101, 1204, 2110, 1741, 620, -106, -361, -2099, -1701, -992, -1061, -912, 1214, 898, 1639, 1719, 1681, 434, -189, 258, -2028, -2169, -460, -916, -852, 1181, 1046, 2119, 1884, 2097, 794, -121, 89, -680, -2971, -2251, -864, -948, -316, 1096, 1630, 1486, 2808, 823, -665, 207, -1434]
3006a434o79K11N99M97k73K145P04J04O04q85j542j431k59L5k15Q39L11PJ204
3025E42J115O05j64l52m26k911J012j36k001J230O84l1J189K194j379R03P6j901
3043B49j254j304R98p56l05J612P72R6R23Q3JK26j53k004K5j09j352J550k57R24
3063c5J02K208j34p82K34J53k014k86q40P37j563J017L27J409L28J339l68p92
3081A040N74j906j137J34j87J57M25K37Q90L25J467K09n53j268j54p11j420M81
3099a397J61q43J414L72O94J961n12K34n50l48j412o61K68n90N8l23J991Q08o18
3118G07K44J082k62j114K80j331j329N73k30N3O54O76J790M15L93k343O18m43
3136D33j200j052N61n06R68Q9R88k17J234J099j328l80J70j763j18q77N28L87
$$ y = [-1434, -2113, -1902, -1303, -806, -1079, 1066, 1770, 1874, 2478, 1593, 51, -1380, -1639, -1604, -1819, -980, -669, -662, 542, 1657, 2262, 2098, 1746, 1320, -1591, -579, -715, -2716, -1486, -802, -833, 356, 2550, 1171, 2074, 2150, 249, -1005, -2309, -1311, -2067, -2372, -760, 12, 108, 1031, 1114, 1115, 1341, 1188, -816, -791, -900, -2252, -702, -959, -35, 67, 2275, 2141, 1359, 1593, 1746, -268, -554, -1394, -657, -2220, -1203, -876, 533, 861, 2200, 1832, 1040, 1614, -292, -1429, -1295, -1482, -1325, -900, -663, 227, 552, 2019, 2228, 1675, 407, 253, -458, -1878, -1397, -1236, -2079, -665, -293, 401, 2362, 1850, 2084, 1534, 1186, -226, -887, -619, -1209, -1151, -1474, 517, 1325, 707, 951, 2033, 1771, 657, 937, -394, -1723, -1150, -1380, -1327, -673, 3, 1793, 2208, 2601, 258, 876, 433, -767, -1819, -1258, -1764, -796, -707, 281, 64, 1298, 2397, 1069, 689, 859, -904, -1022, -1899, -1371, -984]
3154i84K36K21J431l17J110j038L39p84o93m18p71j35K16N81J189K502j851N47
3172A381M71L27k339R3q5l33j745Q73Q83l03J240P40J065K15p98n04n27j758m7
3191a151R7P2j88N08J218Q68q61J122l27R3j546Q9l38j517O20O61j381J597J609
3210A245J89R33j080q45l43k74o09j714O0K090j544K125P96R73r67O48L10r57
3228A036j462K66o06q41K56Q59R37j327K586r02J010k88j481j078P96j350k99
3245a888J090q36O80R15K341j828rR66p43l03j290M19j188J571l16n35J089J312
3263A447m07N55K75j165j009p65l35j03q21K068r41J151m68L011j43j288K35j472
3281a75R8j618L92n65R68L08P02J341L64J77n79r99K21L07k372L80p34j005J895
$$ y = [-984, -748, -527, 904, 587, 1697, 659, 998, 214, -479, -897, -1668, -1803, -1587, -1006, 183, 2685, 834, 1381, 1852, 2179, -160, -67, -152, -485, -2230, -1357, -474, -777, 463, 1203, 2268, 2483, 1685, 1181, 654, -1104, -1151, -1054, -982, -1170, -662, 556, 1424, 563, 1685, 1358, 1451, -95, -6, -344, -1861, -1241, -580, -1961, -364, 1245, 1434, 2367, 1287, 442, 99, -175, -784, -2498, -2438, -348, -1892, 233, 1029, 2002, 1035, 1683, 1993, 1036, -426, -160, -766, -1607, -1351, -492, 445, -882, 1704, 802, 1812, 1524, 43, -1035, -239, -1589, -1888, -798, -1634, -954, -39, 2302, 474, 465, 1431, 688, 385, -905, -486, -1674, -103, -419, -954, 135, 1447, 1040, 1595, 1870, 705, -304, -1069, -1404, -1507, -2328, -260, -1201, -50, -518, 2493, 2350, 1062, 1297, -175, -77, -1695, -1303, -1868, -900, -592, 110, 1451, 1815, 1992, 1413, 414, 635, 942, -1430, -1050, -1784, -2789, -894]
3300h94M63Q12J234O39j120J348j520j449M53o6j755K9O13J224p53K089M50k07
3318A590N70j614q78K00o36m34L71j222J798K02N85N24O42l23M09j393k056M47
3336a218r6q74P51J998M00M36N18j123R14j380r60K86j628L53L01M00P81O01Q07
3355A267n93J103K43r04j442K90o90o25K03o48J129J383n4j093J461J033m39j039
3373E85J37j578m44k61O22q2k09J976Q65k77l56R12j673k67J36j778J280l08M73
3392b47j090J899n69Q80R59J89j116q81J93j738J25J147j711Q32J925l47L93N50
3410A393j75m8j657m7K3j932J351JQ02K45l67Q26J865j79j152j06k22j384o47
3429a410l39J385K99LP24L3q2Q77n16N1j436N27j509l26R15o56K9K283O16M45
$$ y = [-894, -431, 381, 1615, 2254, 1134, 2482, 962, -487, -34, -100, -1855, -1826, -1213, 11, -742, 1347, 1797, 1590, 2160, 546, -332, -132, -768, -1202, -831, -2053, -255, -53, 532, 1056, 1698, 1375, 1784, 391, -1665, -1218, -1314, -2188, -1437, 561, 961, 1397, 1915, 792, 1706, 326, -634, -348, -1976, -1623, -1322, -922, -141, 460, 1267, 674, 1777, 2020, 1116, -326, -36, -726, -1351, -1148, -1796, -667, 716, 662, -431, 1030, 2063, 1624, 585, 722, -856, -1300, -1561, -939, -1021, -1230, 746, 1611, 1334, 978, 1890, 217, -50, 86, -1692, -412, -720, -247, -1337, 562, -7, 873, 1832, 2021, 905, 24, 217, -1521, -1396, -249, -1960, -1128, 797, 450, 843, 1393, 1218, 1170, -487, -534, -511, -2443, -1092, -1091, -289, -44, -411, 415, 2280, 2101, 949, 843, 621, -763, -1410, -1749, -364, -65, -62, 662, 695, 613, 1490, 974, 1025, -411, 116, -1393, -1719, -804, -1460, -1431, 852, 1468, 1913]
3449A913R1o23Rm41p45j545J121j396J087q91J341K42J191J038o54r25k89k43
3467B81q90n49j94R94M65j109K028O44n84J14m72J97n90r85j501J244q20J261
3485d66L02J013N12k33P62j439p12J386k228r86J296j16K17J043p6P66l5O11j05
3504A512p13p31j310Q3j1J86k69O73J115K69J72N57m48Q0j532k1o57K56n23m6
3524a358R80Q41M10M59k56p86L0l69n21j006J0J191n65L40J095J16Q1J022q87
3543H27J85n09j240m23m10N99l48J336j96J165k01J18P0o1j198k83M83q25j599
3562b510K095N13l91O89J322j321Q01j84j58o79K94j757k63P85J9M06J493J38
3580A292q69Q5j27k51l93N8pj85r90R5J644J30N14J352k079N52L8m77o06k94o24
$$ y = [1913, 2004, 1381, 1390, 949, 204, -1341, -220, -1616, -529, -1420, -79, 163, 1354, 2392, 1738, 813, 524, 281, -609, -1158, -1352, -358, 107, -1002, 1026, 1670, 1086, 1200, 728, 925, 335, -650, -2151, -907, -1727, -466, -164, 849, 1361, 1128, 1890, 451, -261, 1125, -1103, -2089, -793, -909, -692, 351, 275, 1041, 1006, 1617, 1512, 799, 68, -1242, -1159, -1170, -984, -1253, -580, 535, 804, 976, 1533, 1085, 1165, -367, -388, -1045, -789, -1312, -1358, -378, 463, 873, 1332, 1076, 290, 320, -49, -570, -1576, -1566, -375, -940, -600, 495, 611, 692, 1714, 827, 1012, 503, -737, -1160, -1570, -971, -1319, 17, -179, 986, 785, 903, 973, 912, -286, -569, -86, -911, -2510, -415, 98, -293, 396, 1718, 397, 1198, 1014, 856, 177, 471, -1286, -1549, -764, -745, -339, 1154, 1292, 423, 508, 381, 130, -263, -205, -212, -397, -1387, -1292, 352, 482, 996, 2348, 269, 821, 859, 382, -224, -518, -1142]
3601a142L23P4J007q00Q41M9Q55j345O59Q28j359k53p28k97N37K17M67J159n08
3620E84J055q02j210J136r68r59J24o73J137M72o36J090O82m40J24O54m08o43
3638C19k37j513M03M8q79P29K354M01m75m48k97O31j015n4j593M31Q76J3N43k29
3658HR9J238l33O18o13j741J13O80l73k92k19M19L17k4R33O15q93O47j552P72
3678D19l48m11j344R60J30J78R58Q67o67R23o56q49m81l41l27j92P57J629j385
3697a80Q16k53k13J34J010q91j668N74r50P10J77O53L68q06L17Q13L07q19p88
3716f89R7J74l94J30p1o44J075k33O19P26N00Np46o11q32K78K8l47J44j12J795
3737H92j90N30n42K84N96k114j307J896j95j613O44N46J263N18n14M90K93j222
$$ y = [-1142, -819, -745, 262, -538, 303, 352, 1207, -138, 521, 1349, -10, -263, -991, -1288, -751, -534, -67, 1092, 584, 1639, 837, -373, 763, -205, -1164, -1040, -1713, -576, -104, -740, 350, 1032, 592, 716, 1370, 962, 319, 82, -1431, -1028, -980, -1859, -1130, 1224, 1625, 1150, 702, 405, 1036, 21, -33, -1626, -1195, -319, -306, 237, 8, 107, 1345, 1012, 1630, 1017, -724, -611, 69, -304, -596, -815, -396, -79, -103, 830, 1445, 552, 1199, -353, 419, 71, -340, -1684, -724, -594, -416, 542, 1409, 742, 1665, 1009, 160, -321, -662, -989, -1181, -424, 1205, -180, 636, 383, 170, 304, 1314, 423, -1245, -671, -1621, -911, -734, -81, 287, -519, -202, 611, 918, 99, -689, -592, -418, -812, -682, -753, -1397, -322, -555, 64, 790, 1290, 1295, 549, -62, -894, -616, -588, -935, -791, -903, 892, 702, 1232, 690, 974, 1570, -544, -1851, 45, -150, -1763, -1119, -573, 690, 1208, 694, 1184, 1477, 255]
3755B55Q69p57j426M5J76L14p99Q29O70P96k89j41q59L65J184j875l25M75l16
3774h09j33J5J197P42m95p09Q11q08n6o98L14O14p09L34r2O81RM22Lj57k03m12
3796a39r21J346j772Q3J253l44R86j230J624m06j037P73Q5l12j521L7p7J179m24
3815h17J27J830q09O90N19n83r56j24k86r91L1R49m64J106O30N3k23K89j71j816
3835a016J234j89r59J691j742Q01l46J195J29L48P8n81j45j64q59J33K12m25n69
3854a174Q44l4J609P4j148K76o93l22N58n23j10J96N03n50M06O82j066J517m67
3873E78q11L32j16q6Lj256J04o9J137P35k56L96q35M41L29n41R21j904P06q35
3893a027P28R46N22j57j010M36P06n7r66o40L33q47M78J655j293O78L76p60Kr0
$$ y = [255, 1124, 367, -1059, -1014, -838, -524, -1323, -494, 176, 972, 683, 542, -317, 48, 1232, -643, -968, -493, -809, -942, -927, 270, 1012, 517, -192, 619, -189, -245, -943, -629, -15, -724, -390, -482, 199, 208, 630, 633, 476, 273, -139, -1060, 286, -1486, -1403, -150, -494, 492, -738, 886, 480, -557, 216, 301, -11, -1532, -1495, -1572, -393, -817, -690, 1140, 331, 1021, 1540, 957, 1, -123, -409, -1400, -1369, -420, -884, 222, 852, 905, 682, 971, 800, -1016, 218, 29, -930, 761, -981, -180, -526, 669, 798, 1146, 1224, 643, 498, 334, -525, -392, -180, -605, -1174, -330, -364, 1245, 1319, 171, 447, -246, -568, -10, -533, -643, -447, 56, -494, -88, 594, -472, 1045, 578, -233, 99, -17, -103, -100, -1356, -1252, -1321, -184, 551, 295, 691, -144, 297, 626, 85, 1006, -898, -192, -1027, -299, 647, 1169, 1012, 2, 438, 1144, 1087, 121, -519, -186, -1033, -555, 1100, -193, 485, 861, 101, 103, 13]
3913A3J013j336k96L18J033j813J116m10M11m45Q42j272Q06N00J15n12q11M17
3931c11k95j82j05J196n09M74J78n01J047q10p93o6J54P50l22K89r55P90Q22k32
3951F19M8r0q14L94m66M15J46l75L83n43P36m7o27n5P24J75q55l77K93L83o52
3972e85m58R12l25R63o05K92K66l32j221J551k43J5j007J273p59J2L95r64J312
3991D92Nn15k18p94J110j368K13L79N5Q76J76k76L36J87o12l48Q60j133N1l88
4011i12P8M25R86M4q61J613l69j790k14J331q09n14N72M2J262m29l5j23L24p01
4031h0J05P30j065r98N43O73j062P33O48j83O26j273J051L24J6j304r7J573j812
4050h52K48j032J442J10q50J231j33j24j64J222q16o35n82J054j160M43M65R91
$$ y = [13, 1026, -310, -606, -288, 745, -1068, 48, -362, 49, -396, 446, -826, -20, 480, 595, 83, -728, -311, -606, -788, -893, 303, -206, 268, 446, -55, 992, 182, -611, -677, -523, 227, -95, 194, -761, 29, 851, 619, 667, 577, -237, 157, -309, 106, 252, -123, 260, -283, 453, 406, -221, -276, 448, 623, -232, -609, -316, 67, -585, -1043, -131, -456, 507, -98, 194, 460, 128, -1093, 458, 215, 230, -777, 496, -263, -251, 144, -820, 492, 497, -18, -236, -1030, 80, -1288, -1075, -696, -641, 235, 411, 135, 471, 658, 46, -302, 558, -575, -524, -912, -834, -409, 577, 621, -240, 1373, 1004, -786, -1000, 331, -478, -992, -420, -378, 884, 455, 420, 297, 621, -80, 25, 755, -310, -1308, -765, -92, -1154, -421, 227, 44, 670, -603, 448, 772, 788, -516, -613, 960, -852, -604, -1636, -194, -84, -934, 297, 164, 40, -124, 1098, 282, -353, -935, 119, -1041, -598, -133, 858]
4068H58j143N74j589J261R61r20K44o09n94O96p89J207L61J08n90R01r97j44M09
4087B05m41q5M2J209q25l39L43j25m1k87J85L72O3o06p4P42o97n8M01L23M12p52
4109c3J084p36O7j42o14Q0m17O33K10l33J413j034j54P0Q4j82m77N58q4q52M64
4130c95k18R72l90N84l85k84N51L42r68q7N96l01o9q23J040J64l74j40O35k71
4150A79P26j085k27P77j104q00J106j75K07qJ004j13j33o31J86k65j383J576r05
4169a068J337j02n12K53K43j32p47O58j51j122O88K0Q61r75O72J08o25M29M94
4188C29p59P02m20J81K7l39K67k57M1M6j160J861N96j486J32N12L32j511Q67k64
4208c03r3o1M93j036K97M57P79m01M74N17k173R11K58o57O18j38Q7j50L45m75
$$ y = [858, -285, 289, -1300, -39, 922, 2, 246, -363, -957, -261, -1050, 157, 518, 626, 36, 937, -60, -204, 205, -236, -321, -279, 930, 105, -234, 109, -16, -57, -344, -159, 213, 276, -330, -404, 338, -359, -417, -16, 307, 719, -33, 1051, 315, 382, 240, -374, -294, -711, -78, 132, -201, 1212, 178, 24, 94, 178, -4, -481, 77, -7, -859, -395, -613, 359, -31, 553, 168, -116, 435, 777, -191, -278, 318, 17, -52, -875, 165, 329, -45, -185, 450, 179, 905, -180, -407, 370, -734, -1534, -428, -603, -396, -404, 600, 487, 354, -277, -91, -356, -1739, -163, -1068, 269, 167, -345, -92, 151, 19, -728, -70, -221, -1343, -655, -635, 226, -749, -77, 31, -594, -165, 329, -430, 272, -148, 33, 60, -279, -12, -269, -228, -182, -1342, 519, 1115, -371, -239, 273, 605, -906, -39, -303, -396, -457, 36, -1000, -703, -246, 533, 132, 606, 1123, -1050, -139, 119, -538, 80, -58, 29, -121, 224, -251]
4228b51m68Q43j043N84k84M4J218j095M17L14Q0r06J487o80P6L03M7j290J11R29
4248D36l04L41n50r60J254p2p1n94J19j47l2m41K84Q20r89j36J541j004J008o2
4268D41j680J038q24N48J198L64j007k77L72j74J90j91O98o81l19m13J609j421
4286e29k91J144o92O22r10J121J92n35L43j62N4l05M3r69M75O4J44Q62m22K56
4306E05n23K64j378J207m14N5o54J016j99j75L59Q45q64lJ97j18P1m63j84Q36
4326C80k1l84m25J16L74p7M9n49J207N81j209N18r67O06P0n69L59k1Q88q55l27
4347b56j47J739k072R97O17j950J082M50m05P19k68O53q34K02m09n39P43k48j32
4366e8J9k28J400j384K0Q17K73k126J865j139O35N62q0m87J37P50j169N74n64
$$ y = [-251, -719, 124, -919, -335, -619, -575, 643, -452, -35, 279, 359, -547, 940, 260, 336, 639, 686, -604, -493, 436, 132, 473, -77, -1037, 217, 145, 74, -520, -401, -548, -580, -1021, -737, 83, -906, -1042, 499, -505, 503, 441, -1239, -201, -1025, -477, 721, 1085, 78, -199, 173, -1, 189, -2, 696, 15, -304, -717, 892, -529, -820, 324, -368, 254, -656, 465, 657, 122, 465, 303, 357, 52, 95, -874, -399, -335, -191, 671, 249, 505, -18, 246, -1132, 75, -339, -284, -938, 78, -121, -296, 63, 908, 44, 41, 238, 120, 191, -272, -456, 380, 359, -25, -450, -334, 40, -37, 12, -537, 670, 1251, 42, 560, -407, 199, 269, -300, 59, 38, 926, 71, -256, -403, 1336, -736, 261, 878, -1072, 10, 460, 55, 774, 506, 1159, 325, 527, 118, -421, 322, 74, -58, -39, -267, 1133, -251, -231, 586, 859, -1267, 598, -541, 94, 656, 576, 89, 226, 976, -193, 381, -183]
4385a83L53Q28l49l69J90l29m32J02O9K35N38n14q68R25j68m25J046m06P73q81
4405A35L05m83k00Q9N25j03j195J279j064J836r80o05O32O6j028O10M50L9O48
4424I56m93q86l02N60J88K94k24K18M76k02j869j35J603P6J17n05M32m0k107Q34
4444a009M95J162j260Q75J05J71q48N63k88J67J68J64j00m06j075J952o12O10
4462H34j02r09j5Q86K85o58j115J047p62O20Q17q17k55J33j06O32l08L40l20l72
4482a45M33J82r5L33n94l21j51Q36m35k73o20J783k17r35O12J5m70K63p73k43
4502h15M73O98l05k29N78J3q8m42n38M51L51O51r70J298q62Q9J27p41M61L50m36
4523A14L47m45K90m05j074J017l92O76Q2l78r62L59M48J80r3L71r79N91O94p32
$$ y = [-183, 170, 998, 649, 280, 470, 141, -291, -189, -120, 115, 653, 139, -729, 196, 28, -397, 649, 243, 1016, 135, 440, -43, -243, -154, 371, 268, -927, 352, -712, 1124, 144, -461, 171, 237, -791, -181, 269, 308, 956, 463, -423, -725, -165, 23, 317, 93, 311, 787, 585, -1284, -1419, 184, 260, 377, -128, 304, 264, -1843, -1009, -514, 648, -612, 263, 368, 539, -309, 254, -34, 133, 301, 465, 365, -41, -1116, 836, 224, 834, 732, -177, -192, 694, 979, 321, -794, 253, -509, 111, 928, 111, -144, -11, -117, 515, 207, 547, 227, -145, 288, 470, 375, 708, 114, -207, -358, 478, 43, -230, -850, 933, 716, -219, 393, 408, -62, 201, -572, -815, -342, 356, 51, -178, 400, 413, 325, -117, -655, -204, 147, 798, -172, 1126, 264, 353, 480, -261, 200, 550, 114, 461, 16, 306, -99, -1173, -156, -548, 128, 210, -168, -1130, -771, -323, -143, -236, 135, -844, -253, 441, -291]
4543b91j56J266j251N03q45J893n06j125J288l98k82j86l88O60m2P65n70m73j58
4562b96n74O27J265j505P33l22l18J09N20m16J35p1p60L8J090N80r72r69J255
4581A49J587j259j091Q75J95m42l87j2N79Q6o57K11j025J296j430Q92JP50n12
4600a94J346j605J03O26m24p50p7N57J077m78j603J373o34rJ173o28J65K98q8
4619B28j1Q49n48q67j20J972q61n87R56j79j529O82p48M17M87K5R23r83n94K29
4639b59P64m34L74l56M23j049O18k36J150n92q09k16L14K9K33N28j061J099j268
4658g48O09m47P58j08K78k41l75k98J226j162J020m94o58M17O11K39j583R77n41
4677e20J21Q13m60O31m51k00q30J624p86N39o68L07m25p29J017N60l56p02M52
$$ y = [-291, -447, 819, -432, 71, -774, 1119, 613, -512, 776, 378, 96, -90, -478, 182, 140, 905, 335, -138, -296, -870, -243, 1022, -483, 250, -72, -390, -281, 239, -177, -42, -113, -873, -835, 255, 835, -137, -1106, 149, 1736, 477, -614, 261, 456, 14, -373, -385, 194, 280, -377, -166, -1191, 105, -1325, -433, -432, 318, -194, 1152, -453, -350, 276, -148, -898, -975, -418, 659, 181, -1422, -49, -683, -692, 481, -147, 18, 316, 228, 217, 1066, 518, -349, -469, 1503, 642, 55, 1011, 832, -697, -15, -763, -346, 141, 166, 1089, 106, -488, -259, 505, 71, 445, 89, 512, -537, 81, -155, 995, 403, -406, -622, -308, -279, -46, 482, -579, 520, -748, -139, -586, 172, 64, 342, 101, -274, -572, 654, -508, 512, 18, -640, -223, 388, 627, -956, 21, -520, -399, 414, -46, 585, 134, -66, -896, 728, -58, 481, -187, 120, -305, -1034, -17, 543, 187, -515, -63]
4696f3r7m4J341q89p26J602j560O97o05L67K11Q76o74P1o11N06k84M84j703J465
4716C64q62J81N79n29j12K38o94k17K651k135J13N27K94M1j413J653m69m86M48
4735A72K44N7K92n61k43o64O16N07j541J330L71l75N78o62J41p6j87m11O05q39
4755f46J144p10o9O6J19l35L36Q22l74k05k82K89M87j252R32j28q59J438p37N6
4775I2J5O94j268oM49l35K47O11j174J081l65m13J233k71Lo48N93n34l09J43K23
4796F1K80q94P84L47o61k78n7J415r11J072p67r09M5P36j229Q49J218j402P72
4815D71m07J44p50J153m85K02m88Q66j015L25l12O55L95n62K49j150J455k90j615
4834a159P34L01K56J158j230j3k79J83M07J019j861O49n06k49J173L47j200R98
$$ y = [-63, -160, -204, 1137, 248, -478, 1124, -436, 261, -344, 23, 234, 1110, 436, 507, -104, 402, 118, 602, -1101, 364, -498, -317, 262, -267, -379, -141, -835, -1052, 1599, -536, -423, 104, 398, 439, -974, 679, 210, -276, 172, 416, 473, 765, 204, -39, -703, -87, 420, -1121, 209, 580, 205, 783, 121, 262, 186, -1, -412, 193, -646, 498, -212, -281, -215, -96, -431, -95, 727, 353, 148, -134, 155, 642, -610, 322, 194, -665, 773, 36, 92, 107, 801, -467, -473, -24, -359, -112, 499, -675, 406, 41, -372, 861, 590, 593, -55, 538, 4, -305, -162, 61, 341, -553, 231, 578, -83, -361, -418, 997, 86, 1158, 391, -518, -473, 263, -966, -117, 1101, -301, 471, 64, 208, -542, 611, 126, 328, -160, 706, -309, 16, -296, 359, 754, 192, 441, -709, 746, 456, -1159, -425, -124, 132, 1290, 60, 47, -232, -49, 358, 1377, -484, 165, -341, -590, 583, 930, -270, 728]
4852G28j55m9o49m3J290r51q5O92j410K60N65n53N15P63l42k30n55J3n03n35K323
4873A089k312R48j08M01j6M21p91Q7K78k87q17J587l31j5R5J52J77N8O80j049
4893B47L56j339J267p46K14N13q20Q21p20m66k72J012L22J010j996j09N9k26J365
4912D92j94n51L00M07Q68j648J817j549j365J007R08N22j094j8L19K9o85m22P56
4931a01l0J205j422j4L64O21J42p05q54P29J09k22l01L19k09L75J24j99R79j786
4951h76J303p09K78q04J695j486Q65p88P09R43k040Q53j247P51O78M04n1K13r11
4970b20M56k08n67J358r70P55J53j470N96P86n51Kl18J63M01J46q60l76P94N9
4990A29q36R30l92l44J074m70M86n86J83n00J53O07l5P31j170l95K98l87Q27j466
$$ y = [728, 573, 524, -125, -168, 1122, 171, 86, 778, -632, -372, 193, -360, 155, 918, 576, 346, -209, -196, -699, -1234, 1089, -1223, -275, -383, 18, 2, 423, -368, -281, -3, -290, -1107, 480, 149, 134, 229, 381, 558, 616, 1296, 247, 603, -736, 531, -215, -1, 512, -308, 513, -207, -673, -945, 67, 389, 1399, -597, -706, -647, -873, 492, 298, -253, 47, 454, 1322, -326, 1491, -58, -1423, -416, 492, 1014, -80, -98, 221, 250, -435, -857, -101, -131, 1074, -348, -362, 2, 623, 765, 60, -794, -65, 44, -178, -479, -160, -369, 6, 130, -69, 910, -876, 427, -282, -4, -808, 887, -599, 266, -522, 187, 1130, -910, -57, -1304, -553, 125, 529, 478, 691, -220, 236, 28, -539, 819, -151, 604, 757, -713, -117, 669, 118, 120, -198, -35, 366, 512, -348, -724, 70, 129, -707, 223, -169, -513, 561, 91, 577, -9, 174, -326, -173, 434, 399, 1130, -40, -435, -137, -524, 303, -1163]
5010a163J748j478J763r70K2P48m72M79m00l37n76J881q96k18k13m28J213N3j440
5029f84N64M8J25p6j090P77L76K84m76LR02r33k98M42k0M0K34M59m33j223R43
5050c6P39r62J69K11n83Q9M23j197J332j6j23K1K83N88j459Q83k14J97O54n58
5070D41k45L13p32l04J55o59K38J059K43o97L13l43K16L73j549J259l04n20R98
5089B55R2j036P64n50j44M24J892j242j769O54R98j7m45J74L1P78r81P80m38J50
5109C70k91o3q8J01q01P97L53K40l85m3K67K90r98J47j44J167j041n66O93o8n36
5130e99M21l99L58K09n1p62Q33j045J595j010J105r96N63k48J56l99J004n47o58
5149d70K99n26J078r91K63J66L78K5K59m40J00k28l16j40M6l04O51m94L07J02
$$ y = [-1163, 585, -893, 870, -100, -78, 670, 198, 677, 277, -60, -636, 1245, 349, 131, -82, -510, 703, 756, -684, -120, -72, 53, -23, -1113, -336, 40, 324, -152, -149, 753, -180, -478, -36, -56, -16, 218, 677, 244, -979, -36, 703, -259, -90, 121, -462, -373, 50, -1147, 185, 169, 46, 67, 350, 938, -521, 362, 148, 345, 999, 441, 196, 509, -223, -527, -372, -1031, -793, 266, 509, -188, 125, -218, -2, 371, -1178, 81, -223, -743, 255, 347, -689, 75, -475, -619, -195, 1697, 455, -1314, -660, 338, 321, -124, 50, 81, 859, -122, 658, 220, 370, 79, 16, -72, 29, -772, 25, 378, 618, 233, 190, 457, 747, -251, -104, -248, 919, -122, -688, 5, -63, -599, -178, -577, -219, -10, -61, -823, 10, -1035, 560, -450, 655, -341, 222, -26, 130, -269, 735, 188, -470, -171, -697, 381, -610, -347, -181, 197, 222, 481, 41, 141, -87, -403, -543, -497, -801, -150, -644, -337, -235]
5169b35N0M82k65r66P91n61P87k90J35P70p51K80o42J435j158R3L08n63j75J95
5189b80L03K52j411J208j82m17L56n20P69m45M2L12P09j11n65j98l22M26R66q55
5209C7L3J03J83O83r89n76j36J14O58P47j337K59m34Q18M82p63o65R57n00K12
5229a14L32Q27j671R62o20m0j23L00M67k5K88j26j40k61L42m25L19m7q88M8Q30
5250B35K91j308J547l03p83J6J172j165p2K54k42R19j058J115n93J01J08L06o00
5269f0m19Q69j30p01Q67K66j008m63R91j62N52j801J081O8j00Q95q29K98N06j242
5289e22K01k01j10O77Q7k85K05M35o75N55j010M50J10J742j570jj20r1n4K93M74
5310E90r0q60N41L32q19L83J315j113q17J95r0m44M44M64j59K2R92j684N45l78
$$ y = [-235, -185, 297, 32, -934, -143, -704, 83, -207, -72, 698, -53, 227, -415, 1020, -138, -45, 263, -300, -475, -280, 23, 275, -1136, 72, -110, -527, -171, -691, 78, -367, -325, -13, 696, 585, 20, -178, -500, -74, 892, 37, 70, 173, 356, 1039, 50, -526, -662, -548, 110, 857, -480, -221, -655, 163, 645, -118, -783, 174, -326, -114, 218, 1045, -626, 336, -284, -324, -447, -147, 320, 295, 583, 457, 317, 56, 398, -27, 292, 245, -643, -595, 235, 526, -782, 765, 462, -321, -305, 867, -298, -370, -116, -358, 561, -497, 618, 25, 126, 234, 540, -60, -479, 390, 260, -441, 426, 692, -316, -779, 212, 50, 602, -1199, -118, -50, -150, 745, -84, 214, 720, -522, -321, -522, -632, 45, 132, -153, 52, 487, -188, 367, -643, -193, -83, 1659, 89, 88, -32, -123, -177, 116, 590, 500, -360, 181, 513, -306, 77, 1392, 279, -538, -343, -433, -877, -433, 31, -128, -106, 886, -798, -253, -631]
5330f31mJ170k10k73K43k61j056P00j04N1L44k56K40p9l6J172j902O30M51k59
5350g0L65L13j266J200m10R21j391R89j894J810j346P88l1L62m1l41J044j410
5368d08O02m7O44p92N44p72O19l07J26k8m21R08o49o52R67l43L97n99l87J252
5388F54j050N96o63L78N10Q10K6j874R01m27J175j071r9l60%R76k38K27n74J79
5408G6Q99r8p66J09N29j020J052j974K237j504L90NJ65o52M31P97j180R6O63k07
5428D8J98m17L41j21o69Q65K6K10m75K46Q5j20R9q55L52J70j41j64m45M80n39
5449h26J027J17m42j36j217J811m3k105J391k97N37j73M31O95j77o25P4m61O41
5468B22j87P88K90q93k94j95j95l60M9N55L58Q69q09J11o83L89k45k83R5j60M33
$$ y = [-631, -635, 535, 325, 52, 295, 34, -1022, -322, -426, -375, -31, -287, -47, -126, -162, 1010, -892, -262, 189, -70, 295, 608, -658, 542, 132, 1053, -338, 651, -1243, 567, -779, 9, -22, 340, 299, -42, 1002, -408, 194, 147, 791, -1, 543, -229, 390, 83, 209, 181, -240, 668, 19, -633, 334, -9, 388, -211, -598, 654, -396, 200, -463, -85, 425, 1235, 1261, -613, 288, -139, 1036, -35, -134, -494, -494, 482, 244, 471, -103, 76, 975, 877, 111, 220, 749, -271, 781, -1193, 1044, -460, -70, -65, 100, -552, -121, 676, -504, -408, 255, 48, 246, -171, 170, 49, -620, 245, 271, 481, 6, 252, 337, 217, 316, -539, -187, -17, -158, -322, -767, -287, -826, 201, 318, -124, -260, -1477, 334, 291, -1814, -423, -720, -183, -356, 75, 770, 593, -32, 42, -419, 222, 35, 823, 1113, 220, -74, -269, -464, -824, -775, -220, 138, 1007, 198, 309, -374, 15, -230, -513, -418, -578, -145]
5489a45N20m95k87O6R04ko19O95q62J151j782M42R33j051J77J21K66j73l87O73
5509A45o08N85N44o34j57l36J20j77P02n47N00l07j53O2K28L67j97j009J025N92
5529G45r05O91n95k31P36l86P46j266J569k93j574J366oj55j2j41q6m46Q9j22
5549b76k61P92J40k43l91l40Q88r52Q04k45l32J079p81m66P04J68Q71o56m5J73
5569F31p00o8R72j254M50M47K62l47J40l39r37oJ012R80m22l31q75k95Q31o89
5589e38K68o59K067j189q38Q57O1M93o7m12j368K148N71r76m46L1J187p85k92
5608A13L76q53j02L93m60L96L24n13kK54j716R98R10L85j056R44J41P33m54p99
5628A2j088J054R87o39k33M1q71Q22R46m09k33k07l93L82RL0J73K59j859J426
$$ y = [-145, 375, -120, -407, -341, 563, 561, -58, 637, -225, 926, -856, -414, 519, -532, -355, -234, 32, -141, -528, 145, -463, 122, 666, 32, -125, -461, -341, -518, 184, -363, 137, -170, -323, -261, -33, 334, 137, -872, 153, 745, -160, 531, -64, -295, 441, 55, 801, -465, 1104, 811, -763, 603, 597, 442, 430, 289, 203, -243, -154, -276, -537, 255, 395, 152, -239, -579, 309, -643, 161, -84, -416, 663, -118, -584, 120, 288, 1159, 503, 458, 631, -69, -137, 835, -419, 31, 478, 740, 393, 533, 194, -743, -749, 263, 1243, 821, 490, -385, -680, 151, -538, -270, -929, 1138, -51, -889, -32, 29, 522, 455, 43, -1325, 823, 1394, 418, -28, 3, 1190, 405, 113, 489, -364, -466, -73, -533, -137, 187, -326, -328, -74, -1790, -792, 118, 503, -553, 391, 532, 1265, 811, 12, -1076, -22, 965, 326, 93, 134, -737, 85, 1031, 622, 389, 182, -211, 171, 180, 210, 383, 642, -1217, 209]
5648B09q39M00L56M44n74k25J301p95l78m18P55j404J019p5N47L3N11j522N8o4
5668f61K63j17L97q1K31k77l28N11m70P59L62r19o25j20P86m1O31R8j024K81P00
5689C56j51N78J79m37j102J110k84l66o3p05J713r65J20l05O36k56L99r40J139
5708F56J006p17k70o6j051N44j94M73J04l79K7J081r52m36k40j3P44m9n25Q29
5728E72p77O74j569J862q36o30k52J203L19q92J19l4R18l76J82n66m96J96K89
5747i4r79K236j196o37J025j35m8o83l10N18n5J122n90R29j419O67l76l84P44
5766C35j135J435j46r70j06O74R68j305k27n5l39J581n23Q59j469N04L5n25J594
5785A185k18j37K3p99K56l96J46K08n11p19N46O39K77l7j29p73J365j474P77m16
$$ y = [209, -630, -230, 126, 570, -4, -229, 1072, 277, -101, -519, 236, -1168, -149, -224, 323, 356, 867, -655, -597, -661, -398, -515, -118, -199, 32, -245, -573, -62, -532, 227, 589, -330, -955, -1075, -289, -330, 301, 399, -625, -344, 356, 205, 783, 962, 525, -577, 533, 249, -117, -180, -885, 828, -137, -17, -322, 314, 58, 457, -483, 656, 1662, 945, 675, 609, -442, 102, -92, 381, 485, 106, 133, 1214, 262, -174, -414, -427, 317, 268, -257, 572, -205, 469, -1100, 762, -74, -704, -956, 247, 566, -326, -207, -241, 677, 301, 483, -83, -579, -383, -94, -1073, 1163, -33, -670, 355, 220, 172, -511, -821, -303, -358, 764, 174, 1103, -316, 351, -25, -409, 335, -800, 635, 489, -481, -587, 87, 1055, -250, -477, -532, -871, 710, 187, 1046, -423, 81, 116, -409, 1185, 967, 830, 853, 54, 310, -86, 60, 268, -243, -962, -416, 223, 500, 463, 334, -439, 926, -548, 229, -187]
5805a87q24N7J775j262M63R29m18l41k38j98k71l23J25J219o93n80J513o83M58
5824E21Q35j562L30q88J004L04m38O3R17o82o42Q38o42K30J513k048K92p45k70
5843a070J327n17N26J5M24p30M7K85m58O74m45O30o22N64K8p33P97j655R37J09
5863A33M5l5K60k65j68J11k60N68j60j80o09L35K08O98l70k52o27P03j829K055
5883C61l25K28r65R80p4m1L96j188J403P8l49n48l08k19J54K59p12J283j274O99
5903a62k97N80l85l87P53M94q78k40Q49j766J059M34k69K3L30p37N80L55k37k48
5923a49n8J14P63l61O44q31K88o97J134n90p86j6J66p37Q75K20k22j3M61K08o70
5944b57k26K94l19Q02q55R12p74Q90m76l50M01J91k53P79r53r65J689J33j179
$$ y = [-187, -1011, -954, 821, -441, 22, 951, 533, 192, -46, -244, -515, -838, -713, 506, -187, -767, 746, 63, 521, 1356, -206, 124, -764, 240, 544, 106, 169, 1086, 404, -238, 600, -42, 188, 1701, -347, -55, -800, -1070, 257, -260, 266, 281, 705, -25, 22, 307, -151, 523, 78, 708, 86, 650, 678, -55, 742, -913, 24, 133, 178, 143, 403, 138, -30, 81, -179, 389, 229, 49, -560, -225, -17, 681, 311, 59, -568, 135, -1694, 361, 36, 264, -701, 279, 205, 164, 560, -628, 775, 853, 504, -44, -352, -571, -417, -158, -870, 413, -861, -162, -459, 121, -264, -651, 102, 596, -282, -522, 327, -1439, -380, 54, -215, -192, 138, -599, -19, 336, 99, -149, -207, -93, 670, 309, 953, 122, 410, -287, 847, 257, -529, -545, -379, -1116, -241, -21, -243, -256, 205, 413, -257, -483, -189, -508, 294, -561, 351, -423, 467, -9, -359, 42, 233, -20, 759, -194, -1159, 530, 663, -516]
5963e16P63k67Q16%n84M1P5j5J73o53L42k36N02j251J28q8J820j640j83J706J38
5984A071j915M22N31r08J002m41L10q74j36Q93k32j59J079L38j476Q37M3k66M06
6003E25o84R31q03j55J97J267l05m70p01o84J310j078P87J16k71j82M8p92J312
6022C68P81j290Q84m71q06N48j02N43m39k74R8M66j93q5j60N38L03j172K76J26
6042f1K53k75o08R76J95o76O45L30l85L42j187N09J65n90K65L27n1k91Q63o04
6062A42M03j118L24O15o31K86L52N01r38m36N10L3l41K13qj04R06k70j159k58
6082i78J488j096J017m46J86j439K228j294L26J99q67J578j079O07j312N14M45
6099G7J51J48J84p2j352J384r45K3p76J713j962J205o55J442n01l46L20n74L9
$$ y = [-516, 247, -20, 796, 796, 212, 253, 328, 313, 486, -167, 175, -61, 441, -810, -682, -770, 1050, -590, -773, 933, 1071, -844, -422, 109, -799, 203, -238, 72, -802, -938, -45, -277, -436, 643, 981, -495, 342, 385, 119, 525, -159, 772, -31, -186, 11, 1278, 973, 503, -198, -882, 428, -650, 137, 253, -18, -200, -152, -944, 368, 1149, -141, 743, 272, -534, 14, -88, 455, 16, -258, -160, 306, 113, 28, -132, 406, 709, -463, -187, -61, 192, -83, -691, 285, 480, -196, 449, 779, 394, 736, -451, 58, 223, -367, -102, 225, 174, -117, 746, 142, 545, -573, -249, 366, -265, 21, 373, 874, -64, -500, 10, 43, -298, -85, -93, -197, 709, 439, -720, -978, 510, -586, 431, -15, 171, -1268, 960, -334, -8, 191, -676, 902, -177, 430, -882, -368, 77, 228, 376, 560, 488, -864, 520, -425, -402, -1178, 535, -1427, -222, -877, 565, 64, -282, 38, -536, -497]
6118d97p06J151k40nR8j64J092l67k81l71J074j71j357j7L51n32P45L75q56N56
6138a22n49R64j6l22j73J67l50k71N91m0k80J53L99j39P04K26j358J02N80k85
6158a9n84J33J70K76k53r02J468j412J407j78k72J90o61M09j31k21J72J255m20
6177D27r92N48Q26m23m12j31L38K20k29M30j527j07R21K64rJ135q23p93L49O44
6197F56Jo38M04j033K91N44j98M99M53n75j37l79o2N02k102K022j17j071L04J600
6217I64k46l8q38P2j11l99N45l21M83l36o87L36n84P07N21J57K68p81P67M17j331
6238d35k59q8j43n42K055m64o32P30j17l26O2J08l14K79k5n45j5P87J25J09j22
6259B28j75o52N80N29l22n70r89J323j24K32K64k7p66K162j566M60n26j07o54
$$ y = [-497, -1203, -52, -292, -297, -199, -363, 729, 362, 81, -290, 784, 613, -744, -761, -410, -942, -197, 178, -678, -122, -671, 293, 277, -45, -218, -51, -401, -672, -81, -121, -401, -248, 151, 12, 716, 942, -416, -314, 266, -19, -603, -470, -300, -24, -277, -1179, 289, -1123, 284, 106, -166, 24, -637, -228, -359, -580, -408, 847, 427, -565, -17, 809, 386, -26, -157, 181, 401, 172, 602, -925, -1032, -111, 153, 144, 1279, 456, -337, 12, 656, 657, 19, 423, -610, -319, 225, 27, 526, 979, 404, 267, -112, -174, 328, -1774, 248, 131, -940, -636, 964, 718, 680, -158, -86, -197, -596, -51, -372, 111, -225, -912, -576, -1160, -453, 68, 225, 493, -288, 479, 896, -435, -694, -782, -925, -1467, 588, 124, -508, 222, 105, -221, -159, -51, -365, -86, -111, -656, -671, 116, 241, 350, 228, 53, -599, -19, 510, 188, -382, -1371, -48, -172, 60, 324, 297, -469, 1693, 127, 587, 61, -46, -700]
6278g00m1O05m95R96j184J983r50J05P94J92p00O14k462J60K83O81J25M32j316
6297h78J199Q29k67j217J083p03j02j98p68J100K04n91Q32j05n07J165l27m76
6315B73m7K37j053L08J248j00j331M92O87j634O81L80P43j130l32Q9j14J212l89
6334B20j27j82P46k93k9m05p21J8L42k57J030n21N60p62o0P31M02K9m03k29m19
6355c30P63n81Q5p5R2r16N52K0R27k47l57L20K98j485M44n2L54O69q06K45R37
6376H57q83J53M09L25o29l32M39j504M10M77K90L1K0J70L02n52n38Q41o97J61
6396b50r9l81Q21q8L35l52n30R38o66m1Q82j38n80M82j148N19l60J426j318J301
6416G53l41j034L46P25n13p90p7K57J519j315J14M40L28L22k10l09M97j400M11
$$ y = [-700, -741, -136, -631, 365, -819, 1164, 214, 319, 1113, 1305, 605, 1219, -1243, -1083, -800, -119, 6, 438, -878, 321, 1150, 883, -334, 749, 46, -56, -254, -1022, 78, 282, -309, 523, 418, -89, 1076, 749, 273, 226, 463, -590, -282, 966, 866, -465, 27, 714, -920, -239, 141, 884, -246, -578, -489, -603, 609, 220, 93, -89, 657, 364, 335, -70, -791, -773, -431, -688, 342, -179, 381, -381, -441, 290, 692, 721, 318, 89, -330, 433, -148, -63, -138, -46, -962, -410, -390, 537, 290, -67, 253, 551, -934, -490, -542, -188, 481, -325, -80, 857, -26, 127, 536, 861, 232, -100, 339, -1165, -755, -278, 12, 43, 63, 233, 535, -17, -555, 286, -411, -250, -349, -730, 91, 3, 338, -14, -544, 394, -272, -313, 569, 431, -149, 333, -815, -296, -656, 770, -548, 753, 412, -622, -276, 449, -64, -854, -931, -674, 845, -470, -356, 84, 412, 734, 524, 215, 712, -688, -277]
6435b77l50qJ54q01L89R02r6P59k04N51p54N29k18n46l08k17P23j02k62M97K03
6456E64q83K8o4J018p35l31j01o3L3O1J407j122L18n90J849j276k66P44j110J160
6476F41n93n23J23L53M99m01M23M47j120J55J063j032j081O15M55r41J184J9J007
6495A293r07k63M61j120N88K94k42M11q63k53J72N53M31j6j6M79p56m51O93m62
6515B6n8j0m86R69N54n53J58q59O23l77j218J88P49P58j075k17J318j072J04J786
6535A308j445Q22O3j300O74J63O84j233O73r69j56J033M04J149j040K21K1j427
6553c55P09k93j040K37L84P55j137N32N2J101m47l08N63q07n13L04M56j8k21m33
6573d79m09M45N77J136o1k59q10j154J027k23m7M71j09N56r32L54M88j41L0p87
$$ y = [-277, -627, -635, -481, -1282, -893, 9, -87, 672, 468, 1019, 265, 794, 576, 30, -278, -495, 228, 126, -136, 361, 564, -319, -291, -355, 663, -72, -403, -504, -567, -534, -473, 934, -188, 130, -460, 1389, 113, -153, 591, -519, 641, 48, -475, -352, 1, 500, 99, 522, 969, -151, 4, 1067, 35, -1046, -431, 24, -917, 267, 286, 1293, 386, 123, 584, -536, 52, 346, 104, 515, -348, -601, -429, 124, 555, 539, 523, 1002, 246, -205, 488, 26, -32, -42, -528, 441, 995, 442, 600, -259, 364, -13, -1231, -1043, -294, 464, -611, -828, 490, -582, -478, 1308, -137, 685, 748, -552, 122, 285, 969, -264, 409, -560, -716, 317, 721, 1870, 830, 1051, 1072, -355, 354, 61, -979, -742, -358, 397, -740, -208, -156, 945, 498, 190, 753, -54, -567, -263, 193, 175, -46, -479, -888, -443, 134, 1270, 1209, 950, 140, -1014, 13, -210, -257, 214, 105, 661, -271, 83, 571, 430, 460, -327]
6593c27o26J141J78o66R5r23J450r29M78M56k66R64l16q10J82m30J07J47r0O5
6613a20L0q51J215m6n5p68N4L34l97k78O39j51p32J632n04O90j408J7J281j48
6633D34n49j327N99P47r5J13p6R69j58n82M82m47m00M7M63k26J41M3o07J170q85
6654a44L47K85n86R27n1j558J878j021L98o16m54M56l18J350L51j720J113p27
6672i0K55N97p31k36P21j7p23J235k39j253M89J74q21Q49l31Q91p36j734K027
6691C27J015k977J373O28N88j010j93n31M73N99j256J507j429M81J025O3M34j248
6709a31R79o82j18K56J70m39l79o68M10J397q29M80k4o65j38N09l15o27R55k30
6729h9k33K62j62L06M67m97k7J82M30o20L07j28j292J618p6j459J660N82p19p18
$$ y = [-327, -953, 188, 366, -300, -205, -1128, 322, -607, -129, 327, 61, 1025, 709, -101, 81, -349, -242, -95, -185, -120, -90, -941, 274, 228, 173, -595, -541, -207, -604, -882, -243, -394, -1126, 506, 2, 692, -716, -699, 582, 434, -115, -1442, -843, -96, -191, -78, -154, 815, 657, 75, 557, 110, -290, -243, 220, -6, 135, 178, -429, 741, -144, 203, 488, -98, 829, 778, -780, 1098, 77, 475, -141, -595, -139, -457, 893, 1244, -476, 637, -90, 165, 762, 31, -205, 516, 499, -224, 1011, 772, -481, 8, 182, -639, 210, -121, 770, 34, -1700, 327, 1342, -1635, -262, 366, 954, -56, -249, -780, -307, 292, -964, 543, -886, -405, 620, 683, 1117, -131, 848, 166, 48, 304, 474, 35, -344, -1012, -602, 795, -34, 446, 422, -243, -381, 128, -187, -814, 141, -89, -322, -60, -222, 84, 551, 54, 27, 209, 639, 19, 326, 198, -1094, 524, 448, -1011, 649, 1231, 512, -206]
6749b06O84N60r55k73Q1o6j386P85J351q16l41P04J066j243P64kq27m98J98R8
6769c22j95P42O14o67N9n85L8R31q41M87n41M60m49K73M75j092J356j432J014
6788C25m24N26o97k35L83j84m17L75n4K50M06k25N09N99K40j521J74m30JR4n8
6809c63M12J50L31L67m50M56n34j20J066j295l01M23O14j505N83J59R34m21L0
6828E36K28j918J320N55n02j282R04m61N07m83O40j66N94P61j478k10J94j76m83
6847i20L6J258j239J286q06J002k89m32N5n01P89j294L05J160m13j175M09J274
6865E05j76n92O71K46n05K50l52J91j045O27K05P38p22j11N41n87J092l25j519
6884h68J053q25n7M50j434J858j77N92o78L63j088J009j05R6L57J51r07l08L45
$$ y = [-206, 478, 1038, 83, -190, -109, -175, -1561, -776, 575, -241, -582, 122, 1188, -55, 709, 707, -120, -618, -420, -322, -517, 225, 839, 172, 231, -354, -316, 615, -226, 261, -280, 180, -269, 4, 479, -613, 743, -689, 325, -99, 427, -270, -505, -122, -306, -723, -348, -402, -152, 254, 29, 538, 1137, 1377, -144, 30, -400, -399, -305, -363, 49, 199, 530, 897, 447, 903, 369, 249, 1315, 20, -281, 142, 756, -749, -166, -7, 927, 506, 536, 764, -1154, 166, 721, 219, -1063, -159, -620, -113, -596, 44, -122, 472, 1233, -245, -455, -261, -437, -920, -884, 374, -865, 421, -385, 617, 328, -104, -49, -550, 239, -1055, -750, 410, -3, -1178, -769, 505, 329, -263, 408, 654, 149, 399, 47, 238, -807, -180, 25, 763, 41, -70, 471, -116, 976, 651, -868, 185, -640, -697, -247, -1681, 177, 0, 592, -86, 277, -811, 198, 93, 189, 546, 697, -210, -518, -173]
6903a73m24J081L63J2n84l31j52k93M66m8p94O47K61o36M21L15o31J423q08j56
6923d1O19m18l25J169j715J358k91j283J055m62l10J009O21j211j34m8m3k5L98
6942g7n91J309l74k33N2M53m43q66J740n14q35N2L39p44O09N52J87k48m08J004
6962I64p46p48J55R96r84k6K79l26m54Q43p55J343j42J12n30j57K21O52j84n4
6982D59o19P63n26N00J83j054L18l98p24J257o94j16J99J54O5O55n50r58K299
7001A213k595R27l9J70m09N97N26o9L11o89O4O73l46n40L00N17p00l04j50N46
7021Cm1j83K0K50q2J24n07J061o43k73P21J25J01j461P53N6P61p55qk38j17N34
7043B01o50O49n92J063j454R16l05J159j308J237j446J545r05q48M56l80J633
$$ y = [-173, -597, 484, 847, 859, 275, -56, -208, -501, -35, -83, -877, -230, 31, -605, -184, 131, -500, 923, 115, -41, 578, 160, -165, 1004, -711, 647, 356, -927, 128, -334, -644, 365, 986, -225, -359, -407, -450, -475, -77, -668, 641, 267, 34, 86, 539, 96, -770, 970, 456, -379, -327, 12, -732, -123, 429, 616, 368, -40, 964, 218, -530, -375, 621, -363, -389, -110, -436, -890, -47, -802, 541, 399, 511, -19, -176, 45, 697, 513, 459, -160, 603, 77, 577, 760, -294, 24, -374, -1098, 159, -535, -651, -452, -298, -233, 422, -128, -1086, 1213, -1382, -455, -494, -324, -733, -136, 390, 321, 632, -57, 7, 680, 334, -206, 94, 611, -89, -393, -543, 3, -38, -221, -201, 49, -33, 91, -416, 645, 2, -271, 450, 575, 676, -785, -32, 24, 785, 30, 22, -216, -333, 201, -449, 200, -392, 671, -783, 133, -172, 987, -321, 916, -530, 1015, 110, -738, -282, -662, 971]
7060I71j078j50M82j011K11j11L31J064q61l40j92N69n56L99M96k32m83J181n02
7079A88R0n06J533j482N50j481L81M25O12m84L36n30J905j676J02l43K34R6j06
7098a56M64j100O23J92J084j992J056O33m49J77m71j157J331M44n38m93K85R8
7116C1J232j270P86p84O98j204M68K82p84O30k10n53R99K64R01j213J92o65n81
7135g81J094j447J142o13Q88p41P1J323l51R0j362M49K79N94o30k94J33j70L15
7154a1L55N54L5o50N32m37j400J040l2J7o67L19O68L3K02n0j60k96l84J89o64
7175h07J065p56N74K41k60M24p4p85N24O20q51n12R03m30r5M68N70r84M31O28
7195H94j01J20q92L62n23m0J54l00J80L77l99P63p34M6j91J553j523N14j02K55
$$ y = [971, -107, -257, 225, -786, -575, -686, -355, 709, -152, -492, -684, -115, -671, -272, 224, -8, -491, 690, 188, 278, -228, 1305, -177, 373, -1108, -727, -302, 310, -174, 162, -368, 1537, -139, -37, -380, -146, -50, -156, 308, -792, -169, 23, 1107, -885, 171, 804, 355, 532, 61, -1096, 235, 679, 141, -352, -67, 31, 1263, -7, 779, -5, 693, -511, -43, 239, -545, 85, -125, -678, 321, 585, 1486, 273, 465, -200, -781, 313, -1134, 8, -605, 283, -458, -387, 936, 585, 675, -687, -238, 41, 635, 5, -289, -156, -326, -11, 344, 898, 933, 283, 815, 378, -1022, 18, -14, 3, -664, -345, 323, 356, 558, 508, 348, 52, -332, -143, -807, 258, -498, 76, 317, 57, 481, 407, -378, 146, 766, -85, -597, 306, -124, -219, 249, 819, -165, 266, 894, 793, 913, 21, 383, -140, -180, -26, -326, -146, 231, -168, 595, -139, -93, -284, 1269, -254, 260, 158, 413]
7215D13M9k36p1N9J78j76q37J244o86J062j137N4N79r50J338o33l06l89p7MJ960
7236A442j109PR15j400O20j84o29M02K98m38L17j333J055P41l0j29J01n84M92
7255E54m46L24o15L56j300J798O4p87P89r27k08J262r92m22R22r58O51j191J161
7274C5J43l67O63j6j021M75n77O28L81p72j14O12Q13o65J86j094J636k92q15m55
7294f16R28J19n76p91J049J13l24N02j12L8M50p16M98o54k40L28m16m09J019k63
7314g3L89l24j17M42p81r1M16k4N59k42n18K92k62Q85j306J030J42q43J83j31
7334c74L81o30N5j15R23J011j043m50K83Q35r71N38j341M31L19Q95p22k16k74
7353d65J230k25o61j6J1K13O21k65o17l0J06M54Jr04M30J198r58r1k70O67l2r50
$$ y = [413, 462, 226, 155, 214, 392, 216, -621, 623, -63, 999, -138, -84, 495, -455, 883, 250, -56, -445, -522, -518, 1442, 333, 340, 1255, -145, 475, 291, -338, 64, 362, -76, 241, -1092, -37, 704, 674, 545, 646, 62, 554, 108, 432, -183, 173, -1127, 671, 735, -52, 737, -190, -398, 864, -128, -550, 372, -586, 65, -1126, 35, 178, -189, 474, 458, -563, -88, -665, -37, 344, -428, -542, 70, 883, 218, 404, -690, 946, 654, -161, -616, 312, 431, -145, -936, 113, 226, -98, 404, 292, 330, 780, 64, 562, -92, -332, -4, -420, -829, 190, -73, 316, -8, -125, 317, -464, -555, -139, -163, 396, 154, -364, -72, -334, 551, -755, 275, 417, -426, -243, -374, 7, -623, -568, -683, 240, 1251, 208, -242, 41, 876, -95, 443, -898, -467, -148, 747, 25, -191, -465, 765, 540, -121, -137, -126, 87, 708, 443, -174, -204, -98, 356, 357, -547, -117, 1081, 123, 32, -238, 429, 397, -553]
7375e53q70J597l94k05R51n6m92J221j924O25q56P20K98k43M81l04m29q9M58j23
7395a87J96J12o45O68J27m57o94L03L24j79P95K85J03j142L0MK23O4R10j310P27
7416B57j81l97P43p95J131j4p88L80l32L64j479P48J198r17M71r05O42Q7k16K42
7436B39o61L20r2k28k25O54M77l97j98M59m20o61J260p32Q97m25l04Q15j049o
7456b77j12l87J309N57j588Q99M0k16n83N53O05K05l33r35J50L51r14Q27n84N3
7476c80j44O54o83J58O21r8K21p29l99K738k670k98J925j053K85j097R57l32J29
7495a95n13Q15o39M81N58o31M62j410J766j397R92n02N79k02l73Q51p92K86m20
7514b84P89l60k84R7m76O46j337P05Q87p24r47J426l00L0M34j26n1j340J251n2
$$ y = [-553, -1423, 174, -220, -425, 526, 470, -22, 1199, -725, -100, -956, -236, 62, -181, 300, -4, -433, -522, -64, -187, 9, 121, -524, 144, 271, -186, -880, -577, -253, -432, 363, 648, 751, -391, -361, -357, -134, -70, 840, -470, 257, 76, -321, 422, -373, 758, 744, -44, 336, 4, 368, -1111, -363, 835, -82, 389, -516, 126, 213, -3, 239, -422, -102, -194, -422, -647, 7, 484, 87, -111, 348, -72, -733, 527, -205, 692, 267, -37, 778, -271, -277, -389, -776, 533, 1090, -498, 401, 441, 225, -358, 195, 800, 1005, 672, -263, -113, 238, -676, 151, -433, -380, -524, 130, -553, -395, 226, 128, 349, -380, -779, 1959, -711, -1009, 916, -137, 148, -949, 8, -324, -195, -708, 107, -532, -51, 507, -124, 338, -1072, 694, -703, 289, -213, 366, 164, -209, 642, -150, 136, -284, 505, 145, -139, -42, -518, 128, -1209, -504, 383, -341, -1288, 138, -162, -132, 302, 176, 125, -1215, 36, -16]
7534a6k47R09q33k18r3O11l06P33n62K07n76Q1L79n33L65q25M56R43j299p0P96
7555i8p71J665p88l65J054j339O32J15m09j10M25Q42k45n04k00j03Q4Q84j123
7574c54P46q57l69Q67K87l93l8m22Q43j37n20m25N38k31R3O13q63O66J109j516
7594c63J832p08J07j042k84K48p85M84m09K37O23K35K86q67l54N05Q57q20R07
7613F89n22q06Q18J32L44o15r25p0Q44p04J586r90M67j12k74j289K266k33m29
7632A77J07n95j72M07P18o83M26K38j136R09p41J59l53K65r0J244m00n62N81r10
7652d11R95n03L37k31l38m06L83L74N05l97l54J53O94j384O11J72N2l68N2P26
7672F62o59K33N38m44k02P66j188J58j19R08r09j66L99l54l1O49J37r66Q63j55
$$ y = [-16, -263, 646, -187, -405, -498, 113, -193, 540, -22, 185, -391, -310, 69, -464, -99, -924, -468, 475, -824, -894, -98, -869, 796, 8, -357, 697, -642, -10, 105, -304, -414, 11, 853, 608, 104, -96, -199, -115, 769, -354, 392, -465, -834, 33, 320, -73, -111, -533, 310, 173, -347, -772, -234, -465, -372, 241, -622, 44, 1153, -363, 1469, 761, 868, -174, -458, -210, -995, -511, -920, -683, -60, 175, 461, -406, -760, -255, 602, -218, 689, 167, -639, 179, 311, 655, 40, -885, -955, -111, -815, 771, -219, 248, 136, -138, -1427, 839, 606, 177, 284, -311, -483, -76, 642, -41, 385, 623, -513, 396, -345, -186, -539, -274, -364, 880, 480, -82, 499, -411, 584, 81, 418, 187, -151, -557, -174, 200, 705, 308, -46, 107, 801, -583, 28, 200, 252, -116, -64, 662, 3, 236, 774, 330, 128, 894, -294, -136, -255, 653, -256, -422, -23, -377, -408, 241, 378, -588, 275, 120]
7692A20K80p52M60m19K13R42j119j28L61o28J140N0m83j37l65J014r10M45r06
7711h22J255q54Q86q82l19Q26m55O94j95M68r81J29j7k72l28J826j279L19O5j25
7731f1L45K6o79r48J586p51N7MM42o82J032p34k59J482j823J258O2M50r58J45
7751fq9r51J119k24P66l37n58k84L6J689j160K92J4j85N03k95l09l99j025Q33
7771e70N0K27l27Q82n41q04O44L72L05l73J57m7l87k2k54N16J642j621M03r46
7791f94J95Q70n79M93o59K54j25K67J91O28O22n95j162L90m25J55P8n65O65P8
7811H2K23l45j50P7Q95o25J192q05n6j26J08n33R40j028n41P92r16j31L97M34
7831a16J71l20j123Q76J066N00j983P75k43k19J238q46n65M60M30j03J88p05M68
$$ y = [120, 400, -352, 108, -311, -98, 844, -275, -403, -42, -670, 470, 520, 37, -100, -465, 549, -361, 84, -822, 433, -421, 465, -417, -736, 90, -365, 329, 134, 602, -379, -250, -267, -539, -867, 959, -320, -1, 64, -61, 284, 310, -369, -1317, 269, -482, -425, -421, 21, -661, 371, -363, -622, 860, -963, 295, 357, 807, -151, -6, -95, -1046, 73, -151, 615, 278, -280, -564, -528, 1161, 1, 293, 307, 122, 625, 330, 21, -378, -1403, -570, -520, -293, -620, 262, -279, -1083, -439, -67, 238, -135, 22, -25, -412, -434, -688, -172, 1470, -151, 252, -694, -499, 371, -208, 285, -374, -120, -245, 22, 213, 841, 1463, 868, -294, 96, -329, -174, -96, -661, 4, 82, 305, -40, -190, -113, 782, 157, 1349, 544, 488, 362, 470, -63, 877, -151, -692, 100, -816, -947, -550, -116, 55, -265, -1388, -512, 554, 1054, -929, -154, -397, -616, 622, -224, -789, -329, 101, -2, 186, -519, -51]
7850e1m91M6P51o80o1N01K09k55j124L81M33M5J105j844J171j71j33O21j272J407
7870E88N02j386p77R24l40P77K71l61P85q83K93J22k43N18q04P0L19k13m56J73
7890a21P8o6N1o36J564j309K59J04q05Q89q7n17O97k52J10o40J309m35M0l40Q
7911i9Q41p90M53q45L13o4L64m73J888j471O40j69j13j15j167M55K84n90N72j25
7931b11k77j056J879m72M00m58n10J127r38K22K78q27j34J315M39r49p64R35K
7950AN24q26R6o82j91J143RO78o50J72o11K46L68p42n5P98J37n69m78MJ102o81
7972b07J042q61O4O71m43j56p40O34K34N77j030k95L63K97l43l86J353j192O41
7991B23K03n30J68j199J469k75O31j119J201j107P28p59J98J34Q80k286K617j327
$$ y = [-51, -542, -496, 255, -425, -486, 15, 224, -31, -1155, -774, -341, -296, 809, -1035, 136, -35, -168, 453, -819, 588, 1090, -296, -1073, -149, -489, 288, 559, 198, 983, 100, 393, 515, 272, 790, -14, 56, 375, 162, -294, -121, -43, -109, -58, -694, 870, -439, -180, -76, -881, 8, -79, -596, 101, -151, -41, -681, 628, 193, 233, -107, -99, 742, -48, 405, -440, -127, -191, 173, -300, 1588, 117, 757, 588, 475, 360, -807, -352, -68, -658, -86, -211, -488, -1544, 335, -137, 263, -195, -705, 422, -516, -294, -16, -843, -977, 338, 777, -172, -936, -1, 1, 525, -301, -205, -887, -1078, 65, 74, 752, 102, 274, -337, -91, 277, -465, -520, 278, 415, -154, -632, -628, 474, -207, 835, -26, 38, 709, 266, 110, -630, 4, 238, 815, -215, -510, -147, 150, -193, -579, 774, -418, 223, 426, -104, 64, -1135, 334, 59, 690, -429, 772, -335, 393, -366, -168, -34, 846, -1440, 1177, -150]
8009a50N79m79j95J076j584Q51j10J55n37K05o67N83R46r35lp8O6P51J21n35L16
8030C76q23J019l18q09J131m51l47J074n25j044J399r96n8L59N82q82P70m13L75
8049D19n81O42j166J320q25K28J48j87M04o5l29n95K63J547j295M51J52j889J962
8068F04L3Q54j737j67N22j368R96K72L3j89N90m93O00m55m32Q7j96O18O36j446
8088f38J63P77j549J043l14J92l19R84P01q56N1n27j008J981q89Q05j218K89M66
8107A34j35M11N1L11j310Q23q59M72j32p62o4J429K56k038K206o12q94K77Q7L12
8127c7n62N76O23r81J31R6MJ412p30l21q78J228J42q88L98N6nn20O59m48K37k05
8149a3j367P73K71l54N95Lj189J204j65J023j627J63K31j24J053j042J106m89
$$ y = [-150, 429, -50, -245, 831, -753, 98, -12, 143, -394, -189, -856, -273, 673, -262, -265, -343, -277, 474, 595, 60, 376, -447, 572, 254, -555, 576, 125, -222, 852, 327, -717, 682, -314, -372, -13, 569, -313, 457, 44, 419, -162, 480, -686, 634, -191, 37, 185, -2, 402, 337, 8, -587, -324, 1223, -72, 379, 531, -1358, 604, 637, 1491, -246, -413, 109, -1259, -263, 9, 42, -147, 443, -50, 550, 95, -337, -250, -446, 172, 808, -638, -475, 302, -1247, -204, -518, -326, -645, 339, 1040, 184, 235, -292, -1300, 681, -208, 597, -621, -332, 134, -1, 410, 461, 772, -538, 285, -574, -102, -234, -996, -1060, 369, 625, -1413, 793, 181, -713, -436, -349, -37, -599, -23, 600, -381, -250, -154, -150, 1262, 532, 211, -667, 561, 703, -185, 213, 269, 264, -256, 403, -45, 192, -13, -1380, -607, -336, -690, -95, -92, -1281, -77, -242, 781, -846, -683, -452, -576, 477, -565, 541, 52]
8167E2o9j211J494K23j60j71j022K018j331p77j24J779o87L65o0m52n95J157j42
8186B87j410R40O65l18L69
$$ y = [52, -17, -1228, 266, 489, 329, 158, -864, 1154, -177, -954, -1078, 701, 14, 379, 319, -133, -728, 429, 287, -1123, -183, 482, 164, 533]
8191E33
$$ Imaginary data points
##PAGE= N=2
##DATA TABLE= (X++(I..I)), XYDATA
0@%%%%%%%%%%%%%%%%%%%%%pJ09k30K56k56K56k56K56l01M14m97N14n57O61p52
36c90Q27r30J042j157J286j430J584j751J931k138K364k605K871l159L474l832
52b013M225m659N153n712O348p082P944q958J0183j1712J3646j6191J9733k4949
66a4044L3361m9118Q7993l42269m14105R91881j32949o40407O14492L06271o90074
77b48968L01432N60301n86854k28408O04907k57880n17178M17974J66608n12310
87c00376J67559M41120l19411j70069M58824p9074m34271K38220J84820m63041
97b75699q724M04970k55743k13847M87193L1245l84140L22453K49501m76241K5222
108i3810L81723l78594k32180M52787j03868l66041M06589J87723m22815J70673
$$ y = [0, 0, 0, 0, 0, 0, 0, 0, 0, 0, 0, 0, 0, 0, 0, 0, 0, 0, 0, 0, 0, 0, -7, 102, -128, 128, -128, 128, -128, 128, -173, 241, -256, 258, -299, 362, -390, 437, -493, 549, -608, 678, -752, 832, -919, 1012, -1126, 1238, -1367, 1504, -1655, 1819, -2013, 2212, -2447, 2706, -3006, 3342, -3740, 4204, -4754, 5429, -6283, 7363, -8828, 10905, -14044, 19317, -29801, 58192, -284077, -698182, 293699, 160750, -479657, 134835, 441106, -248968, 52464, 612765, 25911, -202497, 402410, 144530, -372648, 45326, 211934, -300376, -132817, 308303, -11108, -181177, 277647, 198573, -235698, 2522, 187342, -275699, -284423, 120547, -135196, -349043, 138150, 169395, -214745, 107708, 357209, -119032, -93810, 287913, -90681, -322861, 129926, 26058, -339983, 66606, 254329, -168486, 2187]
118B187L55046l81437j41224L79837j91628l41935L14972J02858l47195J67104
128h1415L24759k46392p3492L50323j00963l02497K20964R1964l69068L9219K98722
139A52124k31030j43813L78178o609l11249K44386J80318l82811j1499L00258
149A68253k77919k12960L55703k4330l06609K86013K15508l19268O9884L19021
159B73296k51817j80472L02774p4198l03243K16629J55375k69633P1202K95081
169B34994j62163j26273K60586l6813k75726J19377J05148k66699j9642K35107
179F7896j18833j23141K53784M5515k13152J29119J41137k42446n1188J98635
189H7326j50752j64784K24078L0990j90685J65027J73957j87194J0265K02488
$$ y = [2187, 357233, -24204, -165428, 214409, 22781, -319154, -4182, 98676, -248519, -81415, 243344, -3048, -76540, 273783, 172820, -129677, 91287, 183251, -185817, -146598, 152124, -78906, -222719, 155459, 148850, -162399, 81987, 262305, -120506, -132005, 168253, -109666, -322626, 33077, 8747, -297862, -11849, 203659, -115609, -45725, 273296, 21479, -158993, 143781, 69583, -233660, -17031, 138344, -131289, -60087, 234994, 72831, -53442, 207144, 170331, -105395, 13982, 119130, -147569, -167211, 67896, -50937, -174078, 79706, 125221, -87931, 41188, 182325, -60121, -111309, 87326, -63426, -228210, -4132, 26858, -163827, 1200, 175157, -12037, -1772, 200716]
199B00716j48256j51723J66749l7657k11020J22352J16218j65559M2303K06454
209A40577r3540q8072J78036k5045j94560P9613P4170j88069p038J72105p9040
220c0863p8664J91923L5423j53106R3517J00363j82035m5301J40287j08516j27864
231a64836J57363L5724j46761J07720J43157j36592k2433J57279r3636j43270
241a06285J18012J0610j67755O7832J28808j08474p083J74792l5294j05876J15802
252H5089K3716j63935J9937Q9129j20181m4992J41735j6071q4648J21130O3716
263A14625j17736K4165Q5947j13019p3641R1684l7107j02434R0828O5567q2429
274e3550M4684J10639o3399m7389Q8121l6906j12611M5226K9815r7616J7908J01152
$$ y = [200716, 52460, -99263, 67486, 29829, -181191, -58839, 57379, -108180, -65877, 140577, 47037, -41035, 137001, 111956, -82604, -2991, 71179, -116890, -123928, 48177, -30863, -109527, 82396, 117819, -35287, 58230, 158593, -23442, -68743, 71544, -36972, -164836, -7473, 28251, -118510, -10790, 132367, -4225, -26658, 130621, 36985, -106285, 11727, 22337, -145418, -77586, 51222, -57252, -64335, 110457, 75163, -30713, 85089, 108805, -55130, -35193, 53936, -66245, -111237, 30498, 14427, -70221, 50909, 114625, -3111, 21054, 107001, -6018, -79659, 12025, -25082, -127516, -36688, 28879, -53550, -8866, 101773, 38374, -9015, 79106, 42200, -70411, -25185, 4630, -92986, -75078, 26074]
286B6074l9523j9189J10239L228p9711M8383K6973j10533j6308O2705o3399m3979
298i5040R4676J5600n5872P3499O0926p5812l009O0906p1347p0540N6274j0507
310b0246p5789N4933O5294n1693J8223Q9232l1835n2396N3191r541r2578J6350
322c6855M0259o2661n741Q6497o868l3457P1437K5657o8745Q876L7172p0054m3382
335e7865N3255j6754n1860N9924M8754m8182K2274O6876m4064m5769M5534k0844
347A1279p9417K5873L2434n1752J1187P8867j0576k4081O3159Q990o7368J0349
359H944K3943o8290k6374N1016j3243l1239O1171L7178l5761K2874M6129m7808
371B8540l6243L2964k8219o2010K9602K6488m1842K3183O7372j6733j4888N5079
$$ y = [26074, -13449, -32638, 77601, 80829, 1118, 49501, 76474, -34059, -50367, 12338, -51061, -95040, -364, 15236, -40636, 32863, 93789, 17977, 14968, 75874, 4527, -66013, -9739, -20246, -96035, -41102, 24192, -27501, -9278, 79954, 48119, -4277, 48914, 39373, -53205, -36855, 3404, -59257, -64998, 21499, 14631, -18826, 52611, 78268, 9523, 18399, 55571, -14483, -57865, -4610, -21364, -73224, -13300, 35454, -12728, 9546, 76422, 32358, -13411, 32123, 11279, -68138, -42265, -9831, -61583, -50396, 28471, 17895, -6186, 56973, 65963, -1405, 8944, 32887, -35403, -61777, -10761, -24004, -55243, 5928, 43106, 7345, 30219, 76348, 28540, -7703, 25261, -2958, -64968, -35366, -8878, -50720, -27537, 39835, 23102, 8214, 63293]
383F3293r332o0415J3230Q797o6871q403M7656k3440j4951O7316J8892l5008L4367
396C5131L0032n9903k1349L2667m2274m6812M4757J4341l7662M0744O0028l2928
408A6772l487N6190k8549n8561L1826J591p1644J5992N2569l9016m407P6760m613
421D1423m3249M8576J5582p7884j935L7285o1026l2254O4113q17m1563O0754M5322
434E4327n4467R000N3906n5240m8846M7509j5388o5414M1648M7344m6834J5809
446a6646Q0495k8114l9027N9158o303q6146K2194L3498p5003o520P8829k4842
458h427l0746Q3323J8818o7306L4403M0645q4102k6366N9549m6377n4123P3195
470g514K2002n8647N2241O6402o0446j3450O5152m7469p1401M9751K856q0249
$$ y = [63293, 53961, -6454, 6776, 15573, -51298, -59701, -12045, -35485, -50436, 16880, 35772, 764, 35131, 65163, 5260, -16089, 16578, -25696, -72508, -27751, -13410, -51072, -10328, 49700, 16772, 13285, 69475, 40926, -17635, 14191, 15782, -55862, -39870, 12699, -26317, -30724, 46036, 41423, -1826, 46750, 62332, -15552, -17487, 19798, -41228, -73482, -9369, -10186, -51749, 9005, 54327, -140, 8860, 62766, 7526, -41320, 6189, -9199, -74613, -32965, 14379, -32455, -16646, 63849, 35735, -3292, 55866, 49563, -36583, -14389, 19109, -55894, -62414, 16415, -8427, -39173, 44150, 62968, -4338, 30065, 70710, -13392, -39758, 19791, -26586, -80709, -7514, 14488, -44159, 8082, 74484, 14038, 588, 65740, 18271, -53130, -3379, -523, -80772]
482h0772L2276O7172n0400L29R0201j8744n5896N7905J2739r3199J2125N2330
494B6066p2703k1090Q8636j1330n1256Q1066L4778p8634K1330N9272q2130m2595
506d8590P2638l5395p1064P4495L6093p2717L9191P9693o4318k9969P6794l6161
518B0690q4843N5441K3135q5766K6091Q2931n1934j9968R6721j2216p5089N7296
530C2489K4990j00478M405O9187o6583l5955R6927k853o7165P3562M7902q9436
542a3008P487P0256p6726n4928Q1245j5726p8203O9647N6383p4510K3616Q9335
554H4868o0274m9071P9043k2770r5268N0019L8394q7449J5103R1810m7414l3838
566c6847R5037o011q4500M8075L6179j00075m990P5474n6385m1700R5079Q191
$$ y = [-80772, -48496, 18676, -31724, -31395, 58806, 40062, -15834, 42071, 54810, -38389, -26264, 26066, -46637, -67727, 20909, 9579, -41677, 39389, 74167, -4467, 16863, 76135, -5995, -48590, 24048, -11347, -82411, -7916, 28177, -44540, -5349, 74344, 10026, -19943, 56851, 20690, -64153, -8712, 14423, -71343, -45252, 37679, -14255, -34223, 62498, 50282, -24807, 32489, 57479, -42999, -38594, 30593, -35990, -71945, 24982, 22129, -45036, 28526, 76428, -13008, -5521, 64735, -11991, -66919, 14326, -1400, -79603, -9956, 46427, -28083, -4467, 84868, 24594, -24477, 54566, 31796, -63472, -13453, 24941, -62508, -47405, 44405, -3009, -36847, 58190, 52179, -32321, 15754, 51933, -48142, -53132, 22342, -34043, -75743, 19336, 27527]
578B7527p1065O6554N5165q6404j645P6047o5932o3032P9416k920q5142O2895
590h536O4243p7782O662R4193n4815o1214P9156j1594j00871M9341N1194q8872
602e8895O350R9142m4690m6352R5406O0q9727M7468M3721r3255p636Q3527m9041
615a3922m8853R1183J3534p5591N1352N5922q3507j5186P5538n4546o5139P4445
627E230J1047q2706N1367P0462p1032n839Q8937m4903p0235P3086M936r6643L8913
640b7380O3839p6060k666R8944l3988n6463Q4223R283r3940L4026M8751q7239
652c8670j7050Q3044l7008n2408Q4640K0358p4880L9943N8954p7631k2096P1099
664C8295m2830o7040P0262K1674p4737L9359P2804o0504j5731Q3464l4706o8883
$$ y = [27527, -43538, 23016, 78181, -8223, -9868, 66179, 247, -62785, 16631, 13711, -71431, -8536, 55707, -22075, -15413, 78780, 23965, -37249, 41907, 30313, -70558, -21217, 29977, -58895, -52545, 46597, 1907, -44445, 50961, 51021, -38706, 8762, 52483, -40772, -48408, 35119, -13922, -62775, 28408, 41942, -33649, 17703, 73625, -9882, -25068, 50470, -4076, -69215, 5230, 16277, -66429, -15062, 55400, -15632, -21471, 67466, 22563, -47672, 25414, 30350, -66293, -27380, 36459, -39601, -42267, 56677, 22689, -33774, 50449, 59732, -34208, -182, 48569, -38670, -55720, 27324, -9684, -62092, 22548, 42906, -31974, 7969, 66923, -10708, -32804, 38295, -4535, -71575, -1313, 20361, -54376, -15017, 57787, -2717, -18448, 65016, 30310, -38573]
676c8573N9486J2768q9932K6400O6464o7515j3454R1726k3720n9176P0529J7585
688E2588q9154K3845N4076p5571k3130Q1475k6460n2596P5146K5450p1795L0305
700D179N7913o8308k5992O6641l1019o2696N9048K7396o7272K7899O7940n2290
712C439k3999O9915k4076o8752M8302K0449p6795J6865O5614m9875j9167Q0234
724D2154j2116o0068N5953K2163p9827J1852N2875n8546k7469P4514j3329m9968
736d1812O0886L0739o4989J5423N3923n7073l2963N6469j9939n6843M7758L1505
748B3084n5344J7988O4450m1419k6863N7532j4085o2646L4139K5305o4429O673
760c5615O0825l4463k4914O8787p32n4579L9961K5059o5787j056N0725m5886k9906
$$ y = [-38573, 20913, 33681, -56251, -29851, 36613, -30902, -44356, 47370, 23650, -35526, 35003, 52588, -36566, -12721, 41355, -34216, -57346, 24129, -2331, -54927, 20219, 45669, -26126, 4179, 62092, -6216, -32208, 34433, 3414, -59282, -234, 27162, -40110, -12211, 55729, 3439, -20560, 49355, 25279, -43473, 4829, 25278, -51517, -34652, 30962, -18913, -38080, 42154, 30038, -30030, 25923, 48086, -31741, -19889, 32986, -25560, -53029, 21485, 8156, -41812, 19074, 49813, -15176, 247, 54170, -2903, -35866, 20603, 664, -56179, -8421, 23084, -32260, -14272, 50178, 8759, -18104, 39428, 25343, -37303, -3164, 22141, -42288, -35615, 25210, -9253, -34167, 34620, 33888, -20691, 19270, 44329, -21458, -22514, 28211, -17675, -47581]
773d7581O0612q47m8149M5373L5155n4436N212M8674m2014l5995M8503q408n1221
786d5122L4499L1563m3177Q098N2973k8499k8692M5108m506n3563K2797K7274
798A8753m7932r20N2437k2491k5398N0903P212m6976K2811K7766n0514j0540M3681
811A8792k7017l0746M7117R948m1903K9132L2977m1522o078L9765k7787l6553
823c3875L6245L552m3244K2528L7261l2958j873M4995j5418l1728L2285L572m6267
836b4925J2994K6065l4311o904M2874q864k4462L6574J1255l7661R556K5085l6654
849i378j5689L1750j2199k9443L2753J8253l1874J4806L3184k7967j3673L1425
861B1948j1417l4313K2907J0686l2919R147L2299k0489r633L6447o332k9874K0549
$$ y = [-47581, 13031, 12184, -35965, 9408, 44563, -9873, -4661, 44013, 1999, -33996, 14507, 6099, -45122, -10623, 20940, -22237, -14139, 38834, 10335, -18357, 26751, 22245, -31318, -8521, 18753, -29179, -30099, 22338, -153, -25551, 25352, 32564, -14412, 8399, 36165, -14349, -24889, 18792, -8225, -38971, 8146, 18094, -23809, 5323, 38300, -3222, -9300, 30465, 2678, -33875, 2370, 5922, -37322, -14794, 22467, -10491, -12364, 32631, 17213, -14515, 17770, 21342, -24925, -11931, 14134, -20177, -27081, 15793, 6929, -17533, 19041, 30296, -7365, 2191, 27276, -9378, -25067, 6683, -5516, -34959, -2206, 16047, -15827, -1021, 32163, 4196, -9477, 21948, 10531, -23782, -875, 9811, -23108, -13961, 18338, -2151, -11784, 24663, 18331, -11543, 9006]
874I006J0257l5553l1K5711k0935j4115L1573J640k4955K1643J7630k8243j343
887g715K5066k0677j8308K6275J095k6387J9582K1972k3346N40K7187j4969k0601
900a0286K3861j405l0393J1436J7247k2225l090K9051q370j6961K2695L814k6916
913a1542O313J5905k4253p568K5237q235j5885K4020J1417k0670Q499K0660k1596
926B302j1615J9738o872k2171J5802J1137k1205O510K3166j2283j1274K3752m701
939A2286k4078J1796Q199k3149p61K2462j2634j0973K6125K717j9314J4165J3657
952B0498k3031k913J7639j3441j6202J9627L775k1014J2710J7915j6134n503K1112
965A5038r943j8349J4829L332k2235N671J8652j6901l478K4136m797j6748J7776
$$ y = [9006, 19263, -16290, -16321, 9390, -11545, -25660, 5913, 7553, -17402, 4241, 21871, -6372, -7715, 17351, -3326, -21634, 4641, 5736, -20651, -1069, 20903, -2443, -1903, 25284, 10315, -10286, 13575, 12170, -18223, -6787, 10460, -11765, -14855, 14196, 5826, -11135, 11560, 15374, -11542, -5229, 10676, -13577, -21145, 4092, -4143, -20028, 3992, 15409, -5261, 3238, 23898, 2302, -9313, 10425, 3553, -18618, -2816, 8321, -12884, -6374, 16792, 4509, -6765, 16987, 12286, -11792, 4, 8203, -14946, -15707, 6755, -5879, -16852, 9273, 11990, -7324, 6841, 20498, -2533, -5446, 12193, -1248, -17450, 2177, 5952, -15062, -2352, 15563, -571, -6074, 15038, 5095, -13254, 1575, 4907, -17328, -11657, 6995, -9906, -13384, 10752, 5955, -10793, 6983]
978F983P360k3865M810J7748j7868j0095K4969k189j9067J9045J1069k2678K319
991a459J9545j8645j4264K2655m394k2869J5454J3876k0385L622K1922j3085j4235
1004a2262K0491j700k3881J2291J3142k2485J165K3607r214j2704K3709M994k3854
1017f701J0309J4140k4000o100K2036j1372j7104K1828P414k1985J1131K0838
1029B0434k1824o164K3615j1855k2787K0830N127k6290J2035K0207j9948m186
1041a0806K7940q475j9976K1387N359k8386M867K0053k0244q716K6262m328k1433
1054a6496K0698J1609k5215M960K2293k2224j2734K4498l061k3891J9431J3533
1066A3401k4576O033K5168j8662j4342K7383m489k7494J9559J3282k8632M236
$$ y = [6983, 14343, -9522, -4712, 13036, -4832, -14927, 10042, 7853, -11214, 7831, 18900, -3778, -1459, 18086, -559, -14823, 7832, 3438, -19431, -3977, 9899, -10486, -6864, 15058, 1973, -12262, 8229, 6529, -17352, -5061, 8081, -14404, -13239, 10368, 1154, -11550, 12159, 17153, -6701, 3608, 17748, -6252, -12352, 9684, -1688, -18792, 3036, 10450, -11535, -404, 20434, -1390, -7554, 16061, 4206, -18581, 2249, 7376, -18914, -6879, 13328, -6620, -10806, 17134, 8659, -11317, 10070, 15429, -12957, -8090, 11963, -8281, -16997, 9265, 4937, -16496, 4202, 15811, -9404, -4444, 17849, -4375, -17109, 7389, 4328, -19563, -132, 13401, -11175, -5142, 20026, 1364, -12978, 14405, 9916, -17578, 1981, 15263, -13369, -9133]
1078i133K6998j7878j5021K9513l124k7453J8491J2883k8679J315K4984j7456
1090d560j4709K9385j05k5879J7449J6522k7512m48K6143j6728j9970K7939K248
1103I775k7864J6769K1179k8833K55L0392j7027k0134K7399L32l1807J5458K0138
1116A6032k9261j328L2137j6162j8515K9975J922l0646J7065J7690l0291l033
1128a4415K9687j4814k0434K8197M561k9609J5750K1602k6983m935K9333j4250
1140C690k2363K5176M517l0131J3389K2900k6027n661L0651j0788k3432K6830
1152H751P374l2648J2528K4281k7902p821L1646j2412k4696K8705P163l1398J2825
1165c604K3611k7292p710L0654j1876k3018K4995Q661l1990J1510K4030k4970
$$ y = [-9133, 17865, -13, -15034, 14479, 11355, -16098, 2393, 15276, -13403, -12088, 12896, -4560, -19269, 10116, 10011, -15868, 1581, 18103, -9409, -9857, 16286, -442, -20412, 7527, 9775, -18089, -1320, 19859, -8974, -8719, 21673, 4646, -15488, 11911, 12243, -19564, -4106, 16032, -13229, -14557, 17580, 1418, -17097, 12878, 14800, -15846, 1219, 18909, -11382, -14415, 15272, 458, -19976, 8221, 12782, -16827, -1077, 20525, -6458, -11393, 17940, 3690, -18673, 6503, 11020, -19111, -5722, 17178, -8849, -14510, 16141, 5353, -18079, 8751, 16125, -16523, -3995, 20286, -7616, -15437, 16209, 3797, -20899, 7806, 14969, -16429, -3604, 20007, -7285, -14995, 15659, 3783, -19235, 5760, 14421, -17569, -6059, 17971, -6999]
1177f999q001L0278r199k4363K4748R120k8882Q830K5174k5463j0493L0993r366
1190F377k3537K2519J1594l1541P687K6535k4205j1140L0273p188k5903K3009
1202D480R994l0579P983K6567k4166j1944L0119o468k6460K4314J1647l0044Q440
1215f117K4786k2561j0191K8250n849k4885K0002J3203k9528M835K5845k1225
1227c435j1936K8204n689k4527K1121J3257k8445L846K6078k0907j2954K7117
1239A1730l487k7068J9334J4865k6438L719K6270j9068j4229K8142m309k7391
1251a7930J9200J3173k8706L078K6166j8688j3141K7517j314k5246J8796J4240
1263A7145k7765J075K4022j7729j4008K5495q64k3312J7098J6688k4751K155K2795
$$ y = [-6999, -15000, 15278, 6079, -18284, 6464, 15584, -13298, -4468, 20706, -4757, -15250, 15743, 6377, -17160, 5359, 16953, -14588, -6901, 19634, -4571, -15711, 14562, 7374, -18529, 4480, 14474, -16105, -8122, 18445, -5721, -17665, 12454, 5986, -20474, 3840, 15487, -14557, -6117, 18669, -3892, -14083, 14167, 8318, -16567, 3435, 16638, -12890, -8055, 17790, -3435, -15371, 12833, 7144, -17383, 3738, 16995, -11450, -7604, 18474, -2433, -15387, 11730, 8243, -18825, 509, 15374, -11064, -7345, 18925, -143, -14372, 13770, 9461, -17930, 1270, 14443, -14263, -11185, 14981, -3707, -16848, 10669, 9355, -15891, 2905, 17145, -10620, -9545, 14477, -3252, -17260, 8235, 7371, -15941, 1157, 17845, -6906, -4751, 18044]
$$ [...]
8191c62
##END NTUPLES=NMR FID
##END=
