##TITLE=1H_UK-23_9_15
 CD2Cl2
 64 sc, 
 20.2.2023
##JCAMPDX= 6.0         $$ Bruker NMR JCAMP-DX V2.0
##DATA TYPE= NMR FID
##DATA CLASS= NTUPLES
##ORIGIN= UXNMR, Bruker Analytische Messtechnik GmbH
##OWNER= root
$$ XWIN-NMR		Version 3.5
$$ Mon Feb 20 13:58:40 2023 Russian Standard Time (UT+4h)  she@DPX200
##.OBSERVE FREQUENCY= 200.13135
##.OBSERVE NUCLEUS= ^1H
##.DELAY= (6, 6)
##.ACQUISITION MODE= SIMULTANEOUS
##.ACQUISITION SCHEME= undefined
##.AVERAGES= 64
##.DIGITISER RES= 18
##SPECTROMETER/DATA SYSTEM= spect
##.PULSE SEQUENCE= zg30
##.SOLVENT NAME= CD2Cl2
##.SHIFT REFERENCE= (INTERNAL, CD2Cl2, 0, 15.7039)
##AUDIT TRAIL= $$ (NUMBER, WHEN, WHO, WHERE, WHAT)
$$ ##TITLE= Audit trail, XWIN-NMR		Version 3.5
$$ ##JCAMPDX= 5.01
$$ ##ORIGIN= Bruker BioSpin GmbH
$$ ##OWNER= she
$$ F:/spectra/data/she/nmr/H-F/1/audita.txt
$$ ##AUDIT TRAIL=  $$ (NUMBER, WHEN, WHO, WHERE, WHAT)
(   1,<2023-02-20 13:57:30.51 +0400>,<she>,<DPX200>,
      <continue with go, POWCHK disabled, PULCHK disabled
       configuration hash MD5:
       00 E9 B6 7A A2 85 ED C7 34 08 36 98 17 FE 4E 26
       data hash MD5: 16K
       30 AA 6A 47 43 93 F0 FB 5F BA 34 D8 6B BB 41 9C>)
$$ ##END=
$$ 
$$ hash MD5
$$ 72 DD F3 93 04 63 09 15 BE DC 00 C6 96 3D BB 01
##$RELAX= 
##$RELAX= 
##$RELAX= 
##$RELAX= 
##$RELAX= 
##$RELAX= 
$$ Bruker specific parameters
$$ --------------------------
##$DU= <F:/spectra>
##$EXPNO= 1
##$NAME= <H-F>
##$PROCNO= 1
##$TYPE= <nmr>
##$USER= <she>
##$AMP= (0..31)
100 100 100 100 100 100 100 100 100 100 100 100 100 100 100 100 100 100 
100 100 100 100 100 100 100 100 100 100 100 100 100 100 
##$AQSEQ= 0
##$AQ_mod= 1
##$AUNM= <au_zg>
##$AUTOPOS= <>
##$BF1= 200.13
##$BF2= 200.13
##$BF3= 200.13
##$BF4= 200.13
##$BF5= 200.13
##$BF6= 200.13
##$BF7= 200.13
##$BF8= 200.13
##$BYTORDA= 1
##$CFDGTYP= 0
##$CFRGTYP= 5
##$CHEMSTR= <none>
##$CNST= (0..31)
1 1 145 1 1 1 1 1 1 1 1 1 1 1 1 1 1 1 1 1 1 1 1 1 1 1 1 1 1 1 1 1 
##$CPDPRG= <>
##$CPDPRG1= <>
##$CPDPRG2= <>
##$CPDPRG3= <>
##$CPDPRG4= <mlev>
##$CPDPRG5= <mlev>
##$CPDPRG6= <mlev>
##$CPDPRG7= <mlev>
##$CPDPRG8= <mlev>
##$CPDPRGB= <>
##$CPDPRGT= <>
##$D= (0..31)
0 1.2 0 0 0 0 0 0 0 0.06 0 0.03 0 0 0 0 0.0002 0 0 0 0 0 0 0 0 0 0 0 0 
0 0 0 
##$DATE= 1676886786
##$DBL= (0..7)
120 120 120 120 120 120 120 120 
##$DBP= (0..7)
150 150 150 150 150 150 150 150 
##$DBP07= 0
##$DBPNAM0= <>
##$DBPNAM1= <>
##$DBPNAM2= <>
##$DBPNAM3= <>
##$DBPNAM4= <>
##$DBPNAM5= <>
##$DBPNAM6= <>
##$DBPNAM7= <>
##$DBPOAL= (0..7)
0.5 0.5 0.5 0.5 0.5 0.5 0.5 0.5 
##$DBPOFFS= (0..7)
0 0 0 0 0 0 0 0 
##$DE= 6
##$DECBNUC= <off>
##$DECIM= 32
##$DECNUC= <off>
##$DECSTAT= 4
##$DIGMOD= 1
##$DIGTYP= 9
##$DL= (0..7)
0 120 120 120 120 120 120 120 
##$DP= (0..7)
150 150 150 150 150 150 150 150 
##$DP07= 0
##$DPNAME0= <>
##$DPNAME1= <>
##$DPNAME2= <>
##$DPNAME3= <>
##$DPNAME4= <>
##$DPNAME5= <>
##$DPNAME6= <>
##$DPNAME7= <>
##$DPOAL= (0..7)
0.5 0.5 0.5 0.5 0.5 0.5 0.5 0.5 
##$DPOFFS= (0..7)
0 0 0 0 0 0 0 0 
##$DQDMODE= 0
##$DR= 18
##$DS= 0
$$ [...]
##$SUBNAM2= <"">
##$SUBNAM3= <"">
##$SUBNAM4= <"">
##$SUBNAM5= <"">
##$SUBNAM6= <"">
##$SUBNAM7= <"">
##$SUBNAM8= <"">
##$SUBNAM9= <"">
##$SW= 18.05172834244
##$SWIBOX= (0..15)
0 0 2 0 0 0 0 0 0 0 0 0 0 0 0 0 
##$SW_h= 3612.71676300578
##$TD= 16384
##$TD0= 1
##$TE= 0
##$TE2= 300
##$TE3= 300
##$TEG= 300
##$TL= (0..7)
0 120 120 120 120 120 120 120 
##$TP= (0..7)
150 150 150 150 150 150 150 150 
##$TP07= 0
##$TPNAME0= <>
##$TPNAME1= <>
##$TPNAME2= <>
##$TPNAME3= <>
##$TPNAME4= <>
##$TPNAME5= <>
##$TPNAME6= <>
##$TPNAME7= <>
##$TPOAL= (0..7)
0.5 0.5 0.5 0.5 0.5 0.5 0.5 0.5 
##$TPOFFS= (0..7)
0 0 0 0 0 0 0 0 
##$TUNHIN= 0
##$TUNHOUT= 0
##$TUNXOUT= 0
##$USERA1= <user>
##$USERA2= <user>
##$USERA3= <user>
##$USERA4= <user>
##$USERA5= <user>
##$V9= 5
##$VALIST= <valist>
##$VCLIST= <CCCCCCCCCCCCCCC>
##$VD= 0
##$VDLIST= <DDDDDDDDDDDDDDD>
##$VPLIST= <PPPPPPPPPPPPPPP>
##$VTLIST= <TTTTTTTTTTTTTTT>
##$WBST= 1024
##$WBSW= 4
##$XGAIN= (0..3)
0 0 0 0 
##$XL= 0
##$YL= 0
##$YMAX_a= 968832
##$YMIN_a= -775819
##$ZGOPTNS= <>
##$ZL1= 120
##$ZL2= 120
##$ZL3= 120
##$ZL4= 120
##$ABSF1= 10
##$ABSF2= 0
##$ABSG= 5
##$ABSL= 3
##$ALPHA= 0
##$AQORDER= 0
##$ASSFAC= 0
##$ASSFACI= 0
##$ASSFACX= 0
##$ASSWID= 0
##$AUNMP= <proc_1d>
##$AZFE= 0.1
##$AZFW= 0.1
##$BCFW= 1
##$BC_mod= 2
##$BYTORDP= 1
##$COROFFS= 0
##$CY= 11.3945322036743
##$DATMOD= 1
##$DC= 2
##$DFILT= <>
##$DTYPP= 0
##$F1P= 2.36226072786647
##$F2P= -0.459571619588291
##$FCOR= 0.5
##$FTSIZE= 0
##$FT_mod= 4
##$GAMMA= 1
##$GB= 0.15
##$INTBC= 1
##$INTSCL= 1
##$ISEN= 128
##$LB= 0.24
##$LEV0= 0
##$LPBIN= 0
##$MAXI= 10000
##$MC2= 0
##$MEAN= 0
##$ME_mod= 0
##$MI= 1.114404
##$NCOEF= 0
##$NC_proc= 0
##$NLEV= 6
##$NOISF1= 3.799351
##$NOISF2= 2.8
##$NSP= 1
##$NTH_PI= 0
##$NZP= 0
##$OFFSET= 15.70392
##$PC= 1
##$PHC0= -19110.08
##$PHC1= 15.40078
##$PH_mod= 1
##$PKNL= yes
##$PPARMOD= 0
##$PSCAL= 0
##$PSIGN= 0
##$REVERSE= no
##$SF= 200.130013532006
##$SI= 16384
##$SIGF1= 3
##$SIGF2= 2
##$SINO= 400
##$SIOLD= 16384
##$SREGLST= <1H.CDCl3>
##$SSB= 0
##$STSI= 0
##$STSR= 0
##$SW_p= 3612.71676300578
##$SYMM= 0
##$S_DEV= 0
##$TDeff= 0
##$TDoff= 0
##$TI= <>
##$TILT= no
##$TM1= 0
##$TM2= 0
##$TOPLEV= 0
##$USERP1= <user>
##$USERP2= <user>
##$USERP3= <user>
##$USERP4= <user>
##$USERP5= <user>
##$WDW= 1
##$XDIM= 8192
##$YMAX_p= 0
##$YMIN_p= 0
$$ End of Bruker specific parameters
$$ ---------------------------------
##NTUPLES= NMR FID
##VAR_NAME=  TIME,          FID/REAL,        FID/IMAG
##SYMBOL=    X,             R,               I
##VAR_TYPE=  INDEPENDENT,   DEPENDENT,       DEPENDENT
##VAR_FORM=  AFFN,          ASDF,            ASDF
##VAR_DIM=   8192,          8192,            8192
##UNITS=     SECONDS,       ARBITRARY UNITS, ARBITRARY UNITS
##FACTOR=    0.0002768,     1,               1
##FIRST=     0,             0,               0
##LAST=      2.2672688,     0,               0
##MIN=       0,             -775819,         0
##MAX=       2.2672688,     968832,          0
$$ Real data points
##PAGE= N=1
##DATA TABLE= (X++(R..R)), XYDATA
$$ [...]
2595A59M76k419q8L172j238j587L299n11k805K025J713l402J36K344k036j504
2611b266K485J353l229K277K359l232o56K278n83l063K617P98l841Q34M277k799
2627c91j132K798N36l213J523K305m213k12K614j437l041L277K447l638J945K340
2643B508j961j213J976Q4m033K114J501j909j122L010j597o89L637m51l538J616
2659f7J761j721j476K118o00j600J703P61j248Q6J436j485K12K25K83j695J584
2676B77l30o87P26L07k36N32L80k16j524J359J34j334R4N43j055J063J276r49
2694C60m54J191j65o21N88m31k332P67N76o45R64L37P92j112J554l55j568J396
2712H42O60j890q92K200j915j410L489n5k427K409J510k670N1J618j283k735K497
$$ y = [159, 635, -1784, -1872, 1300, 62, -1525, 1774, 1263, -1542, 483, 2196, -1206, -1070, 1274, -762, -2266, 219, 1572, -1657, 620, 2979, -253, -909, 1369, 786, -2277, 340, 1138, -2703, -1869, 2408, -391, -1523, 1275, 1811, -1402, 121, 2426, -1787, -1999, 615, -822, -3863, -586, 1861, -1777, 168, 2508, 547, -666, 1310, 1394, -2639, -525, 976, -933, -2055, 955, -642, -1331, 2306, 1855, -1683, -67, 1694, -27, -1503, 615, 15, -1585, 118, 879, -369, -283, 1153, -332, -120, 105, 388, -1307, 277, -53, -740, -14, 293, 57, 589, 969, 753, -771, 588, 722, -612, -518, 25, -1030, 33, 1309, 360, -94, 1097, 932, 311, 899, 468, -1864, -1097, -521, -1166, -202, 135, 927, -185, 1369, 1014, -554, 842, 1502, -388, -1280, 920, -995, -2405, 1084, 1029, -1398, 1011, 2521, -149, -98, 1520, 237, -2498, -1]
2729aQ50l179J359K078j041j035L353q83k717J922J517l645k09K625j002j507
2745a515K466k2k133J027L925m517n17K360j268k000K003K69q66m7L074k133j248
2762a142L267j057j857J449q8k248R47J414o51j737L177N12k472R46P18j560q69
2779a251J397j077j081J674p3q44J828R56j272k34J182j150j005M64J09j192Q35
2796g34K49l92M09J554j628N65P93o31o4J03j11j355j79J657k113J914J257j380
2814h6J62J537n25j429K79M81j451k59J118l65j325L071m84k146K625M59k296
2831f34k19R88r13r28J535R84k378J830J961k251q86K574p34k531K243M45l028
2848a942M12L144j358j731L796r75k641K277P34k798N72J051j640j005K378Q81
$$ y = [-1, 849, -2330, -971, 1107, 66, -969, 2384, 1501, -1216, 706, 2223, -1422, -1631, 994, -8, -1515, 951, 929, -1204, -177, 3748, -769, -1286, 1074, -194, -2194, -191, 78, -788, -835, 2239, 106, -1142, 2125, 1068, -789, 660, 572, -1676, -729, 685, 34, -1703, 1474, 1986, -486, 460, 1178, -382, -1251, 146, -931, -2012, -338, -411, -1255, 573, 1529, 257, 23, 1205, 55, -950, -486, -377, -1569, -734, -485, -877, -468, 1086, -542, 23, 816, 185, 121, 224, 113, -1242, -1421, 236, -1877, 37, 1294, -86, 76, 1613, 1088, -341, -62, 419, -1032, -1291, -173, -538, -1863, 1208, 724, -1422, 1203, 1662, -634, -853, 135, -778, -1706, -171, 813, -1565, 265, 2226, -25, -911, 1663, 929, -1602, 641, 1086, -1942, -1530, 1614, 256, -1475, 2321, 1346, -1295, 982, 1716, -1082, -510, 541, -1099, -2104, 274, 1155]
2864A155k325J809J531k439k78L085j915k287R49Q68k489J771J500o04j057J673
2880I47L66j376N66J340k903K59M44m54r13J221J706j476P15J284k035Q23P54
2897A268j321j066Q85m62p14O16Q46k60L23Q23J5n15r62J461j419j18m19j5O67
2916c67P87J75M5O60m84o64M94p86p73M69J38j081M69J609p78q1J718n19j780
2935g49P52J256k804Q41M52m82p84J933K75k559K883N01j449l52J814k736j249
2952b457K655n13j556J307K577j697q32K882r07k743K282n39k066J11J616j765
2968a645l86L194L42j795N52K076k105l17J463k180j543K335M56k584K126J413
2984A402j259K81J965j074j670Q35K63k306q4J821o53j046K245J09j388J163J430
$$ y = [1155, -1170, 639, 2170, -269, -547, 2538, 623, -1664, -715, 153, -2336, -565, 935, 331, -726, 947, 1313, -63, 503, 1843, -1060, -801, -357, -811, -1724, -503, 1203, -273, 442, 1726, -309, 514, 1268, -53, -1119, -234, -696, -1410, -794, 52, -208, 115, 938, 953, 438, -524, 937, -482, -600, -1019, -1034, -367, 420, 595, 640, 1300, 816, 152, 646, -140, -913, -444, -306, -1387, -918, 691, -87, -168, 1550, 1031, -749, 3, 1259, -1545, -704, -252, -734, -1518, 415, 690, -1869, 1014, 1515, 66, -286, 1528, -1208, -2457, 198, -315, -1871, -564, 2013, 316, -516, 2366, 1459, -1284, 998, 459, -1607, -1496, 120, -1645, -2031, 1163, 1505, -290, 262, 2338, 233, -84, 1379, -801, -2344, -9, 447, -2137, -11, 1402, 143, 424, 2389, 1315, -355, 480, 743, -1563, -1647, 174, -479, -1525, 720, 829, -559, 604, 2034]
3001B034k061N4L54j005p62J098K92j809J932P73q73R04L71j221J28K14l58k15
3019a50l01J05o5L82Q51m44J79R4J34m96K39n78j570J552p39n77J559J158j666
3038c33P43N27m20r92J141l83q93n24N12l39O69J068N00j021O25J065k012l69
3056d36J124j814m47J262P8j414J452K566k220P99J197j230k584K341j8k630Q81
3073a093J968k033l34K230L25j929K279M12j862q28J147j335j173K936j31k020
3089a441K070N84p83j54J378j654p20J389l5k392J136J109j097p1K018m53r97
3106a13J231j96j281k50M58r94M40O38M59j018J187J052j487l08J109p71r09J110
3124C57j658O1N01J475m95q75K389m28j202P61o85j012P74r1j430J410k37R23
$$ y = [2034, -27, 27, 381, -624, -1386, -288, 4, -1805, 127, 900, 27, 931, 1302, 81, 209, 423, 65, -150, -451, -346, -411, -29, 822, 378, 557, 651, 785, 289, 528, -50, -1620, -68, -807, -1384, 175, 1333, -333, 410, 937, 517, -475, 666, 283, -610, -1134, -622, -961, -292, 776, 1276, 255, 880, 1945, -67, -436, 688, -1126, -1573, -311, -233, -1647, -195, 2371, 151, 950, 2147, 917, -1667, 674, 656, -1974, -1093, 875, -1158, -1492, 738, 1063, -866, 1413, 1825, -37, -865, 282, -1053, -2226, 710, 579, -1441, 629, 1213, 430, 276, 1654, 0, -720, 669, 634, -1758, -622, 487, -610, -681, 1337, 884, -113, 1118, 922, -359, -609, -151, -1145, -705, -67, 392, -626, 561, 1613, 126, -182, 927, 156, -753, 357, -1301, -1240, -739, 736, 241, -634, 1755, 1327, 125, 886, 201, -811, -37, -128, -1558, -148, -385, 538]
3142E38l62J216j129j7J023p96j558O61O60j947Q74Q70l70J55J600o87n61K84
3160D54Q49k415K09J020j750L3J767j9o64J399N37j569K04J164j217j063J405
3177C44p9j628J111P26r98N98J774k67j474J684o91k097M03J356j747m86K002
3194E31L41j043N10R89j594L9J517j498k180J851j52j392K283K52p11K99J279
3211A321j85k215J693q77j150M97M70p48L26J516J82j015J985n30j172j70O20
3228E48q43j090J556m40k31N83K44k26Q05Q28j115l12O74j420r98M74k91O29N21
3247a04L97m66M72J230o24l92m60M09j801J007j45p19J321K62k37n35J670J64
3265A449j679J082k68j659l48J156m65M34O88j10m54Q63R09j647Q32m74j348J29
$$ y = [538, 176, 1392, 263, 246, 1269, 473, -1085, -424, 236, -1711, -837, 33, -337, -182, 1418, 731, 170, 454, 1303, -1112, -903, 117, -1633, -1600, 167, 148, -516, 883, 1420, -149, 55, 1219, 2, -1061, 344, 265, -1363, -252, 474, -524, 74, 1848, 1581, 107, 1791, 1100, -997, -594, 762, -985, -1471, 531, 872, -171, 339, 1328, -266, -227, 1290, -208, -2388, -537, -689, -2081, 202, 454, -257, 42, 1321, 1136, -1079, 614, -263, -1413, -916, -446, -1194, -868, 648, 830, -185, 1800, 1270, 98, -72, 548, -295, -1385, 171, -269, -500, 83, 327, 101, 906, 1734, 619, 307, 981, -439, -1437, -963, -1254, -625, -104, 293, -173, 299, 1529, 905, 513, 53, 462, -1339, -332, -477, -1196, 125, 387, 150, -385, 1285, 1449, -230, 852, 584, -1075, -1423, -267, -732, -298, 390, 280, -174, 689, 1598, -49, 783, 309, -1039, -910]
3283i10J224m94j309J654R12o73j23R59m35j343J330o50j429Q44J438j540j22
3300f67J298q8j012J359K24j651L42J97j017L38J527r95j274K212Q4j112P60J105
3318A630j384j380J360l9k036Q73J412j179O08J254n46l69J804j775j235J030
3334B8K8j826l2K234r50L35J434k65q58j62J009j649N24L24q34l82O48j49m40
3353i83M83R39k91M28N27m91q85j45n11l92J057K77j208J251P23r72Q91L24m55
3372E67r77O77m64j140J130K86q10O57Q41m58J5O87p58j107J257p49k71p7K79
3391d15N19j347J709Q87j484m29J398j366j415K406j341j477J674J166j102R47
3407C30N57j94n11P01l97j844K88O81r83Q58J353p18n29J520L60j864J68J264
$$ y = [-910, 314, -180, -1489, 165, 1077, 404, 281, 1240, 805, -538, 792, 142, -1287, -443, 995, -545, -667, 631, 543, -469, 890, 1114, -537, -195, 2, -1015, -677, 850, -145, -1419, 793, 877, -235, 525, 1630, 246, -1134, 226, 187, -1849, -976, 436, -743, -135, 1119, 573, 204, 2008, 233, -1002, 28, 56, -1770, -1802, 432, -518, -183, 1251, 986, 128, -34, 975, -674, -150, 174, -660, -1042, -394, -543, -983, -500, 439, 148, 576, 1103, 612, -273, -418, -929, -1321, -264, 13, -1195, 56, 779, -193, 698, 1022, 567, -410, 267, -197, -1337, -207, 79, -731, -74, 767, 309, 324, 1011, 253, -854, 403, -346, -617, -694, -415, 104, -1243, 466, 1353, -131, -560, 838, -528, -1943, 463, -878, -2355, -681, 485, -617, 330, 887, 693, 182, 883, 486, -1358, -1070, -389, -1372, -514, 839, 121, -408, 1112, 1472, -392, -224, 1040]
3425A040j737m87J157m94j290J632N31n96M97J400m39j138Q46n14r96L34L57q46
3443g43L47J226j220k22J069J109j440l34J116j549o04J071o22n6J325m93k5P94
3461G49K40j090O39J77j188k18O97m18n72P55R68j055Q43P6m05K36M92o90r20
3480f84M91L47l84M60M52n47K19J541j263p78N75q33m93J003K11j080R0J570j282
3499c85L69J251L3j679J054M00j373o33J143j065M04J60J320j464J074J377j202
3516G84k94M83p35j647J387J0j213J43J769n49M60J46N22j594O74O99j142o69
3534g66J060l42o98J334Q3k50kJ73k32r59J390j790k14J075N68k022Q20J763j432
3553d41M82J041o60o67m0j9k81k05N74j96k8P01J78j09M22l1r10L68q16j03P24
$$ y = [1040, -697, -1184, -27, -521, -1811, -179, 352, -244, 253, 1653, 1214, 76, 922, 408, -588, -254, 103, -743, -396, 830, -390, -612, 457, 1566, 126, -208, 908, -641, -1245, -174, -796, -852, 473, -20, -45, 749, 989, -101, 538, 715, -473, -691, 6, -412, -984, -229, 739, -316, 527, 603, 198, 434, 926, 236, -684, -193, 154, -230, 230, 682, 135, 354, 1895, 632, -146, 429, -404, -897, 106, 317, -763, -673, 897, -385, -16, 1235, 1268, -411, 643, 1043, -330, -963, 180, -885, -481, -321, 999, -465, 609, 1986, 784, 490, 973, 238, -1409, -22, -12, -1225, -1082, 687, 138, 598, 744, 1266, -328, 346, 1045, -97, -766, 294, -48, -746, 588, 671, 421, 419, 592, 360, -599, 791, -999, -1213, -138, 430, -1592, -772, 991, -441, 41, 1082, 422, -245, -285, -304, -585, -790, -216, -412, -440, 261, 439, 330, 752, 721, -189, 179, -637, -740, -16]
3574a6p09L52j88J068M10k64N89k89q59m42R58p62j195M45J209o45K97J182p67
3593C74L37P24q64j208R78r48r12J7J032j15J70J305jr83Q37k08l83q42J322r43
3613c11o11J037p58K75J653m66j090L70J432j121m37k23k98r75J366L33p56Q44
3631B64L05J86j020L86L25j628J283j73o71R6M44M45o13O37M83p50K88P74j413
3650c52j94O31o05k83O53O77j186J538P22m87j336L74m56j065R21M68j129R85
3668a24j12L06n62J237p77k07J25O84p57m63N83j227P60O34N83k06M75p1j019
3687a38L81L77n07m16N23q91P67j97j31k48R06L43n04P15n82l81m16O49m74l07
3707e31N54J19j52N33L10j177O14M09n83j045L82J52n13R37K92n00q0P14j79j13
$$ y = [-16, -725, -373, -561, 507, 917, 653, 1242, 953, 94, -348, 610, -152, -1347, -902, 307, -338, -41, 1141, 374, 711, 1435, 571, -637, 341, -607, -1519, -1502, -470, -585, -415, 890, 889, -94, 743, 535, 152, -690, 632, -311, -922, 115, -643, -368, 1285, 819, -271, 99, 1531, 410, -27, -250, -548, -1523, -157, 176, -580, 264, 569, 755, -265, 121, 446, -1182, 101, -72, -743, -647, -203, 242, -371, 266, 749, -1, 287, 1061, -352, -546, 85, -520, -803, -150, 527, -659, 879, 1601, 1114, -222, 152, -304, -1369, -448, 20, -1109, -124, -236, 70, -492, 745, -32, -239, -114, 570, -187, -650, -67, -1294, -534, 100, 683, 477, 952, 881, -138, 243, 620, 113, -303, 220, -671, 96, -101, -232, -480, 426, 769, 265, 980, 398, 17, -399, 250, -224, -531, 23, 142, -10, 523, 833, -344, 270, 679, 96, -949, -567, -415, -928, 9, 301, -199, -279, 435, 256, 143]
3727A43M39p04m36J5M68j78j00N53p6p65P64J128j011j040J821j081n89K66M50
3746F7j174J453P06j071k67R53o67o14J646k54j861o32J691p65l3J035m65J55
3764i7O62l9j176O11M32o56l15N12k64K20K95N99k58L14J01o68O54k62m09j109
3784h53L98l13L84m34J229p41M50Q25q43m0j5N12o44j84l60K37N98J19m27L36
3804B34M90K10j179m14J024o79J05m2j00M1R2N12m46J053k50o72l75j65K7n06
3824a040J161N48m27m13J091l76k13R9q6r22P12K24j406l5J194o23J43Q38l23
3843A46m4J59N50l93r13L2r7p77J145K8k84N59K82K46n51Q53j25j917Q83O09j065
3864f74N48P12j515O83O46N02j021M45P43r77j79L5j73m48L73lM70J54n11m47
$$ y = [143, 582, -122, -558, -543, -75, -253, -353, 200, 124, -641, 123, 1251, 240, -800, 1021, -60, -649, -383, 67, -1107, 346, 1052, -19, -286, 667, 0, -614, 1032, 778, -1083, -1715, -24, -789, -822, 213, -252, -97, 565, 526, -650, -39, 393, -263, -578, -66, -330, -110, 185, 784, 526, 840, 941, 273, 927, 665, 256, -853, -455, -768, -384, -818, 411, -330, 120, 945, 102, 62, 47, 559, -85, -269, -629, -392, 206, 325, -102, 234, 724, 934, -245, -659, 365, -314, -209, -251, -351, -310, -218, 294, -152, 901, 651, -21, -396, -561, -534, -1040, 121, 669, 242, -171, 920, 544, 331, 430, 344, -578, 134, 358, -1048, -1083, 111, -512, -369, 469, 146, 102, 261, 811, 418, -495, -463, -560, -1337, -192, -164, -448, 111, 393, 639, 88, 941, 816, -1101, -218, 391, -674, -126, 586, -929, -246, 400, 902, -119, 326, 1069, 92, -87, -52, -225, -673, -300, -303, 167, 321, -190, -637]
3884f37J192K49r76j321J549o05j28O78O90p57N9J176q61MPo43L9P37o2j426j
3905a037J172P4J70K65j189O03K05p4q34R19M94j667M82N88q17N74Q14n52K3J91
3925D04k26L40j181O76n22k21K80J99j19N32K29r34Q64L67o83j027O38r1p80N12
3945g43J170j178K11P08L11q23J507r77l86JK95o58j01J288k45j045O93N34m42
3964A20L33K58k48r22L47M4q06n9J815r47j58M60j74N5M56k23p21l23pM69M53
3985B22k8n28J62N65J052j635P49p1o28j044J362l15M35m78M06o47J81J71J95
4004A26K72k77O26j800J210K03o50P90M59r44O00m94l43M82k67j79q9r59J425
4023A91j22n17O08l49k02J100j98o07j65O05o66L59O29l32k55J57o62N88M21n16
$$ y = [-637, 555, 804, -172, -1493, 56, -549, -677, 1, 691, -66, -7, 1169, 308, 312, 319, -324, -285, 452, 390, -1036, -1037, 135, 209, 379, 644, -545, 58, 263, 189, -645, 274, 768, -899, -417, 171, -646, -72, 742, 190, 213, 404, 178, 518, -663, 13, -509, -730, -450, -251, -370, 162, 391, -543, 321, 688, 5, -1022, -384, -475, -1255, -743, 427, -751, -540, 168, 479, -344, 1163, 186, -200, -199, 96, -562, -663, 625, 380, -665, 28, 562, 120, 453, 711, 463, -459, -112, -68, -874, -933, 882, -65, -223, 237, 63, 118, 574, 351, -370, -693, -700, -231, 222, 194, -334, -172, 393, 1445, -190, 559, 488, -140, -1184, 178, -137, 298, -180, 226, -421, -240, -69, 126, 398, 121, 747, -1053, 157, 360, -290, 500, 959, 15, 615, 121, -222, 260, -7, -186, -275, -1234, 191, 69, -448, 160, -189, -391, 709, 511, -96, -261, 344, -322, 37, 666, 334, 79, 236, -426, 162, 583, 67]
4043F7n0K22J18j066M69L74J3o67K41R7K20K31PJ01m66M5N53j024O07k75k40j05
4065e28R98L6J6l25N08j357R76k02k00j15L50J34l79K83m23K08J12J490j377k10
4085eK93p17k50Q07m66J93M21M60o63m34M80l12k38J48N07p21j86J455r29n8J70
4106d5O20j03r83J377j587P07m85M08o51R04l5J87KO76j405R28L92o78k4l47m77
4127f19Q2P42o3L31q82N43M21m67M2P97j117Q8K66n91P93j09o26M49k22J416j165
4148A09L95k97O5j028R48l13JM72k27j096R55O13q38P46k35l70m05J08N71k47
4168g3m5J24J30m72O37O45r77J44M90q61q6N56p77J96N98J27q29J119L30j408
4188d32n84J946j374J81K69l33K34L91l96o29Q21o47J278q81N80m59l10L57K91
$$ y = [67, 17, 239, 357, -709, -240, 134, 147, -520, -279, -182, 38, 269, 276, 377, -89, -44, 509, -515, 92, -183, -423, -528, 470, 506, 522, 197, 705, -652, 324, 122, -78, -193, 157, 291, -88, 195, -228, -20, 92, 1582, 205, -5, 288, -429, -679, 128, -338, -145, 276, 736, 73, -361, 119, -193, -431, -283, 224, -497, -683, 772, -157, -215, -45, 575, 472, -511, 866, -721, -14, -499, -91, -742, 162, 127, 314, 316, 992, -413, 515, 907, 229, 205, -142, -619, -537, 205, 142, 473, -409, 134, 555, 88, 130, 927, -190, -102, 164, -427, 366, 257, -369, 80, -142, 1274, 109, 504, 207, 272, -756, 192, -121, -120, 352, 125, -971, -16, 597, -241, 505, 270, -100, -505, -397, 174, -73, -118, 6, 136, -336, 301, 946, -31, 113, 603, -258, -344, 212, -565, -369, 229, 356, -473, 646, 976, -432, -1016, 930, -444, -263, 6, -327, -93, 298, -98, -727, 94, -553, 725, -156, 424, -35, -345, 12, 303]
4207C03m03j81K50K63j77Q26J31j060J51p4K88m03O34q9q65j49K00m93J045k08
4227a1M3q10K83P54k67M62k37p33L49N10Nk98r0o0J3R38n82j110L62J034l11n52
4249c08N99q18Q72J4L1n09K4Q06j546M88M91j32p07P04N14q24M86m10Q46p15M88
4270C94j236P08N4j65j06O56K93p13k0l80L78q26L79M9J06L75K34o90K52J258
4290A000m54n59Q51l14q22K08M96m47p04R40p49O5M19N26p14J83R62j024p7O34
4310D20o50m73R29m2o25j9R5M07m93Q41N5p83P10J53j559L57J442j60r18N50m12
4331a75j52J064r48N43l61N69n05n6K19k62o37J211q41Q68N9p36m75J129m30J42
4351B26m43K33L06p11L51N67n18m97M98p7j77k59J47N98o6J47j79l19O86j019
$$ y = [303, -100, -281, -31, 232, 55, 881, 1012, -48, 103, 29, 317, -86, 548, 459, -406, -555, -355, -848, 197, -11, 32, -778, -495, 259, -8, 454, 217, -516, -167, 343, 348, 50, -40, -100, -87, 851, 269, -841, -479, 555, 244, -308, 291, -527, 345, 359, 390, -119, -95, 711, -835, -347, 144, 12, -695, 9, 523, -301, 185, -225, 621, -94, 394, -842, -134, -80, -245, -351, 305, 598, -115, -135, -515, -137, -963, -584, -535, -429, -54, 180, -510, -258, 1000, 546, -13, 838, 524, -298, -90, 406, -41, -745, 195, -554, -489, -70, 456, -258, -75, 887, -137, -214, 420, -230, -703, 226, 184, -441, -460, -365, 42, -451, 390, 445, -338, 372, 525, -1034, -677, 765, 605, -313, 237, -175, -327, 737, -211, 332, -29, 540, 35, -21, 198, -64, -701, 510, -331, 537, 596, -140, -615, 514, 84, 226, -217, 16, 322, -389, -38, 529, 11, -486, 12, -65, -242, -501, -354, 244, 178, 325, 146, -173, 513, -506]
4371e06O44P28m36l70K24J78o64k7L26J70j204J166k87N3Q93k5j097N6P5J8m29
4392e14j32O32K1J70Q41j553M13P41j117L09L30J18m26o7M41n11l24P50k74N41
4412C89r32J187l42K10j00j02r01R92l25L58m57j61O81N8R3o85O92p05N42j184
4432f92M98O34K81n34K17m10l4l18q9J09K90n7J80K2J15M28r30P55m4o69M14K97
4454D63j165K63M4Q3k45M81M96q68M69O19p94j42L94L5l85M85l52O71n27J24M5
4475A94M55K22o55k16K87J42l40o05J120q02L93m96K98l38O34L84j409P31l7r36
4495i74O05O88n82L81R2l09R9p72J381n57N66r04P49j097Q62M84j554J853o55
4514C56m18o7K28j36L03j86j02k23J55J07L0j55R33o85o11P96p06N71k54p1J11
$$ y = [-506, 138, 866, 430, 60, 284, 462, -202, -229, 97, 267, -937, 229, -58, -5, 888, 863, -234, -178, -103, -85, -514, -646, -14, 7, 177, 1018, -535, -122, 619, -498, -189, 141, 259, -167, -234, 207, -304, -628, 122, -152, 389, -543, 644, 302, 512, 412, 310, -591, 401, 76, 434, -23, -184, 497, 555, 648, -37, 655, -50, 492, -692, -194, 440, 721, 187, 404, -6, -40, -358, -447, -338, -48, -105, 75, 97, 212, 640, -290, 465, 421, -248, 166, 463, -702, -439, -395, -312, -557, -76, 420, -448, 21, 640, -154, -296, 98, 133, -252, 233, -119, 552, 25, 149, 194, 649, 871, 216, 0, 287, 429, 89, -516, 604, -198, 195, -301, -3, -341, 293, 677, -732, -1, -38, -974, -369, 319, -263, 118, 210, -99, 0, -772, 609, 52, 618, -286, 463, -634, 228, 712, -842, 1011, 356, -62, -129, 99, -37, 266, 80, -22, -245, -90, 17, 47, -108, 825, 140, -471, 325, -381, 190, -64, -135, -24]
4535b4j26M22M98j025k20J016o16K29n63L57o74J258l42o18M65O05j63l49l12
4554a82J41K06l9N27n14K27n92N11j01l06O76o09K61q9K2k79J74j03Q8O69k5K9
4576F92j162o6j2r9O09l82M00J30m13K7N40n93K08O85o6j309Q51p7K2j71J07r4
4598a73j55N06o02M62r8L76l41j38P71m77l41N17k03m11M47l54P16o86L32k94
4618a46j8N3N34q09K1P01K1l65L03K36p15m80N28n06r0L87R01m22J50l27K87j8
4640B26J09J82j043L63j45m05J071qr92J72O47j20m3m32M66k46LK7N10k00N77
4661G19p85m59O04j82l19M64j20N6J03J77j257M29J103L47j250N49L53n10L19
4680C41n03N46K60k54k14m49n76K18O43R7M08o23J04N90j037K86P97o18r5M74
$$ y = [-24, -150, 272, 770, -255, -475, 541, -75, 154, -409, -52, -726, 532, 190, -428, 37, 642, 479, 130, -182, -41, 165, 126, 653, 139, 366, -226, 285, 184, -122, 554, -55, 206, 117, 139, -140, 34, -69, 19, 688, 663, 692, -470, -536, -548, -647, -38, -420, -20, 110, -303, -276, 264, -329, -121, 564, 498, -811, 40, -37, -15, -186, -79, -173, -328, 178, -424, 38, -60, 316, -25, -163, 608, 131, -210, 307, 104, -307, 140, -214, 502, -184, 148, -146, -164, -111, 423, -386, -365, 336, 357, -8, 295, 531, -184, -664, -136, -642, -732, -345, 556, 134, 284, -43, 244, 226, 335, 517, -526, -163, -308, -713, 358, 350, -642, -470, 177, 57, 14, -418, 48, -198, -195, -168, 342, 142, 719, -66, -525, 79, -103, -422, 42, -78, -22, 81, 258, -999, -570, 533, 880, -370, 179, 532, 22, 341, -162, 384, 644, 390, 176, -273, -849, -631, 12, 109, 517, -106, -2, 588, -449, -163, 634, 16, -79, 395]
4700C95p39j44P3N06K27j063J492n13m60K04N1N5m74K72N48j193J045k28j79L13
4720A88m24K83O1J68J67k66J94k45q14K04J113n65J14K43m95L15o23J44O05n3
4740C14j88r8j021J781J84j050m15Q92M9q87P63j99o90M66M08k67j69j68J36J51
4760hL92j22p53M24p2k79N2N78m66L29J70n86l0L79J49J66J15p41m80J42L06J74
4782a61r4k37Q63j033J432j120J46k20K47O92p52Q9K84o89N8L50K76M6n29J053
4802G01o47L0p4n78K76Q56l59o37J036j98n50O61m73o36O53k94j53j9P82j086
4822g09J333n31J25n21O01q87O53l44j70o1M07l22L00M56J34J06m57m2j23n22
4842e74L25l23J203o16PL84o72L01J30L47j102J362q71j29K11L98o98j32M34M94
$$ y = [395, -344, -488, -415, 91, 318, -745, 747, 234, -226, -22, 29, 84, -390, -118, 430, -763, 282, 54, -125, 188, -236, 47, 108, 276, 443, 177, 371, 126, -688, -484, 629, 64, 178, 421, -74, 241, -382, -238, 367, 314, 126, 28, -993, 788, 972, -78, -493, 399, 448, -439, 324, 125, -565, -99, 309, 42, -127, -295, -159, -8, 384, 262, -491, -67, -139, -418, -366, 212, -254, 75, 245, -341, -371, 8, 157, 323, 438, -303, -783, -641, -335, -161, -255, -492, 371, -662, 770, -350, -204, -424, -177, 515, -237, -148, 136, -553, -495, -145, 131, 177, -352, 701, 54, 84, 10, -568, -292, 564, 205, -432, 604, 406, -144, 517, 44, -592, 61, -233, -386, -405, 377, -709, 624, 93, 218, -303, 298, -589, 64, -280, -450, -511, -104, -426, -126, 330, 464, 570, 113, 71, -52, -574, -249, -572, 631, 15, 22, 406, -266, 35, 165, 512, -590, 772, -99, -228, -17, 381, -317, -449, -15, 479]
4862D79q36N89m69N31o57J123n09m48l35l8k34J062q43l36P45O10J44q05N42K67
4882E82o65k50K21L69N0m49O17j148L72O96p06R72j49m65j96o2L33p69J189p42
4902b00O17l67O80p09N42n45j40j04K68m31J13P98n80j4L7k20m67J702r08P04
4922G76p81k15M44M55o41L33p42O0O39n3p59N37k19o69O35j74K85j54O38L14r11
4943b02M94K61r45Q39R6n67j60K6LJ12n4J128q28K10K11q39L19M51n67p67K89
4964d90N98m29K88N64r14k61P31Q88r07l53O42m36K94k3n70j19j15R49k42o98
4984f03J506j241L8M71j22m82N68k38K36k3n66J15Q64o18O62l52N52j015q0R8
5004b30K87j70o93P88L96k03M52n13K07p85J4P91q05J06j35P5M68J12n40k6J121
$$ y = [479, -357, 232, -237, 294, -363, 760, 251, -197, -532, -570, -804, 258, -585, -921, -176, 434, 578, -227, 315, 582, -83, -333, -112, 257, 307, -142, 475, -673, -301, 395, -311, 661, 512, 47, -149, -211, 122, -647, 542, -200, 417, 50, 730, 21, 563, 18, -122, -226, 42, -389, -276, 522, -58, -72, -35, -255, -722, 980, 72, 776, -5, -220, 224, 679, 38, 371, -371, -311, 328, 275, -484, 53, -166, -835, -200, -374, -89, -243, 395, 709, -202, 292, 553, -392, 447, 543, -24, -184, -158, -155, -43, -97, 1031, 203, 413, 624, -215, 104, 555, -12, -779, -490, 108, -321, -33, 531, -383, -644, 87, 975, 68, -285, 357, -79, 215, 192, -378, -497, -612, 337, 95, -603, 903, -338, -300, 171, 49, -433, 135, -103, 133, 110, -456, -341, 523, -95, 567, 215, 767, -248, -328, -230, 57, -113, -806, -18, 378, 175, 627, 114, 321, -464, -450, 341, -464, -358, -493, -418, 50, 162, -378, -404, 717]
5025G17l72q44J17J046n38m61Q02j081L21J14M23K30n3L79n65M96j435L65oM50
5045A05m7n31J162p98l12M14N50j09J7j04N57n66l45m6p40J042j95q20J077o3
5065B48l96o20J937j401p8Q92o63pj68k55M49r85Q64J040r84k50O06k66j53R27
5085G37m53o06R5J78j41l84P74K96j070L83K8K8J9K22q03M08P08j72r15R56Q11
5106A099j140N14q77L50J11K09j087K31J302L16m75P48j039j96m68J348k49q40
5124a43k0L34p63N98J009j425k48O80N58m11l71M88n9j328R23K74q44Q72m20K74
5144b2m00R22M7M7m92n41L60j19N02n86O45p17m84J35J084j07j03M91r96Q73L69
5165I08p65J27j96N95o64O98m14p93L77k77O89l63Q1j15l37L72P41j070j19K36
$$ y = [717, 345, -499, -382, 664, 126, -335, 467, -614, -293, -179, 244, 474, 421, 800, 235, 731, -704, -339, -345, 105, 58, -473, 689, -109, -421, -7, 543, 434, 451, 347, 904, 338, -7, -53, -793, 249, 54, -766, 311, 248, -148, -768, 1169, -232, -310, 582, -81, -88, -256, -511, -62, -1047, -183, 857, -127, -377, 229, -37, -190, 737, 284, -322, -227, -49, -190, -574, 200, 496, -574, -191, -163, -135, -116, 106, -697, -289, 419, 247, -668, 288, 1099, -41, 473, -404, -54, 57, 266, -821, -590, 712, 1028, 553, 1301, 262, 66, -402, 946, 697, -143, -163, 171, -592, 6, 1015, -410, -658, 22, 580, 169, -202, 286, 227, -1101, -178, 96, -748, 124, -296, -22, -422, 500, 547, 594, 102, -439, -79, -198, 304, -282, 363, -354, -838, -703, 381, 274, 171, 662, -334, 539, 908, 143, 270, 74, 669, 5, 703, 289, -504, -127, -404, 285, -78, 3, -112, -449, -77, 664, -406, -525, -289]
5185b89j39o6l5Q26p40L35N50j58n95K97O25p20J53L95k96m00N18o71R32o42K70
5206A50o83Q87K13K1j033P00l18l57P67k82j295J245K07j015N79n20K18L28k93
5225d81J485j210J2N90k77m08O7K6m13M14N48o64Q46R3q82M43M02k60r43n2R21
5246B57l88O2N87m48p05J472j099p0m22L39L47l15O60j41q86J027k84j27L68O85
5266I19j427K77O92r87R55p01M70l32J36J72k76K70o54L35J76J23K33m01l49K41
5286a28P63r33L74k68k56P58M55j413P10j97p8P65j67n73N54N80n88m80j20m64
5306g06l14M31J66Q80n21j04K2N81j408J321k05k29L21o51K76j22k62nM87L01
5326B59p0m62L08M37m85m20O39q02O88L34n94n1l27Q02M9n51J95p6P5O65n99m52
$$ y = [-289, -428, -494, -529, 297, -443, -108, 442, 284, -311, -14, 611, -109, 44, 439, 143, -257, 261, -410, 522, -120, 150, -533, 354, 567, 588, -445, 255, -63, -420, 347, 65, -1230, 15, 222, -793, -214, -734, -516, -188, -481, 1004, -206, -194, 396, 119, -289, -222, -196, -609, -195, 353, -311, 535, 628, -254, 189, 591, 331, -612, -664, 257, -131, -69, 518, 70, -635, 837, -262, -332, -754, -415, -68, -383, 277, 136, -750, 277, -7, -134, 234, 919, -508, -231, 461, -526, 429, -272, 198, -134, 2, 174, -102, 168, -486, -151, 25, 148, 381, -20, -369, -128, 635, -298, 76, -192, -448, 310, 765, -648, 62, -135, -213, 552, 385, -188, 366, 946, 358, -122, -242, -706, -1020, -589, -423, 457, -64, -168, -146, 435, -973, 348, 143, -86, 235, -416, -140, -262, -524, -529, -42, 259, 189, -273, 35, 472, -13, -433, 206, -596, 92, 426, -168, -219, -546, 256, 305, -246, -51, -127, -52, 613, 14, -438]
5348d38J86O66m84K26n7n37R67j095M48J40j37n1M91J31p70M03k48O35o24J13
5368c5O18r4j479Q78M95J37k36n79J086p48K88j23k65J77M61n74l91K47n25K35
5388d27J95N21m2k34R1J27o44L11m9k09K99K44n94R6N56O7p58J966j954M59j36
5409a15M90o71L40N29n24r55J463r84M96k51L08l37m94J452j315R36J42n03p6
5428f9q0M97l97q49J956j227k57O95m73K85k17R4j19O79m58j35l36O49q85N33
5448a14j9n9l11l15Q67m28j13K20l76P39q98M15K16j28J414j361l54j52M88O39
5468C70m64N44j320P13K74M92j293O12N30p18J57K43j197O84J35N73l59J023j150
5487a51l69P06L79j73m03N7O73n00N43j042l44L97M4J40q8p2M38L07m82J61o55
$$ y = [-438, -252, 414, -70, 156, 99, -438, 529, -566, -118, 22, -115, -166, 325, 456, -314, 89, -159, 476, -148, -35, 583, 489, -990, -112, 383, 520, 284, -295, 791, 43, 331, 208, -57, 120, 581, 7, -384, -137, -662, -427, -232, 289, 247, 13, 104, 231, -413, -102, -151, -360, -61, 183, -411, -315, 241, 308, -450, 1516, -438, 21, -115, 375, -296, 44, 573, 49, -906, 557, -427, 69, -182, 126, -211, -705, 747, -568, 368, 510, 7, -69, -149, 348, -49, -898, 1058, -169, -426, 269, -204, 81, -136, -42, -161, 518, 60, -75, -411, 238, -647, -114, -133, -192, -503, -818, 49, -379, -492, -272, -648, 91, -807, -392, -176, -304, 1110, -251, -605, -757, -269, 370, -94, 450, -870, -157, 117, 609, -684, -72, 458, -260, -103, 140, -1057, -373, -238, 335, -24, 999, -151, -520, 186, 565, 392, -11, 46, 719, 219, 762, -280, -624, -227, -183, -43, -131, -203, 235, 542, 60, 221, -434]
5508d34M99k94pL73R28q58p18O25mK37N01j95n92q16J482o66p47O07J30N0k95
5529a94N1N16p67L24K80o21Q0N72j53J85j21lo23P22k17M1l4j78k0p6j99N11M10
5552D86J15p81m34P27l81p32J203L80r87Q00K35j090L31M60k42o67J90O82j345
5571a050O14L12J34M3n9L12o19J09K91J27J09k7n38K48o9q53P12N16l09m8j52
5592a97J29K22n87K43P7J58r48Q41j14J47K75m01l82N31l63M23K64L83q40n37
5612f76N31J71K11m16L93m37R60k88n1k71j031R61m17N98J1r5K93l7o51N11M38
5633G08j108J84P40J01q37o3L74j20m69M25L51p57L53K82l89j1N36o89N19J30
5653B60J77K19p37N08R9l59O8k0j070Q82L4n63J005r08N75l24r40J787j235R76
$$ y = [-434, 65, -229, -236, 137, 1065, 207, -511, 114, 110, 347, 848, 653, 61, -755, 727, 61, -686, -79, 51, 101, -194, -143, 373, -394, -70, 210, -411, -331, 241, 88, 273, 152, 149, -474, 248, 31, 72, 38, -140, -160, -236, -435, 76, 486, 601, -180, -614, 113, -268, -1000, 203, 583, -404, 396, 631, -459, -128, 332, 90, -577, -387, 295, -1050, -436, -124, 10, 53, -6, 306, -313, -204, 87, 214, 323, 296, -242, 6, -63, -916, -204, 312, 3, -45, -197, -68, 154, -433, -190, -113, 45, -903, -62, -176, -29, 246, -155, -537, -6, -369, 54, 318, 701, -139, -676, -145, 26, 237, -179, 214, -223, 737, 449, 398, 127, -904, 57, -360, 238, 249, 154, 447, 410, -241, 270, 708, -400, -216, 524, 625, -212, -275, 99, -21, -490, -65, 286, -471, -118, 164, -225, -236, 300, -389, 130, 260, 437, 656, -81, 427, 526, 167, 235, 215, -855, 27, 61, -502, 503, -405, 170, -154, -1094, 693, -542, 434]
5673D34K66j494L25J20O08K81J12l85L1l19L02j49n29J005l25n72N2L70l27L67
5693A73J39o86K90P03p42M7P41r0j296O65L50j10N25o83Q71p63k33O5Q01j166
5713c99j48O95R01j075%qO63j140M20n37Q27Kok94j000Q00Q70j245K01N41P1m16
5735b77R45o37q43O34K97l9j305J236p0q6M22k69n44l45J458j1m44J19n92O63
5755C12q8m92Q36p10K39l88r02J354M6q62K43R4J31l38K78K08k0n12K34L16O07
5776E86p00o07N03Q89k40j93p7M78p22M5m3L6m60M71K89j310Q73M38j39n60J506
5797A063j351O72J29j39o91K77L65q24N88L40p4k33p9M59K4l91J01k67k80J5j24
5818d20J313l64k92Q6O50q92j6k1J53m67l46J002r46JJ139o15L50n3L42p16N7
$$ y = [434, 700, -794, -469, -349, 259, 540, 652, 267, 298, -21, 281, 132, -397, 608, 283, -289, -237, 133, -194, 173, 312, -374, -84, 619, -123, -76, 665, 575, -721, -56, 294, 184, 709, 26, 897, 134, -99, -34, 767, -399, -547, 148, 1049, -26, -26, -34, 629, -511, -91, -628, 199, 201, 195, -99, -1099, -299, 571, -674, -473, 68, 139, -277, 668, 31, -812, -178, 119, 80, -1225, 11, -59, -145, 277, 8, -536, -881, 577, 566, 122, 241, -351, 312, 224, -268, 568, -142, 97, -291, -1193, 161, 207, -655, -412, -318, -187, -525, -247, -39, -59, -571, -337, -21, 586, -114, -721, -218, 671, 431, 238, 161, 639, -83, -38, -81, -45, -505, -34, 255, -1055, -182, 256, 117, -443, 1063, -288, 384, 513, 374, -317, -40, 325, -499, 89, 429, 355, 122, 43, 502, 526, 135, 236, -31, -311, -296, -420, 893, 529, 237, 323, 973, 81, 65, 44, 197, -270, -616, 386, -560, -559, 580, -35, 315, 262, 604, -112, -55]
5839e5q1k50j51O35L35p15k44K060j719Q26n69o38M36k62L31Q4o66N18K92q53
5859f86Q20j24k94P72L70j365P11j13k76M84l26N19j186J391l24o6J6k87l52k59
5879e75O52K37j42k24K9J74n02M38k09q1P61p07N82o83Q31p91k1N19j01n02J60
5900a55K25P70n82M8j80L78l63M11m25j73K38k25k55O13o80R7R97o36K20p78M55
5921@n66l39Q44k30J78j9J29J07m8O7j088Q92L36m9p79J126n03l71M8P38p0p01
5943b98M73l61J00Q5m68j50R05j87l27p1Q02n87N18k3q18J88O41j01l59m44jJ061
5965E78q98J011n7o40M73j2o66Q6J27o66M20K89o37K16M8J615j557J35P22m31
5985A56L83k39m60k98M82l28M47p38P14N72n71n17Q08m51j13N05l79n34P01J37
$$ y = [-55, -136, -386, -537, 98, 433, -282, -526, 1534, -185, 641, 72, -566, -130, -392, -61, 23, -643, -125, 167, -686, 134, 10, -284, 488, 858, -507, 204, 91, -185, 299, -27, 492, -694, 697, 373, 307, 323, 36, -316, -575, 77, 314, 172, -52, -23, 151, -351, 87, -122, -203, 558, -149, 433, -250, 581, -210, -231, 288, 187, -315, -155, 70, 840, 258, 306, 126, 504, 141, 552, 127, -46, 192, -33, -288, 325, -355, -258, 739, 103, 323, -455, 0, -566, -905, -61, -291, -113, -132, -3, 104, 56, 123, -965, -73, 263, 214, -565, 561, 58, -313, -265, 473, 403, -298, 175, -186, -86, -1, -469, -619, 286, 99, -228, -299, 503, -84, 434, 411, -407, -219, 422, 321, -38, -482, -483, 578, -320, 691, 634, -6, 467, 455, -211, -125, 2, -664, -244, 45, -592, -376, -328, 1287, -270, -135, 587, 156, 539, 300, -160, -458, 24, -304, 143, -595, 119, 691, 120, -397, 411, -40, -153, 352, -27, -561, 140, 277]
6005B77r25N99P17p5q49M93M85p29P2L40K10n55j88j86R2O22q0m47J12j77L75
6026A83K50q61j84K42J091q49n97j0J064r5k03J85k81N00l18j77k62P31l53l97
6046c41M04M14k02j19m09l6L47r82M97k01N93J15M18p88K90j75J59R76j459L58
6066a41q5J294j317j17n74J537m05J98l23l29k30M54N6o12K58P56m62M10m60Q1
6086a1P31p69L54P7l80k13J8O17O3m11n59K10M67m21O90n04J60L81J04l74n94
6107c64J6M85p27J014j82n12J462j267m90J216n12l22J02l23k47Q45q1N6K66J6
6127D51j14L62m68k16k22k2K49k31N54m42L27p46R59m43L25q6m34Q61q29o78J459
6148F16k16p92J31o46P30N30J74q06J074j332N40l46M45mn30J588o94k43M25o0
$$ y = [277, -648, -49, 668, 593, -256, 237, 722, -7, 65, 405, 615, 60, -128, -314, -222, 400, 320, -127, -15, -192, 183, 433, -428, -612, -370, 721, -128, -725, -735, 329, 234, 31, 216, -65, 435, 117, -60, -322, 409, 56, -341, 63, 477, 275, 156, -253, -289, 58, -924, -427, -628, -35, 80, 498, -290, 0, -175, -16, 960, -499, -141, -226, 1068, -249, -366, -940, 597, 192, 390, 67, -262, -492, -38, 18, -594, -336, 420, -42, 368, -92, -11, 720, -49, 305, 382, 2, -211, -193, 424, 487, 76, -483, -273, 194, -227, 463, -41, 119, 500, 604, 230, -364, -348, 137, -590, 424, 242, -270, 1192, -75, -565, 651, 139, -183, -81, -404, -651, 194, 113, 169, 435, 451, 337, 699, 231, 15, -207, -229, 20, -211, 343, -99, 228, -518, 441, -2, 323, 237, -197, 664, -165, -843, 616, 400, -392, -261, -907, -177, 353, 527, -279, 795, -537, 3, -343, 102, 98, -432, 1156, 462, 219, 644, 584]
6168E84o83J32N20j435J413k68j037P20O81m26K93m68K35j020K9N27M31m94K81
6187A5j37J0J40j201J241L62n24k02O3m7k39M62j19L71o56P05n24R39k74m68k64
6208c47N01J98n45L99r68J279q22J108r56O90o02M19Pn7r0m01k58PN62n79n3k06
6230g14N17K84M40k4o57K63l81k68OR8Q1m02r4N56J065j161L98m72R13m48J19
6251A19j30o67J46P65m98P36n64M22r08P06O36k01o84m90J58j35O60n99O62l18
6271a84J85k30K29m8j82j15K54j34l33K59O73l07M7q7J058j053M78k79k59p72
6291h00N00J4M16N19j172Q30L30j9m83M72J07j063O0j20j3k7N76m82M41P50q09
6312B7Q20r2L11j011n01M52n02J26K30J127j351O92N65k93m0l58l79n11J21J142
$$ y = [584, -99, 33, 553, -882, 531, 263, -774, -54, 627, 201, 494, 26, 261, -759, -730, -203, 228, -266, 15, -122, -112, 28, -1173, 68, 430, -94, -296, -233, -280, -519, -57, -176, 195, -461, 244, -280, 659, 385, -83, -347, 154, 352, -193, 206, -762, 517, -305, 803, -153, 537, -65, 354, 361, 304, 214, -187, -445, -438, 124, -455, -508, -714, -197, 87, 527, 503, -154, 109, -272, -540, -534, -436, -355, -757, -851, -295, 770, -391, 7, -465, 448, 0, 119, -11, -678, -532, 233, -265, 471, -93, 329, -579, 127, 763, 562, -122, -612, -454, -589, 71, -528, 134, -184, 1, -229, 0, -48, -230, -345, -91, -225, -558, -299, 374, 67, 114, 27, 1085, 32, 510, 231, -28, -800, -300, -286, 130, 649, -523, 307, 637, 618, 135, 607, 714, -349, -289, -409, -422, -449, 127, -355, 86, 836, 27, 847, 755, 1066, 55, -446, 6, -496, -370, -140, 987, -364, 328, 893, 600, 560, 202, -177, -688, -567, 575]
6332E75q54L10l35K70O90q66Q73p29J22k85k91P1M74j34N45j266O49N89j466Q00
6352b58L84J69n73Q2m40P20q8j48L40j39J08K11k53L11Q6n32L52m98N86o35L75
6373A60q04J355m94j42N07o72J20K69N5p61K09M53K06p96j48J386j152M37J64
6392C52L79j114J5K46O7n4L95q60K05L07K75m72O90M88j622N78j68J94j83m56
6412g38P01J46J64m25j21L54K95K44k20m85k01M95p40j49j1J212J51l61J28M62
6432I01q49m09P85q92p3O1L62J22j65K84L50m29P35k54o06r0k62j24N29l26j14
6453d64j15R02l3q62O28l0L67j001J028r26O70m61l48N64K60k01j08M45l88k7
6473a00j97P45p32j54J96L05Lj49J42L00r73Q22l42J87J3O0p52M95R1K20p76J307
$$ y = [575, -279, 31, -304, -34, 656, -210, 663, -66, 56, -229, -520, -449, 25, -109, 436, -830, -181, 408, -1058, -258, 126, 295, -278, -196, -636, 84, -4, -152, 188, 49, 157, 368, 115, 426, 512, -20, 332, -166, 420, -215, 160, -644, 711, 217, 75, 582, -90, 30, 299, 354, -407, -198, 255, 461, -335, -483, 903, -249, 188, 352, 731, -383, -368, -122, -55, -109, 286, -574, -369, -62, 213, -259, 431, 919, -703, -125, -293, -99, -282, -738, -37, 109, 273, -152, -273, 81, 376, 620, 400, -85, -286, 209, -531, -680, -691, 521, 672, 311, 439, 901, 52, -357, 428, -464, -537, -476, -114, 8, -157, 127, 477, 48, 783, 529, -77, -167, -429, -553, -24, -350, -464, -579, 323, 290, -572, 56, 26, 393, -608, 420, -506, 164, -297, -645, -81, 179, -22, -130, 315, -73, -100, -297, 448, -284, -438, -242, 63, 66, -83, 59, 359, -614, 208, -134, 53, 66, 126, -626, -131, -40, 180, -596, 711]
6495G11m04L72l03Q97j569R00j117M89l3m74M50r2QM96m01K20Q4K16j003O58J62
6516B67p49k91Q84N78j487L74P17j46j54M61j76j089R84K4n95N10k32p19J652
6535H13r8l92r1j86m10m5M60k20l61m53Q08n7NM46k29O87r36N47K43k49r26L50
6557b94Q87j86l73m36J003j101J045n73O14n47k19M2n76M18M17n5K06L14M48j383
6577c49O57k10j02l48M86l42l86j67R24P6K53L3M25j251p8K31R8l31K85M14k90
6598B8j09k10L37j94M42p16L75K87J4l59n82K05k73J079j084J035J55O89p69k90
6618F0rq27j80O46n82J110o14J059J28q21OP6N51n88J95j045J41P75J94n36Q66
6639F05j009K88P63K8l42j99j6m41L12r40L96L72K23P61j262K91P84m47M58l97
$$ y = [711, 307, 679, 376, 1273, -296, 604, -513, -24, -57, -531, -81, -173, -165, 331, -70, 150, 234, 450, -553, 105, 267, -482, -773, 111, 689, -798, -424, 293, 147, -7, 454, 278, -811, 173, 197, -398, 112, -120, -839, 813, 715, 323, 232, 46, -364, -409, 51, -169, -530, -983, -175, -232, -227, 219, -10, 677, -259, 288, 531, 282, -644, -294, 593, 407, 34, -402, 601, -500, 545, -28, 586, 39, -180, -138, -714, -296, 121, 66, 272, 586, 1034, -349, 308, 98, -4, -352, 134, -208, -594, -761, 163, 239, 492, 525, 950, -301, -379, -148, -50, -381, -96, 318, 28, -81, -291, 46, -148, 294, -422, -47, 240, 254, -105, -687, -482, -755, 324, -760, 275, 430, 1119, 350, 60, 51, -776, -956, -310, -892, 218, -396, 663, 791, -30, -24, 52, 603, 15, 210, -835, -694, 81, 275, -261, 605, -404, -116, 647, 675, 333, 134, 118, -323, -11, -951, -555, -183, 40, 801, -461, -170, 614, 167, 625, 228]
6659B28j42k45M49j199K30P15l00J10M00O92j112j34%n6l2p2lP83m93P08l46n79
6681c98Q46n32j49J030m17j032O33n0n25N5O58N94q24P42n35r2O42k93l47m7J49
6702A08Q4n36L37m5O1P3N87j118J49J031l9j217l11P47j96k52K18Q42p31K53m77
6723d32P89j316J015n4l38R93m47q1L4R6m49M09J62O72j455Q86q48q48J413P57
6743I58o71l47M73o54R04N79j210l43P23q23l61K18J182j259P69K18J76p81P16
6762D67L66q17j9k57j74p3j08J051o34N96J11k38j20J16o03O65N02j215O47j98
6782F5j98m23rP62K82p1K85q09N60n56M02k50q74j43Q86L36j29M43n0L7N7j09
6804D94r95K90j16p03N21K49P20m5l2m5q69P5j3J12pk61K80P13m1k18j65k5l59
$$ y = [228, 86, -159, 290, -909, -679, 36, -264, -154, 246, 938, -174, -308, -308, -364, -396, -468, -471, 312, -181, 527, 181, -398, 448, -84, -233, 797, 380, -652, -19, -69, -594, -539, 119, 713, -111, 631, 96, 4, 646, 353, 6, -41, 108, 192, -344, -7, -52, 9, 82, 669, -449, -300, 731, 692, -525, -836, -89, -285, -537, -319, 523, -208, 45, -432, 357, -959, 56, 2, -336, 657, 210, 129, 163, 259, -190, 219, 381, 1053, -402, 484, -364, -1212, 201, 958, 287, -60, 413, -241, 663, 1242, 32, -311, 412, -411, -772, -554, 628, -631, 138, 356, 532, -249, 467, 833, 16, -3, -260, -434, -507, -615, 436, -198, 398, 509, 271, 151, 267, -336, 329, 831, -384, 263, 65, -133, -556, -565, 197, 479, 408, 693, -116, 444, -112, 290, 40, -834, -977, -91, 245, 116, 559, 509, 546, 603, 494, -501, -211, -327, -1030, -509, -260, 460, 415, 383, 338, -531, -456, -469, -357, -364, -625, -345, 368, 327, 109, -56, -81, -440]
6827d40L99M5K20J03j048P71n50K25J026j312M34m38J436p20P42p72L55m14j29
6846f7M62n97j95k39L09J61N37k74M85L70n78o01K83o15N17j87q1M52j59L70l46
6867GJ0p18J20N72j59j31q56J299l92n7k60Q84k23L60n11j09K19m94J18M53j46
6888a4K0K32L1p15L84m5K2J87K71q10K37M32j172N71P49r67R87k42p87M17P2L83
6910B43L33q50j49M49J24n51O50L00L12l18r6m66l46M04p00Q71l39j86O19j90
6930A14M8j06J14m62L8L41J97l61O8N62o01J77m1J13k65N75o93N53K50q53K57
6951B5j38K47M08r77P3J58o5Q83N0l02j32K36q96M48J66j40m75Q31o67j12R57
6972E78j38l06L9k56O13l30q6j97j22j78J97K73p44j48J295J02p94O66m77J44
$$ y = [-440, -41, 4, 224, 327, -721, 50, -500, -275, 751, -561, -127, -565, 871, 151, 893, 121, 476, 62, -67, 395, -202, -397, -636, -327, -166, 371, 97, 582, 952, 374, -227, 56, -559, -42, -229, -310, 142, -17, 353, 7, 17, -701, -581, -9, -168, -299, -1155, 144, -248, -305, -565, 319, 96, 456, -55, -164, 55, -439, -321, 132, -14, 6, 238, 269, -446, -62, -107, -85, 102, 373, -437, -200, 232, -940, -369, 380, -587, 400, 158, -629, -212, -140, 243, 576, -274, -423, 26, 150, -401, 249, 549, 861, 543, 447, -19, -365, 39, -661, 210, -129, -315, 304, 114, 162, 56, 170, -292, -254, 87, 284, -77, -9, 553, -48, 129, 88, 201, -64, 511, -182, 371, 621, -232, 25, -113, 134, 542, -435, -362, -204, -269, 614, 664, 362, 230, 466, -430, 18, 184, 44, -431, 400, -267, -379, 578, 440, 134, 173, -83, 530, 200, 114, -83, -205, -383, -186, 87, -657, -805, 490, 592, -202, 464, -13, 131]
6992A31J14m72L16K6J00j1k60j83m2N0P80j494L79L71O38k74n90O64J29j09j30
7013A33N31k78k85K11p31R34n07k19k92J028m90j3k01K40M81j361J145n23K04
7032Gk29N20o85O50k87j87Q55j031R62q14L24k02m43m21O52Q67q18L24J44M67
7052F55j071N95q38J741j131m01N81j21k67P86m23M7J20p8j09j45j76Q1P15m65
7072I6j44L11o94L7P75n63L38J05k64J86J02o71K51P25N2p39L37l25J195o25m45
7093D0n20R93q09J68o18L37n73O81N1J61J23Q91j129R4k52J72J87J66q60P04O29
7114F36n4o23j2k19N11k37k4K76q12R00q19K11j99j04M47r3K20K72j68P20j035
7135b06k56R95k69n70M78o41N64l73N82j051P98k87K90q9m1k45P14j007J024j46
$$ y = [131, 245, -227, 89, 115, 215, 204, -56, -239, -281, -231, 549, -945, -566, -195, 443, 169, -421, 243, 372, 263, 133, 664, 386, 101, 312, -419, 515, 8, -211, -503, 525, 35, 22, -179, 61, 542, -819, 326, -197, 7, -222, 298, -387, 263, -24, -211, 644, -387, 575, -239, 85, -117, -560, -981, -329, 538, -280, 44, 188, 655, -416, 179, -659, 1082, -49, -450, 131, 10, -257, 529, 106, 153, 273, 195, 86, -59, -235, -154, 561, 96, -48, 263, -431, -394, 381, -182, 156, 261, -3, 183, 285, -386, -135, 590, 642, -97, 240, -85, 1110, 485, 40, -480, 513, -296, -128, -746, -409, -982, -301, -250, -89, 34, 925, -204, -110, -362, -190, -3, 163, -697, 7, 636, 582, -41, -53, -272, 239, 2, -22, 254, -558, 342, -477, -266, -465, -569, -122, -215, 5, 277, 109, 829, -206, -462, 533, 264, -306, 172, -469, 95, -278, 304, -747, 51, -236, 54, -35, -76, -321, 393, -614, 410, 264]
7155B64Pq1m93K54R32q88K60j40P8m98k4Q71m60r4M45k50l46k59J69j32O06J48
7177C69L3k75l56j7L97J38k9m91J98j276M98K81P88l55o07J019Q0l57O23m36p49
7198e24M90N59l47j008n4L09O15m5L22k34n88M5j93Q27k49o8r7k1O04p52l57L05
7220d61R45j06P9k82l63K97n23j29J51K77J2l02O45L20q08L4K88k80j71P1K75
7241c1K17j36k93j85L29j55N01p22O3P52J27k25o12Q5N66p64J58j45N12L38l93
7262a3O87m67j58l36m09r8N68L05l65Q90r08k58N67L35n65M24L4o84J66Q32m29
7283A18N0k91N41k24R3m57J21P05m17P8m69Q25j200R1J328j497J50R79r06N04
7303A22J05M71m13J77K7n19r10M09N86J62m43L57o8K41j1L82j255M79K56q15J023
$$ y = [264, 271, 190, -303, -49, 883, -5, 255, 115, 193, -305, -329, 542, 82, -12, 433, 183, -163, -422, -253, -385, 221, 369, 402, 127, -229, -246, 151, 289, 260, -231, -33, -1309, -811, -530, 258, -97, -704, 315, 395, 38, 661, 225, -524, -34, 525, 178, -830, -884, -575, 40, -5, 317, 83, -505, -460, -653, 174, -75, -143, -240, -261, 343, -409, -766, -461, 484, 378, 457, 175, -188, 109, -414, -543, -392, -115, -103, -405, 240, 560, -248, -214, 74, -206, -377, -306, -31, 186, 50, -243, -428, -99, -254, 247, -475, -412, 340, 467, 242, -370, -285, 281, -483, -325, -470, 42, 380, -13, 674, 207, 49, -287, -696, -794, -226, 79, -286, 604, -304, -562, 5, 340, -225, 199, 233, -451, -285, 547, 118, 168, -123, 418, 194, 287, -170, -49, 656, 239, 317, -152, 673, -527, -436, 892, -605, -455, 524, -382, 122, 227, 698, 285, 462, 489, -30, -940, -531, 55, 217, -226, 131, 63, 304, 293, 675, -580, -101, 155, -660, 363]
7324C63K34o93M72k30J90l76L12k48l53Q97k09q67Q33p74O78J53r21J131j006
7343d14P13p7K2P9j48l68K0N66l86P43j020k54Q84o6j43m35k58J90M80K59p24
7364c37R30n96M49Q52j463L0Q3j8L12J73p86m2N98N03o87m93K21j82j51R28m86
7385a62M36o34J74N25k44j69K7L42j04j69L81m06P64j253Q52n75L20n34M56n8
7405c1J14n95O96L7n35O22n31K49n95J030n45M13l48m9q8J114j013K27M7k38K9
7426A0J67r28M49J17l17P36j5m0k70o57L06K33J81L09o09j91J16M69m66O71k92
7447b1K31o48L72J31m42n92N30J00Q47j235J099j165K19J057j000L45J69q82R78
7466I3P6o60j00J33P71K76p05L21l26Q1J27K17l45m11o3O90O3m88Q5K50l58R07
$$ y = [363, 597, -96, 376, 146, 336, -40, 272, 24, -329, 568, 359, -508, 325, -449, 229, 382, -539, 592, -414, 299, 222, 244, 323, 175, -193, -173, 393, 7, 750, -270, -524, 360, 294, 151, -284, -542, -352, 128, 387, -337, 593, -3, 446, 1298, -165, -135, -52, -70, 242, 415, -371, -413, 185, 688, 1, -492, -271, -453, -604, 324, -162, 274, -360, -186, 339, 95, -74, -47, 295, 191, 22, 403, -3, 761, -492, 360, -215, 105, -429, 27, -31, 83, -512, 184, 221, -314, 308, -223, 26, -569, 461, -84, 329, -19, -68, -156, 958, -55, 172, 219, -19, 10, 177, -751, -302, -185, -502, 234, 219, 179, -91, -748, -442, -209, -28, 281, -328, -519, -403, 66, -400, 271, -21, 210, -438, -66, 65, -377, -969, -439, -339, 508, -727, 372, -793, -574, 483, -517, -172, -3, -885, 93, 169, -491, -591, -458, 313, 589, -116, 205, -121, -40, 87, 304, -41, -452, -515, 175, 238, -250, -165, 85, -273, 634]
7488F34j088P34o80Q01Q8p1p77N8N84j33k28J73j9N06p1l90k6J46L84q63L24l16
7510b30R73q84L73j02qJ78j20n88O09n1k01m18P6J36K2K67j88Q68r31L09k55J96
7532C1P5n18Q48n12K15N84m03n04P76q78k8j84j05J594j455L27j25O38j80j1o3
7553A22j80L48r15N90K30j90L46n45m82Q47q2o2N99p16k06N33j32O78n67p52Q83
7574C47q04J11K96N35P0q80N07k28N17p9n80L77M34p22J20o81O08J38l61%N52
7595B77j88q63K73J284l11q43K59o63R60r28k83J195M8m74M56r02J239o17k67
7614c48j4L20r9N70p80R02o25L0N50l48m69Q52q11M70j85K84L5l10n9J33L04n43
7636a41J7M6J025q21J04L64m64M65m90j13K50J04M80p65k93M01m95K25N21n73
$$ y = [634, -454, 280, -400, 401, 489, 418, -359, -301, 283, 150, -78, 95, 76, 582, 511, 121, 95, 241, 625, -238, 86, -230, 743, -141, 232, 130, 122, 300, 180, -408, 201, 150, -51, -469, -393, -257, -235, 32, -156, 712, -219, 90, -165, 31, 106, -412, 436, -76, 139, 723, 320, -184, 592, -286, -314, -498, -603, 991, -464, -137, -262, 376, 196, 185, 122, -58, 290, -625, -35, 195, 5, 351, -194, -676, 171, 89, 27, 626, -90, -296, 237, 105, 783, 216, -536, 347, -457, -346, -50, 485, 555, -325, 182, -46, 471, 392, -188, 189, 623, -99, 21, -660, -52, 86, -275, -275, 277, 89, -774, -501, 783, 472, -371, -112, -775, 185, -743, -1026, 169, 217, -257, 199, -703, 536, -81, -348, -362, -42, -141, 429, -351, 551, -74, -44, 506, 158, -311, 541, -270, 200, 15, 299, 334, 24, -35, 98, 402, -141, -124, -78, 947, 126, 230, 594, 130, 595, 105, -8, 242, 346, 826, 61, -232, 169, -326, -101, 420, -153]
7656a53k76L55L00o66Q65k28j5L4J52m97o98N40N50J75j24nm0Kr2o88Q76k36Q2
7679B13Qp37L63R5j75J04k01p10Q92P2O1j28l59M02p03J10M11P15p20N01n17M64
7701A61m09J27j1L66l87j46M41M99o70m32N74Q20j250p1N27J49n97M76j95l76
7721d04L4O71L89o43P66r60N86j05k60n87P12o41L56n4L32M10k28L77j003P45
7741D93l80M2M26j91o05J69Q54n40j110R88l29k55N13j59J38J07o74J350k43q47
7761b53M95K10j067K59L61m54Q51M16k98o94k10K37K30J086j614R76p35k19Q45
7780D22j17L8J43l21J01m36M3N14l58k24l36R15j9q44N01n75j3M03m31J425j253
7801d22R21p61l74J417j119J054j111R71l95n95J35O3J12K73n33l23O84J13j38
$$ y = [-153, -429, -74, 226, -440, 425, 197, 182, 216, 368, -129, -827, -287, 263, 438, 314, 309, 269, 271, 179, -509, 367, 131, 213, 221, -516, -153, -58, -233, -129, -330, -1040, -148, -76, -15, -143, -502, -100, -803, -693, -282, 433, -287, 214, -303, 161, -248, -121, -132, 234, -153, -299, 142, 641, -29, -461, 113, 933, -317, -388, 139, 288, -309, 167, -28, -404, -370, 301, 690, 47, 813, -147, 439, 334, 74, -513, 199, -442, -86, -140, 192, 602, 374, 751, -252, 493, 113, 155, 581, 390, -215, -46, 808, 268, -842, 146, -183, -438, 75, -84, 54, 161, -513, 837, 594, -253, 242, 452, -615, -356, 5, -449, 402, 818, 520, -174, -384, -147, 83, 1169, -445, 531, -204, -423, 422, 305, 343, 486, 165, 266, -170, -127, 387, 29, -195, -531, 384, 365, -479, 22, -553, -566, -163, -594, 831, -422, 499, -262, -636, 781, -338, 716, -395, 576, 181, -414, -279, -216, -104, 169, -364, -687, -3, 110, -28]
7820b8j15L28j28o35J519j3o62p32R84l04J13N53q69p38R97M04j116M07N5J06
7840A26K64K28m67O09j369J030j65j6k4Q8k07l51J44q71O66L07L63o99R65r41
7860c20m3L6O61r03J072L84j240L61N12k49L56l37q23J44o2K66K27j30L71K53
7880E36p59J44J16P33j175J58n53J8O90M48p03N81q2k35N23m34k57L7N69l66k23
7901b34R8J97m5o91M23O21r34j50O19L58k70l3K65M0m15J42K49L77o40m04P39
7922C12m78L19j3n59O60l87L89j38m53Q52K62q90O34j76J37p91N27J65j1p72L3
7943c78L58P9l31k49Q79j023O10p17J142p37N48n49j25k50Q40N99j595N69K93
7962c7P2n81N59J64k29k97N4M64n75N48J60r25O14L1k44N70k90q2p8O3K90l21
$$ y = [-28, -143, 185, 57, -578, 941, 928, 266, -466, 518, 214, 327, 880, 11, -727, 270, 674, -442, -35, 20, 126, 390, 618, 151, 760, -609, 421, 256, 240, 216, 304, 97, -254, -110, -981, -315, -8, 355, -344, 621, -320, -363, -327, 334, -569, 503, 887, -353, 8, 520, 271, 627, 290, -533, -389, -451, -185, 42, -88, 283, 536, -223, -79, 37, 770, -405, -247, -800, -782, -92, 356, -347, 234, 152, -83, 440, 6, -251, -214, 355, -11, -234, -136, 61, 16, -675, -252, 369, -565, -715, -96, 262, -8, -41, 224, 264, -151, -9, 240, 617, -23, -427, 312, -166, 153, 140, -419, 241, -146, 243, 105, -348, 504, 766, -124, 510, 334, 471, -320, 207, 372, 361, -411, -378, -20, 59, -272, -521, 358, -665, -55, -772, 370, -367, 181, -368, -493, -743, 97, 696, -899, -330, -37, 35, -546, 13, 177, -52, -349, -295, 169, -406, 142, 302, -623, -9, 22, -222, 348, 58, -24, -102, -39, 251, -70]
7984g0R19j175l65O08L9R09j104L6k03N95J86J05k03l87q5M45m18k28P75r45L15
8005b51k65J110j266J203l13k42j22l16O79l1M25q17k70Q07J03p09M10j041J440
8024E34j2R3o93N82m84R61l64q50J78k1N27M16j48j056m24J277r36P6r8j78J146
8045E26j022P0J023J30j94j076M38k12N66J54o33k01J89O82k73J41n06J74L11
8064B87p7m0p37J087m54J93j68l66M37q8L82n00M11O64p14o45K34k33j16j13M14
8085a42J73n19M72j12p4l06J065m55O01j207L62M11o72N19j9q11N63L23l15l74
8105e17N20j23j31L42m53P28j95r0R0M36r22J18M23k25m54J50M52l5n09Q61k31
8126B35m63K13l44M72O6J11q03O23l27k72L20M59p46NJ132m65o58J12J357j140
$$ y = [-70, 849, -326, -691, -83, -44, 865, -239, -203, -406, 189, 375, 480, 277, -110, -195, 250, -168, -396, 379, -566, -251, -516, 594, -672, 531, 218, -24, -146, -462, 217, 186, 611, -206, -476, 331, 434, -275, 135, -906, 534, 522, 615, -78, 504, 20, 981, 617, -233, -55, -76, 451, 867, 719, -337, -761, 516, -420, -344, -442, -620, 526, -496, -426, 597, 727, 533, -543, -105, -317, 249, 403, -230, -431, -242, 440, 167, 308, -198, -24, 287, 210, 170, -567, 520, 66, 259, 91, -275, 162, 74, 456, -44, 367, 1031, 317, -328, -94, -327, -443, -556, -142, 31, -488, -16, -128, -202, -508, 557, 102, 703, -504, -142, 269, -403, 116, 97, -714, -151, 172, -143, -517, 3, -120, -251, 91, -362, 366, 171, 81, 171, 607, -315, -197, 226, 1, -453, -303, 149, 114, -395, 466, 235, -228, -15, -359, 113, 179, 290, -513, 110, -217, -489, -169, 290, -456, -451, 681, 216, -442, -330, 1027, -113]
8146a13k76R66j145K28N60K51r82L39N52j05O03j420Q33N77o80l29l22L17m35
8165e81P7M00Q2k62K46l06O4M87O6k02P43q72j62L02j62k34M82J16j76K68p70
8186c94m63J162n20K8K55
$$ y = [-113, -389, 577, -568, -340, 220, 471, -511, -172, 380, 275, 878, -542, 291, 868, 188, -141, -463, -146, -581, -504, -104, -22, -284, -38, -344, -280, 207, 273, 71, 814, -58, -220, 82, -80, -314, 168, 284, 108, 376, -394, -857, 305, -215, -187, 68]
8191F8
$$ Imaginary data points
##PAGE= N=2
##DATA TABLE= (X++(I..I)), XYDATA
0@%%%%%%%%%%%%%%%%Ql1O2j03J28j28J30j52J78k20K77l00L41m04M53n14N79o59
34c55P43q32R42j051J167j298J444j605J784j972K176k402K646k914L210l537
50a854L889m279M719n210N762o377P087p906Q856r993J1365j3051J5206j8065
64i851K2009k7836L7265n4931R8446l69498m71423J306249j31858j032087P63667
75A30152O78595j012884K6583J042997n23228p66510P68119J39559r63309K31378
85b48548P27550o44447m19198P60217k5956p40715M24721N52704o38676j97592
95d49940O99858j99590n76492N28323L70857n81598N2379O02357k96124l68459
105b18429M88441J11416n18582P8089L27055l31851k44094L33940N5465l16531
$$ y = [0, 0, 0, 0, 0, 0, 0, 0, 0, 0, 0, 0, 0, 0, 0, 0, 0, 8, -23, 39, -64, 64, -64, 66, -86, 92, -128, 149, -151, 190, -214, 239, -275, 304, -355, 388, -444, 498, -553, 614, -684, 760, -845, 939, -1033, 1143, -1259, 1387, -1527, 1683, -1854, 2035, -2244, 2475, -2735, 3027, -3350, 3737, -4169, 4687, -5306, 6059, -6992, 8214, -9851, 12158, -15678, 21587, -33344, 65102, -304396, -775819, 530430, 398572, -633515, 130152, 808747, -204137, -177554, 865443, 342215, -424295, 343824, 483383, -479926, -248548, 479002, -165445, -584643, 175574, 149618, -591097, -166376, 386328, -252348, -449940, 249918, 50328, -526164, 2159, 373016, -208582, -156203, 446154, 150030, -218429, 270012, 381428, -137154, -59065, 267990, -63861, -307955, 25985, 81450, -235081]
115b35081R2911K80532j64979j85796K51644J05354k94352P682K96488j47928
125F475k44220K91457J65330l25970N2603L73334k02250k80598L24914Q8781m29296
136a79440O4583L59675k87276k66473M09156P8903m36409J75262M04278l66200
146d3941k40442M82302l0420n15176K83196L75346m93262j18212N89497j67081
156A21807m75648M63372K48711o12619N2194N49054l90223l66782N77722N9084
166B26672n90635K88780M78087m90295j69016O08915j41442n41799L93388K93344
176C55999n78044k0999N64732k78409m01333N04761J60712n58195J42707M64426
186C56357m09009k78541N02074l2800n03366K77357L46986m21036o9876M96941
$$ y = [-235081, -142170, 138362, -26617, -212413, 39231, 144585, -149767, -142085, 154403, 6475, -237745, 53712, 219042, -106928, -54325, 319009, 116759, -163839, 161075, 249856, -179440, -114857, 244818, -42458, -308931, 100225, 179128, -257281, -82019, 322259, -43941, -284383, 197919, 167499, -347677, -64481, 310865, -182397, -300609, 288888, 121807, -353841, 109531, 358242, -254377, -202183, 346871, -43352, -410134, 167588, 226672, -363963, -75183, 402904, -87391, -256407, 352508, 211066, -330733, 62655, 355999, -222045, -243044, 321688, 43279, -358054, 146707, 307419, -250776, -108069, 356357, -52652, -331193, 170881, 138081, -365285, -87928, 259058, -161978, -231854, 265087]
196B65087j34232l65774L34753J80404m26163J5024L61327k27334k61915L25840
206F7017R1086l36829J03604L01664k20965j77074K87812J7233l12404R9170K26584
217A46898k22265j24683K82568J9177k43486J35347K12839k06395j03923K42854
227A38931k6409k54161J10971J75325k10810q4212K58454j7045k32892J44742
237B894J77604k36655q1563K59727p0734k60996J79702J72025k64323k3132L14952
248A69501r9796k42475K45234J34074l24061J1082K98800j91905k31323K98084
258F7215Q2644l28315J10130L03548k43338j64290L33583j6281l50111J69192
268c6023K31678l19997q3086L65601q9561k91583K76439J82377l47017J0372L39282
$$ y = [265087, 130855, -234919, 99834, 280238, -145925, -130901, 230426, 3092, -258823, 67017, 158103, -178726, -75122, 226542, 5577, -171497, 116315, 133548, -178856, -79686, 146898, -75367, -200050, 82518, 101695, -141791, -6444, 206395, 0, -103923, 138931, 112522, -141639, -30668, 144657, -66153, -150365, 108089, 91044, -141848, 2894, 180498, -56157, -137720, 122007, 51273, -209723, -30021, 142004, -122319, -145451, 169501, 69705, -172770, 72464, 206538, -117523, -106441, 192359, 454, -230869, 67215, 149859, -178456, -68326, 235222, -8116, -172406, 161177, 144896, -205215, -36023, 195655, -124342, -207428, 158173, 68612, -222971, 53468, 235845, -111172, -100800, 238482]
279B38482k02511k63215L03258P2632l63619J05823L12550k47276j54493L54391
289A56022l738l32765J78843K27716l15468r1359L28951j00875k83825K47985
299A1487J69763l03905J7666L18306j57394k21962K62476O8983l16916O2662K51854
310A63020k02869j47718K77817K3528k61121J28080K06455k21079r6286K49104
320A18931m9911k43127J48479J53152k21117l2351K51541o7536j90881J76043
330D3223J11879k27594r854K11568j14423j69815J82601P7415k09550M1789K05164
341A42403j19837j30346J87420L3353k18359N0704J68259j53123j08298K03045
351E5221J7999j92510R9237J70913j62538p9783K01109k8534k09120J05594J34032
$$ y = [238482, 35971, -227244, 76014, 148646, -214973, -109150, 203400, -43876, -198369, 156022, 152284, -180481, -1638, 226078, -89390, -180749, 148202, 47327, -236498, 11487, 181250, -122655, -104989, 213317, 55923, -166039, 96437, 165420, -151496, -88834, 163020, -39849, -187567, 90250, 113778, -147343, -19263, 187192, -33887, -130173, 118931, 69020, -174107, -25628, 127524, -93593, -125944, 125597, 58061, -132820, 43223, 155102, -72492, -82346, 129222, 14799, -155016, 27585, 105000, -104550, -62761, 142403, 22566, -107780, 79640, 112993, -105366, -54662, 113597, -39526, -147824, 55221, 73220, -119290, -20053, 150860, -11678, -91461, 109648, 81114, -128006, -22412, 111620]
362A11620j88621m9392K17139m1838j76049J54694J20385j99980k0184K02026
372A29800r9416j77675J62727P7763k14769K8445K13153j15098j32305K07695
382H0320M8878k24136O2875J82590j74601j18343K16482n838k19180J22152J74468
393A45667j92352n4619K39652n7455k12344J57676J15832k37934j3104K30859
403A21878j10238j72990K11801P9783k34906N4759K15614j65873j39268K21824
413H2384N723k41859J04633J80963j96576o8356K45300m2506k06045J57764J23957
424A45382k25467j8707K19020j06848j68394J89269P6251k10002N1330K00526
434A52360j35262j17125J91857Q688k07238P4653J44210j62816o7771J91690k1435
$$ y = [111620, -77001, -126393, 90746, 48908, -127141, 27553, 147938, -52042, -72226, 129800, 30384, -147291, 15436, 93199, -121570, -93125, 120028, 4930, -127375, 80320, 129198, -94938, -32063, 150527, -24074, -142417, 74065, 68227, -150953, -28801, 145667, -46685, -101304, 138348, 80893, -131451, 26225, 142057, -95877, -108981, 121878, 11640, -161350, 50451, 130234, -104672, -49913, 165701, -172, -139440, 82384, 88107, -153752, -49119, 131844, -64732, -133088, 112212, 69706, -136339, 21425, 145382, -80085, -98792, 120228, 13380, -155014, 34255, 110506, -99496, -48166, 152360, 17098, -100027, 91830, 100518, -106720, -32067, 112143, -50673, -118444, 73246, 51811]
445E1811j61077J20498J11289j61874k7581J64391o9634j43036J19519O4470j55791
456h7015J3029J54482o7834r5080J33052M4645j42007K0430J17560r1404r2529
467i2671J12470K3794j27616L7200J20105p4878o7010J22380J9918j30778L4654
478b2432J03152r9546p4913J26138J0237j29289O3337J19891j01773n6365J43959
489H2396r193j44988P0711R8466j38185m6650J56024l4334j37999J15578R4742
500A06568j57932j0689J67904q2930j41979J44026N5255j90393L6545J76454j21390
511a8561j02078J93219J5713j93444R1371J44784j75887o4865J98164m9657j75637
522a36878J47497J09603j89322Q004J99648j03211j40516J72821L7078k07963
$$ y = [51811, -109266, 11232, 122521, -39353, -66934, 97457, 27823, -115213, 4306, 68776, -87015, -73986, 80496, 12662, -82418, 50634, 95279, -46728, -26298, 91262, -142, -92671, 19799, 43593, -84023, -46823, 73282, -1596, -68606, 53774, 73692, -57086, -22432, 80720, -18826, -93739, 32399, 42636, -86653, -23316, 96575, -5198, -61563, 82396, 73203, -71785, -1074, 97392, -40793, -87443, 68581, 34247, -103752, 11826, 106568, -51364, -62053, 105851, 22921, -119058, 24968, 80223, -110170, -73625, 102829, -18561, -120639, 72580, 88293, -105151, -13780, 131004, -44883, -109748, 88416, 38759, -136878, 10619, 120222, -69100, -61096, 138552, 35341, -105175, 67646, 104724, -103239]
532a03239N3494J61497j49515q3230J97564r124j75007J13577J22914j70207l4190
543g5466J74260p3629j49043J30890O5800j62192K6054J54907q8686q4718J43050
554F1227J9281j43679M9529R9407j12691n4913J20636j2928j08490P0982Q0287
565F8648r0461k0797J04076k4097r0329N4404M8492q6732j8731Q6135j7973o9065
577e6430N9435N5798o9504j3791Q2355k1047p9268M4975M9264p9265k1490Q9384
589D0416j5032q1440O1768O3049q8859k1907R9947l5825j01850P4840N7808j14585
601f1670k386J26586n5036r0494J17472M2658j38594L0461J22712j06125p9667
612i4083J43464R47j46037Q3623J15287j34223l3023J64010m8494j40897J14528
$$ y = [-103239, -49745, 111752, -37763, -120993, 76571, 67447, -107560, 6017, 128931, -41276, -75466, 98794, 25165, -123878, 7012, 72812, -89380, -63326, 91581, 2895, -81823, 61227, 80508, -63171, -13642, 85765, -26926, -81839, 38797, 25869, -82621, -11639, 68648, -21813, -42610, 61466, 37369, -52960, 1444, 49936, -36796, -55527, 30608, 12635, -56430, 3005, 58803, -10701, -24492, 57863, 36816, -42452, 2523, 51787, -27478, -48968, 40416, 25384, -56056, 5712, 68761, -20098, -42005, 57942, 22117, -79733, -4893, 52915, -61670, -64056, 62530, 7494, -83000, 34472, 77130, -61464, -31003, 91709, -14416, -94083, 49381, 50328, -95709, -12086, 103201, -31022, -64045, 99965, 51471, -89426, 25102]
623B5102O8476j67349O688J54381r4139j03690J57652L0442j60040O6271J32692
634A16486j35812o5400J59810l4313j53323J06277R0232j53276r41J61155p0507
645B0388j06064J35924L6079j53301L6399J18657j09141o7245J30792o984j19808
656h4304P4136Q8771j03905k1882J13662l4929r6363P4680M5684j00093k172R2702
668D5987m2319o0309P7283L0403p8922J4452O7536m7905m7268N8559J1441o6917
680c7979J4859N7523l4212l4575N4416J7235n7253L694N2866l3080m9182M6760
692A072K6259o4627M644P2931l1762n1623O6803K6099q2926R805P5766n6535n8231
705f2325Q4228J2993r1764M0017Q4168p4679l9232J03304j3173j04029O1031O4495
$$ y = [25102, 93578, -73771, -67083, 87298, -6841, -110531, 47121, 77563, -82477, -16206, 116486, -19326, -84726, 75084, 40771, -112552, -6275, 83957, -69319, -70260, 90895, 20388, -85676, 50248, 86327, -66974, -30575, 88082, -21059, -88304, 42488, 35504, -84304, -10168, 78603, -25302, -47184, 66478, 31549, -64814, 9866, 55550, -44543, -46715, 45987, 3668, -56641, 20642, 51045, -27877, -13425, 54111, 6206, -41062, 17497, 28938, -37979, -23120, 34403, 191, -34384, 20032, 37267, -19986, -16292, 36574, 3494, -45688, 1072, 27331, -37296, -32652, 40279, 8517, -43106, 23697, 49796, -33130, -23325, 52441, -4094, -62325, 21903, 34896, -56868, -16851, 67317, -7362, -46594, 56710, 43537, -60492, 539, 65034]
717F5034j06829j9878J15805m1942r2099R9875N1202j18603J8176J14241q0464
728D518p8032J14211P148j29386N5820R6716j05473l2303J31456k8104j08494
739g1923R1316O1460j25090k89J15450o9756q4425J09241K5932j16648M2311R8881
751G6460q4494m7939J10323j2523j04850N8948O5217r7942j6492J02863l3759
762A5812p7533P8200L9075r1336J0130Q1266n3916n5961P4242J2301p8489K6586
774a9623O4672n1053l1409O7167J726o2491K5364M3578m8632k5751N5234k526
786A6256n1209K8740M2165m0649j8774N1908l614n2476K2868L6483m7479k1570
798c7351N4101k042n1715L3612M4164m7750j7406O0139j1306o1019L4726L8136
$$ y = [65034, -41795, -61673, 54132, 12190, -79909, 19966, 71168, -47435, -29259, 84982, 4518, -73514, 40697, 47845, -81541, -25721, 70995, -34478, -66781, 64675, 36571, -71923, 19393, 80853, -44237, -44526, 70924, 1168, -83257, 25984, 51916, -64732, -22421, 76460, -8034, -55973, 54350, 41827, -63023, -4075, 61142, -36800, -53292, 49571, 15812, -61721, 16479, 55554, -35782, -25652, 55614, 1698, -54263, 19979, 32280, -46209, -19623, 45049, -6004, -37413, 29754, 31480, -31011, -5647, 37931, -10701, -36452, 18782, 16256, -34953, -6213, 35952, -4697, -23471, 28437, 24823, -27653, -4785, 31698, -15781, -37351, 16750, 14708, -37007, -3395, 40769, -6981, -24387, 35752, 24446, -36573, -1847, 36289]
810C6289o3055j3476P0045j9436n7763N7535L7034p1483K229P3661m3737n8172
822e0329O7998J7513q4240K1775P4278n9090l8715Q7189P64q3481M6212N9863
834E9737q0769k2422Q7566k8209p6698O7831M2309q5726P235Q7703m8532n9972
846d9947P9528J5134r1000K6860P2622o8216l7327Q6552o499q0016N1221N4702
858E3614p8470j4344Q2267l0998o8206O2947L2177p7544J0256P4798m3963m6118
870d3584O9672J1965p4563K3729N6503n4834l0247O6907k902o0441L6287M5320
882D3812n3269j5092N9595j6027n4011L7044K9222n5625m744N4282j9733l9616
894c4162M3250K3001m8766K894M7703k8145l6184L8260J3564m8478O526M5686
$$ y = [36289, -26766, -40242, 29803, 10367, -47396, 10139, 47173, -24310, -22081, 51580, 7843, -50329, 17669, 35182, -49058, -27283, 46995, -12095, -50810, 36379, 37143, -46338, -126, 59737, -21032, -43454, 44112, 15903, -60795, 7036, 49345, -36381, -29146, 58557, 10025, -49947, 29581, 44715, -46285, -19425, 53197, -15019, -52346, 34206, 27707, -52309, -1088, 53614, -24856, -39200, 43067, 12069, -56137, 6810, 38987, -38557, -28301, 46497, 2534, -43584, 26088, 38053, -36510, -12781, 43722, -11112, -41359, 25548, 22646, -37795, -1508, 43812, -9457, -24549, 35046, 19019, -34992, 2052, 31274, -24351, -29095, 25187, 5454, -34162, 9088, 32089, -16677, -13783, 33920, 5775, -30409, 7851, 21415, -27063, -20537, 25149]
906B5149k6013k8791M3925J3266m6533J0840M0212l2262l0312M3077N026n0105
918c2521J7945M2571l6817k1395N2178J240n1292K6160L8271m6592j8509N4277
930B5516j0548n0946L6853L4983n3255n457N8757k2292m6776M5862K2807o1479
942b5975N038N7698l6805l8981N6724J1110o3009K2078N2730m9870k9306O3250
954B4682n469o2838L6219M4737n7949j1218O6593k0144n4114N0430K7184o4825
966b6712L567O0718l7330m1776N9976J1859o3107K3874N5146n0489k6029O1976
978C1673p564o2087L5734L7701n6848j1115O1886j9351m7830M7144K6674n7608
990b1591M943N2128l2776l6915M7218Q835n3639J8154M3036l6237k0508M8950
$$ y = [25149, -864, -29655, 14270, 27536, -18997, -8157, 32055, -207, -30519, 12558, 17584, -32521, -14576, 27995, -8822, -30217, 21961, 23201, -28091, -1931, 36340, -10252, -28761, 25516, 14968, -35978, 875, 35858, -17397, -22854, 35903, 13611, -33165, 12697, 35504, -25975, -20937, 36761, -44, -39025, 17699, 28809, -34200, -12122, 40608, -9262, -38568, 24682, 19213, -43625, -7406, 37331, -20618, -31836, 34757, 14613, -39501, 10929, 38113, -26712, -23145, 37573, 243, -41533, 18443, 30302, -32805, -8931, 46215, -4274, -30303, 31673, 24109, -37978, -2244, 35457, -21391, -32506, 29380, 10029, -37801, 9343, 36017, -21591, -16648, 35480, 2704, -34211, 13007, 21842, -31797, -13643, 29393, -6844, -27352, 21598]
1002B1598j137m4602K4229L0066m0020j3305M1105j0193l6882K7314K3398l5600
1014a4029n229M0215j0502l2093K6997J7683l5348k599L4460j4618k7283K7779
1026E433J4616l2595J248L3534j5187k6765K7887J1935l4574K182L3865j9453
1038B126k4847L1230J1006l8001O859L5494k6258k4596L7756N478m3638J7020
1050a0371L7514l5412j8121M6989l363m5846K8120L1782m5252j1141N0462j6206
1062I155m2482L9896K3886n0593L871N0008k8084l5542M8257Q893n6335J7085
1074a1985M4439m3000k2397N5362n444n1323L5132L4842n2249n960N4399k4221
1086G595m3592M4154J9611n5771J1049M8460l4886k7603N0056L893m9879K2972
$$ y = [21598, 20461, -24141, 88, 30154, -9866, -23171, 17934, 7741, -29141, -1827, 21571, -14029, -19258, 20957, 10455, -21638, 5359, 23042, -12306, -14905, 19555, 4937, -22346, 5433, 20049, -12546, -11298, 22236, 7049, -19716, 8171, 20106, -14468, -12286, 21579, 2126, -22721, 8509, 19515, -18486, -11627, 23867, -2391, -26987, 10769, 16247, -27391, -10371, 27143, -8269, -26390, 20599, 17236, -28610, -490, 31292, -13960, -25101, 25361, 9155, -33327, 6569, 30455, -20138, -16267, 33741, 5657, -29885, 18372, 27265, -29070, -11985, 32454, -10546, -32943, 22419, 16975, -34348, 784, 35626, -16623, -22583, 31816, 7595, -35997, 8157, 27768, -28003, -16954, 31506, -3380, -30983, 19073, 22966, -26913, -3941]
1098c941L6243m2385j5001M7835j1428m0990L0846K2712m0969n13M1859j9321
1110D947l0131L5151J0570l8322Q784L1551k4265j9652L2609K268l1948J3535
1122d903K3332k2593j1715K8342j396k6101J2222J9435j9884j0475K3846j027
1134I083k2097Q330J7954j7025j1993K3253K084k3288R371K0021j8812j0698K5673
1147A1856m17k7298J1801K2065k5168j0654L1691m722l0377K1642K2043l2733
1159a0271m727L7518j3891l2756L1231J5730m1335L929L9201k4465k8468M0944
1171A2640P886m4391J6335L6183l5827j7920M6793p770m3505K9994K6247m4669
1183a8004l384M7580k2119l4733M1822J3580m7385J3437M0415l3781k2156M4500
$$ y = [-3941, 32302, -10083, -25084, 22751, 11323, -29667, 1179, 23891, -17078, -17591, 24268, 4947, -25184, 9967, 20537, -17785, -9001, 22550, -1715, -21367, 11242, 13510, -18438, -4903, 18429, -4164, -15879, 12463, 11067, -15034, -2812, 16623, -3261, -13736, 10110, 9083, -13014, -4684, 13270, -3755, -15748, 7505, 9589, -13699, -4328, 15693, -3119, -13817, 11856, 11439, -15859, -4058, 18007, -7161, -17815, 13876, 9154, -21223, 419, 22462, -10271, -14998, 22520, 8629, -24127, 7104, 22834, -18501, -14572, 24629, 164, -28304, 12640, 20526, -23865, -7530, 28653, -7174, -25094, 21699, 13929, -29576, 418, 26665, -18004, -21388, 26192, 4073, -30660, 11162, 24742, -22643, -9206, 31209, -2572, -24728, 19772]
1195A9772k292m4472K4553L0898m2063p882M5107j5597l5187L4841J6088m1887
1207a8121O044L7141k5270k3877L5872K278l6301J4580K7067k8107r136L2199
1219A4369m777k8087J9722J7389k6907k162K5606j0607j9565J8264R547k1481
1231h689K80K0740r603j5165J6649Q259j8520p69J7070o501j5522J2668R580j7319
1245f842j996J7254m311j5678J3522J0003j7681l268K0823p053j7822J5277J1693
1258A3921k2512j439K3931j1434k0096K2910R150l0276P777K6126j9576j7516
1270a9034L0867J173l2416J4645K6382l0471j0822L6073q726l2550K7213J9535
1282B1869l5967J795L6913j9407k6107L3792P774l8622J1879L0698l0171j7137
$$ y = [19772, 17480, -26992, -2439, 28459, -13604, -21486, 23621, 8024, -27163, 7678, 23766, -18121, -12077, 25064, -206, -24083, 11789, 14067, -22234, -7654, 19413, -8694, -17830, 14369, 9592, -18495, 1227, 18616, -8291, -10453, 15153, 4546, -15019, 3245, 12792, -8689, -8409, 12331, 2728, -12437, 4212, 12471, -6049, -6818, 10252, 3751, -11771, 897, 10477, -6842, -8838, 8416, 4105, -11573, 1949, 11952, -5729, -8997, 11826, 4773, -13049, 2228, 13921, -8591, -10030, 13901, 2467, -17629, 5281, 14431, -15845, -8068, 18058, -1518, -19034, 11833, 13006, -19410, -4765, 21617, -8854, -19676, 16397, 7671, -24879, 2334, 21869, -14098, -12303, 24610, 5203, -20904, 12888, 20662, -17960, -6081, 24617, -5554, -22691]
1294b2691L8893l556l5339K3831K3134l4924n157L7291j6904k9094L0145J1202
1306A6831l8123R298L1830k4568j7138L3819J261l0777J5586K3222k8103p913
1318a4775L0491r147k4440J9946J3384k5686O11K5141j1380j7255J9468O223k2967
1331a0386N314J7955j3202j1849J7443J779j7467O826J4067j2019p381J5503K74
1344F857j4960N362J2445r872q251J3595K600j5063M200J2285r800r990J3490
1357B898L204j5990M005J5971j1649j0053J7990J918j9213P035J6409j7102q911
1370a3488K1468j648k2079J4132J6924k1055l859K5671p587k2392K0457J0069
1382A6613k7053J598K5359j7061j8107K7041M976k8168J1142K4531k4707j1428
$$ y = [-22691, 16202, 12646, -22693, 1138, 24272, -10652, -15809, 21482, 4578, -24516, 5629, 16831, -21292, -11994, 19836, -4732, -21870, 11949, 13210, -17567, -1981, 21241, -6862, -14775, 15716, 6569, -17871, 2075, 15459, -10227, -9616, 15525, 4145, -13110, 6358, 12581, -10386, -5072, 12883, -319, -12168, 5275, 7054, -10413, -3587, 10480, -1539, -8920, 6583, 6857, -8103, -2741, 9704, -168, -8419, 5176, 7776, -7287, -3087, 9198, -602, -10592, 2898, 6102, -9888, -5883, 10088, -1561, -11614, 6376, 8294, -10919, -3884, 12525, -4577, -13488, 7980, 6332, -15747, -1615, 15309, -5746, -9605, 16066, 8479, -13913, 6544, 16613, -10440, -8842, 16517, -544, -18651, 8390, 13366, -14802, -3660, 20871, -3836, -15264]
1394a5264K9924n361k9618J8918J6899k8606k269L0522j3972k1613K6603R593
1406A5756k8996O879K4887k0520j4780K7807j226k7744J5303J9724k3619n657
1418a2186K7712q017k3130J9739J1515k5244J102K2898j3179j5779K0585M942
1430A0958k1885O933J8350j6442r375J9274j593j8206R960J2893j5475l725J7612
1443I279l913j4446J0287P763j4023k739J3900m101j2721J0008P571j1070j154
1456e359J3001l351j1580P875O290j2295j863J1955m105j0180R171Q984j2218
1469c675J020J2907n644j1221J0661O523j5740n38J3672p659j2144J4381O479
1482I022j6379L395J6727j1329j1479J6400J707k0644O985J5883j6806p722K2873
$$ y = [-15264, 14660, 9299, -20319, -1401, 15498, -13108, -15377, 15145, 1173, -20440, 6163, 15756, -13240, -6361, 18526, -1994, -16774, 11033, 9807, -17937, -2634, 17090, -6529, -12186, 15526, 7509, -15621, 4118, 15633, -9611, -8509, 14389, 1210, -14569, 6016, 10958, -10927, -3994, 14356, -2086, -11461, 7813, 6220, -11986, -2026, 10867, -4608, -8333, 9279, 5366, -9080, 1207, 8970, -5053, -7792, 6108, 2007, -10714, -706, 6865, -4205, -5359, 7642, 4291, -7289, 586, 6876, -5419, -7282, 4673, 568, -9612, -441, 8543, -3675, -2655, 10252, 4608, -6613, 4048, 10571, -5169, -5707, 7965, 306, -11838, 2543, 9022, -7357, -3962, 12765, 1436, -10043, 6357, 8064, -12580, -5595, 10288, -6518, -14240, 8633]
1495H633l575j8937J5206J2537k1251j425K1815j0084j7886J8689P353k3056N995
1508e986K0415j4696j2476K2327J398k3973J2356J5261j9881o228K2610o540j9397
1521a4810J7536J0975k2413Q62K1781j3132j5120J9944K935k1717Q713J7827j6924
1534c543o913K0326k188j8677J1990J1075j8182l283J7667o781j4295J4842P364
1547I402j6103K857J4799q916r782J3559Q82j5605M521J0748r331n567J2464Q18
1561D746j0402O277Q083p817m143Q273k054r685M282O438p063k713Q876k49p242
1576d393L860R240p682n179Q488l02j0330L439P813p811m683J0950J127j0615
1590f078O549Q770j1050m021J1991l066j2663R051P975j4203j82J6297o355j2057
$$ y = [8633, 5058, -13879, 1327, 13864, -7387, -8812, 13003, 2919, -14967, 3722, 11075, -11981, -5986, 14429, -267, -12743, 9584, 10982, -12991, -635, 14626, -5255, -11483, 11127, 4587, -14810, 2726, 13701, -8712, -7850, 13931, 799, -14321, 5623, 8558, -13159, -4446, 13381, -3543, -10456, 9870, 7682, -10995, 995, 12070, -6112, -9395, 8272, 1491, -12804, 2038, 9402, -6701, -3844, 10955, 2039, -7743, 5816, 6698, -8907, -4386, 6362, -2969, -8536, 3928, 4746, -5656, 621, 8704, 887, -3256, 5017, 2963, -6722, -2440, 3998, -3065, -5778, 3098, 2849, -4393, -533, 8707, 1025, -4154, 4334, 4032, -6298, -2859, 4954, -2857, -7540, 3410, 4537, -6078, 471, 9241, -1809, -5830, 6161, 3095, -9568, -517, 7458, -6745, -6927, 9370, 3015, -9042]
1604i042J3510N499j7309K861J5546j2530r518J6602J619j7353Q472J4047j5850
1617c446n231J8188n529j7148J3551R148j8578P0J8986r492j2636J8488L654j9191
1631i166O402J5704j6239q620J9893k905j7770J3050J1950j6412m54J7832q053
1644E212j4293J3840M732j8459L752J4314j2232p376J5490R39j4579Q580J0450
1657A0370j3432l242J2077l831j2255R183N295j0867O41J1216m624n601R352J886
1671F168r150K547P018o308n695N808K043o502K083O780l613m196N385K036o596
1686b192O94M565j958n945M950K753n829L64O625j324o745O246K644p917q4Q401
1702E248m229p533Q934M334j0879J994J0806q524o981J0960N69j3909N588J0749
$$ y = [-9042, 4468, 9967, -7342, -4481, 11065, -1465, -10983, 5619, 7238, -10115, -1643, 12404, -3446, -8677, 9511, 3982, -13166, 385, 9533, -9045, -8975, 10011, 519, -12117, 6371, 10025, -9166, -2764, 12940, -3299, -11919, 7974, 5069, -12701, 349, 12299, -4113, -4567, 13265, 5212, -9081, 4759, 9491, -8968, -5216, 9098, -3134, -10510, 4980, 5919, -8660, -80, 10370, -3062, -6304, 5773, 1942, -10313, -1130, 4165, -6702, -6061, 5155, 531, -5070, 4282, 6168, -2982, -435, 6583, 275, -5420, 388, 2431, -4071, -1988, 4792, 1179, -3017, 2368, 4404, -2192, -1498, 3067, 1109, -4836, 114, 2867, -2962, -2598, 4027, 2703, -4042, 2204, 4848, -3069, -3153, 5248, 1019, -6514, 2420, 6754, -4125, -2131, 8675, 151, -6830, 4130, 4699, -9210, -3622, 7127]
1716G127j2366l710J4493j754j3573J1674P850j5281m09J5278r215j1071J4298
1729C341L695j5782O484J4813j2975o455J7534k836j6906J1073R148j7233j985
1742h084J6455q325j1755J5396M551j5676M716J3874j2867p548J4839j656j5592
1755a1672Q632J0269j3608j106J4701m368r896J1377M094j2972K161R260p070
1768a98o835R751O74r511N300P155p710k106Q522k417p604M525L697o359l23N817
1784B378k011m174N518K331n082O42K956j666k324O66K390j831k090L179K281
1799C163m745J239M247l372l694L717M36n710N48O679m601l188P287J642p574
1814c926L494O218p274m084R581k174j0067P838O572j0291J67J2685m837r212
$$ y = [7127, -5239, -8949, 5544, 3790, -9783, 1891, 9741, -5540, -5949, 9329, 114, -10957, 3341, 7036, -8746, -2262, 12551, -424, -6879, 10655, 7819, -9087, 1986, 11134, -6099, -8084, 8371, 46, -11709, 3687, 8238, -7438, -2722, 11152, -1715, -9263, 5576, 3920, -11672, -3040, 7229, -6379, -7485, 7216, 2848, -7048, 4329, 8423, -4549, -2388, 6872, -198, -7033, 2718, 3392, -6119, -819, 6336, -1374, -3480, 5042, 2625, -4979, -454, 3243, -3116, -3439, 2378, 367, -3807, 1711, 4042, -1040, -398, 2558, 892, -1432, -766, 1624, -207, -2297, 882, 3163, -1582, -343, 3904, 532, -3162, 555, 991, -4719, -4171, 2508, -2093, -5281, 2006, 3648, -3926, -432, 5786, -1488, -5572, 4009, 1835, -8232, -394, 6178, -4113, -3946, 8739, 3902, -5310]
1828e310J0402L928j4554K955J0317r666o559J2767k94j2261P499R231j1450k415
1842e410J3814o524j1070J2217K695j3781K784J2676j0980n128J4954j041j3230
1855h024R014Q797j3747j906J2985n351j0010J0090M576j2197K456J1202q420
1868e35n496J0795q81j0718O928O415j0238j150R416l237o574P502L478q662J123
1883a834O703n669m113O295R28n555K824M043l667j789M538k32m624Q03K437k778
1899a690j919K961K61j627O87L488j143j166J189J873l098j558K337p75l677J704
1915b153M434l395j20N413j128m907L342L197o505j435P385m136p247Q266K442
1930C453q331K545Q454o456m291R239j310r986N761O003r263k188J1300l286q795
$$ y = [-5310, 5092, 9020, -5534, -2579, 7738, -1928, -8487, 4280, 3986, -8275, -776, 8455, -2995, -5410, 8404, 1880, -9190, 3027, 5722, -8059, -5275, 7401, -3579, -8707, 6247, 5206, -8024, 990, 9787, -3960, -5866, 7119, 1768, -8242, 1848, 6424, -5773, -3317, 7885, -535, -6031, 4764, 3883, -6835, 93, 6508, -3730, -4880, 4536, 1299, -5275, 2227, 5705, -2957, -1834, 4869, -800, -4913, 1382, 2310, -3245, -421, 3622, -45, -1834, 2704, 2472, -2152, -1349, 1088, -1690, -3609, -648, -387, -2014, -1327, 2161, 1018, -148, 1041, 2914, -184, -1742, 595, -180, -3857, -2153, 2281, -1114, -1234, 4179, 3051, -1856, 1486, 4683, -1822, -3257, 4128, -8, -7255, 1011, 3453, -4878, -2333, 6121, -335, -4626, 4613, 3303, -6683, -922, 5081, -4182, -6370, 4930, 1644, -7151]
1945g151R770L828j1278K014R944p882n361J0124m1j1433O772Q456j0417j711
1959d366J1112m248r446R126L846j1300K054J0378q059n884J0590N07r561N222
1973b9N869q413j868R294l907p420P585K627p942J334Q575m502n249P782j69p609
1989d042L122M477o369j756O969j866m705N268L071m651n76L972j025m051J876
2004b86J550l442M6K782j066j577K492J800j386j186J577q8j590r80J596o31j876
2021b265J815J238k705N60L309o29l009L022Q99m333M43L447k452l090N709k16
2037A743n275L685M067n622j818O886j813o764O029K740p753J825O955n303m380
2052d798Q110K22p505L169N892p273k306Q525j776p612O474M990r528L35R150
$$ y = [-7151, 2619, 6447, -4831, -2817, 7127, -755, -6116, 4008, 3967, -7466, -694, 7762, -2655, -4366, 6746, 2498, -6948, 2178, 6024, -5276, -3222, 7156, -903, -6787, 3803, 4310, -5251, -29, 5840, -2573, -4441, 4853, 946, -6474, 1111, 3738, -4204, -2870, 5705, 1203, -4046, 3736, 3567, -4042, -920, 3557, -2812, -4568, 2401, 535, -4170, 1098, 4169, -482, -1058, 2914, 1889, -2162, -286, 1264, -2178, -2132, 650, -416, -1993, 499, 2299, 913, -273, 1304, 1216, -374, -1354, 242, -389, -2265, -450, 788, -1917, -1357, 1952, 1323, -1686, 1336, 2235, -2098, -1655, 1792, -660, -3750, 1959, 1743, -3532, 153, 4220, -1402, -3220, 3666, 1853, -4911, 1118, 3858, -3895, -2070, 4885, -418, -4798, 3312, 3534, -3971, -802, 5090, -2183, -4489, 4036, 2260, -5352, 1122, 6112, -3416, -3081, 6069]
2067F069n417p050Q080J602r319L346P670p092k667R249j908q366O334M869q630
2082c230M86P514n160m927P686J109p915M419N749n695l521P810k033p228N524
2097E88K813p177L07O410l854k934M937K176n726K488L497m243j866L325n20l558
2113c337K135K336k668P8K953n19j455J899J26k027R16J156j008j300j62J583
2129G06j88j541J445M43l89j384K068k50j693k50K951k268j295L270m04m116L293
2146C98J902m012J53M222k056m070M412J853n508J618N005n045k641N788j011
2161A008n428L580L815o081l66O726k197m926N911K599p587J763N890n641l426
2176d360P518J30q213M990N358p511k80P412l408o231P066J491q119K159O199
$$ y = [6069, 652, -6398, 1682, 3284, -6035, -2689, 4981, -2111, -4778, 4471, 2563, -5803, 531, 5400, -3230, -2744, 4770, -390, -5317, 2369, 3478, -4437, -18, 5731, 36, -3485, 4325, 2292, -4936, 588, 3401, -3776, -3469, 2941, -913, -3847, 1090, 3266, -2460, 28, 3525, -718, -2584, 741, 221, -3337, -1202, 1134, -1534, -1456, 1497, 978, -477, 1422, 1548, -479, 437, 1593, 585, -715, -877, 706, 518, -1023, 422, 865, 476, -908, 1160, 910, -783, -1033, 1918, -350, -1645, 1625, 1221, -2895, 398, 2300, -1712, -1559, 2663, 607, -3463, 949, 2802, -2706, -1088, 3917, -1128, -3769, 2019, 1008, -4420, -840, 2975, -3106, -3472, 3254, 1057, -3869, 2042, 4641, -2946, -1183, 4707, -934, -4360, 3158, 3288, -4925, 65, 5423, -2088, -2368, 5044, 1636, -4595, 2471, 3962, -4157, -1998, 4201]
2191D201n262l881P908q19n949M017L168n942l53O798l794m046N087J658o813
2206d022K819M875n249j610N942j162n019M495K277n618P12M417k190l253L468
2221H82J128m620K202K389l640l69K889r1j919J290J341k215O71J421j226m22
2237b89K61P07m52j33r72J499l65m52J28J647k212k33J668o19p36J31J370l587
2255b639J152K308r16k605L107J347m233J869L012k813j142L677r60m215L555
2270E04K475n098P01M707l080l527N788M59o134K786L997n215j666N916j967m660
2286d014N304J599o572J654N373m232k443N436O49o695L472M636o979m37O390
2301C141k710m720M599K549o003K018N203m579l038O193n40n559M166K520n196
$$ y = [4201, -1061, -4942, 2966, 2147, -3802, 215, 3383, -2559, -2912, 3886, 92, -3954, 1133, 2791, -4022, -1203, 3672, -1577, -3187, 2755, 1593, -3426, 1069, 3346, -2272, -1560, 2857, 667, -2586, 882, 2010, -2610, -408, 1981, -1659, -2028, 861, 770, -1149, 141, 1482, -733, -62, 1359, 133, -289, -28, 679, 227, 94, -878, 621, 256, -196, -68, 1579, -633, -866, 802, 183, -553, -422, 948, -2639, -1487, 821, -95, -2700, 407, 1754, -2479, -610, 2402, -411, -1553, 2124, 1164, -3051, 504, 2979, -2119, -1418, 3289, 209, -3318, 2470, 2929, -3205, -419, 3578, -1637, -3303, 2613, 646, -4014, 1290, 2889, -3683, -2029, 3344, -888, -3331, 2105, 2754, -3941, -469, 4167, -2812, -3249, 3141, 431, -4289, 310, 2859, -3144, -1126, 4077, -502, -3540, 2653, 2113, -3446, 720, 3240, -1956]
2316a956j95M726k707l378N085J483n111J107L767k510k130L317k27l071J448
2331c52R65j460m23K609j093j547K330n5j442J82O70q83l11J371p16j017J902
2348G30j315M47M70j85k06L57k71k98P60m91o46J283K50j030n12K464k003j516
2366a712K169O06k308R98J682k232n54L776j715k987M044N61m158N03L522l033
2382h38j883M708l26l955K558K509m056k13M570l301l510N341O52n163J902M064
2398C059m764q52N228q97m142L941J587n278R26M974n096k319N229Q61n269J547
2414a265M385l573j538N242k268m560M067J593m698J129M319l191j318L716p88
2429A252l844K937K353m140p3L904k687k802L748K59k639J627J932k423r80K843
$$ y = [-1956, -2151, 2575, -132, -3510, 1575, 3058, -2053, -946, 2821, 311, -1819, 1498, 1271, -1800, -352, 613, -847, -1270, 1339, 246, -1301, 1029, 974, -468, -286, 384, -499, -810, 561, -155, -1172, 730, -585, -138, 332, 147, -59, 298, 27, -271, 489, -2, -648, 635, 885, -145, -657, 1807, -196, -1712, 457, 1063, -1245, -247, 1435, -797, -1351, 2425, 710, -2277, 1767, 2328, -1830, -1327, 2195, -838, -2721, 1987, 1661, -2294, 264, 2773, -1283, -1496, 3074, -227, -3737, 1604, 2256, -2907, -1005, 3059, -1705, -2557, 2671, 1774, -2368, 1573, 3160, -2118, -1192, 3782, -1314, -3633, 1596, 2457, -2812, -1265, 3120, -453, -1991, 3251, 983, -3577, 490, 2083, -2615, -1486, 2833, -358, -1676, 2040, 1252, -2592, 345, 2698, -1442, -1515, 2389, -298, -3100, 648, 907, -1732, -105, 1827, -596, -1576, 1267]
2445A267q84k499K204L64j688O25J110n30p89J497N20k183J315m87m58N57k11
2462b70p13J337M70n73l98J130j022j062J915pj532J287o86j101P94K418j787
2479B00k60K365j541j911K247m04k519J055J714k943p59M210o13k174K985O36
2495B288l096O50K192k114k305L159j41m505L968K542m191J22N052l085k658L899
2511A777O96n189J760L720m506j176M569m40m170M008J113l944L27M043k559k448
2527b419K517J550l937J780L262l704J74L115j805k012K521R68l627N17K908k131
2543c23j653K842K97k056J883J049k894j24K482k036j800K639P3j658J364J478
2559A563j988k8J892q92j845J075L21j655J193P01j972R76J128j00P60k89q9p92
$$ y = [1267, 383, -2116, 88, 452, -1236, -611, 499, -31, -820, 677, 1197, -986, 329, -158, -616, -59, -270, -983, 354, 824, 251, -147, 983, -39, -1101, 814, 807, -725, 562, -124, -1225, -431, 1987, 200, -60, 2305, 764, -1147, 1100, 696, -1823, -768, 946, -1997, -2756, 1454, 841, -1333, 1652, 2288, -808, -158, 2034, -80, -2385, 774, 633, -3872, 96, 2638, -1553, -1431, 3621, 536, -2122, 1777, 2473, -2716, -956, 2764, -1742, -2918, 1651, 1211, -2959, 1049, 2162, -1782, -1455, 2588, 29, -2419, 98, 1648, -2289, -509, 2753, -951, -777, 2338, 533, -1479, 1042, 2010, -1617, -1100, 1808, -323, -1976, 866, 1163, -893, 990, 2039, -855, -979, 1503, -533, -2333, 306, 379, -1279, 85, 1563, -425, -453, 1439, 547, -1298, -223, 98, -1557, -364, 337, -1635, -659, 469, 369, 1129, 840, 751, -41]
2577d1L0j05k001J880K44j600J238L48p62P81K033j580j189J975p93j816J245
2594a13J070l219R90K408o19j261J808J022l475J372J487k888j238L450o91k236
2610b133K283J799l049O38K393k154j843K959N05m350K206K515k671j027M258
2625B329j434k208K784R50l903J51L312k756k079M566l9l387K691J789m181j94
2641a609M442k799k518K753O77l139J490J835j521j378L627q4k535J988J196l724
2657a299M26J825k046r26K365M19j483J274J337k312L94J129n88q98N0K94j252
2674a291L52J413j250Q82J374K7j293J505j281K6o23P6j147J73R59k38K56R74
2692H94L37p61L11l74j724J153l43j143P53Q45j276K99J741q93n18J650J12k627
$$ y = [-41, -11, -116, -2117, -237, 7, -1593, -355, -7, -769, 12, 2045, 465, -724, 1251, 458, -1358, -113, 957, -2262, -1272, 1136, 517, -744, 1064, 2086, -1389, -17, 1470, -1418, -2656, 794, 103, -2133, 150, 1949, -1100, -462, 1931, -223, -2066, 893, 1398, -2952, -746, 1769, -902, -1929, 2329, 895, -1313, 1471, 2421, -1482, -1331, 1981, -775, -2854, 1712, 1673, -1714, 977, 2766, -1415, -1609, 2833, 34, -2484, 269, 946, -2193, -703, 1132, -389, -1767, 1860, 1776, -759, 1229, 2425, -1299, -873, 952, -1094, -2020, 345, 764, -719, 555, 1892, -420, -26, 1103, 515, -383, -333, -39, -1291, -939, 474, -776, 106, 1480, 1507, 214, 1719, 438, 464, -159, -83, -1230, -1057, -98, -336, -80, 894, 1231, 470, 781, 407, -1317, -164, -507, -1650, -897, -52, -1328, -1029, 712, -181, -699, 951, 1063, -1564]
2710a564J360K011l236L2K347k39j686J837Q49k533J503J426k359j428K434l44
2726D10k467J498J884k184M1L517k151j921K766M44l177J88K374k578n14M122
2742B252p55l461K541J516l053N66J927k032j534K724q25k606K495K574l631O71
2758f31L192j476k733K980n58l106R26K207j979p27L452j50k311K511p4k237P14
2775@J028j569n88M31L50j752J536K159k182l74L093j135j028O07o06j038J147
2792G9l87j165J186N74n43J82J290r44j086R09p15j037J675k92p83J265P00p75
2810A33p13K462q50j285J003j49k110J073J71o91K73J989p5j746J358L23j924
2827g58R64Q07k382l86J576m43j445K958N10j976O75L067k423j938J826K74l449
$$ y = [-1564, -204, 1807, -1429, -1397, 950, 711, -975, 862, 1711, -822, 681, 2107, -252, -1680, 754, 410, -2057, -559, 1325, -859, -818, 2699, 548, -1373, 1393, 1837, -1340, -1152, 1222, -1356, -1870, 2252, 1497, -1964, 577, 2093, -960, -394, 1533, -499, -2033, 691, -134, -2740, -245, 2329, -1302, -631, 2561, 1085, -1648, 1332, 774, -2332, -1406, 801, -1178, -1905, 1547, 1397, -914, 1597, 1523, -714, 0, 1028, -541, -1129, -698, -348, -2100, -564, 1595, -587, -961, 2132, 997, -31, 576, -30, -1068, 79, -308, -1473, -287, 287, -256, -74, 1216, 272, -814, 95, -620, -1657, 18, -274, -1057, 208, 908, 133, -580, 1882, 1032, -253, 750, 601, -1509, -436, -265, -956, -683, 1306, 1231, -515, 843, 1166, -758, 206, 1013, -1369, -1755, -179, -622, -2067, 891, 1401, -575, 100, 3167, 744, -1194, 632, 906, -2543]
2844b543K046J556k826P22K829j330j086J695L68k801J604J475k828j406K963
2859D38q06k113L300M44j713J03K962k009j257J710l61k921J322J401j962J964
2875E02J271j867n87J772L11k914J077R08j518QJ197N2j256J861O19j076n65J992
2893A787k039o46J548p19r47P27L70m55M89P76j14k53L83p59p34K77P9q44P24
2912c50J326r29J7P96p62N74M72r78q92N34Nj655J712R7r12L98K441j314p18J562
2932A424r20j844P29k20M42r74J060K80n60J735o9j222J023J447k664n31J337
2949D73k89k906J855J598j966L98K350j278j303K529q20j843m0J762j821q52L010
2966H57r17j038K700j49j710P32J017j455j443K022o91q42M44J820j555J63K721
$$ y = [-2543, -497, 1059, -1767, -1045, 1784, 454, -632, 1063, 1431, -1370, 234, 1709, -1119, -2525, 438, -368, -2481, 819, 1263, -450, -347, 2615, 606, -651, 1059, 698, -2223, -901, 500, -1462, 502, 1773, -94, -681, 1091, 1402, -1512, -435, 473, -1045, -1037, 160, 212, -1044, 817, 1436, 360, -205, 1787, -252, -898, 650, -69, -1016, -289, 81, -374, 115, 891, 777, 524, 907, 148, -586, -309, -230, -1074, -350, 976, 47, 64, 860, 98, 672, 1144, 166, -726, -192, -187, -1842, -130, -33, -945, -547, 1894, 580, -138, 1424, 504, -1340, -611, -831, -389, -1363, -303, -23, -583, 1152, 1083, -139, 884, 2331, -333, -864, 473, 184, -2722, -867, 731, -1235, -837, 1513, 235, -1068, 1461, 641, -1202, -1242, 520, -1301, -2153, 857, -60, -1098, 1602, 1453, -257, 475, 1492, 37, -1406, 616, -75, -917, -473, 1347, -208, -45, 2676]
2983B676k242o68J522j041j396J54O25l47o32K845j403j239J884O54j723P45L40
3000G54k260n1J730j058k93J288J155j173Q79L16j368l74J649j454j410K023r10
3017e57j057J571R98o92N10K71j068O7M14j398M6K12K53o16K51J446l22k32J559
3036A656l57j014O26j79j379J5R11j985N96J143o98j9K367m56j860J041O46j603
3054e49q63J118l22j873K778j37q42J066J303j202j194K007j454j530J360M82
3070A48k138J490J983j118p27K293o99j614K41R62k457K06J924o38j249J483J721
3087A811j603K49J197j364n61K46k40j185P44J048k021R61J753n41k93J097k65
3104A033l36q03O83j714J92Q14l33k33J512J254k293J639n64k02q08N51p15r11
$$ y = [2676, 434, -234, 1288, 247, -1149, -995, -370, -717, -1349, 1496, 93, -1146, 738, 1392, -331, 414, 754, -1506, -1557, 173, -885, -1178, 110, 1265, 92, 971, 1287, -81, -455, 1194, -260, -1670, 353, -557, -1614, -43, 955, 263, 773, 1044, -24, 43, 457, -941, -895, -683, -430, -1046, -795, 651, 329, 97, 1656, 1299, 285, 911, 732, -647, -632, 279, -1706, -1110, 33, -665, -684, 1683, 1227, -633, 408, 1054, -549, -1412, -294, -616, -2489, 289, 152, -690, 376, 1679, 477, -717, 1290, -164, -1694, -334, 148, -1990, -500, 1483, 365, -362, 1931, 1232, -382, -141, 821, -1636, -1430, 494, -144, -1393, 90, 1811, 208, 457, 1654, 290, -271, -25, -265, -1450, -706, 342, -1679, -718, 1035, 494, 201, 1298, 1033, 697, -106, 577, -1137, -945, -131, -464, -697, 815, 2069, -224, 1415, 851, 649, -159, 392, -323, -1234]
3122a234Q09n3k85J028R78p44Q10q62J51p61r3o77J81J21J52r04J340J066j101
3141g8k90J836j101j077P69q0j574P68j23k16J080J438j27j863J101N03k025N27
3159e32O30j478M50R49k48q10K320m43r82KJ663j723j95R66j596j068J745J129
3177G79j825R47K556j684o14J681j647q90K53L4j529M90K071n33j357K422J63
3194A317j417K71J376k958j73Q58l2o72J812l60j603K429J528j460q12J343j157
3211B90j786P01Q19j623R28P59k90J15N24M94j020M59J099k093n68J486r62j52
3229h20O92L43L76J99Q42j868P53L14q97n29O03m60j58k68J634r54N71J486k302
3248d43J194O5j365o27P20m09m12K97J326l43k91J530k90q17J06J75j460P32M23
$$ y = [-1234, -425, -478, -763, 265, 1243, 499, 1309, 447, 598, -163, -256, -933, -752, -631, -479, -1383, -43, 1023, -78, -368, 1468, 367, -710, 59, -21, -1595, -827, -950, -1166, -86, 1352, 1225, -638, 463, 966, -1059, -532, 98, -1380, -930, 19, -229, -1039, 1281, 838, -144, -142, 1521, -202, -397, 569, -1027, -2095, -350, 779, -1046, -99, 2457, 773, 159, 1840, 193, -697, -444, -410, -1939, -1449, 622, 89, -1268, 1154, 1317, -100, 171, 1547, -1411, -1584, -726, -758, -1430, 382, 22, -1581, 848, 2376, 916, 104, 1447, 290, -1496, -795, 24, -1599, -671, 88, -202, -87, 437, 931, -89, 370, 1469, -624, -1192, 294, -668, -820, -128, 215, 591, 790, 1632, -236, 517, 831, -66, -595, 8, -452, -610, -878, 756, -198, 373, 1859, -443, 751, 816, -549, -1176, -456, -865, -1277, -980, 346, 3, -288, 1242, 952, 135, 241, 416, -1044, -312, 111]
3267A11q68M4J381q66L26J462p27j340P78L02j503M27K77l26j71R52J49j224J432
3286F16J256j185j32k43J92j643R63N7j006L49J303j74m60J467n52r94O33P54
3304A201k175L3J459j579p41J890M77o40J97J350j333p54J229j310p76P80K42
3321d50r72N08K082o4j104J450k17j639j94J290k102K29J429j062j95K057o08
3338D38j65O18O60j968PO36l00j755J441L20r1J04J407l87m67Q23j136n62N35
3357A58j95q68p1M71n32J158L21P69p74M33k70j838J322m43j249J009J60k54N33
3376a60J393m22o12J286r39n71m78Q83r44M3K55q55M74J335M2r26J143J61j256
3395a48p57J185j274q74J809o9o95J021J040r89j58J273q27k090J536R3j578O86
$$ y = [111, -757, -713, 668, -198, 128, 1590, 863, -477, 301, 603, -900, -473, -196, -522, -693, 259, 408, -816, 616, 1872, 687, 555, 312, 504, -1139, -176, -119, -1125, -776, 527, 353, -107, 1360, 808, -186, 447, 1201, -974, -941, 518, -1061, -1802, 88, 565, -75, 122, 1472, 139, -615, 614, -696, -1472, -692, -450, -1422, -914, 1168, 1104, 0, 1450, 1233, -406, -600, 690, -1412, -1183, 246, -816, -1011, 1046, 438, 273, 891, 1551, -417, -410, 226, -74, -1829, -388, -68, -159, -55, 1352, 965, 498, 1321, 185, -377, 158, -37, -905, -976, -505, -1037, 121, 442, 1211, 437, 870, 600, -1238, 84, -359, -1608, -599, -439, -693, -160, 1233, 811, 199, 1485, 546, -25, -503, 380, -564, -521, -266, -1121, -647, 688, 730, -196, 947, 1108, -148, -905, 280, -994, -1868, -59, -128, -823, 198, 1238, 249, 91, 1364, 537, -1553, -17, 76, -1502, -816]
3413h16J258o32J81J071J09r72LP24k062O10O28r97j069J661L36j410J677Q41
3431A141l95n08M81M40k099R07m76n42R94N27l06j55P58K02l32J53j79j579K53
3450g15R00j063L31J142r54O1J175o58K53j01P79r30j016J71j48j37J01N74L94
3469A59Q1P33q41L45Q60j217m27K01k56j45l00K88n27J274J215p37m49J184r24
3488E17p70J15M7p53k59J430k06q05J234N35j667J373K79j891P91K84j246P7P45
3507a70M71j210J845N05k06j045J141j441j310J631p88n46Q16P05k50Q06N22p36
3525G40m72L25l98n78l07L82o26R3J176J9p89R17J018j906q2Q03j390o9Q53m62
3545g53m76J086L00k56N41J167p84j715J179l98p12L77J92R5q18J311k22l26J503
$$ y = [-816, 442, -190, -9, 1062, 1171, 199, 202, 926, -1136, -526, 102, -895, -1964, -303, 33, -1377, 300, 1141, 746, 238, 719, 1159, -940, -33, -509, -1051, -57, 470, 164, 9, 767, 969, 637, 790, 611, -968, -715, 185, -878, -547, 595, -359, -298, 877, 219, 472, 371, 1150, 220, -796, -625, -773, -910, -809, -235, 159, 240, 973, 132, 477, 1337, 120, -307, -106, -362, -507, -807, -519, -1046, 228, 1443, 706, 257, 1441, 517, -253, -138, -91, -844, -1103, 327, 121, -684, 550, 1085, -582, 791, 1070, -821, -30, 254, -992, -915, -170, 301, -909, 936, 1441, 1235, 190, 1331, -110, -1420, 211, -577, -1123, -307, 398, 148, 954, 1476, 740, 268, 593, 195, -383, -690, -308, -934, -841, 335, 354, -435, 482, 1500, -406, -488, 315, -1075, -1144, -291, -753, -1229, -143, 157, -99, 442, 1609, 825, -890, 289, -109, -821, -444, -252, -157, -975, 336, 114, -212, 1291]
3564A291o48k81L04q20L05q99O64k70q8J84Q51N13n09Q25j017P9k68r58K34l78
3584h86Q65p37K46J154j606J836r2o75LO01j171l35L55l9p42J842r65K20L83M72
3604G29k23n24L83M57k010O18k0M59J5O56J13n64m80J503j120l72J338j620n43
3623a205j6J657j662O57Q20L99k67N09q19k38M74J73k022J486m4n14M44P21J95
3642G48p60Q23J75j677P68M54j488K63J071j270K82K72J082j000Q42N99j270K42
3660A56o14k54j85O31L05j262J053J406n42o76N02L20j629L18J746j713j067J716
3678B11m50K92N70J42l84L57k96m05j058Q29J51p98O89L89j156J286P69l42K32
3697A028l77j300N40l67k65j45N76N44P2L63J51r88R51J19n07j181N50N16p08
$$ y = [1291, 643, 362, 666, -154, 151, -748, -84, -354, -442, -258, 593, 1106, 597, 1422, 405, 484, 216, -742, -508, -886, -21, -758, -512, 642, -964, 872, 780, 105, 108, 709, -462, -797, -442, -481, -1223, 619, -346, -126, 257, 729, 506, -18, 365, 822, -1188, -570, -590, -131, -116, 540, 653, 89, -391, 1112, -8, -380, 958, -662, -1205, -1221, 436, -1226, -569, 251, 650, 383, 892, 73, -165, 309, 482, -1540, -54, -98, -612, -168, 553, 748, -12, 811, 986, -691, 77, 531, -957, -694, 377, -893, -611, -339, 743, -257, 585, 1184, -86, 156, -458, -712, -897, -266, 39, -1223, -170, 1236, 694, 18, 520, 840, -789, -471, 1275, -438, -1505, 211, -239, 53, 623, 765, 381, 738, 442, 37, -1021, -192, -41, -839, -150, 239, -917, 369, 1138, 796, 1028, 651, -649, -109, -476, -741, -886, -310, 234, 306, 669, 820, -168, 783, 902, 395, -786, -236, 280, -428]
3716d28j80N07q24R52O37Qk68k61Q58j992R56Q7p49jJ633r27l3J66J289j485K19
3737A64Q16j094m90O27q05K9J495j152K47N52L70p91j18Q91o07q13P44n12J59
3756b88j241J295L69l64O12M99j876J642k21j295P2J097m13o23R84J64k40L61
3774E34K74r70K05L32j081l89O63J06m87Q24L85J29o90J318l88p74n81N49n13
3793e54L36l39o18L94J117O55j63r31Q63l69n30K18n04N70o99k34L59M29L18K22
3813E40q78J666j097j39K45o58o83J142n06o83P29O86n31L53N19q73K86K48m48
3832h2m99R19pj226J1J402m59o5O92J037j741Q89m13p13j70j07J06m22P10J12
3852b6p7J96O58m13j90L42n79o60J29N00p11P95R67j263k17J702p29o08L85L78
$$ y = [-428, -608, -101, -925, 27, 664, 672, 404, 143, 1001, -991, -35, 52, -697, -698, 935, 8, -25, 141, 1430, -55, 164, 980, -114, -604, 23, -782, -753, 742, -410, -163, 389, 759, -32, -150, 741, 134, -679, 65, -447, -288, -1529, -234, 135, -229, 383, 882, -994, 648, 427, -868, -796, 301, -112, -735, 249, 413, 173, 534, 808, -162, 43, 375, -706, -1095, -432, -326, -813, 11, 396, 525, -165, 1153, 765, -9, -590, -41, -554, -218, -557, -1175, -781, 336, 991, 828, -103, 760, 391, -139, 79, -425, 145, -554, -788, -429, 0, 318, 540, -338, 1328, 231, 92, 337, -321, -1004, 138, -368, -1051, -322, 364, -167, 186, 705, -168, 118, 366, -82, -581, 338, 331, -895, -884, 518, 59, -6, 686, 1723, -18, 871, 458, -255, -425, -532, -426, -848, -138, -26, -103, 93, 751, 338, 148, 490, -89, -749, -620, -120, -831, -36, 931, -332, -549, 1153, 424, -184, 201, 579]
3872E79p66j147J347ok13M08p62N39P3J079j226J50m34J73l70N71L00n75P07n6
3892C71n88k08J250j41j87q29M92j112O34j3J45Q0K56m84P70J91l59q31R71p23
3912c15J63j159R31k10M1K28N04k66j14Q16j032K80k86P8NK67l92K37P50l58j35
3933C3K68P60j100p13O75P07j215Q55m29j99P22J05p15n5J044K51j330M60o42
3952e18k57J65O53l65K2J302j137N25j78P27j344k58K10m4J14R05R4j346Q31M00
3972E01r83J06N14j11m63M05j76o85P35K18K17o77J271q26J41R5k14L78p83M13
3992G6n73K36K82K1l15M57oJ8k79L34k89j71Q1J98j047o8J316j332J539J79p86
4013a29K8P50j56l37p24O24p81R35p97K85n5K95Q50p06K75n7q56J370l24o71J80
$$ y = [579, -187, -1334, 13, 7, -206, 202, -560, -21, 52, 1131, -95, 55, -379, -206, -576, -5, 295, -280, 427, 371, -217, -425, 825, 684, 497, -332, 160, -952, -318, -331, -186, -106, 150, -334, 436, 627, 268, -563, 408, -315, -152, -1311, -380, -590, -549, -321, 183, -83, -197, 619, -413, -133, -419, -341, -336, -69, -461, -224, 526, 168, 33, 301, 1061, -39, -752, -77, 630, -585, 270, -159, -358, 364, 469, -246, -301, 743, 994, -336, 124, -518, -775, -610, 43, -322, -300, 1002, -135, 390, 212, 939, -405, -663, -453, -497, -383, 522, 616, -730, 101, 501, -482, -376, 138, 27, -436, -31, -207, -892, -157, 61, 278, -399, 872, 46, 187, 282, 68, 446, -337, 76, -497, -261, 21, 42, -273, 184, 178, 196, -83, 251, -38, -209, -128, 70, -977, -1045, 271, -1061, 478, 657, -129, -101, 649, 493, 156, -568, 56, -725, 210, -587, -302, -357, -62, 788, 82, 357, 300, -556, 814, 490, -181, -1]
4034aJ44j29l63O95l89j025J5J850r37M7L50l02l47l3J76Q3L0Q17n27n28O97q67
4056e44j3R47k28j354N77Q87l33J4R75o58K54j71l15n78o35J562m92M4m44R13
4076D08n72j8J407j323J39L53r26P47l64L41j014L22J509k156J369N02n45l36
4094a57O43j229j93O98R11j129l38J949r88m59Q80Q85k052Q77n49j96j87M85O99
4113E50o97o6J36l93M99K27n70N41o46K37P9J14J28l90O43N46r88P26l76N12k76
4134E36m90l74r3J60P17k3n47k75N21q1m37P87k27m6K33r02M6n1M67n67P05l92
4156c33m24N80K56l26q3P00O6j150M3O84p13J018n4j38K49l06L6r09P36j27K6
4177a69l80J017j092M58J495p81l28K11J72o78n23Q53M1r19L21R53q89K37k8r68
$$ y = [-1, 143, 14, -349, 346, -43, -1068, -1053, 797, -140, -93, 257, -45, -392, -425, -249, -166, -136, 681, 154, -374, 323, -544, -557, 390, 162, -1192, -615, 272, -61, -47, 928, 270, 524, 353, 38, -540, -1175, 387, -105, -61, -505, 408, -164, -182, 1225, -98, 41, 394, -532, 215, -149, 192, -822, -500, 1009, -1147, 222, 724, 179, -157, 486, -743, -936, -238, 673, -456, -794, 1155, 167, -292, 588, 1473, -579, 298, -251, -447, -634, -149, 550, -147, -213, -77, -470, 29, 256, -314, 227, -419, -182, -103, 11, 139, -251, 392, 938, -50, 676, 300, 812, 536, 46, -328, -421, -261, 456, 433, -114, -389, 132, 51, -386, 401, 174, 128, 361, -541, -495, -546, -79, -646, 59, -333, -757, -177, 79, -247, -330, 370, 436, -714, -671, 13, -700, 318, 264, 126, 375, 69, 105, -804, -68, -195, -169, -549, 468, -624, -166, 1329, 548, 220, 431, 603, -75, -598, 255, 296, -623, -302, 651, -238, -1, -29, -997]
4197i97J275J92n1q50M97j27l88J74O05l61p81J654j071L18J37j14R2L8l65n02
4217f25R32K06m38o00L65Q25p13o7L85j073M19N13j86q5L45k78L41k03J026m23
4237F66j052R77l79j114R17j200J319K4m3j71q1J17N33n23N55m38M09o49Q43q97
4257a87J64O62p59J21N13k61m82k0J69K92o49N63k10k54O0M94j295P82J186j199
4277c10O85L83m51m78P31j427N82K89K28o95O18M00l33n76P83L03j105K50K89
4296A66k09l12O89L01j006N73K55j300O73J63n05M4R44k35r14J26R82m09k88K64
4316Bl33q2L65n0k11N89l79K92k25M72L84r59kM33j181J485o30j31N84j077K60
4337c94k35M04J13K68k56O01o78k12L86l51Q23m29n49M38n8M89l93J92k14M73
$$ y = [-997, 278, 470, 419, -431, 66, -61, -449, -275, 330, -31, -812, 842, -229, 89, 226, 112, 204, 242, -123, -625, 307, 513, 75, -525, -160, 665, -48, -115, 270, -803, -384, 129, -57, -142, 203, -75, 266, 63, 1089, 666, -386, 591, 212, -902, 15, -1185, 134, 158, 115, -56, -137, -20, 513, -10, 545, 107, 516, -133, 710, -187, -23, 639, -120, 1, 514, 253, -229, -249, -80, 212, -437, 126, -84, -338, -278, 216, -1079, -297, 889, -310, 375, 758, 307, -171, 560, -867, -285, 4, 232, -463, 155, 555, 222, -354, 429, 732, -373, -123, 166, -43, -355, 334, 635, -371, 202, 457, -843, -170, -7, -512, -468, 476, 241, -673, -547, 435, 26, -262, 2, -331, -413, -48, -98, -309, 280, -99, 193, -32, 440, 824, -135, -137, 296, -885, 600, -30, -161, 423, -654, -394, -629, -225, -112, 156, -100, 501, -177, -389, -3, -354, 469, 40, -509, -71, -129, 360, -33, 159, -55, 418]
4357D18o39R38n25j306R55R46p49K0J71n1n15J018l09M5o2j039O22R5M72p97L8
4378b54O20J09l54q4M93M4m75K35r18L99N76j27l16L69Q9k04M55m86r12L29P12
4399C00o32q74J274L42q17O32O09j284M4Q27m05m68O73L86o23q80M35J097j127
4418d91K47R6p12R30P22j220L61J118p47j115J294n3j221L41Q46l22j10k10R74
4437G28p26L37L14j444K15N41m82J4R47J37j039K50N92j02j26k01L75k71N26n97
$$ y = [418, -221, 717, 192, -1114, -159, 787, 38, 58, 229, 178, -337, 681, 372, 417, 355, -684, -62, 33, 505, -292, -254, 366, 475, 121, 37, 530, 574, 99, 334, -584, -185, 391, 264, -52, 317, 406, 202, 657, 171, -741, -412, 300, -332, -1206, 68, 410, -407, 225, 834, -450, -406, 421, 16, -452, 221, 607, -16, -896, -461, 636, -491, -244, -148, -860, 70, 792, -428, -67, 1051, 304, -811, 483, 430, -791, -450, 396, 74, -36, -246, 728, 2, 339, 653, -791, -576, -35, -517, -503, 444, 581, -458, -208, 384, 282, 156, -45, 330, 59, 585, -12]
$$ [...]
8191D3
##END NTUPLES=NMR FID
##END=
