##TITLE=1H_UK-23_8_1
 CD2CL2
 108 sc, 
 21.11.2022
##JCAMPDX= 6.0         $$ Bruker NMR JCAMP-DX V2.0
##DATA TYPE= NMR FID
##DATA CLASS= NTUPLES
##ORIGIN= UXNMR, Bruker Analytische Messtechnik GmbH
##OWNER= root
$$ XWIN-NMR		Version 3.5
$$ Mon Nov 21 14:00:52 2022 Russian Standard Time (UT+4h)  she@DPX200
##.OBSERVE FREQUENCY= 200.1313499994
##.OBSERVE NUCLEUS= ^1H
##.DELAY= (6, 6)
##.ACQUISITION MODE= SIMULTANEOUS
##.ACQUISITION SCHEME= undefined
##.AVERAGES= 108
##.DIGITISER RES= 18
##SPECTROMETER/DATA SYSTEM= spect
##.PULSE SEQUENCE= zg30
##.SOLVENT NAME= CD2Cl2
##.SHIFT REFERENCE= (INTERNAL, CD2Cl2, 0, 15.7039)
##AUDIT TRAIL= $$ (NUMBER, WHEN, WHO, WHERE, WHAT)
$$ ##TITLE= Audit trail, XWIN-NMR		Version 3.5
$$ ##JCAMPDX= 5.01
$$ ##ORIGIN= Bruker BioSpin GmbH
$$ ##OWNER= she
$$ F:/spectra/data/she/nmr/H-F/1/audita.txt
$$ ##AUDIT TRAIL=  $$ (NUMBER, WHEN, WHO, WHERE, WHAT)
(   1,<2022-11-21 13:57:46.85 +0400>,<she>,<DPX200>,
      <continue with go, POWCHK disabled, PULCHK disabled
       configuration hash MD5:
       00 E9 B6 7A A2 85 ED C7 34 08 36 98 17 FE 4E 26
       data hash MD5: 16K
       E0 F5 01 50 D1 5B FF 45 39 C5 46 73 47 35 77 70>)
$$ ##END=
$$ 
$$ hash MD5
$$ D3 60 CB DF CE EF 5D F8 8F 92 A7 06 D4 0C 0B 98
##$RELAX= 
##$RELAX= 
##$RELAX= 
##$RELAX= 
##$RELAX= 
##$RELAX= 
$$ Bruker specific parameters
$$ --------------------------
##$DU= <F:/spectra>
##$EXPNO= 1
##$NAME= <H-F>
##$PROCNO= 1
##$TYPE= <nmr>
##$USER= <she>
##$AMP= (0..31)
100 100 100 100 100 100 100 100 100 100 100 100 100 100 100 100 100 100 
100 100 100 100 100 100 100 100 100 100 100 100 100 100 
##$AQSEQ= 0
##$AQ_mod= 1
##$AUNM= <au_zg>
##$AUTOPOS= <>
##$BF1= 200.13
##$BF2= 200.13
##$BF3= 200.13
##$BF4= 200.13
##$BF5= 200.13
##$BF6= 200.13
##$BF7= 200.13
##$BF8= 200.13
##$BYTORDA= 1
##$CFDGTYP= 0
##$CFRGTYP= 5
##$CHEMSTR= <none>
##$CNST= (0..31)
1 1 145 1 1 1 1 1 1 1 1 1 1 1 1 1 1 1 1 1 1 1 1 1 1 1 1 1 1 1 1 1 
##$CPDPRG= <>
##$CPDPRG1= <>
##$CPDPRG2= <>
##$CPDPRG3= <>
##$CPDPRG4= <mlev>
##$CPDPRG5= <mlev>
##$CPDPRG6= <mlev>
##$CPDPRG7= <mlev>
##$CPDPRG8= <mlev>
##$CPDPRGB= <>
##$CPDPRGT= <>
##$D= (0..31)
0 1.2 0 0 0 0 0 0 0 0.06 0 0.03 0 0 0 0 0.0002 0 0 0 0 0 0 0 0 0 0 0 0 
0 0 0 
##$DATE= 1669024284
##$DBL= (0..7)
120 120 120 120 120 120 120 120 
##$DBP= (0..7)
150 150 150 150 150 150 150 150 
##$DBP07= 0
##$DBPNAM0= <>
##$DBPNAM1= <>
##$DBPNAM2= <>
##$DBPNAM3= <>
##$DBPNAM4= <>
##$DBPNAM5= <>
##$DBPNAM6= <>
##$DBPNAM7= <>
##$DBPOAL= (0..7)
0.5 0.5 0.5 0.5 0.5 0.5 0.5 0.5 
##$DBPOFFS= (0..7)
0 0 0 0 0 0 0 0 
##$DE= 6
##$DECBNUC= <off>
##$DECIM= 32
##$DECNUC= <off>
##$DECSTAT= 4
##$DIGMOD= 1
##$DIGTYP= 9
##$DL= (0..7)
0 120 120 120 120 120 120 120 
##$DP= (0..7)
150 150 150 150 150 150 150 150 
##$DP07= 0
##$DPNAME0= <>
##$DPNAME1= <>
##$DPNAME2= <>
##$DPNAME3= <>
##$DPNAME4= <>
##$DPNAME5= <>
##$DPNAME6= <>
##$DPNAME7= <>
##$DPOAL= (0..7)
0.5 0.5 0.5 0.5 0.5 0.5 0.5 0.5 
##$DPOFFS= (0..7)
0 0 0 0 0 0 0 0 
##$DQDMODE= 0
##$DR= 18
##$DS= 0
$$ [...]
##$SUBNAM2= <"">
##$SUBNAM3= <"">
##$SUBNAM4= <"">
##$SUBNAM5= <"">
##$SUBNAM6= <"">
##$SUBNAM7= <"">
##$SUBNAM8= <"">
##$SUBNAM9= <"">
##$SW= 18.0517283424941
##$SWIBOX= (0..15)
0 0 2 0 0 0 0 0 0 0 0 0 0 0 0 0 
##$SW_h= 3612.71676300578
##$TD= 16384
##$TD0= 1
##$TE= 0
##$TE2= 300
##$TE3= 300
##$TEG= 300
##$TL= (0..7)
0 120 120 120 120 120 120 120 
##$TP= (0..7)
150 150 150 150 150 150 150 150 
##$TP07= 0
##$TPNAME0= <>
##$TPNAME1= <>
##$TPNAME2= <>
##$TPNAME3= <>
##$TPNAME4= <>
##$TPNAME5= <>
##$TPNAME6= <>
##$TPNAME7= <>
##$TPOAL= (0..7)
0.5 0.5 0.5 0.5 0.5 0.5 0.5 0.5 
##$TPOFFS= (0..7)
0 0 0 0 0 0 0 0 
##$TUNHIN= 0
##$TUNHOUT= 0
##$TUNXOUT= 0
##$USERA1= <user>
##$USERA2= <user>
##$USERA3= <user>
##$USERA4= <user>
##$USERA5= <user>
##$V9= 5
##$VALIST= <valist>
##$VCLIST= <CCCCCCCCCCCCCCC>
##$VD= 0
##$VDLIST= <DDDDDDDDDDDDDDD>
##$VPLIST= <PPPPPPPPPPPPPPP>
##$VTLIST= <TTTTTTTTTTTTTTT>
##$WBST= 1024
##$WBSW= 4
##$XGAIN= (0..3)
0 0 0 0 
##$XL= 0
##$YL= 0
##$YMAX_a= 2360792
##$YMIN_a= -1784609
##$ZGOPTNS= <>
##$ZL1= 120
##$ZL2= 120
##$ZL3= 120
##$ZL4= 120
##$ABSF1= 10
##$ABSF2= 0
##$ABSG= 5
##$ABSL= 3
##$ALPHA= 0
##$AQORDER= 0
##$ASSFAC= 0
##$ASSFACI= 0
##$ASSFACX= 0
##$ASSWID= 0
##$AUNMP= <proc_1d>
##$AZFE= 0.1
##$AZFW= 0.1
##$BCFW= 1
##$BC_mod= 2
##$BYTORDP= 1
##$COROFFS= 0
##$CY= 11.3945322036743
##$DATMOD= 1
##$DC= 2
##$DFILT= <>
##$DTYPP= 0
##$F1P= 2.36226072786647
##$F2P= -0.459571619588291
##$FCOR= 0.5
##$FTSIZE= 0
##$FT_mod= 4
##$GAMMA= 1
##$GB= 0.15
##$INTBC= 1
##$INTSCL= 1
##$ISEN= 128
##$LB= 0.24
##$LEV0= 0
##$LPBIN= 0
##$MAXI= 10000
##$MC2= 0
##$MEAN= 0
##$ME_mod= 0
##$MI= 1.114404
##$NCOEF= 0
##$NC_proc= 0
##$NLEV= 6
##$NOISF1= 3.799351
##$NOISF2= 2.8
##$NSP= 1
##$NTH_PI= 0
##$NZP= 0
##$OFFSET= 15.70392
##$PC= 1
##$PHC0= -18036.44
##$PHC1= 18.8007
##$PH_mod= 1
##$PKNL= yes
##$PPARMOD= 0
##$PSCAL= 0
##$PSIGN= 0
##$REVERSE= no
##$SF= 200.130013532006
##$SI= 16384
##$SIGF1= 3
##$SIGF2= 2
##$SINO= 400
##$SIOLD= 16384
##$SREGLST= <1H.CDCl3>
##$SSB= 0
##$STSI= 0
##$STSR= 0
##$SW_p= 3612.71676300578
##$SYMM= 0
##$S_DEV= 0
##$TDeff= 0
##$TDoff= 0
##$TI= <>
##$TILT= no
##$TM1= 0
##$TM2= 0
##$TOPLEV= 0
##$USERP1= <user>
##$USERP2= <user>
##$USERP3= <user>
##$USERP4= <user>
##$USERP5= <user>
##$WDW= 1
##$XDIM= 8192
##$YMAX_p= 0
##$YMIN_p= 0
$$ End of Bruker specific parameters
$$ ---------------------------------
##NTUPLES= NMR FID
##VAR_NAME=  TIME,          FID/REAL,        FID/IMAG
##SYMBOL=    X,             R,               I
##VAR_TYPE=  INDEPENDENT,   DEPENDENT,       DEPENDENT
##VAR_FORM=  AFFN,          ASDF,            ASDF
##VAR_DIM=   8192,          8192,            8192
##UNITS=     SECONDS,       ARBITRARY UNITS, ARBITRARY UNITS
##FACTOR=    0.0002768,     1,               1
##FIRST=     0,             0,               0
##LAST=      2.2672688,     0,               0
##MIN=       0,             -1784609,        0
##MAX=       2.2672688,     2360792,         0
$$ Real data points
##PAGE= N=1
##DATA TABLE= (X++(R..R)), XYDATA
$$ [...]
2897A868m509J669J736l658J21N214j328l993N022J634n668K775L796n105m936
2912e362O531O07o975M636M715n364k68P791l890n778O472P56r401J123Q797q168
2928c778k348R768o56q187O899N828q698j666P770m284q144P547L547r898L071
2943c229R671o832l441J0903j876r259N588L635p786k648Q394l444p312Q635L895
2958D894q201L544O302o637l980O992k82q029M056L344m983o87O436j733l013
2973a977M255J223m233M26L274m911k289M572n8k410K144J687q43m48J679o18
2989A473k167j436J671j337p67L219k77j23Q2K906l05k915K42O06j068k369K972
3006D07o43j583O73M493k619j374M153p46m646J470K220m111k827M956r79l777
$$ y = [1868, -2641, -972, 764, -2894, -2773, 2441, 1113, -2880, 2142, 3776, -1892, 883, 4679, -426, -5362, 1169, 1776, -5199, -563, 4152, -1212, -1480, 6311, 2421, -3357, 3115, 3871, -5530, -4407, 4390, -3778, -6126, 3642, 2986, -5201, 1698, 7526, -1172, -2838, 4932, 648, -7496, 51, 3598, -6300, -3229, 6442, -390, -3831, 7072, 5196, -4063, 1525, 5160, -2626, -5274, 3120, -324, -7636, 999, 4894, -3307, 237, 6539, -98, -4078, 2914, 2632, -5397, -1341, 2003, -2980, -3667, 2769, 1036, -1977, 2278, 3501, -732, -306, 2968, -1943, -4232, 340, 282, -2128, 16, 1703, 860, 412, 2091, 1473, -694, -2130, -459, -1796, -2563, 656, 379, 256, 338, 3244, 2939, 24, 266, 872, -196, -2565, 407, -236, -1819, -1146, 3347, 728, -646, 3507, 2761, -1885, -415, 1805, -2306, -5133, -177, -1156, -4933]
3022d933N267L685m125k19O381n014m419N409J79q216L459O002o442o37Q173j194
3038C356o836O739K170p671M1O943o165m577O891K84p400N273O713p125j002P819
3054E453l610o206N427K640q249oR733o354m011Q996r3p646M542N209q244o40
3070c059N941k660n412N224L374n807J639N058m007k690N115q38n017J186K960
3085A007k806j216L823J179k458K577K697n147n8K102j344k860R77Q54j187Q46
3101a014J889j390J791R89K33j094o13o37r47j398l53J552Q79j613J300L576q71
3118B279j747L135k111k664J471J37l319k75L970j997q31M951Q72m760K763K802
3134D676n984j831M767j502m964L947K882l805r3O884k853m443N706J80p172K099
$$ y = [-4933, 334, 4019, -106, -325, 6056, 1042, -3377, 2032, 2211, -6005, -2546, 3456, -2986, -3623, 4550, 3356, -3480, 3259, 5429, -2242, -2201, 4742, -1423, -6000, 891, 1175, -6225, -952, 5761, -1364, -2366, 5453, 1843, -4363, 1064, 3704, -4545, -4551, 5182, -1172, -5183, 3813, 3720, -3926, 616, 5825, -2419, -3059, 2882, 222, -5190, 34, 3408, -2399, -760, 4298, 291, -2399, 2716, 1878, -3139, -1953, 1007, -1799, -3015, 808, 1987, -471, 2106, 4803, -344, -402, 1700, 356, -2504, -1527, -673, -1860, -1014, 875, -515, 1276, 2265, 2498, 1404, 791, 154, -793, -2191, -2544, -992, -113, -1726, -426, 3150, 2279, 532, 3667, 1556, -1108, 363, 500, -2819, -3094, 876, -1121, -1952, 2999, 3871, -889, 1874, 4676, -1308, -3139, 1628, 126, -4838, -891, 1991, -1814, -1907, 4977, 2124, -2319, 3387, 3567, -3605, -1506]
3150a506M565n423k522P399j283n594N549M114p207J337N289m494m996N445O72
3165A345p054L625O305m710j454N396r85n351L020K815o928O60N793l750l075
3180d348O702Q81o026K603N979n820j190K740j403l869J830K547m046K111L902
3195B593j083k551M158L82m102N20K195m140j91Q96J43j47J016K417r20N07j87
3212A506k10j653K54q69m25r38J040M54J144j88J114J515p93q99J768l326m78
3229i84L43O58k541J014L291k068j501M013J168m677J505K483m492j108K798r58
3245a056k259L806J797m096J079N721m848k231L113Q68o544L501L550m543k03
3260b345N676j831l887N264J299n210n20M634m727k986N293O3m237L430M350m647
$$ y = [-1506, 3059, -2364, -4886, 2513, 1230, -4364, 1185, 5299, -1908, -571, 4718, 224, -4772, 673, 1345, -5709, -2084, 4221, -489, -1943, 3453, 2468, -2883, 137, 2952, -3976, -3316, 2477, -1273, -4348, 2354, 3235, -2791, -188, 5791, -29, -1219, 1521, 118, -3751, -1921, 626, -3420, -1309, 2593, 1510, -1041, 3117, 3499, -603, -83, 2112, -2028, -2219, -1323, -1180, -1327, -311, 2106, 1186, 1693, 1506, 1296, -357, -103, -972, -1397, -2335, -1295, -841, 303, 115, 1229, 2744, 1951, 1052, 2820, -506, -984, -641, 17, -2524, -1510, 1781, -287, -1788, 2225, 3393, -1284, 221, 2704, -1788, -2896, -98, -1056, -3315, 491, 2288, -1808, -729, 4992, 144, -2087, 1026, 1894, -4650, -1149, 2401, -2142, -2345, 3331, 1500, -2387, 2877, 4176, -1034, -1554, 3080, -1647, -4633, 660, 723, -3514, -84, 4266, -381]
3276c81r86O242l558m560L745O87o457J202N497k590k162O205J234n501L759K352
3292D728n671j822N097l274l070L999J332l639J280M120k050j943L558j557k746
3307a658K523M90l590M6K972j408m18J388J303j038P68Q00j786q30l11k2n15r1
3325a377J704o11O2P48P14K42j992m8K580k774j744J369J113j621J195L036k078
3342E18r60K682l76l276J282J129l333K20L253m16k174N468m73l906J725K682
3358D045m486k225M019j364m773K848M905n985J217N656k894k444N026n12m767
3373a734m13M041m288j454N283m91m677M780K998m680M81M519l503n315N479o00
3389D26m951K390M711m103M40L908p25m304M115R40m252n06L545k952j763M040
$$ y = [-381, -1367, 4875, 1317, -3243, 502, 1189, -5268, -4066, 1431, -1159, -3321, 2884, 4118, -1383, 2376, 4728, -943, -2765, 2332, -942, -4012, -13, 1319, -2320, -1040, 3080, 1030, -913, 2645, 1088, -1658, 865, 1355, -2235, -2189, 783, -625, -1043, 345, 1648, 610, 1378, 2178, 392, -438, -749, -771, -1286, -1377, 327, -284, -222, 526, 1240, 1482, -510, -558, 2022, -752, -2496, -1127, -14, -1635, -440, 2596, 518, -442, 2240, 1864, -1412, -130, 999, -2334, -2114, 1139, 723, -1451, 4017, 3544, -362, 1363, 4045, -441, -2666, 1353, -11, -4784, -1936, 2969, -3016, -1799, 3857, 963, -1481, 3545, 3033, -1734, -2147, 1894, -2394, -3848, 1435, 944, -3733, 1047, 4045, -635, -154, 4365, 862, -4453, 1026, 426, -4525, -2135, 2576, -1527, -1087, 2821, 2096, -2208, 1907, 2847, -1405, -1911, 1634, -1318, -3081, 959]
3405I59Q57l437K490K803l251j849L763j991k969J994M01j026m96K881j233l18
3421d22K116L82k489L75R90j601j901K209j372N05J048J653q07O85o11N47q67
3438D40n35r67M73p56m90J581J312k185J714K775j602k150K791k357j685J386
3454b55L45k952P48L150p64k102L536O47k861J912J740n549j605N001k803k381
3470d193M314Q12k185R46N196m193k456M668j662m465K582J766l757O64L736q78
3486H95l218N049N94l694k06L325l233k207K979p13l327L680K819m366J418L401
3502C196k494l429M185O09n887K419L497l307p44L060Q26l533K271K487m898M91
3518a251K590k062k134L158J729k975P03J943j217j9K287j886k188M90M16j484
$$ y = [959, 1816, -1621, 869, 3672, 421, -1428, 2335, 344, -2625, -631, -230, -1256, -1752, 1129, -104, -422, 1694, 2076, -413, -38, 952, -649, -2550, -341, -1713, -1208, -160, 1493, 686, 1371, 760, 1307, 440, -95, -1062, -589, -1345, -1835, -254, 1058, -1127, 587, 3362, 1760, -390, 2401, 44, -1641, -255, 90, -2862, -2114, 1036, 272, -1830, 1706, 2353, -508, 1404, 3144, -2405, -4010, 991, -1812, -4193, 121, 933, -1252, -306, 4890, 697, -1759, 2909, 1247, -3218, -636, 1130, -2627, -1963, 1773, 895, -2323, 2726, 3320, -374, -580, 2745, -488, -2695, 284, -429, -3756, -76, 2743, -1623, -205, 3196, 702, -2727, 1458, 2067, -3820, -1401, 2096, -1211, -1955, 1105, 1931, -1602, 669, 3156, -1742, -1251, 1339, -723, -2857, 301, 2030, -945, -242, 1701, 484, 465, 2752, 866, -1322, -832, -416, -1900]
3534a900N65N96M21J5J544m47L63J32o99l50n01Pj650O78N40q09J504J211k68
3553I52N54m7l43j091J144k004j939J894N5j018O17K459j357j87K340o69k479
3570a119J993J02k457j467L521j156k229M370N54l668K389J765j937k212K632
3585A081j710k591K769K655n056J176N426l718k103M514N71n114J018L274m203
3600b011j798N719k223k614M047J324l521P77L493j761m567M403q65l008J748
3615h57K863l640J188K948o90k959K462M96l014O63J505k603j843M413O65k627
3631a030J532K761l112K51J793j498l172J590P43k824K272J244o25l30K138p23
3647A010j94l39M52j160p01N40m24Q2L45q14K022O52o35P54l42j210j388K034
$$ y = [-1900, -1335, -739, -318, -303, 1241, 794, 1157, 1289, 590, 240, -261, -254, -1904, -1226, -686, -1495, 9, 1220, 952, 1506, 1459, 1116, 25, 1169, -835, -2774, -880, -825, -1843, -1226, 1233, -124, -311, 2029, 1360, -1119, 874, 976, -1481, -2948, 573, -583, -2812, 1558, 2112, -1556, 833, 2598, 661, -1551, 1081, -629, -3220, -451, 2204, -2852, -1676, 3750, 32, -2071, 2443, 3014, -2100, -1082, 2192, -2011, -3809, 1910, -313, -2927, 1120, 2444, -1077, -300, 3193, 1432, -3135, 1268, 403, -2605, -857, 2006, -1634, -446, 2502, 1812, -1147, 1315, 1811, -1203, -540, 965, -1638, -3481, 932, 1597, -1030, 502, 3263, 151, 402, 2195, 697, -2475, -885, -142, -2966, -694, 550, -75, -405, 1733, 1010, 816, 477, 929, -231, -932, -392, -816, -734, -389, -1203, 819, 1471, 836, 1590, 1248, 38, -1350, 684]
3665F84k612P8J327L89j289J446J528k088O69J519p27k834K352l35k483J325K062
3682A011n24j296K752M15l031J852J084l390l98L091j986k707M211O72l438J155
3698e27L452l173m93K431l86l844L163P54l476Q80M056j737k216K691J616m261
3714a070P26K946l879j862M681k239j752K203J991k138k71M020k351k741M273
3729B537j624m077K263K012j896m17K924j175j771L406K00k713k27J933k430o62
3745a717J331J037j761N70J876j313n7J150l63p66J004j65k187J119N0l22M86
3762b8L14N69j33N82l93q00J44l27m15M92n57j010J088J461r43J24P91r38m61
3781d40R97j614p21J720k47o06J33J966j355q59K717m41k405J576R77k391n9K546
$$ y = [684, -1928, -1850, -523, -134, -1423, 23, 1551, -537, 132, 1651, 924, -1910, 442, 107, -2376, -1051, 1011, 487, -809, 1943, 2358, -673, 1179, 2263, -1127, -1525, 1566, -420, -3127, 1084, 1756, -1682, -527, 2925, -248, -741, 1690, 1304, -2540, 623, 1377, -2099, -1219, 2837, 1100, -1116, 1575, 3191, -1070, -344, 2602, -1277, -3139, 1542, -697, -2449, -246, 1745, -393, -664, 3356, 1005, -1736, 2537, 913, -3164, -901, 1111, -785, -1202, 1722, 547, -1224, 2182, 2382, -331, -558, 1375, -1055, -1717, -386, 651, -1110, -540, 1336, 23, -34, 1116, 753, -13, 991, 826, -1361, -242, -192, -514, -28, 286, 855, 722, 1304, 911, 111, 255, -72, -487, 5, -552, -1562, -474, 987, 44, 168, 959, 21, -440, 557, -1057, -1778, -58, -305, -911, -778, 1188, -167, -1026, 1691, 1250, -1155, 421, 1398, -993, -1052, 1494]
3799A494j696j663L437K80l666K417L618n025m8K620j543l750L032J637k630P57
3815g29L408k071o16K488q20l596J754K564m578J56K967j184k364M178N06l119
3831a056K416J431k581j255K453o77l697L604O36k476K55L160j359j530K858l98
3847A784k695J632k99j063o21J619Q3j166K121P32l239K048M53j575p55J183p56
3864e14j129J758Q42j488J012L78p84L11p46k05J97K91p84j65N73M06l47J21J654
3883A381R6j019R95j572j04K7n81j050J150J248k050J572K284j190j399K182q79
3900A091k122J044P11k493j8K090j541M44K868o55k645J487J796l400L48K779
3916A784k341k410L801N13k943J588L514l162r81K622p76l304K108P80j962K58
$$ y = [1494, -202, -1865, 1572, 1852, -1814, 603, 4221, -804, -852, 1768, 225, -3525, -493, 1144, -1486, -729, 2679, 608, -8, 2480, 1660, -1936, -182, 2382, -2196, -2040, 927, -257, -2621, 1557, 2063, -1056, 1360, 2791, 210, -1045, 1408, 731, -2966, 638, 1274, -1202, -947, 2213, 854, -676, 2182, 1784, -911, 721, 422, -641, -1262, 357, 440, -726, 1395, 2127, -1112, 936, 1389, -186, -941, 242, -514, -1643, 115, 957, -531, 481, 859, 75, 386, -360, -565, -368, -77, -861, -1026, -453, -47, -394, -273, 1381, 1477, 458, 1453, -119, -223, -196, -777, -1827, -677, 571, -1479, 93, 2377, 1187, -212, 1970, 1091, -1031, 13, 724, -1769, -1787, 303, -1238, -794, 2074, 1419, -1226, 261, 2057, -1343, -995, 1784, -557, -2967, 834, 1347, -1596, -8, 3506, 344, -637, 1985, 1209, -2095, 13, 793, -1169, -911]
3932i11K115j774j181L179kk452J811N85k628k35L573q74k853K226L51k779K201
3949C52J565j550j308K220j210j884K070J100k975Q90J825m56j886K695j62k364
3965a078J539M49j809j680K158N47j463J452j01q37J127J147j244o07J544j453
3981c09r48J388q34k42N96Q84j682K496l28j54n63O95j429o01J661j292q05J063
3999d04J216k064J950P72j702J084P2j007n06P70J048k215P87J551j293j315K927
4016A671L0k296J232J441k592m50K759q60m015M206J9k894J486K040k183n83K859
4033A870r87l321K872J228l503J562K275k238k106L902l70l912K431K169l127
4048a255j99K892k747k62K983N47k504J274J126j801j790K995p29k933L211L78
$$ y = [-911, 1204, -570, -1751, 1428, 1426, -1026, 785, 1370, -1258, -1493, 2080, 1206, -1647, 579, 930, -1849, 352, 1917, 367, -941, 1279, 69, -1815, 255, 1355, -1620, -730, 1095, 639, -1247, 1448, 1286, -1078, 461, 910, -899, -2579, -421, 126, -1337, 115, 14, -823, 304, 1451, 207, -400, 1144, -309, -1257, 131, -703, -945, -349, 535, -1147, 1349, 1021, 867, 304, 999, -430, -1031, 630, -662, -1467, -404, 812, -1252, 698, 1470, -232, 852, 924, -83, -589, 181, 1229, -986, -199, 1352, 59, -1256, 1671, 1701, -595, 637, 2078, -514, -964, 1795, 935, -3080, 1126, 1145, -1749, -263, 1777, -406, -989, 1870, 883, -2438, 434, 1662, -1841, -279, 1996, -242, -2348, 1554, 1184, -2728, -297, 1872, -1255, -1454, 1438, -1309, -1571, 1412, 1959, -545, 729, 1855, 54, -1736, 1259, 530, -2403, 808, 1186]
4064A186k498Q55J541J44k302K121q0j376J691j216o23m27J408o9j180J598J613
4081B386l392J341J522j788r28J359j102m62J167k30o55O92P34j232J054K36o36
4098F6m12P83o89o65Q43l33l18J173J70j658J487J347k452o03J850p91o55J136
4116B79N40r43j42J797j734o69J367r43j055J843L60k404K58K025j068q30L129
4133A810p21j277P37J737k616q19K400j288k342K508J152k304J473J910j906j738
4149a284L390o44k406J755Q62l748J700K205j632j486K216P54l291J642J535k315
4165g47l35K494k079j841K399J275k500J184J823k372m25J959q72k464J950K381
4181A830k903O5J245o82r48K490l46j974J411J310l033R82J891j409m33P43l68
$$ y = [1186, -1312, -457, 1084, 1228, -1074, 1047, 967, -409, 1282, 66, -557, -984, 424, 355, -825, 773, 2386, -1006, 335, 1857, 69, -859, 500, -602, -1064, 103, -127, -782, -90, 644, -588, 466, 702, 66, -346, 437, -252, -917, -74, -407, -725, 448, 618, -1040, 447, 1794, -658, -1261, 589, -202, -857, 279, 819, -124, -266, 1531, -203, -872, 495, -448, -1503, 340, 700, -1704, -1446, 579, -489, -1319, 1810, 1089, -188, 549, 2286, -330, -1149, 1251, -37, -2379, 129, 1281, -1023, 450, 2360, 454, -1284, 2106, 1462, -944, 811, 1673, -2075, -375, 1830, 198, -1288, 928, 1682, -1609, 33, 1568, -747, -1082, 1412, -667, -2508, -109, 1166, -1334, -150, 1673, -699, -1124, 835, -37, -2501, -551, 1830, -1073, -1008, 237, -445, -1393, 1097, 751, -1223, 188, 1498, -1535, -553, 1338, -71, -504, 239, -129]
4198a29q40J718J168k387L75J344p08j262J000n25m91J958p75n52n89K866k951
4215g80R30R0o28n21P36J13j097R09P06q93J019J369j797n16J300m39j557R63
4233i3K072l510P24J528p64m03J354K11j765J260M31k078o43J855p06j664K941
4250G50k91r82M43K685l122j93J952m5k776J867L62k776J486K386k215j732L850
4267A649n06k340J251J006k381Q97J489j332o93K776r97k470K338L31k662J144
4283e00Q48m00r81O06K002k300K13K135j860p80K107j953l52J228J696k182k14
4300f87K164k238M65J050P19j756P45M28j175O08O61j203n7J187q41K7P37p74
4318F0ON65j47p81M01N09j129q43J516N33j532J154P87j112J19J445j874K9O22
$$ y = [-129, -969, 749, 1917, -470, -95, 1249, 541, -721, 279, -246, -737, 1221, 446, -106, -695, 2171, -780, 150, 240, -388, -909, -173, -60, -1157, -248, 458, -435, 584, 1953, 156, -360, 940, 501, -1056, -93, 1979, -1531, -807, 721, -43, -446, 908, 1119, -646, 614, 1045, -1033, -1676, 179, -527, -2191, 750, 459, -523, -80, 2605, -517, -710, 1242, 1197, -1579, 288, 650, -2126, -640, 1746, -469, -2201, 1649, 1143, -1197, 54, 1060, -1321, -424, 1065, -267, -960, 1816, 819, -1651, 687, 1018, -1644, -500, 348, -52, -1033, -427, 1575, -725, -512, 1623, -237, -1017, 1090, -863, -1215, 13, 1709, -473, -687, 1477, -761, -296, 754, 1473, -283, 462, 890, -285, 323, 984, -219, -276, 911, 70, 97, 834, 60, 66, 631, 484, -297, 104, 613, -516, -1359, 157, 690, -842, 312, 1099, -13, 106, 1551, -323, -294, 328]
4337C28m15m97Q98K72j037j1J066q07m59J995l61j130Q32P4j955Q54J144r38j198
4356a345K036k13j298Q14J232j643O59J771j985j178K097n35j837R93K324k638
4372g46P0K767j118k616K257J328l678J492J554p34j499J214L89j999J887p4r85
4389d91n52K109j273j467L095o49k428J961J983l086M74K150j509j891J769m05
4405b10j067R86P52P4p67J300m72o67J535p69j377M71Q29j458N22J571m89j015
4423b51N3J333j688Q5J084m56j468J062k04P08M07j9j341J39N99l94R03m56q15
4442g19J402r69J299j546M16J732k958J215J021j001k51J601l15j629P61J825
4458A884k616J75J216o27j213J886l51j100P81J308k351O1J032K59j576K315k13
$$ y = [328, -87, -584, 314, 586, -451, -462, 604, -203, -662, 1333, 972, -158, 674, 748, -1207, -353, 791, -147, -1345, 691, 478, -820, -6, 1226, -417, 242, 2013, 28, -1150, 947, 412, -1425, -432, 1892, -746, -676, 2091, 973, -1643, 614, 1942, -1736, -244, 1310, 576, -923, 291, 680, -1319, 568, 494, -491, -1043, 1066, -207, -1674, 1421, 772, -1656, 305, 2288, -798, -324, 1826, 317, -1574, 195, -210, -1277, -291, 461, 535, -232, 1068, 596, -71, 1464, 695, -682, -211, 618, -840, -318, 1253, 764, -251, -198, 1135, -553, -468, 616, 160, -1308, -246, -450, 258, 665, 646, -695, -556, 43, -351, 552, 96, -719, 683, -286, 1013, -533, -117, 1615, -1343, -128, 893, -108, -359, 1242, 927, -702, 59, 1884, -732, -557, 659, 32, -1181, 705, 354, -746, 35, 1343, -1008, -947, 85, 344, -1232, 1083, 870]
4475H70k226J158J769k526k70K336q52j136J724P12k152P67J209j000j324K158
4491A217j112j906K754M18l083J354J430j465j078J716P55k442J475Q05j127m2
4507c31J869k168p03J281Q10k186J992J069j762p85J920q21j785K972j082o04
4523c14p78K092j383n93J545J64k015J886p29l54J465r42r38Q58J044j160j321
4540a473J994k13r9k73J103j500o26K481j924L95M67l40l39K21Q16p59n53R17
4558B95p25l66J728q52n68N37R86k794K102R10j895o47K776j262j593J188J125
4575I45k312J527J515j636m49J800j550j414K266J24j213q40K190j294j245K110
4591E24k22j869J336J671k115m37K459j086q81J133Q06k320p7K470j976p90K108
$$ y = [870, -1356, -198, 1571, -955, -1225, 1111, 259, -877, 847, 1559, -593, 174, 1383, 383, -941, 1217, 105, -1801, 953, 1371, -1712, -358, 1072, -393, -1471, 245, 1000, -1442, 33, 838, -289, -331, 1538, -630, -1333, -52, 758, -1428, 564, 1633, -129, -914, 1006, 185, -1600, 1372, 290, -314, -1092, 1000, -383, -976, 569, 733, -1282, 604, -125, -479, 986, 44, -894, -36, 1008, -152, -1473, 521, 308, 209, -64, 1039, -461, -1087, 1394, -530, -135, 332, -8, -347, -126, 690, -69, -622, 295, -430, -796, 932, 80, -488, 49, 1035, -1759, 343, 1253, -642, -1289, 1487, 225, -1368, -180, 945, -1367, 160, 1675, 39, -410, 1390, -160, -1574, 692, 816, -397, -1237, 953, -341, -1586, 524, 302, -1567, -231, 1440, -675, -1112, 1347, 261, -620, 513, 1319, -1001, -1078, 1392, -584, -1374, 734]
4608G34m54j385J553Q88k329O74J159j728n66K442j13l131L310m74j967O55J613
4625H81m62m54L53K57k365K102Q13j683J20J13Jk16Q22R9j363L66K708k700j105
4644a713L102j913k25J459q40r91N54N68M9o77J415o02l03J095r71m07N56N65
4662G21k40o89J358r56j720K626p72q96J694l01j151M60L29M67j753J446j557
4679i34J40J172m32q63L27J858j743o54J817l51j799Q48J897j965M51J325j081
4696A3q25K681j615j100J259J389k157q01J559l4j447K250n7k110R57m46K47j358
4714a595K380l83k443L365j392j359J496J737j268j082J727k18j425j20J423j792
4730i49N77J759o77k425J961O66j029Q4J178k166L10J989j250m89R36l40p13N75
$$ y = [734, 280, -1105, 448, 1336, -993, -319, 840, -888, -1454, 988, 875, -2256, 1054, 580, -1387, -732, 881, 419, -35, 318, 575, -1790, 312, 1125, -558, -438, -325, -324, -540, 282, 381, -982, -616, 2092, -608, -1713, 1389, -524, -749, 710, -130, -1121, -567, 1, 50, -627, 788, 186, -117, 978, 7, -400, 156, 721, 481, -208, 1150, 194, -1526, 1100, 328, -568, 1126, 825, -326, 134, 463, 930, -823, 623, -934, -794, 378, -54, -917, -590, 1268, -475, -1129, 688, 337, -1462, -614, 1283, -682, -231, 1094, 13, -812, 1869, 254, -846, 413, 1802, -355, -1156, 403, 369, -1078, 1172, 1115, -995, -38, -484, -237, -1595, 785, 402, -2041, 1324, -68, -1427, 69, 1806, 538, -544, 1183, 965, -460, -580, 843, -949, -372, 1387, 710, -1715, 246, 912, -117, -33, 1145, -1021, -711, 1278, 28, -461, 475, 135, -578, -3]
4748cR4m08k96J367j734M78R64r98j11R23r0J2j233J609j186J55k7O88j429O15
4768f10J114q67j95K194j768J41K68l28l33j56J702j561P06L49j871R27J084K40
4786A036j533J909n37j662N79P22r14j058K461j703M81L38M16r55R56J94K41j381
4804d10J272L42j808P29O80j670M24J568p92j382K011O8j273L84P81q29j546K459
4822A008n15j130R84k41N24n74J563k064k5J889j421m66l98J896j284j95J475
4839A026r34q03J752n64k166J263J034j207N75R22r34j243K682q04j524N85Q30
4856D90n11n48J092j032L63R82m71j598J111K76n00l07R71j09p27L83l52j063
4874a550J858n26N51r8m10l65N7N98N7k07n95O62m62K49J673j195k04Q40n32o84
$$ y = [-3, 91, -317, -613, 754, -980, -502, 462, -536, -647, 276, 186, 198, -1035, 574, -612, -457, -484, 204, -1225, -610, 504, -363, -558, 1636, -132, 9, 277, -51, -384, -540, 1162, -399, 307, 656, -1215, -288, 796, 1036, -497, 1412, 875, -787, -208, 514, -400, -1458, 1003, -700, -219, 119, 535, -420, 536, 730, 971, -410, 862, 1204, -604, 125, 805, -865, -441, 1127, 335, -1047, 964, 1032, -241, 143, 924, 95, -1451, 1008, 493, -637, 347, 106, 630, 56, 1619, -445, -470, 1419, -2, -468, -866, 1030, -254, -449, 1026, 92, -711, 1041, 477, -1689, -426, 608, -599, -24, 898, -36, -1279, 1403, 599, -925, -340, 490, -21, -569, 523, -509, -146, 836, 365, -1233, -122, 154, -346, -653, 318, 209, -518, -135, -487, -1550, 308, -218, 333, 235, -175, -540, -483, 115, 172, -35, -630, 32, -430, -181, 1492, 297, 93, 933, 401, -283]
4894b83N31k46j51l4R79j806j24K182j149l23P16o2q1K84L16j400j85J846j134
4913a24l24R4O04j394M88K016q90m49M83n11j12M22J268k386j8J784j546j386
4931a981K999J2j235L79M69r37J63J102n98j401J625o19j002R77J196j338p17
4948i06J539l57j493N56J653j192K46J8n58k66J592p24m97J120r0j455j2K173
4966A347j861j94J841j234l22L86O78o46j44N50j054Q06o07N49o40O85N97j168
4984d31J007R9L23j366O47k33n16K86Q2K00m70Q82j115l89J506n77j018O88L63
5003c2n15Q82kj248n0L031k151l37N39J185k373R37N80j329N84K05l84KR97K04
5023G25j609M93K174j700j082J603o4j328Q72P90p66q0P86m99k050J988L87j511
$$ y = [-283, 248, 2, -149, -183, 796, -1010, -1134, 1048, -101, -424, 292, 230, 149, 433, 749, -651, -836, 1010, -124, -448, -354, 250, -1144, -656, 1360, 470, 21, 504, -7, -119, 303, 1571, -815, -833, 951, -595, -1981, 1018, 1030, -205, 174, 643, -294, -131, 971, 373, -1028, 597, -22, -1024, -47, 1149, -189, -906, 633, 276, -1217, -661, 992, -200, 46, 64, -494, -760, 832, 108, -389, 731, 641, -814, -826, 1347, -514, -708, 1133, -101, -423, -37, 641, -5, -149, 401, -653, 153, -454, 95, -545, 140, 737, -431, 576, 675, 998, -368, 279, 46, -470, -184, -102, 98, -372, 510, -605, -994, 512, -65, -1083, -395, -32, -547, 335, 333, -915, -965, 2066, -85, -422, 117, 1302, -1071, -134, 446, -883, -299, -94, -478, -476, 521, 725, -884, -391, 1783, 83, -999, 604, 540, -788, 84, 874, 108, 28, 814, 315, -1735, 253, 640, -871]
5041h71J985j462o40K15K177j332j645J503K214k867J99J665j350K47J71o29p64
5058a184J202o49L71O01R22j6k172R37J42p49J476K4k234N49K099k455L70J675
5076I09p0j058O01R76j915L84R02p31n54L09L50j425J055j80P64j114J001j45
5094E9j070J004M36m60O90J80l27q53J891j635q61J297k57n24J36P44j180M18
5112c12K43M17l11M79j23m38J199m72j368L22J47M36k46M16k48p24R99K38j155
5131e01j95J539n87m49Q22j028p53J451L18j812J853R29r72o03J174m26j253M15
5149g8J213j964N92N50n07n20Q90J021j281K6J92p63K30J182j142oO15M59j920
5168a211O81J792j881j02J963j004j465N26J224j165PJ551m25j090J397k32j003
$$ y = [-871, 1114, -348, -988, -773, 1404, 72, -1573, -70, 2144, -723, -524, 1141, -209, 38, 209, -420, -1184, 18, -631, -260, 341, 1263, 1247, -925, 12, 154, -595, 881, 905, -1329, -780, 1319, -1136, -766, 909, 839, -219, 382, 1358, -557, -173, 729, -2, -556, -247, 103, -1322, -267, -447, 317, -797, 204, 59, -1011, -7, 429, -31, 659, 839, 512, -341, 1550, -85, -946, 351, 94, -430, -294, 450, -730, -312, -69, 348, 37, 516, 393, -45, 1154, 682, -686, -364, -217, 219, -27, 389, 141, -583, 416, 654, -501, -696, 843, 256, -193, 629, -399, -1152, 299, 617, -1195, 658, 1587, 615, 12, 1186, 760, -493, -78, 1135, -829, -237, 313, -194, -714, 176, 1197, -84, -58, 134, -629, -399, 783, -359, -365, 250, 709, -1211, -530, 1262, -619, -721, 1242, 238, -1227, -701, 523, -642, -635, 916, 491, -599, 798, 566, -437]
5185d37J170k8j146m92J759j353m29J102K87q73O87l22l12R35K58j258N36kp99
5204g17O17j43N8q18L80O28n8K54r5j12K84l13R23k170J294J284p18j142J986
5223A422j517l16m6M38L34l37Q17j340J28J576j440PO15K01j499J024J83m65o61
5242h76J663r86j54J284j80j277j048K183j5o70J80J1q55J105jr56Q43M4o91o89
5262a085J398N93j446L99J13J37q60J463r78J07M56k06j242J494J760k246k92
5279d35J732j368p7K41N67j349P97j9L32j288J531m47P6j96K04L35o86j22M1m8
5299a79j16R54j955J929k36m38o09M25K62j74N26m58q08J238r8J99m36M30k49
5318B07j524K185o37j19J29N9q37K7J811j837J80q0M5M95o40P53j99m43j94J043
$$ y = [-437, 733, 705, -441, -933, 826, -527, -956, 146, 433, -440, 247, -75, -387, 548, 806, -452, 84, 82, -717, -100, -243, -185, -1003, -623, 5, -53, 201, 106, -6, 278, -35, 888, -1282, 12, 1296, 578, -564, 1422, -95, -411, -457, -19, 315, -22, 795, -545, -417, 1159, -281, -274, 341, 542, -957, 67, 250, -215, -876, 787, -199, -353, 931, 751, -526, -1574, 609, 594, -76, 104, 115, -740, 365, 364, -592, 251, 295, -396, -1085, 313, 906, -540, -141, -28, 109, -751, 712, -266, -159, 297, 91, -1151, 343, 2103, -143, -435, 1297, -71, -148, 93, 660, -689, 108, 89, 421, -867, 664, 217, 293, 97, 301, 636, -50, -172, -131, -179, -295, 659, -1296, 633, 397, -41, -650, -225, 37, -137, 389, -69, -877, 361, 263, 462, 26, 456, 207, -1317, 868, 231, 112, 241, 300, -537, -510, 1301, -536, -356, -436, -391, 104, -536, 217, 18, -425, -619, 424]
5338D24j720J819n48j03J504j038N82j389N15l32m63p9J790j721Q30M76j699L73
5356g79N30n15L41P80K58j003J13N54j279J121R44p31p30J049l80q23P35N36j346
5375f25N55r48J089k42M76j76q61J16Q88j107O73R25p06n97P92K62p47Q72j73
5394D66r35o01J366po71O6j60O82n4l18L10Q4k18j39m44L66P2n25P50R07j249
5415b52K12J01M98q52J008r73j66L48L7J69R57q56l43k70n23J860j165n27J046
5434C09o77O1P06n84J85P3L90n92j7J97l20J42j68j12M65R58j025j021J321L72
5454F63r90j32M52P9J70m91m2n67R18q40R58n03O77j032J46P40j074J202o47K86
5474b7l87R7J691r92o58J105o38l66J541j498q11k28J549J21n67L95m87o30J204
$$ y = [424, -1296, 523, -25, -128, 1376, 338, 920, -469, 46, -286, -749, -828, 962, -759, 71, 547, -1152, -779, -249, -764, -423, 357, 615, -388, -275, 279, -1000, 121, 1065, 334, -396, 653, 273, -550, 185, 721, -625, -70, -1018, 71, -171, 305, 129, -732, -616, 272, -835, -162, 763, 57, -540, 252, 514, -233, 639, 466, -469, -1070, 296, 289, -382, -316, -476, 206, 152, -166, 144, 228, 10, -129, -573, -207, -135, -660, 90, 997, -252, -40, 61, 559, -293, 715, -258, -424, -76, -39, 130, 1087, 231, -112, -382, -905, 955, -210, -737, 309, -368, -307, 399, -185, 0, 73, 463, -129, -146, 51, -269, -127, -295, -407, 58, 1016, -9, -1030, 291, 663, -327, -459, -7, 72, 242, -249, -291, -858, 60, -780, 178, -325, 352, -680, -534, 206, -868, 334, -313, -27, -414, -317, 1374, 382, -276, 829, 191, -175, 1366, -132, -943, -1171, 378, 499, -68, 327, -160, -790, 414]
5493D14O57j503J9M95K39q66J777r08k44k91R69j241n51J739k64q72j19Q03k33
5512B0MK06P98j153R3K30j4jJ86j177J099l1Q91j748R85M47j404R39L9l49K89
5533C49m44m8Kk67J346j343J17K27M47r33P67L1j078J811r54k27L56K57r19Q88
5553C85m48n0M9J37K67m53l03j58O24q25M42j470Q35Q00O68l34M1m40l60M67K4
5574a02n56R98L59o76j80J277j643o94Q28P64r89J31R22q06R20p67K57K94q89
5593e52J068n87j087J113J012k056J455r64M18J7L53J59n69P57o45Q13J91M21
5611A317j044m70R16q46o5N42M46m19n94P7J9m60L09P7q00N17J13M43M01r3k40
5632A46j06M32m6J05J16k30l68L78j507Q87o03L39R38r22M52N9J89M1j56M22j357
$$ y = [414, 1071, -432, -413, 82, 321, -545, 1232, 324, 80, -211, 758, -483, -1034, 705, 441, -431, -550, 253, 20, 24, 230, 1028, -125, -32, 198, 184, 183, 369, -808, 291, 260, 1151, -597, 388, 835, -569, 370, 409, 60, 349, -95, -143, -141, -408, 938, -405, -288, -61, 386, -547, 220, 251, -827, 984, 30, -197, 159, 416, -503, 385, -63, -113, -64, 73, 340, -113, -416, -574, 50, -775, -333, -1803, -968, -168, 500, 166, 207, -233, -593, -126, -102, -658, 340, 699, 23, -157, 1120, -523, -1217, -389, 375, -614, -483, 439, -367, 553, -214, 43, 337, -552, 516, -71, -1158, -45, 967, -1089, 366, -598, -180, -163, 190, 349, -220, 537, -108, 705, 896, 1317, 273, -197, 719, -127, -192, 350, 796, 377, -217, -140, -121, -581, -272, -195, -995, -478, -365, 78, 479, 386, 146, 40, 472, 426, 531, 647, 417, 49, 427, -1080, -193, -796, -457, 481, -441, 11, 70, 259, 300, 144, 566, -791]
5653g91Q64M87q09Q31J43j258J466j584K35j94L28M31l76l80J06M69o72P92k19
5672a31M22k35J31j27l51O03q02L2k1N5p74K243q87J10M1o27o76M51K105j910
5692c48l49J337n12k93j82P97L09q95J137q86L52M0k44o69o02J709r04n83O73
5711a13J36m22P16N15q56N82o8pj33m43J92r90J125l99j59q58R50M5L56N44K99
5732A012j107R7P37n04j0j12Q98j445Q25N66j493N09P4N2J29k38J61q28M58J50
5752f9j72m99P17j75K59Q43j460O51j77K51n92R26j430Q62m53J673o32J17r5k51
5772B94n00L97r60M07N48l40o90J221l29J73o71R78r69O8n77P42q91O22l4M08
5792a03K95m40N77o37J51P43M9n96M13j24j275J429P2r86M48L62L04j303K252
$$ y = [-791, 73, 560, -249, 582, 725, -533, 933, -651, -416, -610, -282, 149, -227, -607, -501, -32, -704, 88, -131, 291, 56, 187, 60, -291, 312, -490, -458, -479, -424, -1198, 1045, 158, 268, 309, -318, -994, -543, 1562, -348, -697, 640, 128, -165, -347, 450, 759, -136, 1001, 115, 467, 507, 263, -406, -1008, 701, -203, -786, -113, 23, -399, 317, 832, -24, 558, 490, 483, 350, -93, 99, -891, 234, -165, -324, -1182, -232, -187, 169, 713, 1012, -95, 2, 739, 235, 225, 113, 1011, -434, 391, 957, -536, -27, 47, 99, 228, -10, 151, -677, -219, -69, -241, -740, -23, -198, 61, 904, -556, 95, -82, 169, -423, 503, -927, -65, -518, 1155, 523, 640, 545, 294, -206, 191, -769, -362, 186, -154, -844, 377, 48, 221, -450, 528, -441, -373, -950, -208, -1099, -477, -511, -103, 192, -248, 329, -308, -157, 586, 635, 39, 452, 328, -947, 482, 554, -432, 16, 378, 682, -621, 1631]
5811A631j505n71P00l18L10j246Q65j77j235K070N90q55j42m2j01k1J043j111
5829a15p32L61J039o0q35O88Np86Q96m50j101J345P1j304P83j17mJ12n20j17P83
5850e8N47p94q01N86J073q71M04J60k36q55L58P50l87J51J119j400m40P68k43
5869a69r46K50P03O47q5n76P60P2q89L45l39L90m92J82j92O92p36K26O79p99J14
5890a63J213j021q18J191J62m56K33m05j96q4P83k83K83j2J24j322J089P00j427
5909d09K77K22k79M0J75M01p26MJ039n89J55j25j89O14p86J17l12l87J062n36
5929b32J278j67j121J83m37M57o79J42O47p73L78P94J91j529J439p50J71k31q21
5948a060J299n43N46P66l86j612J112J82p12M8Q72n50M20n94q84J376J63k15o09
$$ y = [1631, 126, -445, 255, -63, 247, -999, -134, -311, -1546, 524, 1114, 259, 117, 75, -26, -47, 996, -115, -847, -486, 553, 493, -342, 346, 351, -435, 461, 11, -1090, 255, 326, -978, -195, -312, -316, -204, -724, -841, -58, 489, -305, -1106, -520, 553, -318, 86, 246, 10, -845, -487, 263, -124, 27, 1146, -254, -694, 74, -169, -1115, -865, -162, 485, 400, -176, 584, 656, -233, 112, -227, 163, -329, -147, -339, 353, -383, -157, 522, -277, -163, 1050, 29, -789, 402, 564, 108, 341, -64, -260, -344, 439, 156, 439, 427, 551, -771, 318, 1018, -409, -132, 90, -189, -149, 26, 427, -299, -295, 744, 155, 310, 185, -4, 610, -176, -59, -371, -758, 304, -232, 1046, 879, -242, -59, -496, -39, -718, -576, 71, -702, -324, 470, 661, -868, 571, -179, -8, -239, -1060, 239, -304, 242, 1008, 622, -990, 122, 304, -408, -360, 512, -38, 382, -212, -1096, 280, 443, 228, -381]
5967c81J298m14M46j261J319p42n48Q94j018j66p7O86K48j025R19L22q07K43l89
5986d53N73j167Q17P08m10k96L44J043l33p11r6M44n19q77M69N59q4P4J87j44
6006A28j09J038p39j65n70J3P60k53M04r53R4m11L7R2M71M17n73N90J14J07j749
6027a257J278O98j121N92J92M22j466J261K64j218k7O4p11O08R27l41o22R57p30
6046b30l30J194n15K60N32j114K4j61k24J05m5j49J388j085Q22m35k29j09j53
6065d54N21M8l82O59k66P05o02n15m6M70M65n75k81L77k13M1J71j022K6P07m31
6086e97Q10KO32p95J45L34j643N89k38r1K41M84j16J225j173J621o82l25m31j74
6106a82J43N38p63M74m87N41J1l68J08J107p82R03j273J65q00M20M86K20r60J72
$$ y = [-381, 917, 503, 949, -312, 1007, 265, -283, 611, -407, -573, -650, 36, 284, -741, 178, 500, -307, -64, -453, 120, -1047, -230, 478, 68, -228, 116, 1159, 826, 115, 19, 463, -56, -933, -464, 95, 11, 85, 272, 128, 19, 1057, 318, 153, -417, -404, 356, 103, 507, -446, -352, -763, -726, -634, -163, 254, -319, 271, 385, 492, -1257, 21, 719, -402, 190, 382, 804, -662, 599, 863, -355, -382, -318, -1029, -421, 506, 165, -457, 500, -230, -560, 634, 119, 379, 911, -203, -179, -340, -564, -459, -504, -653, 735, -350, 472, 37, -192, -301, -454, 67, 115, -267, 392, 126, 831, 229, -286, -332, 138, 603, 28, -253, 124, -89, -48, 123, -899, -873, -166, -597, 213, 215, 847, 52, 197, 531, -1112, -523, -761, -852, -611, -127, -243, 982, -191, 1430, 748, 423, -8, -182, -39, 499, -264, 210, -277, 264, 275, -93, 15, 1122, 340, 1243, -30, 135, -665, -245, 241, 461, -499, -327]
6126c27P19n99O10q32L71Q97m92j544J455o49K42M98O32M1m94l23K32r91R90n88
6146a52P40q66N38k43p49J454m04j78n07p0l07J837o77j292O94jJ06O02P1m02
6166A94k61K09N01j413O77J51R2L8j551R15k4N17O79l05q49J705j186J0N8M12
6186E69j010K63Q53j034Q27n4j15L36n16m97K59l30L17k90M96L98n69k67K94N90
6206E20R29j287M09n58l10M96l45o8L94n35l54K154p29j088K75J044j767L60L37
6225a23P98r22r9j67J446l26o81K82J15L03m54q95P83L6q57R18j02q7q46L06J483
6246I11r01j72Q71r55J52m76J92k16O74L31l10l86J076J66j224Q41K64j605R55
6265A88q44O62k96N68q00Q16O50n05K44q42L39n79J120j959J184n16K91N97m58
$$ y = [-327, 392, -207, 403, -429, -58, 839, 347, -1197, 258, -391, -149, 349, 981, 1022, 528, 205, 437, -554, 436, -152, 588, -278, 260, 17, -732, 722, 318, 140, -367, -437, -744, 1093, 416, -876, -182, -183, -77, 525, 596, 194, -67, 142, 643, -770, -93, 58, 150, 188, -1363, -448, -472, 45, 724, 419, -430, 1275, 89, 99, 157, 569, -441, -178, 675, -359, 468, 414, 299, 635, 119, -378, -119, -449, -132, -422, 74, 472, -97, -364, -70, 520, 1449, 162, 571, 13, -297, 199, -146, -214, 180, -355, -709, 1445, 716, -372, -97, 947, -820, -460, -123, 675, -247, -346, -513, 933, 607, -74, 208, 323, 626, 172, -723, 60, 96, -761, 157, 55, -32, -878, -572, 911, 10, -162, 709, -246, -94, -570, -378, -594, 80, 411, 101, -285, 791, 957, -267, 574, 838, -767, 188, -656, 6, -290, 278, -522, 294, 944, 439, 683, -159, 180, -399, 721, -1238, -54, -570, -279, 318, -140]
6284a40Q98n92n93r2R64q9m19K13j13k58p89J148k50N25J57l95l25k69R10j764
6304a273J430o39N28L31r43P07j28m75L36J010p90m1j37J04l12Q7Q59n28P39m41
6324D24K85m13j89O94j814J85P14l34q07N40J124m17L86K67j170L38n51J507p74
6343en64O08K90p13k26Q29O22K5k43o36N23o63M58j071K77l76Q15m65Q3O92J56
6364D16N73j49j484L59L77l6k82n09j04R88J37K51q14J22J91K12M37j164M04P3
6384bP04k34p44O83q21Q83O96p08k56k25P69k6n34r8J25l63N1J17K06L99L47k11
6406G58k57m06l28P21r83J23P04l36L45R58q16L36k88n73p11n8O77r11R34o70
6426g81M30p69K177j910J503n22N3q64Q58M49j054K91o08R56n95M50J06P4l30
$$ y = [-140, 758, 166, -427, -519, 445, 356, -63, 150, 37, -221, -1010, 138, -112, 413, 570, 175, -150, -419, 491, -1273, 157, -482, 46, 377, -566, 141, 13, -462, -126, 884, 94, 53, -84, 20, -292, -205, 654, 126, 865, 424, 709, 296, 107, 801, -1013, -828, -114, -448, -1255, -715, 409, -8, 378, 645, -525, -187, -738, 769, -5, -569, 39, 329, -384, -610, 219, 841, 866, 623, -13, 510, -153, 305, -766, -489, -865, -50, -515, -432, 260, 416, 989, 840, -644, -285, 92, 56, -226, -735, -839, 149, 286, 537, -277, -155, 36, 248, 685, -479, -75, -2, 702, 468, -276, 407, -414, 469, 1165, 457, 201, -24, 745, 719, 185, 87, 212, -151, -100, 17, 223, 622, 969, 758, 501, 95, -233, 488, -495, -372, 332, -4, 341, 1299, 483, 819, 531, -42, -753, -811, -134, -1045, -111, -781, -351, -1120, 1057, -853, 650, 128, 181, -683, 175, 624, -430, -139, -747, 209, -386, 64, 170, 244, -86]
6445h6J36pR98q69j121J501M8O16q14k33L69q64L81N14n45j248J687j027L41K02
6465b1J280j812Q94l10K46j709J616j10r03P79O62j298K48J315l76q30l85J848
6483A134j455q8P98o5r79J392q23j6J94L13r26Q58r28M12K10o8n96K05kk72q7
6504g89l9R51L04l83P52j04o78M36J032k823J312O43j390N59K40P10j392Q42O51
6523H34J40j156k53O01m28k14j86L5L02J335j500R63k33K63m46j87J00k9o17P67
6543I1j001P19J057n88l34K95Q39j087K22l03k5Q8l71L29q07J485o72M82k25K68
6563D62j33M52j69k005P99K33K8M15n11J126j203J038L51j446M11N20q3q66j54
6582g35P73l02J79j08J034j071M30K32j74Q8L63j237J71o91J119o51J46N97l44
$$ y = [-86, 50, 43, 1041, 172, -949, 552, 600, 1216, 402, 169, 538, -326, 55, 569, 24, -1224, 463, -564, -223, -21, 1259, -553, 341, 31, 277, -1432, 184, 74, -829, -50, 612, -686, -438, 877, 501, -329, -714, 1134, -321, -409, 389, 324, -655, 737, -86, -102, 92, 405, -521, 337, -591, -179, 31, -37, -633, -428, -430, -702, -789, -828, 123, 427, 44, 796, 692, 14, 450, 1482, -1341, -29, 614, -776, -217, 23, 733, -659, 183, 834, 974, -182, -435, 166, -262, -476, -662, -627, -325, 1010, -490, 473, 240, 503, 57, -130, -30, -59, -676, 91, -910, -191, 866, 278, -56, 239, 1078, -9, 213, -90, -115, -27, -398, -69, -876, 609, -63, 419, 194, 462, 329, 781, 612, -1393, -594, -361, -333, 82, -429, 697, -506, 532, 883, -563, -152, 368, 285, -581, -735, 38, -264, -85, -193, 841, -230, 200, 432, 258, 346, 709, -528, -357, -1048, 71, -580, -434, 163, -181]
6601a81k31J025n7J70p85k8j151K39J026m30L51p33K226j529K89n11N51k10M6
6620G7K68o39J206m54p74K54P9L1j44l54N25Q45r44o70O84n90Q60j021M36M71
6640A46N9J5q97M73o19J016j72j075Q76J67p5q49J907j018L49N95r14j66K47n59
6660d94N50k87J44L80K85P5J93j007J376N47k076O39j85j250L72P51K66m17N20
6679C82l07P64p76O26r0l69M13k88ll95L99n79L98N23r24P24k26R6M00k34o8j089
6701f23l86J038L87r24j75J846l89j443L42M37k3k29N15j460J010R12j070j178
6719a413J768j110O80l13RK23k30Q85m66m9O22n86k87N57R58o96j310J624r66
6738a00K31p01J46O5N78j70M5M21k39J390j643L73k55n10J54m65J151m97l88m50
$$ y = [-181, -412, 613, 556, 726, -59, -87, -1238, -999, 27, -403, -52, -785, 1441, -88, 201, -310, 241, 31, 77, 345, -294, 912, 458, -316, -62, 17, 48, -96, -450, 75, 920, -24, -694, -10, -600, 260, -761, -325, 146, 205, 220, -677, -204, -823, 193, 21, -1054, -178, -11, -86, -935, 972, -46, 303, 898, -16, -182, 65, -494, 56, -231, -87, 293, 578, 653, 846, -161, 1215, 1762, -314, 325, 140, -1110, -738, 13, 279, -138, 382, 75, 839, 63, 689, 599, 230, 643, 355, 352, -43, 356, -223, 175, 698, -226, 498, 272, 368, 768, 534, 466, -623, -1009, 29, 416, -508, -683, 1163, 774, -669, -327, 110, 87, -142, 373, -1087, -77, 835, -235, -1413, 355, -755, -75, -388, -379, -156, -386, 499, 33, -16, 606, 20, -267, 290, 1248, 552, -758, 866, -100, 131, -570, -424, -359, 219, 49, 94, 515, 276, 1666, 23, 396, 141, -369, -215, -680, 471, -26, -414, -864]
6758h64J094J8J65o85L2M46j601J800m32r19O77L53o19M71R17n81m36k57N48p61
6778f34L89l70M82P4K54n44R49q81O89J04m00N39m98j041J456j529N19L30J353
6797A241j637P00P4m01Q05m71o19o46k75J618q74k9N82M67n29Q91j042J75L05
6816C35q73P91q39Q16q11R98qk77j50j04J005l06r45P07o3m01N6Q69r42K75j27
6837Fj081M63Q40Q9r5R29j582j59k86l79L42M69l90J051n71O92N07j104J7M20
6857A78o2k89j35p4J03P74j167L53Q53q44N60p94n95J65K33P81j53o86P11J1J63
6878H6j0P67N1j346M13j56j097J243P08j000O66R29j281R07p70l69Q90m51R50
6897A130j598k01N57L54J73l63P10r83L88K74j108n08J393Q13j422R87%p74n60
$$ y = [-864, 230, 248, 413, -272, -240, 206, -1395, 405, -27, -946, -269, 84, -535, -64, 853, 272, -164, -421, 127, -634, -245, -615, -133, -59, 195, -349, 600, -281, 408, 512, 112, 651, 153, -888, 568, -961, -442, -112, 1241, -396, 304, 378, -23, 782, 311, -308, -954, -1229, 389, -485, -514, 68, 535, 6, 897, -145, 30, 335, -538, 253, -586, 230, -581, 417, 409, 132, -18, -122, 883, 577, -368, 339, 276, -125, -69, 800, -142, 133, 6, -1075, -612, 228, 317, 222, 1151, -431, -590, -876, -1255, -913, -444, -834, 217, -354, 338, 845, -259, -242, 178, 116, -173, -308, -382, -279, 495, -672, -319, 534, -310, 250, -544, -1139, -974, -741, 40, -113, -799, -88, -77, 86, 76, 843, 894, -452, -39, -195, -1292, -49, 659, -341, 325, 1254, -27, 880, 110, -259, 631, 180, 1130, -468, -669, -112, 242, 415, 52, 762, -221, 167, 441, -667, -1175, 218, 1031, -391, 596, 596, -178, -738]
6916g38R67m21P04l63j0j64o06N18K58j330K96J387j437J729J83j427O66k7o73
6935d88O64l55K95k17J470j160r69k84J617j126j75N49P86r07L25L60p67Q20m10
6954B8j12r4m2R13j506Q61Q85o90q23L68O39k95N03j170L13N17L9j161M1L03n9
6975e42q7J173j511Q05n71L27l20J516m47lp62N92K4r77J266l93l90K96M24l59
6995F1o35J280K80p2j221J026k045J092L98j07l48K73K42j01N35j96L35j119L75
7014E3q38K74J1r08L38J051J06j099J634j24n21J327j743j08N29M63k40j14q34
7033g43K507j626j128K088p39j090J212k18p28LO67j55L7M70k69l21N36J60r98
7052c35L31P90j010k55L33j17M18r34J926j202Kl11O6n85J274N5j356J886j235
$$ y = [-738, 229, -192, 512, 149, 139, -25, -631, -113, 145, -1185, -889, 498, -939, 790, 973, -454, 212, 185, -488, 176, -179, 116, -101, 1369, 209, -760, -1044, 573, -553, -728, -179, 607, -300, 25, 385, -382, 438, 28, -84, -178, -220, 693, -813, 48, 933, 243, -580, -212, 427, 132, 635, -535, -222, 295, 334, -827, -786, -483, -542, -629, 544, -967, -162, -733, -406, -726, 790, 343, 340, -422, 170, 194, -783, 483, 90, -300, -4, 420, 61, -574, 706, 986, 914, -307, 719, -1326, -234, 164, 57, -291, -18, 224, 123, 658, 462, 797, -322, 53, -785, -511, -500, -1408, -1070, -19, 87, -1012, 622, 498, -23, 1304, -439, -547, -18, 445, 205, 91, -743, 1764, 138, -990, 1098, 359, -731, 481, 263, -465, -462, 205, 50, 87, 557, 288, -33, 503, 663, -335, -4, 786, -224, -479, -146, -263, 155, -779, 1147, -55, -53, -364, -298, -883, 391, 446, -910, 976, -259]
7071b59k96L72m91P77l93J347j464M32n37N56P10j551P34r99J123N19k10K50k27
7090C93o36J433j089L89J02p85M46n0j078N94N56J37r46P92n87k1m64Q09M58n16
7110f3n93J012k19m8K3J43O38q58K1L07k20j045M82M15L31j151J686n09m18j43
7130b09J262j283M15n26Q91r96L63n68Q23p00R31o81m89M89P88j801J025J040
7148G74q22j038R11n78O74K80n48q2J091p43K81J4k92l68P15q32O93k34M0nK02
7169A33K9P62j074m85P53n98R30k93l46K09l77L66P24l48K51l76m32l51J668j599
7189d54k93N86O67j117L54k73n1P03L02j30j060Q76J54p58R13L9r63J128p79J317
7209A161j445L63m37j276K330j141P41l45q06j99O16qR8Q37Q6O3j312N42K15k465
$$ y = [-259, -555, -183, -674, 103, -290, 1057, -407, 25, -512, 44, 754, -797, -63, -1062, 61, 580, 370, 620, 393, -243, 1190, 101, 490, 592, -193, 253, 203, -875, -281, 275, 412, -534, 258, -329, -350, -814, -5, 453, -63, -656, 356, 137, 89, 112, 255, 893, 35, 56, 363, 143, -902, -420, -5, 326, -825, 861, 352, -66, -209, 1053, -230, 185, -341, 550, -446, -83, -651, 172, -528, 403, -278, -767, -278, 510, -1291, -266, 774, -48, -1086, -175, -753, -79, 201, -347, -429, 662, -81, 200, 214, -78, -446, 269, -563, 130, -104, -64, -69, 133, 162, 924, -150, -635, 118, -480, 450, 157, -189, 20, -357, 9, 733, 385, 636, 260, -172, -523, 1145, -454, -747, -161, 506, -611, -257, -530, -581, 122, 424, 294, -766, 110, 264, -494, 419, 458, -505, 623, -156, 1161, -284, 79, -358, -1634, 696, -445, 296, -49, -855, -1054, -438, -446, -348, 489, 575, 638, -674, -132, 83, -2382]
7229b382K835o65l80Q17j82N24q28K36m10R2M31O89j327n4k83J082k51j24J038
7248H58j406k77J611m41o67N75R5k0P77q92K09L48o40J380j734P14r54l69Q67
7267C4l84M96m82R3l54R96p18P16J10J99n6j259L83o3L78j023J070J29O36o27
7287B74Q52j749N90K10P7M49j391J095o84K4R9J328j825N99M32L53l47O74j357
7306b97r7J9J420j916J268J54p55KJ291j745J019k41n23k97K09K13Q23l95l9k90
7326a77O03j23P4k18j8M26j173J406n80m47J188P8k32m18m44K45J96l82k41Q35
7346E98m52r11M49o3L55m3q80R22J50k88k89N54j94k71N45j215J274m55L16J94
7366B96J60J19K28r18J75L93p82P54r9q70J21j34K04K65J96P20j876J580J2k03
$$ y = [-2382, 453, -212, -592, 225, 43, 567, -261, -25, -435, -343, 88, 777, -550, -604, -887, 195, -56, -180, 858, -548, -825, 786, 345, -322, 253, 348, 328, 1105, 213, 422, 770, 130, 1510, -224, 490, -464, -833, 34, -350, 146, -336, -243, -597, 399, -319, 397, 507, 706, 650, -609, -226, -289, 89, -934, 136, 265, 901, 274, 1126, -623, -33, 177, 254, 703, -688, 407, -277, -253, -154, 1174, -651, -52, 380, 733, 386, 1060, -297, -394, -375, 1045, -871, 397, 551, -204, -202, 1089, -656, 363, 122, -401, -698, -489, -276, 547, 152, 113, -177, 426, 303, 377, 159, 141, 567, -606, 800, 220, -227, 961, 1039, 807, 389, -55, 190, 386, 4, -237, 598, 146, -765, -316, -379, -24, -67, -947, -25, 125, -163, -452, 102, -92, -363, 182, -1033, 241, -214, 102, 296, 456, 575, 803, -115, 60, 453, -329, 425, 326, -544, -423, -557, -353, -88, 108, 828, -1048, 532, 544, 341]
7386C41p00R16n30m15n06O94J34k73P73n41M2Q28j204N08L58m23j71n72J327K55
7406H41j484Q18r71O43R68o00o84J37P26j028K31m48K031j299l67O31P2p56N14
7425b5P07l26o60K86l20J201l24l67m39Q06m30m41J164l14j52r87J28L31j42L65
7445F1Q73p02J154j510k34n57J644j023Q06m44n6N51k64M77p22j468J353pJ36
7464F8L53k94j171P84R28o12J108p97j46o38j8M25N23m52K36l10j38l62L73pO82
7485E35o27L50L96j12l97k69M80j041o10J747L21j48j131N91k56O62j76l1O86
7504I70j701J056o66j125J204L06n90R89l48p93J299p83j70pn80J045k95K90n47
7523d46J098j233r34J210l50J413j420P18M81j356P70o0Q09j254J006k68J74J35
$$ y = [341, -359, 557, 27, -388, -894, -200, -66, -339, 434, -107, -65, 763, -441, 67, 425, 2, -169, -741, 586, 841, -643, 175, -796, -153, 815, 215, -469, -332, 394, -634, -403, -851, 1180, -119, -486, 145, 217, -539, -25, 682, 356, -304, -18, -338, 863, 539, 172, -267, 539, 109, -332, 832, 518, 366, -621, -493, -162, -304, 61, 934, 232, 1386, -124, -358, -915, 729, -294, 512, 68, 12, 563, 299, 776, 54, -1414, -61, -68, 68, 421, 127, -1044, -260, 668, 56, 1164, 367, 221, -417, -435, -10, 513, 61, 297, -13, -151, -513, -140, -147, 535, -92, 258, 654, 542, 145, -124, 356, -685, -1295, 452, 773, 625, -506, 85, -171, 491, 315, 284, 970, -731, 325, -341, -1466, -262, 44, -546, 443, 95, -698, 601, -182, -352, -359, -939, 106, -189, 101, -446, 652, -581, -1515, -305, -655, 758, -662, 56, 537, -819, -49, -109, 700, -554, 452, 184, 358, 493]
7541D93m92k1p11R09m80O53k41L45n12J60L55k22m28j31O82n62o60K096j285O02
7561E50j013m2P91l63L32k38k42M48r31o34J137Q18j152J565j498O25P36n39j500
7580a150J177K10n35l00O99M30L00j021N18o76N93J9n51P27J77q78o0l44J212
7599E47o80P63q06N25q36M56L54j52j0M05R0j212M09P93n35k7L59o84J102l09
7619E52j151L75N15j79m73L01j25k59J34k7N16m9j30M40p36k49J425r31j111J093
7639f9K3o09K90J066j405J81Q11L51r47J50ql60J267j287J035j190P15M65m64
7658A5K99j34j082J74P27M00o05L39M1m67o6R21j388K02J245n68J32n22m42J219
7678D40M31m01l89O35n34j46J368q42r71m04K4J436p76J84N20o26K4L39L02k189
$$ y = [493, 1, -20, -731, 178, -302, 351, 110, 455, -57, 103, 458, 236, -192, -323, 359, -203, -863, 1233, -52, 550, -463, -505, 286, -77, 255, 17, -225, 223, -708, -1342, -205, 613, -539, 1026, -472, 153, 889, 350, -1150, 27, 237, -298, -598, 101, 531, 831, -190, 328, -348, 245, 264, -287, 440, 617, -261, -321, -665, 547, -133, 630, -176, 349, -487, -31, 323, 171, 161, 566, 656, -556, -147, 646, 111, 84, 443, -241, 861, 552, -599, -224, 291, 112, -361, -60, -185, -444, -310, -337, 179, 130, 0, 440, -296, -545, 880, -51, -1162, -69, -46, -655, -365, 701, -704, -523, 288, 639, -308, -158, -166, -526, 741, -546, 489, -701, 14, 479, 15, 314, 180, -902, -728, -1, 399, -206, 133, 174, -293, -359, 562, -826, -624, 621, 53, 185, -337, -779, 440, 871, 470, 81, 716, 182, 36, 1404, 562, -409, -813, -789, 647, -129, 55, 575, -51, -27, 312, 614, -1575]
7698a575J753M89j315J228n92o77O3J583j749L09L54J91j23M07O52m55r00J055
7716F98j333j4R77m74P20J67p13j070J877j224nM12j24L98p66O84k7L59j200N9
7736e99P39J968j430j558R55l69N75j19K70m16n16j23J095m60m93N97j6j33p26
7755g59Q18m31J107r59L99Q76j404l8r23Q39J3Q73K43n12j02m57K09P80p92M23
7775B03l54M95j538J697N7p48J91Q56j356L06K5n89J069Q4q0L1K57o22PMr1n23
7797f19J99K93M1k59M22j30l45p0K87K68J91P64q79q84Q82r3P04o58k7r08R77
7818A56l78Q57n44k32L23o84J169q6r93K77J396j088N89q82K99j03m75J91L10
7837A02k64O32j147Q26r94J006j39Q83q38R32L89k119J479j109J117L17p40r83
$$ y = [-1575, 178, 667, -648, 580, -12, -689, -626, 957, -792, -483, -129, 62, -61, 346, 998, 543, -357, 698, -635, -649, 328, -146, 574, 741, 28, -1042, 835, -389, -394, 18, -106, 292, -474, 210, 183, 542, -658, -599, 140, 2108, 678, -880, 75, -294, 281, 162, 432, 16, -500, -623, 472, 12, -481, 116, 100, -33, -759, 59, -372, 735, -224, 175, 1051, -353, -391, -1314, -475, -462, 411, 654, 142, 40, -417, -208, 572, -220, 203, -151, 344, -1194, 503, 560, -188, 3, 859, -497, -191, -166, -755, 314, 398, 318, 349, 606, -16, -9, -5, -96, -619, -420, -127, -86, -345, 77, -53, -398, -468, -181, 87, 278, 1042, 163, -721, 161, 68, 772, 114, 87, -821, 156, -222, 635, 91, -141, 182, -502, 667, 581, -412, -135, 1261, 173, 762, -120, 179, 76, -399, -208, 102, -162, 470, -677, 149, -845, 161, 22, 905, 67, 999, 1388, -731, 748, -361, 756, 1073, 333, -650]
7855f50l70J516m99k17P19M85j184O96Q3j082O10m61O62k69N58l45J25q20L5K0
7875c88Q61j004O87O10q77k18N99L2r14O21J48N17j082r24J445j66J07L42J62
7894E58p75J53M33p62L89n6M51p29R25l31N36l32QL4j115J583j312p42M14J204
7914E34J01p45q6M02k18J79q16O11O85q84M37P83o62k73O22j411L43Q8J927j517
7934A00l37P13K74p20j92N83n6L71n89N35J97r23L11l36O50k31J43J000j553L62
7954C02k09l01l23o91P30J169j52j089J847j187j114J254o53K39L99n00N68j079
7972g90L75J024m9m05Q3n62L2K53q28J058j046J030J6n14L15K82o41J341j002
7991b8O39o91l61L55l4O50l37j8O23j094J247q24m15O4J316q36n0j93J128j083
$$ y = [-650, -1020, 496, -3, -220, 499, 984, -200, 496, 579, -503, 107, -354, 308, 39, 597, 252, 377, -443, -408, -388, 473, -531, 156, 766, -111, -329, 270, 302, -612, 9, 157, 674, -408, -1332, 113, -53, 54, 396, 558, -217, -64, 369, -393, -4, -60, 391, -338, 587, 256, 792, 460, 468, 502, -613, 970, -342, -1084, -670, 534, 635, -110, -196, 206, -12, 167, -649, -38, 647, -237, 200, 983, 321, 48, 670, -741, -398, -310, 1617, 100, -237, 476, 750, 30, -162, 421, 365, 736, 147, 682, 879, -44, 267, -69, 581, 350, 493, 1493, -60, 302, 93, -208, -531, -1222, -492, 677, 525, -564, 1283, 96, -1018, 236, -417, -178, 221, -279, 289, -790, -415, 609, 560, 155, 238, -324, -292, -39, -867, 191, -855, 175, 191, -323, -8, 274, -367, 974, -28, 611, -80, -441, -86, -120, 530, 193, 175, 798, -296, 951, 127, -288, -224, 1092, 256, 206, 13, 1141, 58]
8011E8p38M38M03k82j220J330k72m95J176j257o1R72J48k2m71N86m08k12K61J85
8031A19m17L86J43q18M23j49lR5R76j231P14o96M33P2R48m11p70jP53j216N0J284
8053F84j855J039N12J97n46j66J361j322O99J42r06J7k97L53p17P05j57J083l46
8072D80K01k55j5j12r59N71j73R4o19J564l44R67j597m27K10P38o62J162q83K50
8092A91o7k32k52N57K16M11q83P49j536J034l18J11o74l66O81K36M4j00J876j706
8112b8L54l38R66p38l55Q43q17M25j580Q44O05j04M73k44J01l72L32r1M72j335
8132e87O89N68j75n33L86r77J093k87m22J34L9M0r80K241j789Q54n81O03l30j095
8152a109P06j00J361r31R36r93m16J929j019j06m10J763j791K59R60o84n64L17
$$ y = [58, -680, -242, 161, -121, -1341, -11, -283, -778, 398, -859, -920, 52, 200, 178, -293, 293, -115, -327, -66, 119, -298, 88, 231, -587, -164, -313, -316, -221, 755, -476, 238, -458, -25, 47, 995, 584, -186, -187, 566, -650, -600, 684, -1171, -132, 380, 577, 31, -135, 1226, -96, 603, 745, -161, -144, -441, -88, -805, -100, -257, 826, 480, 681, 426, 411, 299, -660, -89, -262, -168, -787, 777, 433, 1400, -197, -624, -414, 324, -338, 824, -59, 191, 124, -108, -360, 197, 413, 824, -59, 690, -846, 188, -130, -19, -693, -1059, -378, -142, -98, -198, 1678, -28, 326, -12, 954, 216, -139, 704, -113, 312, -1268, -424, 181, 77, 550, 306, 407, 35, 367, 276, 748, -587, 102, 670, 495, -38, 348, -629, 464, 177, -245, -111, -72, -32, -1012, 1229, -560, 294, -287, 316, -14, -1109, -403, -503, 858, -73, 863, -130, -546, 1383, 364, 258, -152, 1611, -180, 79, 1039, 355, -209, 108]
8170A08J69o62K77r12O80m7KL71p37Q21q98M21r2J447r00r9N25p76Q88N64o90
$$ y = [108, 277, -385, -108, -1020, -340, -387, -385, -14, -751, 70, -828, -407, -499, 948, 48, -51, 474, -302, 586, 1150, 460]
8191D60
$$ Imaginary data points
##PAGE= N=2
##DATA TABLE= (X++(I..I)), XYDATA
0@%%%%%%%%%%%%%%%j06K14k16K16k16K16l22M30m32N14o22P02q10R33j045J192
31F48j395J587j781K001k251K522k819L144l504L899m327M790n295N849o460P126
47C734p842Q636r510J0475j1541J2711j4018J5490j7148J9038k1226K3787k6816
60a4230L0460l4968M0687m8216N8605p3848R8427j44082K55275r74653r78066
71a784609L134429m83473k278222J914104J389931k405022L01244K296367j413835
80F70914j532213J910022O2821k138380Q10410J485416j669967p32856J712725
89E78892l65487j578410J144879R91533j517438j58115J485982o87026j028800
98a133990J348689N35260j258923M15899J095836q95813m81893J144953q0663
$$ y = [0, 0, 0, 0, 0, 0, 0, 0, 0, 0, 0, 0, 0, 0, 0, 0, -106, 108, -108, 108, -108, 108, -214, 216, -216, 298, -324, 378, -432, 501, -544, 648, -747, 840, -941, 1060, -1191, 1331, -1488, 1656, -1848, 2051, -2276, 2514, -2781, 3068, -3392, 3734, -4108, 4528, -4982, 5493, -6048, 6663, -7355, 8135, -9013, 10025, -11201, 12586, -14230, 16230, -18738, 21949, -26267, 32338, -41510, 56917, -87165, 168110, -806543, -1784609, 1349820, 866347, -1411875, 502229, 1892160, -512862, -211618, 2084749, 670914, -861299, 1048723, 1111544, -1026836, -216426, 1268990, -400977, -1133833, 578892, 213405, -1365005, -220126, 771407, -746031, -904146, 581836, -105190, -1133990, 214699, 749959, -508964, -93065, 1002771, 106958, -374935, 770018, 689355]
107F89355r46256M61367L64621q77124j65060O29760j95491m10288L20851J82866
117E4601l65085j06951L33239J20496k43972R027L20483j26839l38208L52379
127I170L95008l45775l3100N65485k01287n59313M30586L37932o70689r4822O47702
138D80897l92882o96570O07797L76105q09717P8737Q56818n67068o93838Q94036
148A34315K05712j057172M19565R47201r35974m60502J272752j37891j103684
157g15678R01307P22911j318840p8200J264689p22227r21030J241237K70901j375202
167g30132M79255J115113j042902m79870J371784k10780j272408P93907P18325
176G42292j264416p5587J325510n58569r49823J099907L73157j270292L36266
$$ y = [689355, -256901, 204466, 569087, -308037, -473097, 156663, -38828, -449116, -128265, 54601, -310484, -417435, -84196, 36300, -207672, -198645, 121838, -5001, -343209, 9170, 404178, 58403, 25303, 590788, 389501, -169812, 260774, 598706, -71983, -166805, 480897, 88015, -608555, -758, 375347, -434370, -355633, 501185, -65883, -759721, 134315, 340027, -717145, -297580, 649621, -286353, -746855, 525897, 388006, -715678, 185629, 908540, -410300, -488500, 776189, 53962, -867068, 374169, 645070, -730132, -250877, 864236, -178666, -658536, 713248, 502468, -769940, 23967, 742292, -522124, -597711, 727799, 169230, -780593, 319314, 692471, -577821, -241555]
185b41555J105444r19764o49191J133068j16193j159296O85038P96158r91049
194c57340j36787J102109m11547q14620Q39847L66779r69587J25307P77042o07923
204h6720n08740P87379J23270p07899L25732N60019n64853k73990O27605o7161
214B14642n71727L12657L52503n09723j40693N36141n9265l83006L27221K86778
224C65528m06694j17743L87203q9222l55773K14460K37378l33737j38284L69862
234A32978L999l38665J81764L04497l40625k27043L89256l11m44479K22382L95362
245B79115l99763j93923N53214k7840n08345L51968L90819n75143j61196O09789
255C18695k16776n52914N17295L34551o73470K8438O88548l79164m89228O61165
$$ y = [-241555, 863889, -55875, -705066, 428002, 311809, -847487, -162449, 633709, -357340, -494127, 607982, 196435, -618185, 221662, 588441, -381146, -255839, 521203, -86720, -595460, 191919, 315189, -392710, -66978, 493041, -71812, -345802, 281803, 214642, -357085, -44428, 308075, -201648, -342341, 193800, 134535, -248471, 78750, 365528, -41166, -158909, 228294, 139072, -216701, -2241, 235137, -98600, -236884, 132978, 136977, -201688, -19924, 284573, -56052, -283095, 106161, 105850, -338629, -116247, 279115, -120648, -314571, 238643, 210803, -297542, 54426, 445245, -129898, -291094, 318695, 101919, -450995, 66300, 400851, -272619, -244181, 444367, 65203, -424025, 237140]
265B37140J52208p88752J98704O21781n95617l40317Q14340k1218p43591M73609
275H287N38895p40703j36449Q32146l02617p02226O17679L02625q49420J09766
285c22017P99713m85786m87319P83207R3000q26829L36204O36256o75527k93390
295d42488P88660j66601p30758N34196M69593p08651k2344P62435l42396n67680
305d26034O12094K20353p26255J37655O03907m79308l78371O35803N1809o08128
315c56475K98118M63028n14967k09219N67970j14127n06080L56945L15935m94891
325a93763n4695N14887j68383l73933L85612K01301m59435M400L99230k32623
335B2598k95776L57326J24066l90607O6699L49222k19090k25789L24588P3438
$$ y = [237140, 389348, -399404, -200700, 421081, -174536, -514853, 299487, 278269, -465322, 8287, 547182, -193521, -329970, 502176, 199559, -502667, 115012, 417637, -431783, -322017, 477696, -8090, -495409, 287798, 380798, -446031, -109827, 526429, -149098, -442488, 346172, 179571, -551187, -16991, 452602, -256049, -278393, 484042, 141646, -426034, 186060, 406413, -319842, -182187, 421720, -57588, -435959, 199844, 251653, -356475, -58357, 404671, -110296, -319515, 248455, 134328, -371752, -14807, 301128, -193763, -248458, 266429, 98046, -275887, 109725, 311026, -148409, -144009, 255221, 22598, -273178, 84148, 208214, -182393, -115694, 233528, 14438, -211351, 113237, 186675]
345A86675l67326N5354K88201k26135k00200L27880R1675l20139R8603L15659
355B50247k13055k01082L24943N5131l75507Q0639K92194k70304k01462L75309
365A17053N0173l77864J59195L22626l23088j83254M08014l3160m30838K18747
375g2396K94100m00591j01769M97066r4732l98847L60252K64081m87814j9429
385a60079M98965k55671m00129M38885J42150n55640J27590M97169l74125k83983
395c24868N49019R66n73330K72190M10691n12058j52311N98257j50480n05569
405c87493M46756L11329n65678L1323N82708l27122m22524N21510J13571o10521
415c06141J88552M92544m56712k59346N76084n4931n46713L31325L43295n31520
$$ y = [186675, -180651, -125297, 162904, -63231, -263431, 64449, 156124, -164015, -65412, 250247, 37192, -163890, 161053, 216184, -159323, -78684, 213510, -56794, -258256, 117053, 167226, -210638, -51443, 271183, -51905, -235159, 172855, 139695, -291143, -72396, 221704, -178887, -280656, 216410, 121678, -277169, 83083, 347164, -140650, -160079, 338886, 83215, -316914, 121971, 264121, -291519, -163929, 333240, -40885, -324868, 224151, 225117, -348213, -76023, 334668, -177390, -329701, 268556, 118076, -387493, 59263, 370592, -195086, -163763, 418945, 91823, -330701, 190809, 304380, -306141, -117589, 374955, -81757, -341103, 234981, 180050, -366663, -35338, 307957, -223563]
425b23563r1399N33132k09911m10852M46510K18492m87354R9217M77449k91466
435F0255k76242M40761M5767m60636J59216L18512l53751j49944M09491n3730
445A39699l56707K33728K16583l46765o6752L28335j28900k78946K20938J31047
455I2260k77096K4336K92174r4125j60743K21846R8853k31329N205K08481j04769
466G5093j82864J45200Q9519k11852k5841K12459n9693j84740J43140J18413k30377
477a11543n5307K36448q1546k24660J97855J61121k61348j918L29279j03984k38984
488a54587K74174J41926l49514K3576L36277k19642k53906L51119O8722m11193
498a93048J37252L44918l40768j98172M28731o1878m49799K66749K88258m43156
$$ y = [-223563, -314962, 218170, 8259, -402593, 43917, 262409, -224945, -125728, 351721, 60255, -215987, 224774, 270541, -190095, -30879, 287633, -66118, -216062, 193429, 139699, -217008, 16720, 233303, -113462, -180214, 148121, 19221, -259725, -38787, 92260, -184836, -160500, 131674, 37549, -123194, 98652, 197505, -33824, -28619, 179862, 75093, -107771, 37429, 126948, -84904, -110745, 101714, 42021, -142719, 421, 118834, -111543, -166850, 69598, -11948, -236608, -38753, 122368, -138980, -140898, 188381, 84397, -154587, 119587, 261513, -88001, -64425, 271852, 52210, -201696, 149423, 218145, -193048, -55796, 289122, -51646, -249818, 178913, 117035, -332764, -66015, 222243, -220913]
508b20913m8825N02113j90233l73904M35100J80554n10607J06892M62950l63803
518b0676k88479M96073N905m99439K76033L66761m52444j04309N16734j74204
528A21955m30544L88631J99351n17112M5578M57204l02100k85131M67202P0867
538B15901m45840K07001L46669l77602j41819M25518j06859l79346K75811J93511
548B12945l84041M022L69906j73181k33134L04026P7738l26755P7238K41164k14758
559d4830j38036K53871k542k31744J18236J72819j63527n9663J93485j6611j69243
570h7785P1862J05139j27564o6302J36325R139j26213N0237J27532p8563q4161
581g0354J27973M6701j55174P671J54510q5633j33156J52530P8804j94803K4536
$$ y = [-220913, -269738, 232375, 42142, -331762, 103338, 283892, -226715, -119823, 343127, -20676, -309155, 186918, 192823, -306616, -30583, 336178, -116266, -220575, 296159, 121955, -308589, 80042, 279393, -237719, -192141, 265063, -37037, -322168, 145034, 215901, -229939, -22938, 323731, -53871, -195690, 229828, 122969, -256377, 19434, 212945, -171096, -167074, 202832, 29651, -203483, 100543, 178281, -148474, -71236, 169928, -44830, -182866, 71005, 68463, -163281, -45045, 127774, -35753, -95416, 98069, 81458, -87785, -15923, 89216, -38348, -104650, 31675, 40814, -85399, -35162, 92370, 13807, -70354, 57619, 104320, -50854, -43183, 111327, 25694, -107462, 45068, 123872, -70931, -46395]
592d6395K11134j29246j69365K13528M5942k88830O8922K45330k20323j50923
602b20226L17584L33l13384J89085K41346l15603o7808L65264j39189l13290L01065
613D5177J51249l83680P1290L82488k47901k28052L91537K5224m16162J82151
623b6679K99325l72135j31691M13601j14464l61868L18716K14360m06180L6624
633a30391M07658k49445k78455L84900N2946m24958J63674L22426l38432j28702
643b18779M11270p3797l38336K71477J92617l67242r226L30497j90556k40245
653b32320K90018O9560l09430R9582K55724k08937j19371K71477j3735k47601
663a45033J31473J60387k09397n4861K20347n0743j69384J40314J01975j66275
$$ y = [-46395, 164739, 35493, -133872, 79656, 125598, -163232, -94310, 151020, -69303, -220226, 97358, 97691, -215693, -26608, 214738, -100865, -168673, 196591, 57402, -255888, 45177, 196426, -187254, -115964, 266524, 18623, -209429, 182108, 207332, -208830, -26679, 272646, -99489, -231180, 182421, 67957, -293911, 24805, 239165, -167015, -130391, 277267, 27822, -250633, 134267, 187213, -237745, -74071, 248355, -90077, -218779, 192491, 118694, -219642, 51835, 244452, -122790, -132016, 198481, 7925, -232320, 57698, 127258, -182172, -82590, 173134, -35803, -155174, 116303, 102568, -145033, -13560, 146827, -62570, -117431, 102916, 52173, -117211, 23103, 125078, -41197]
673d1197j2712J54260o6884j25116J01460N9715j23239n503J16766k9989r0401
684f2840O8285P2302r0851m3407J03967m885j25577M4575J12169r9745o8803J58425
696F3615J2223j64240P7400J39896j60991p6971J99279l7531k04916J34682J39134
707A21580k10412k1686K49418q7397j93716K06151R5255k71175L3621K48823j78823
718h361j73182K70162L0753k90401J32037K39384k50755r7769L12519p2850k89274
729a97737K15107J59086l16114K156L12089j70201k13650K95377O6307l16388
739a63968J15322K59280k52109j25028L07967m4239k84409J90788J79002k78623
749i6017k6443K90372j23066k17943K33664Q7313k80710N2191K38873j78414j41084
$$ y = [-41197, -53909, 100351, 33467, -91649, 9811, 69526, -53713, -59216, 57550, 27561, -62840, 5445, 77747, -13104, -56511, 47456, 42571, -83006, -38431, 73738, -26007, -94810, 63615, 75838, -88402, -11002, 128894, -32097, -109068, 90211, 52680, -152236, -17554, 121580, -88832, -110518, 138900, 51503, -142213, 63938, 159193, -111982, -78361, 170462, -8361, -181543, 88619, 119372, -171029, -38992, 200392, -50363, -148132, 164387, 91537, -197737, 17370, 176456, -139658, -137502, 174587, 4386, -209264, 86113, 152420, -163968, -48646, 210634, -41475, -166503, 141464, 97225, -187184, 3604, 182606, -96017, -122460, 167912, 44846, -173097, 60567, 147880, -132830, -80639, 158234, -20180, -161264]
760a61264K47776J2044k41501J18170J74987k00467o4683K22856n4614j86776
770a33472J42449J06241j83991n366J81598p4108j27717J32236N6099j54360R057
781e1334J29674p7978r8151J10016M2910j21020J9045J19873n6942q1352R8130
792C2871L9178j18479O118J09097o2458q9608J00184M8854j18564J3516J27381
803H8090o0423r5199J09419M3706j46790J1254J31241r0841j04810J42870L6180
814F4697j61375N2149J55392j20983q7881J79664k265j89904R4817J39413j78292
825e4568n2845K08087n1395j80761J53147J10001k08887m50K08081j15208j58373
836a43171J90257N1121k22582O4832J94819j60297j03189K24667o335k17301J22957
$$ y = [-161264, 86512, 98556, -142945, -24775, 150212, -50255, -114938, 107918, 53304, -133472, 8977, 115218, -68773, -74139, 107459, 33351, -94366, 37870, 93969, -60391, -51334, 78340, 362, -97789, 12227, 55137, -65883, -46838, 73035, 16093, -65259, 32871, 72049, -46430, -40312, 68785, 6327, -83281, 16903, 65757, -52807, -39291, 88090, 27667, -67532, 41887, 85593, -61197, -49943, 81298, -9543, -114353, 28517, 64697, -96678, -44529, 110863, -10120, -98001, 81663, 79398, -110506, -15689, 123724, -54568, -107413, 100674, 49279, -131482, 21665, 131666, -77221, -77671, 130410, 15202, -143171, 47086, 98207, -124375, -59543, 135276, -25021, -128210, 96457, 90122, -127179, -4222]
847d222J52252k04180m8431K27097p0735j87360J73122R9499k20601J7061K07137
858A40639j33297j44928J92487L0124k18792P6878J71261j61476p7178K07820
868H3538j8792j80805J21420J18575j78425k9471J82690p0749j47282J42870P6069
879I9638j68815J9307J63834q8619j07987J38103K7260j58543L6228J19761j08826
890b8659p3478J36479P690j27303O4638J06897r7696m4961J21200j2136j15216
901f2545N8455P7317r9913l2653J11724j5486r9608O5149P3806r6444k9658J06226
913E6370k6137j05234O2724O6153j01985k3052J15890k8466r8151Q5112O8026
924G1250j14515p510J24525n1564j04376J06201N6774j34087J0905J33701p5303
$$ y = [-4222, 148030, -56150, -104581, 122516, 51781, -135579, 37543, 137042, -83559, -66498, 140639, 7342, -137586, 54901, 85025, -133767, -56889, 114372, -47104, -124282, 83538, 64746, -116059, 5361, 123936, -54489, -83960, 98730, 27981, -119301, 23569, 99638, -69177, -49870, 113964, 25345, -82642, 55461, 82721, -75822, -39594, 80167, -28659, -102137, 34342, 42032, -85271, -20633, 86264, -11432, -56393, 64807, 52671, -62545, -4090, 73227, -26686, -59339, 52385, 36899, -62709, 2440, 76246, -20198, -49856, 56370, 30233, -75001, -12277, 53876, -48109, -71161, 44729, 16263, -81888, 3224, 71250, -43265, -50775, 73750, 22186, -82190, 24011, 80785, -53302, -42397, 91304, 16001]
935A6001r5553J25000L3193j47157L6152J26444j08981q0053J52179K544j54643
946i4874Q1956J19411j41689m6653J67444m2226j50749J15067Q7062j66943j891
957g4085J70208q4241j23130J54506M9097j75693M4197J49588j28151r0406J68143
968F0033l926j67480R1856J23101j53514l3036J76797m8142j43280J26646P8264
979A07319j68748L646J56240r2666j10591J46202L1489j57998N3452J31260j15589
990a5984o3709J48115j2460j40818P9660Q9202j26858k7866J34361l8039j07605
1001h2001R4825N9569j13760N35J11525n5947q0265Q9049L1277j06878J3340R2408
1013E3677o0052o1554Q5986K4483r1415K2061P8291n5070m9152P8304J5550q1627
$$ y = [16001, -79552, 45448, 78641, -68516, -32364, 94080, -14901, -94954, 57225, 59769, -94874, -12918, 106493, -35196, -81849, 85595, 43369, -107380, 7687, 94749, -72194, -74085, 96123, 11882, -111248, 43258, 92355, -83338, -39141, 110447, -17704, -108110, 60033, 56107, -111373, -19517, 103584, -49930, -82966, 93831, 45689, -97591, 29055, 107319, -61429, -57783, 98457, 5791, -104800, 41402, 72891, -85107, -31655, 99605, -15984, -79693, 68422, 55962, -84856, -5196, 84006, -42852, -70718, 63643, 25604, -82001, 12824, 72393, -41367, -40832, 70693, 14746, -65519, 23530, 54807, -52071, -38731, 53677, -6375, -67929, 18057, 42540, -48875, -26814, 51477, -3593, -52745, 25559, 41109, -40518]
1025d0518K4048P1826n6623m7162P9479J3763q4146K3679P5950o1414n0190Q4678
1037C3370J0987r4330L4355Q1643p6213n0654J01687k541j09243N5726Q3360r9961
1049c1814l3523J21539k7753j09427R0458P0025j23478n062J30122o5973j03929
1060h8815J14123M2955j40035L0296J29136r6683p7636J41017P257j42493P1221
1071i657J08701j30256m3242J48650m1899j31798J10886P5711j48401O376J47613
1082I2684q0699j03398J37155K9339j49543M8336J17705j13943o1223J39987j3798
1093D2602j30449Q4540Q6098j23773j7935J29887m8707j01528J01630M8564j20531
1104d9602J2701J07932p0506p2383J03506J7300j07196L6652Q5027p7613m1646
$$ y = [-40518, -16470, 55356, -1267, -48429, 31050, 44813, -39333, -15654, 60296, -1118, -51308, 33370, 44357, -49973, -15618, 66025, -10188, -60842, 40845, 38304, -70939, -15213, 68147, -31814, -65337, 56202, 28449, -80978, 9480, 79505, -43973, -49035, 81087, 15114, -88815, 25308, 68263, -71772, -41476, 87660, -9023, -86659, 54358, 61615, -80878, -9657, 99044, -31212, -74454, 74196, 32297, -99501, 11385, 87096, -61305, -54929, 92684, 11985, -91413, 45742, 75081, -74462, -26126, 91579, -22364, -83587, 56400, 42602, -87847, -3307, 82791, -40982, -58917, 70970, 22263, -79265, 22365, 70929, -49602, -36901, 71031, 525, -71858, 31648, 48948, -58248, -21596, 63431, -14182, -55828]
1115e5828R4957n164q4553M5902N8882p3584k4311P6051j4112o6713M4180M6650
1127D2357n9014j5932O8117r971o0002L9116M3934n9012k1797O3727j1230o7102
1139d6809L9366M8373o0978k1231P6251j3769p1695N0721N1244p6864j5340Q6514
1151D5783l0367p6161O5363M5538q9291K283R8238m9870p3041R1599K8011j08742
1163e0657K7882R8329q0407o2401J13222r4j18573O0374Q5852j06562l0689J25086
1175F1362l6886j05676R3909N7970j24416R643J20963p3159q3238J14447K0869
1186E5788j26034M5178J03804r6835m9643J23952j4002j13277P4257P3847j10613
1197c3578j5304J14498m8919r2298R2403L9965j12064K0418J00782o8588n9645
$$ y = [-55828, 39129, 33965, -50588, -4686, 54196, -19388, -43699, 32352, 18240, -48473, -4293, 42357, -16657, -32589, 35528, 25557, -34445, 4671, 48605, -10407, -32204, 31523, 20293, -46809, -7443, 40930, -20048, -41279, 34972, 21203, -50492, 229, 51473, -25391, -40731, 45783, 15416, -60745, 4618, 50156, -39135, -36852, 61386, 11516, -61525, 30074, 58085, -50657, -22775, 75554, -4853, -67254, 45968, 45874, -72699, -12325, 73527, -33035, -63724, 61362, 24476, -81200, 12709, 70679, -53737, -44094, 76869, 3710, -79528, 34919, 55788, -70246, -25068, 78736, -18099, -67742, 56210, 42208, -71069, 3188, 77035, -33578, -48882, 65616, 16697, -75601, 16802, 56767, -55297, -34879, 65903, -2685, -62330]
1208f2330R9642R081r8853M3319P2255p8996l3565Q9795j5312q0316N2772N1405
1220D8897p3585j1956P7559k3829o0585N1372L3140o4944m731O3932k7317n2016
1232d4063M8919K6840n8057j098O1398k4128m6641M7193K6265n8289K86N8584
1244C7209k7523m9660M7153K4582o2017L562O3426l0604m9915O1207K3760p1920
1256c0740J3600O8733m6977m8687P3156J0578q4339L0596O9874o8836l6843Q9619
1268C9734q089q7715N4666O0514q9013j7534R6273l7035q0298P6588L7856r7895
1280e1948J2032R5242n9344n9474R6528J5104j01792M0678Q3401q2305l8836J01522
1292E0808j5249r5111O3771O0175r4904j0447R8392m0826p6468Q0288L2112r6896
$$ y = [-62330, 37312, 46393, -52460, -9141, 63114, -15882, -49447, 40348, 25036, -55280, -2508, 48897, -24688, -36644, 40915, 17086, -43499, 7873, 41013, -23931, -28662, 35270, 7953, -44063, 4856, 31696, -26361, -27459, 33939, 9811, -36830, 10363, 36628, -21661, -21375, 37209, 9686, -39974, 7179, 31761, -30256, -26694, 36732, 6128, -43787, 17420, 41180, -30740, -17140, 51593, 4616, -44071, 29085, 39663, -44676, -14080, 55794, -13042, -49885, 39734, 31645, -56070, -1404, 59110, -29903, -47437, 48836, 11801, -68497, 8091, 45947, -51948, -39916, 55326, -4018, -63492, 33036, 48140, -53652, -12974, 70427, -11878, -50714, 50808, 35559, -59552, 4219, 64394, -30510, -40957, 57435, 16609, -59859, 20429, 52541, -44355]
1304d4355J8621Q2675o3421n0690Q5630N326q5745L9104O4825o9045k7707Q3063
1316C8281j3588p0615M9862M3787o9766r906P1997k8097n8600N3121K7891o5947
1328c1580J924O2372l1925m3576N3929J8165n8364J2683N3267l5375l5207N0560
1340A6873J0296n4266J3348M8316l5069l0395N0682J1785n3334J6652M8701m0613
1352B976l1543N2011M927o0685K0790M6509m7646k7348O1884k448n9635L5365
1364d843M6002n7816j8978O7385j8147o2431M6917L6075o9897j566P3068l1086
1376D683n4293O5627K7215p5317J3815P0835n1997m3955P3029M794p8464L6301
1388g727O0510o6784k4654Q4014j6010p4511N4325M3410p9893n410P7583l7230
$$ y = [-44355, -25734, 56941, -6480, -57170, 28460, 33786, -51959, -12855, 51970, -17075, -44782, 38281, 24693, -45922, 3940, 47727, -22039, -31945, 40052, 11955, -46645, 6476, 34367, -31580, -29656, 32716, 791, -42785, 11144, 29309, -29055, -16372, 36895, 1520, -33687, 16873, 27169, -27097, -13749, 34567, -502, -30897, 19785, 31570, -21764, -5112, 43589, 2976, -28567, 23444, 28371, -32314, -11524, 34985, -12661, -40009, 21875, 19427, -40208, -4843, 41159, -16657, -35635, 31750, 13603, -48828, -1911, 34164, -35733, -37299, 35769, 4683, -49610, 16017, 43232, -32085, -18270, 52565, 568, -43387, 29642, 34436, -44028, -7727, 52783, -14001, -38655, 45359, 29349, -45162, 9163, 52573, -27320, -32730, 44853, 7623]
1400G623o1174O7190K5106p9848J8106O9798n2463m2033P3690L382p4331L3644
1412a1310N5852o0702k2193P3126j3332o3683M5021L9317o6512o979O5748k6959
1424G394n2967N3101K5978o1834Q448N8682l4642l8960N3909R252n8229J6636
1436a3232M6046l8757k5458N2856L696m8802K3458M1420m1565k1424M8925o493
1448B0670n0684K4109L3059m3819j5349M9705o803m3035L0574L2081m4076j1192
1460b4760M9378j5612m5012L3445K6065m7003l888N2431j8779l7980M4164K2111
1472C4560n2884N788N0744l2800m0089N0393J3343n8614J4588N2030m0465l0308
1484c3714N9849M87n9452K9646M4917n5802j9177O2743j4458n7523M5268L5844
$$ y = [7623, -53551, 13639, 38745, -41103, -22997, 46801, -5662, -47695, 25995, 29377, -44954, -11310, 44542, -16160, -38353, 34773, 21441, -42242, 2779, 42096, -24416, -31395, 34353, 7394, -45573, 7528, 33506, -28328, -19880, 38802, 4160, -34800, 19109, 28361, -29868, -13232, 32814, -5943, -31401, 21455, 25151, -23651, -193, 41227, -338, -21762, 27163, 20670, -30014, -5905, 27154, -16665, -32014, 17691, 10888, -32147, -1573, 30508, -13568, -24760, 24618, 9006, -36006, -2561, 23504, -23499, -27387, 25044, 6265, -31715, 12449, 34560, -18324, -12536, 38208, 5408, -34681, 15712, 29055, -29559, -14971, 37059, -3406, -33714, 26135, 26622, -32830, -3184, 41733, -14069, -33246, 29497, 15039, -42484, 2784, 38628]
1496C8628o3531l172O5749l2351m9125N6970K0051o6372J4046N9099m4612l4805
1508c9425O3722L411o4132L0232M8750n7177k0933O4870j4116n5153M2817L5851
1520C8717n9701k533O1299k7479m6700N1394J8244o1929J0341N1421l8939l1234
1532c7099N3664O376n1686K4117M0484m1666k0148M9680o797m7617K6794L1207
1544B7309m4050r461M6873j0822l6350L2570K5560m3520l146M0895j9184l4269
1556b7595L3033J5201m1000K820L9006j9891k7651L6264J3498l9671O837L5326
1568B6177k4641k7037L5077J0667m0740Q798L6937k7235k3611M0371O295m4500
1580b3442J7019L7154l6872k1002M5414k727m4655K6071L3218m3413j1774M9662
$$ y = [38628, -24903, -28075, 37674, 5323, -43802, 13168, 33219, -33153, -19107, 39992, -4620, -39425, 24297, 27708, -36424, -6192, 42558, -14619, -35552, 29318, 15202, -39951, 2866, 38717, -20984, -23517, 37782, 10303, -36397, 14997, 33241, -28688, -18347, 33074, -5865, -37099, 16565, 22941, -28745, -4628, 35856, -5810, -25958, 23722, 16925, -30692, -3898, 27309, -16741, -26202, 20671, 9849, -26501, 6069, 31629, -11891, -15037, 25858, 6674, -27595, 5438, 20639, -20361, -17541, 21465, 1574, -26077, 10187, 23685, -15986, -9149, 26177, 1536, -25501, 9576, 20243, -20497, -11699, 25238, -1997, -25608, 14763, 21058, -23442, -6423, 30731, -6141, -27143, 18271, 15544, -29111, -3040, 30178, -13235, -25009, 24653]
1592B4653j3150m6046L6783K6729n0108L83N1435k4954l8377M6964J6212n4414
1604b3890J1274M8978l8476l2868N4020K557n6371K9974M3595m8950j6342N8635
1616C2136j4324n2127L9131K7909n6687j440N5302l1375l9111N0935J6696n5217
1628b8172J7143M8463l9707k8493N0551p84n2348K5786L6536m2848j4071N1148
1640B3204j1001l8960L4447K5603m5967p21M1686k2886l4129L7074J2801m1748
1652b0597R440L5529k4373k2034L4774M287l6055J2515K7990k7122j6175L0919
1664I098K161l0549J3714K6666k4003j3497K8638J098k9366J2369K4199k4652
1676d124j1780L0252j956k9668J5817K3363k7734j2344L2592p218l3027K0224
$$ y = [24653, 11503, -34543, 2240, 28969, -21139, -20756, 30679, 5725, -32652, 14312, 30524, -23890, -12616, 36362, -2114, -34982, 19038, 21595, -34776, -4802, 38793, -10157, -26499, 32136, 17812, -34315, 4816, 32725, -23962, -25402, 29900, -1475, -40586, 10349, 27045, -28172, -11029, 37434, -2273, -30766, 19785, 19001, -33347, -7561, 28975, -13873, -27944, 23204, 12203, -26757, 7690, 33293, -12674, -13395, 28291, 5405, -28724, 8350, 21151, -20597, -11157, 24372, -1, -22035, 12739, 17026, -19029, -6514, 21476, -5646, -21821, 9098, 11259, -19290, -5576, 21090, -2913, -16410, 12228, 13326, -16040, -3671, 20528, -4124, -15904, 14348, 12392, -17276, -1459, 21904, -5830, -18174, 14418, 7200, -25827, -5603]
1688e603K3685l2526p045M0128j0227l1418K8309J9327l8866j828M1381k0835
1700D482l3425L7429J4766m4749J0986M4370l0115k5943M6782J223n0573J9955
1712d812L5648m4989j6156N1359j2765m4426L6659K8466m8046L44M9917k5855
1724E344l7571M3191J1866n1937J5279M3174l7644k1046N0713k180m6492K7949
1736F46L4438m5057j0939M7545j7796l9993L4902J9644m4566N480M2969k6206
1748A067k6562L8730O282m1794J6259K9652k9397j5192L6280k264l1516J8668
1760B13K3743k8550q685L0479q900k5355J7034J6312k6744k358K7815r719k0087
1773a4802J7113J2427k3403l706K1573q818j9482J4531J3526j9848k449K4556
$$ y = [-5603, 18082, -14444, -21489, 18639, 8412, -23006, 5303, 24630, -14236, -16064, 25317, 4482, -28943, 8486, 23252, -21497, -10511, 33859, 3744, -22199, 24583, 25806, -24767, -4812, 30836, -14153, -30309, 21050, 8285, -36141, 518, 28984, -19062, -18718, 31199, 5344, -32227, 10964, 22830, -29107, -13828, 29346, -8298, -29344, 21369, 19189, -27303, 646, 35084, -9973, -20912, 26633, 8837, -31156, 3746, 23390, -21176, -15696, 27273, 1067, -25495, 13235, 19517, -22277, -6018, 23634, -5763, -20955, 15325, 13061, -18455, 213, 23956, -4594, -13279, 17200, 8300, -17055, -21, 16291, -10453, -12811, 15004, 5285, -14802, 2311, 14738, -8665, -12371, 9202, 384, -19098, -4567, 8959, -10889, -13338, 11218]
1785A1218o152j8533J7194J3460k4024l445K5013r783k4472K1520J4384k7634
1797a1254J998L1705j3791k3578K8906J0049l6691N832L0522k7157k1208L5472
1809A0805J702l7216J8414L0474l2697j1913M1760r377l8160K7560K1404m3585
1821b0829j179M2536k0515l0735M0351J3193m4979J4198L7667l2090k2079M3627
1833A9166k875m4076K5671K9401m1103p185M5260j5500l4388L3397J6768m1786
1845a7250M746L8506k6386k3387L7072N754l9270J6487K9328l0721j2525L4977
1857A7331p073l1360K0727J9259l0837k232L0514j1701k3253K3094J0971k7631
1869a2191R35K4150j5512j7558K2258M977k2000P187J9882j1813j0050J7126L566
$$ y = [11218, 5066, -13467, 3727, 17187, -6837, -10282, 14731, 4948, -19524, 1996, 16380, -11254, -9256, 22449, 8658, -14920, 13986, 24035, -12656, -6824, 23698, -3459, -24667, 10805, 12507, -24709, -6295, 24179, -8518, -20431, 21329, 11952, -26208, 1352, 22756, -20829, -22008, 20528, 13, -30722, 9629, 22822, -22157, -7959, 29708, -2382, -24461, 19166, 16291, -27785, -2114, 27287, -13816, -21001, 24259, 8759, -25629, 7768, 24536, -17250, -12504, 26002, -384, -23771, 13301, 19055, -20215, -3728, 25600, -5121, -17646, 17331, 10258, -21102, -375, 18884, -11953, -14185, 16329, 4628, -18625, 4469, 15440, -12191, -11256, 12894, -2618, -20176, 2082, 7059, -14941, -7754, 12128, 315, -9735, 7391, 10957]
1882A0957j8063L966J4620j2215j1237J5996L747j5626M558J7957r012j2477J5944
1895I115N094k1599K592J6887j2381j5113J8885N702k3694P583K2872j7498j2886
1908a4441K5858M7k8762J2764K0302k4917r345L0413m784k9433K2577J8983l0603
1921a1341j232L4429j5606k7296K9715J0705l6022P568L3381k5991j9256L6995
1933A6049q09l6928J9991K6341l3909q986L7858j1297l2560L0021J6776l8109
1945a5562K119L6465k3269k3136L4308M582l7365J5516K7768k8952j0718L5744
1957A7500n831l1286K1934J8282l1835l078L0289j4361k3191K6697R659k9916
1969a5137P796K4757j8086j3142K4848M19k5214R882J6726j7915q060K1879l424
$$ y = [10957, -7106, -3140, 11480, -735, -11972, 4024, 7771, -7855, -3297, 14660, 5648, -6829, 9115, 14209, -7390, -4798, 12089, -292, -15405, 3480, 9182, -14512, -6929, 15943, -1555, -14441, 11417, 11464, -17298, -4534, 15768, -9149, -18494, 11919, 7135, -22298, 279, 19262, -11341, -12573, 21856, 6250, -21046, 8669, 19374, -16648, -9080, 24301, -1690, -20946, 16049, 15240, -21688, -1697, 24644, -9265, -18251, 19607, 8310, -24250, 5771, 22547, -15562, -13443, 23022, -247, -23383, 10925, 15507, -21858, -6342, 21426, -7526, -18244, 17500, 11669, -19617, 2317, 20599, -11236, -14314, 15975, 1614, -21577, 5120, 14779, -15137, -7341, 17416, -670, -13812, 11036, 11455, -13759, -3877, 12849, -5066, -13126, 8753, 5329]
1982E329j7826J2857J2624j6103l277J6147l490j5073R327P725j3518l373J3888
1995E237l380j1544Q896R404j2211k590J2262j114j4193P464J1600j3871n404
2008i444J5068q35j4669Q573J3679j4752o236J9504m511j8053J3292J2773k1420
2021g031j743K4374j1990j9056K0065R242k7150M424K4488j7829j6293K6667M295
2034A2463k9234J2708K3769k5212r590K9919p832k8380K2310J5679l0554J179
2046a2775L0414j5178k1317K8435R105l4240R946K7672k5778j5912L2332j696
2058A1008l2530K0908K1944l1314j252L0642j3388k3111K5222Q209l0153M831
2070h984K5264k0215j5975K7150K564k5967J3403J8887k1118p108K4087n763k0919
$$ y = [5329, -12497, 360, 12984, -3119, -6396, 9751, 6261, -8812, 515, 8240, -5278, -8651, 5237, 1857, -9687, -791, 8613, -3598, -6188, 6074, 4960, -9233, -1769, 9831, -4040, -9444, 5624, 4789, -9880, -1307, 12372, -2380, -8616, 10888, 6377, -11676, 1616, 14389, -7031, -8774, 15600, 3610, -15446, 4619, 13861, -13289, -8865, 15623, -2206, -18499, 8168, 12463, -16771, -4063, 19706, -5506, -15096, 14823, 6991, -21389, 921, 16600, -13954, -12775, 17639, 2461, -18856, 9579, 18684, -15556, -5610, 22062, -3716, -19628, 12704, 11008, -21522, -614, 21330, -9984, -11236, 19406, 6018, -17093, 8129, 16338, -13815, -8984, 16280, -3935, -19910, 7240, 9804, -16163, -2760, 16127, -4991, -12099, 11988, 6225, -14694]
2083a4694J6650J0408k0646q78J8696p599j3695J7243N313j6618K809J2304q804
2096D89r427J3155K271j2403K839R105o414o770J0176K854j0647K430Q142n187
2110F13o824P453M240q917n17J1352l641j0605Q571N909j2769J00J2967p043j0197
2125i308J1938N673j5973K608J6523j0188j2650J7412J502k0682O681J7155j4621
2138c930q940K2327j937k0670J4236J5360k2264l126K5205j0927k1551K1559Q842
2151A4184k6702N242K4461j7236j5545K6338J703k7120J3815J9362k5982o993
2163a4473K8310r516k4759K2183J2671k7755K670K7498j6289j7309K6913K095
2175A2239k7060J1511K0553k2144r949K6906n937k2103J7871J3261k3890J140
$$ y = [-14694, 1956, 12364, -8282, -9160, 9536, 1937, -11758, 5485, 10798, -5820, -3011, 9293, 489, -8938, 4217, 6488, -5915, -3076, 6029, -385, -7155, 3021, 5875, -4772, -2342, 5800, 613, -6211, 1242, 5482, -3435, -3952, 7400, 3759, -6846, 1725, 7634, -5135, -5035, 7932, 889, -9308, 2630, 8303, -7670, -5062, 11461, 1273, -11377, 6035, 7537, -13145, -6464, 10691, -3930, -12870, 9457, 7520, -13150, 1086, 16446, -5818, -8944, 16261, 5334, -16217, 5342, 14184, -12518, -7276, 17185, -51, -15596, 10742, 12445, -14675, -860, 18502, -7480, -14473, 13837, 4321, -20438, 1745, 14416, -13339, -10669, 16829, 540, -16769, 10144, 12239, -14821, -3310, 17243, -4901, -14850, 12056, 6119, -15984, 1887, 15148, -8742, -7602]
2187g602K1803j2588j4545J7900N422k1792P550J5783j5216q179J7543n99j5941
2200a0461R707J0233j2521l651J3823l563j0803R441N602j1116O07Q461l802q237
2214f280P585L336o673l74N875j687n290L634L988m812l514N702l71p134J553
2229d462Q320o712m756R757K586j0408K786J1370q828n749J2873l70j5130P609
2243a114J2248j5651m528J8834n160j6800J4671R864j9472J289J9245j2541j4615
2256a3730K0175L597k3145P729J8063j7931q794K3921k238k2740J6330J4702k4695
2269h756J55K4020j3419j7724K2040N240k5468P981K1016j9749r966K5470k833
2282H007k2519J4615J4434k2572k363K3490j2319j5792J8815N826k0682O266J8880
$$ y = [-7602, 14201, 1613, -12932, 4968, 10390, -11402, -3852, 11931, -3285, -11464, 6079, 5480, -10461, -754, 9479, -3042, -6693, 7130, 3567, -7236, 2205, 7807, -3309, -2702, 5759, 1957, -6280, 1305, 4641, -2032, -2406, 3469, 1782, -3508, 126, 4114, -698, -4212, 1490, 1119, -6015, -4462, 3858, -2854, -7610, 2147, 4733, -5675, -2889, 8481, -347, -6096, 6777, 6407, -8723, -1114, 11134, -4517, -9045, 9789, 4629, -12171, 2500, 12364, -7108, -5819, 13426, 885, -13730, 6445, 10042, -13103, -5374, 12689, -5242, -14036, 9885, 7647, -15093, 1237, 15939, -8756, -8601, 15419, 2000, -15724, 6316, 11556, -13912, -5931, 15085, -4664, -14630, 10840, 8007, -14512, 103, 14537, -8035, -10398, 13092, 773, -15019, 3796, 9622, -11060, -4794, 14086]
2295A4086j4964r344J9813j403j8274J1196J1178j7792j881J5757o724j2525J4100
2308C223O215j6087K914J2144q202o355R491P96j1419N550O215p424k635P640
2322B066n53n984K433N061l646j485L617J062m661J223M526k140m720M126M132
2337E057o809j832O314l52p456M631O506p279l054R819j808r091O222P072j3297
2352e357m01J2624n170j2441J3284N029j6562M574J5847j2053q806J7332j718
2365F182j7160Q614J2409j7371k938K0032p190j5602J6752P579k0984N083K0133
2378A5539j6515j1443J9967N83k1970J0859J5578j9905k631K1663o558j8071J6983
2391D079R790k1620K609J8680j4935j1078J8706J295k0343J0371J4242j6026m677
$$ y = [14086, -878, -10222, 9591, 8188, -10086, 1110, 12288, -5504, -7385, 8372, 1648, -10877, 3223, 9438, -6649, -3735, 8409, 207, -6148, 3343, 4139, -7280, -1730, 4485, -2939, -5574, 2066, 1513, -4471, -2038, 3023, -623, -2108, 1509, 2571, -2090, -867, 3659, 1519, -3201, 925, 5057, -1752, -3584, 2730, 2378, -5078, -447, 6059, -1220, -4274, 5545, 3737, -5354, 868, 7940, -5357, -5758, 6866, 1696, -10745, 2539, 7568, -8994, -4420, 11427, -626, -9432, 7900, 6182, -10978, -2364, 10045, -7326, -10264, 9768, 2578, -13024, 3728, 11307, -9677, -4594, 15539, -976, -12419, 7548, 8131, -13839, -2980, 12598, -7307, -9938, 11725, 5167, -12904, 4079, 13869, -7751, -5142, 13538, -1397, -12475, 6231, 7526, -12817, -2446, 11796, -4230, -8907]
2404h907J8791n616j5511J3874O813j7769K759J4980r222r493J3688K504j5845
2417h954Q175P716r646l059J1165j941j0178Q417M676r334o03Q830m596m476M591
2432G83J844n316M25M352j593k519L035K699l634j056J728K408n951J104M203
2447B512k279l628L007L117n461K391N113k792n753O048K423r251R12R285p381
2462a737n855J0506J567j0928O491R398j1925k105J2578l854j2895R836N946j3421
2476f398l89J4899p387j0108J5153J809j6621O728J3561j4303o283J6678k923
2489D416j6579J2361R307j6582j19J7567r044j2537J6078M006j8007N618J4587
2502A1072j3566p138J7865l583j5454J1249J0534j6711n87J5210q632j0289J4306
$$ y = [-8907, 9884, 4268, -11243, 2631, 9444, -8325, -5566, 9414, 192, -9301, 4387, 6891, -8954, -779, 6937, -2709, -5768, 5397, 3456, -6722, 1695, 6371, -2963, -3566, 5264, 668, -3808, 783, 2627, -2689, -2264, 2088, 495, -2024, 1011, 3710, 76, -980, 748, 3156, -2795, -1691, 2512, 233, -3395, -388, 2729, -2732, -341, 4772, 1980, -3773, 2275, 4698, -4553, -3641, 5644, -1737, -7592, 2914, 4481, -6447, 44, 9442, -2483, -4588, 7990, 4136, -8759, 1077, 7023, -6398, -6787, 8112, 725, -9383, 5770, 7579, -9042, -2314, 11247, -3056, -9339, 7339, 4416, -12163, 198, 9505, -7077, -7196, 10371, 1327, -11210, 4868, 8874, -9133, -3515, 11072, -2494, -9632, 8233, 4650, -10804, 445, 10979, -5732, -6319, 8891, 259, -10030, 4276]
2515D276L481j5784M536J2370j0891m622J3885k616j2272P830O073j1943m48J1153
2529E028l558p746R501M531j0232P06P746n656o260P378N11p825L755M534l131
2544g18k550M801K733n052R68L208l420k125J350J601l203L70K263J906l456J370
2560D6M445k685k535M210l83o457J408M905n891k810R804j013p347N386M098q196
2576c015j174R530l657q723Q859K948j1383K994J1302q082p035J3630j530j3050
2590h386P804Q670j2238k301J5484n775j1711J2480M928j5982M220J2835j0437
2603d09q282J3220J93j4635P959J1388j3414k612J5954n417j1720J0475O196j6462
2617g566J817J3505r713r003J5111R88j2687O922J1653j2526k894J2284o412j0235
$$ y = [4276, 7757, -8027, -3491, 8879, -2012, -6634, 7251, 4635, -7637, 193, 6266, -5677, -6125, 5028, 1470, -6276, 3225, 7756, -2476, -1770, 5976, 320, -5940, 1438, 1949, -5876, -2121, 2413, -718, -3268, 1533, 4266, -786, 182, 3390, -30, -2155, -805, 796, -2407, -2037, 226, 2132, -1324, 46, 4491, 1806, -729, 3481, 3098, -3359, -1951, 2954, -2937, -5747, 4057, 3044, -4303, 1083, 5181, -3015, -4189, 5341, 1684, -7039, 1820, 4768, -6615, -3621, 7681, -401, -7436, 6194, 4664, -8386, -582, 8088, -4150, -6451, 9033, 3258, -8453, 4027, 8955, -7027, -2807, 10028, -409, -8691, 4529, 4722, -9913, -1954, 9434, -3980, -6592, 9362, 3945, -7775, 2700, 8896, -7566, -5749, 7756, -1957, -10960, 4151, 5139, -7548, -626, 11027, -1499, -4393, 7891, 1479, -8756]
2631h756Q768N120j1995K204J0649o173n586J0123J245r648M336O753r429l459
2645e848P578j517n926M456M562n237M43O072k161l336K809J661n315Q3J839p96
2661f33k453K948J791j461p70J428Q50k345m24K296j205l407L455J736l267j571
2677c032N953j848m762N066L510r310J263O388m028m052P635J832q880M100P869
2692G704p815l319Q039j894r592N884M984j0734J48J2971m641p201J0936K224
2706G694j3551M752R162j1465n355J3870l649j1717J0250P662j1701K82J4127
2719A0361p324r570J0857J261j3254K716J0346q273o205J3978o70j0466Q297P191
2733I245j2270K5J0749o809r538R949K418j0383L533J0510q265l635J0391k040
$$ y = [-8756, 12, 5132, -6863, -4659, 5990, -183, -5769, 4354, 5599, -4049, 287, 7040, -2389, -5848, 1730, 213, -5713, -1257, 3305, -1932, -1489, 4583, 2422, -914, 1895, 3556, -1759, -1676, 163, -633, -3086, -138, 1653, 192, -578, 850, 1700, -645, -1069, 1227, 22, -3385, 70, 1806, -1461, -3032, 2921, 1073, -3689, 1377, 4887, -4423, -3160, 3228, -800, -4852, 2783, 4615, -4265, -165, 7704, -111, -3430, 4609, 2715, -6877, -993, 3991, -6743, -6595, 6376, 1735, -5466, 5470, 7694, -5857, -1105, 8057, -3408, -8763, 5107, 1458, -10259, -9, 7653, -4048, -3766, 10361, 3037, -6533, 4324, 5585, -7669, -4953, 5393, -2880, -9085, 4893, 4223, -6243, 2054, 9245, -3025, -3000, 7749, 940, -8598, 1351, 3769, -6614, -3081, 7429, -836, -4471, 5920, 3880]
2747C880q716N566M458q826m01P150l175o117P153L219n996J557M569m119k946
2762b744N057q31n346K529J996k082m22L273L08k325L27K330k077j420o49J228
2778h48o51o25L044Q10k621J993J783j788k199K776N0n213R2N062l435k265O448
2795B413on236M698M434p817j673P328l499p646O726L538r257L063Q530n602m854
2811d860J1857j425j0760N448N751q919l696J1037m514p991Q991N718j0778K272
2825a869J0495q339o669J1666k478j0173N740O678r404j985J2785l284r502R631
2839C292L823j1218J354R116q405n350J1343r05r277O037P390q276j858Q335l269
2854B132q881O918L491q772K049P252m142l665P643O01o180J939L140n438k099
$$ y = [3880, -4836, 730, 5188, -3638, -4039, 3111, -64, -6181, 972, 4191, -1805, -248, 4321, 202, -2744, 2313, 1482, -3864, -1335, 661, -1421, -1843, 1430, 1738, -587, -260, 2070, -7, -1427, -2076, -848, -1499, -2124, 920, 1730, -891, 1102, 2885, 1097, -1102, 1674, 1724, -3489, -3397, 1665, -1770, -4035, 2413, 2407, -2829, 1869, 6303, -1514, -3187, 4141, 642, -7004, -278, 3260, -5997, -2934, 5596, -6, -4860, 6997, 5572, -5188, 260, 6011, -2908, -6604, 4433, -81, -8072, 919, 6637, -4141, -1869, 8626, 287, -6382, 5284, 2806, -7367, -1627, 5051, -4353, -6338, 6447, 3163, -6339, 3292, 7115, -4103, -2749, 6367, -2038, -7388, 3955, 3050, -6227, -190, 7200, -1076, -2934, 5401, 2132, -6749, 169, 3660, -5112, -3063, 4189, 47, -3618, 4025, 4626, -1554, 385, 3525, -1913, -4012]
2869d012N147j494l315M028K285l581O73M201k492j770J492k81k659k68O22o4
2885a488p29J796J856J10r01J514N46k131j700R81m31l991J899L046k000j258
2901b881P134o72n732M774Q91n422J2M970m936m267P260J47n350L773N096l713
2917A084l732Q200k332q322N574K481p800L88Q812n382m687Q896K047j0102M599
2932b76O639p973m100Q462j580q434O449O878j0044L47J0477n815o011P851J013
2947C883j0357L941P272p968k121J0140j282p355N919N146r371K10O695m583p130
2962f961Q370O98o765K180P580m844k461O500r42o134L015J844m972p89M283j888
2978a286k657N660J544l908J892K400j764l070K973j156l722J061P10k51l9L364
$$ y = [-4012, 1135, -359, -3674, 354, 2639, -942, -269, 3932, 1440, -330, 1162, 881, -1778, -2046, -1424, -1488, -2217, -421, 1435, 1545, 644, 2158, 2704, 573, -1127, -146, -577, -4568, -2669, 377, -1623, -2881, 4253, 3581, -2151, 2623, 3514, -1908, -1896, 3074, -1862, -6129, 1131, 1278, -4072, -299, 4797, 1084, -2648, 5552, 3220, -5102, 472, 2953, -4847, -4459, 4353, -1029, -5716, 3180, 5227, -4875, -276, 6363, -1610, -5710, 2752, 1172, -7262, -813, 6065, -3979, -3632, 6845, 1030, -4981, 2870, 3883, -6474, -2533, 4739, -3229, -5350, 4790, 3508, -3847, 2072, 7218, -2153, -1943, 4752, 169, -6961, 1409, 2107, -4658, -2478, 5102, 258, -2203, 4297, 3355, -2779, 236, 2080, -2892, -3681, 602, -1286, -3943, 1717, 3261, -647, 1245, 3645, 1881, -1189, 1784, 628, -3094, -2033, -1323, -1574, -1613, 1751]
2994A751J03j99m41L94O90l028j181J459p68j190Q54J680j157J178K703o68k391
3011b11K689Q49o072J606L421l107l345O158o1m302K217N312o360j124M833l255
3027g52n290N726J839o194J991P033m194l380P017k49o709K681M449p268r02Q193
3043C991m153m851P092L166q462K694P526o640m311O634p67r506M751N724o358
3058c470J058P674l006n091O783J875r195J537O771o129m479N725K045n601L827
3073C24M632n628M3N774k856n005L096J323m846l10M948l367j218M910k62j571
3089a3J079J894k775j887K532q00k968O53K701j479O53J870M90j126J525q66j569
3106h6n66K10L2j169L76K027Q00j526P51N63L6k106J635j418l272K347K107k103
$$ y = [1751, 1854, 1655, 1214, 1608, 2298, -730, -1911, -452, -1220, -2410, -1556, 124, -1033, 145, 2848, 2180, -211, 2478, 3327, -2745, -1139, 2282, -825, -4170, 1988, 1927, -2375, -158, 5154, -1206, -2330, 2503, -752, -6042, -316, 1523, -4671, -2680, 4353, 159, -3221, 3796, 3547, -3162, -481, 3968, -3300, -4202, 3991, -162, -5013, 2079, 5245, -3217, -523, 7003, 363, -3948, 2686, 1919, -7587, -2836, 2888, -3470, -2412, 5262, 2256, -2835, 3948, 5823, -3372, -1835, 4936, -1193, -5672, 53, 2098, -3503, 324, 4956, -672, -629, 5145, 2289, -2716, 380, 1703, -3143, -3453, 1495, -1872, -3090, 1820, 1558, -13, 1066, 2960, 185, -1702, 830, 30, -2938, -2285, 416, -1063, -410, 1460, 1950, 824, 2349, 1483, -86, -652, -442, -410, -1579, -1203, 824, 1624, 98, 849, 1412, 1448, -658, 977, -441, -3713, -1366, 741, -1362]
3124a362J1L508k0k984K704R74m260n34L302k913k695M568J467m696K535M955
3140D560m714j666O932k894n673L707J607n927O13O553k799l689O670J890q457
3155c287M477M094o361k869O469k997n550N371M149o805R12Q482m076l753O051
3170D307k13p699K227L939n345k823P355j386m291M998L730m426j134M643m213
3185c31l510N481p47m308J566N124m458p55N094m68m328K808J137l540q6K313
3201I92j903j609K028K052j658K93K348k129j091R88p43j612P44P62M66m84N45
3218a1J585J02o62m39J010k586j565J827o67j66P62K272j696M36K500j734j222
3235b54K845p60l878M55K315k408k576N039L47k833K919L650m230j396M829l794
$$ y = [-1362, -1351, 2157, 2137, -847, 1857, 2831, -1429, -1963, 1339, -1574, -4269, 299, 1766, -2930, -395, 4560, -154, -1820, 5112, 2218, -3455, 252, 1859, -4068, -3455, 3098, 299, -3390, 3280, 5170, -3287, 1190, 5284, -1077, -3946, 2523, -474, -6024, -653, 3496, -3309, -2397, 6085, 2009, -1744, 4307, 4094, -3605, -1378, 2561, -2784, -5607, 1748, 362, -3929, 1069, 4799, 373, -761, 3882, -331, -3841, 1640, 893, -3415, -1849, 3275, -1183, -1938, 3156, 2688, -1640, 1168, 2305, -1235, -1321, 992, -911, -2520, -492, 1560, -98, 195, 2543, 414, -677, 311, -432, -2044, -1300, -538, -72, -556, -11, 1574, 1676, 1014, 575, 1585, -1001, -2566, -739, -1406, -1572, -810, 1462, -234, 202, 2702, 968, -254, 2591, 1831, -2047, -1592, 723, -1685, -4261, 778, 1125, -1708, 1211, 4861, 631, -765, 4064, 270]
3251B70m700L586K108o331K621N240l108j958O009N42o769M602J714o469o10N801
3267B548l480l591O472J452o647L174N020m691k213N028j345p155M723L222n361
3282b844k57P014l364k590M331J132n557J664L820m682k365M895j797k938L590
3297E2L542m999J425M028l706k753K516J055m075N53K605j260L36K884m44r45
3313H14P41R98k856j419K108k016j581K989N18l62O37J937o9p23K06j210k74j851
3331a413r79J340j444J33J919J867j451N38K070q22k459J686j152k759P95K397
3347B66k455m69M081l51k408L887J362m445N50K819k785m393N157K96m316J839
3363a365M787l135j515O051l215l664K656J224m664k50N814l255k667O237m75
$$ y = [270, -4430, -844, 1264, -5067, -2446, 2794, -314, -2272, 3737, 4279, -2490, 2112, 3826, -2643, -3253, 2548, -932, -4523, 1949, 3401, -3246, -72, 4948, 257, -1956, 3072, 1727, -5428, -705, 2517, -2844, -3101, 3913, 549, -2041, 2290, 3422, -2135, -471, 3349, -1333, -3698, 1197, -600, -3538, 52, 3594, -1405, 20, 4048, 342, -2411, 105, 1160, -2915, -2362, 243, -1017, -681, 2203, 1759, 814, 1555, 2553, -303, -1722, 386, -1630, -3211, -222, 296, -66, 571, 2508, 2439, 1716, 1922, 712, 438, -1413, -2392, -1052, -2496, -2363, -444, 1423, -28, 510, 2580, 1758, -701, 985, -167, -2926, -2131, 266, -2189, -2658, 1423, 1072, -1336, 2551, 3913, -532, 18, 2837, 52, -4341, 816, 1112, -3204, -1365, 3422, 287, -1228, 4823, 1608, -2056, 600, 1824, -2840, -3090, 2724, -531, -3198, 3039, 2564]
3378B564n378L481M052n199j600M780k998m136M590J177m049J777N341m100k069
3393a767N035k190m430O66L899l941n45N269j419k523M161J665m445K565J262
3408C262l174l446M158j429k519J616L000j170N9K651j689l58Q37m97k339r3L80
3425g51r75J75R81M19q48K674o07J261j261M07j191q35r55P81Q2O8J97K1J234
3444H77q53J751L37j917j379J467M52k849J534J275j769Q6K711j054k337L850
3460B182N88n246J098L100l911N2K075J455l246K734K882l963LL797m155l491
3476d046M880J08m139J010N407m509j118N138j064k667K401J251n187j62L680
3491I83j798k932M478J717m488K561L965m035j803L362o70m413J820J890l886
$$ y = [2564, -2814, 667, 4719, -480, -2080, 2700, -298, -4434, 156, 1333, -2716, -939, 4402, 302, -1767, 3268, 1078, -3352, -2686, 1213, -2728, -3273, 1996, 577, -1946, 2215, 3880, -565, 2000, 3262, 88, -3358, 800, -629, -3148, -1532, 1468, 298, 357, 3008, 1319, 961, 1798, 1301, -1038, -1131, -751, -1726, -1551, -570, -151, -999, 1675, 1068, 2329, 1068, 1475, 284, -551, -1506, -725, -643, -575, -378, -357, 877, 24, 1775, 2112, 195, -1184, 283, 735, -2114, -580, 695, -1074, -988, 1723, 669, -1668, 2182, 2770, -2476, -1378, 1722, -2189, -2137, -62, 1393, -1853, 881, 3763, -200, -197, 3600, -555, -4046, 834, 942, -3197, -2187, 3220, -1289, -2407, 2731, 1667, -1000, 1401, 2652, -2535, -2697, 983, -815, -3747, 731, 2448, -2040, 521, 4486, 451, -1352, 2010, 1340, -3073, -1253, 637, -3249]
3506c249J820L557j923j821M617L04m188J040J674l044j790L157o09k364K926
3521A07J940k472J59L560j877j838K874k112j869j08N42m81L45J694Pj626J790
3538F35M4n02l27p50m0n43P48o8R15k58l52O77K014j675p89J400k491J084R45
3557F67j062j951J837J387L5j652K826j100j549K417p16l310Q21K559l343j75
3573b309L947n46k548L255K402n536J062L118m309k663M312M62l755K105M642
3588C639l873m85M693j184m358L079m67l985Q54L766l686r57N335j009k627J182
3604h3K816k841j908M265k637l652L619K205l970J177L414k681n66K391n9l814
3620b324J916K317k675q72K625j680o43J421J334j348J81K514k941j187K385j699
$$ y = [-3249, -1429, 2128, 205, -1616, 3001, 3305, -883, 157, 1831, -1213, -3003, 154, -455, -2819, 107, 2047, -425, -266, 3294, 1417, -421, 2453, 341, -1528, -1636, -1094, -1575, -1230, 464, 471, -1155, 635, 679, 177, -150, -900, -940, -1483, -735, -803, 112, -146, -498, 179, 2193, 518, -271, 1129, -1362, -278, 667, -395, -2346, -509, 878, 913, -739, 2087, 987, -562, 1855, 1139, -2171, -1350, 1209, -2134, -2309, 1638, 1092, -1456, 1799, 4201, -1335, -273, 2845, -1464, -4127, 185, 647, -3108, -1003, 3639, -234, -719, 3974, 2790, -1568, 1511, 1044, -2941, -2087, 1679, -2007, -2964, 2371, 1362, -1265, -83, 2733, -108, -2016, 2249, -388, -4040, -421, 1784, -2186, -1009, 2405, -276, -842, 1549, 1490, -2324, -408, 1909, -766, -1638, 987, -693, -1336, 85, 1419, 71, 252, 2766, -175, -1362, 1023, -676]
3636f76k143K642Q65j943J893J210j369j70J039q94j398J043j309K41o4N89N94
3653A50j66k9J536j335N93r28R4M70j443j74L36J39P3J416K15L63k11O23o28j641
3673e47N58L81l007K258K91j445N71L148k02k590K986m09k941j304M007l816j162
3690c223L506o3k469K638J787k895m98M082l036k175K697k83l508J084M308m069
3706b117p8M586j78l864K638J563m209j069L759j746j060K723J252l910J829L238
3722C357m024j042M544j675l509K791O63l416M45M211j934j283M276j293l018
3737i07N52K255l955P14J630p10k069L304Q82k386J636M93j000n70J489k060j501
3754b203J726n05j087R16J869j856J390J639j510n30Q46p05j616O90P63k23R33
$$ y = [-676, -2819, -177, 688, -1255, 638, 1848, 479, 309, 1348, 454, -944, 99, -1210, -969, -1033, -444, 150, -16, -45, 1491, 156, 749, -179, -85, 385, -1058, -1232, -896, -757, -684, 732, 947, 1310, 1099, 1722, 1094, -547, 11, 392, -2615, -357, -66, -1511, -940, 2208, 2006, -584, 2402, 1993, -948, -2252, 1755, -2061, -3223, 283, 220, -2249, 389, 2176, -719, -1217, 2865, -171, -2346, 351, 68, -3440, -2356, 1952, -2117, -2195, 2391, 2213, -1651, 987, 2550, -1659, -2728, 1031, -715, -1775, 948, 2200, -1710, 119, 3357, -667, -1709, 2835, 1160, -2349, 442, 1105, -2311, -1866, 2345, 411, -872, 3404, 2111, -907, -355, 1900, -2055, -1341, 289, -421, -2490, 814, 1696, -690, 946, 1439, 439, -131, 1358, -702, -2203, -477, -982, -2069, -1153, 716, -1140, 250, 1889, 379, -151, 695, -10, -1626, -936, -173, -396, 537]
3771E37l4m93J139R6m14J107L48k116j171K312j814j857J595K132j739r37M119
3788B810j986j765K582j111k214J091J875k874j898L949N94l994M065J546l770
3803a100J097J970k565j674K801J12j807O73L132k623m56K680j540l808M037L39
3819A268l543M14L792l391J11L317J15k950J827K233n207P64K242j504k545L422
3835C65j61k570L314K055l189n72K962n84l574K477L12l396R06K320j275j488
3851b098M015o82k155J614P21j572J75M19p98j444J128J239l51O47N28j686J085
$$ y = [537, 503, 10, 1149, 1245, 831, 1938, 2286, 170, -1001, 1311, -503, -2360, -765, 1367, -372, -1309, 2810, 824, -941, 1641, 530, -1684, -593, 1282, -1592, -3490, 459, 1053, -2941, 1124, 2670, -1100, -3, 1967, -598, -2272, 529, 641, -1166, -493, 2639, 16, -440, 2240, 700, -3108, 929, 1268, -2275, -1861, 1931, -1460, -1349, 1968, 2083, -867, 960, 3193, -2014, -1250, 992, -512, -3057, 365, 204, -2366, 948, 3003, -186, -758, 2204, 1620, -1954, 523, 835, -2561, -1655, 665, -610, -2098, 1917, 1235, -920, 694, 1415, -157, 18, 437, -361, -1805, -677, 562, 211, 858, 1386, -300, 785]
$$ [...]
8191H32
##END NTUPLES=NMR FID
##END=
