##TITLE=1H_UK-23_8_1
 CD2Cl2
 108 sc, 
 17.11.2022
##JCAMPDX= 6.0         $$ Bruker NMR JCAMP-DX V2.0
##DATA TYPE= NMR FID
##DATA CLASS= NTUPLES
##ORIGIN= UXNMR, Bruker Analytische Messtechnik GmbH
##OWNER= root
$$ XWIN-NMR		Version 3.5
$$ Thu Nov 17 16:15:26 2022 Russian Standard Time (UT+4h)  she@DPX200
##.OBSERVE FREQUENCY= 200.1313499994
##.OBSERVE NUCLEUS= ^1H
##.DELAY= (6, 6)
##.ACQUISITION MODE= SIMULTANEOUS
##.ACQUISITION SCHEME= undefined
##.AVERAGES= 108
##.DIGITISER RES= 18
##SPECTROMETER/DATA SYSTEM= spect
##.PULSE SEQUENCE= zg30
##.SOLVENT NAME= CD2Cl2
##.SHIFT REFERENCE= (INTERNAL, CD2Cl2, 0, 15.7039)
##AUDIT TRAIL= $$ (NUMBER, WHEN, WHO, WHERE, WHAT)
$$ ##TITLE= Audit trail, XWIN-NMR		Version 3.5
$$ ##JCAMPDX= 5.01
$$ ##ORIGIN= Bruker BioSpin GmbH
$$ ##OWNER= she
$$ F:/spectra/data/she/nmr/H-F/1/audita.txt
$$ ##AUDIT TRAIL=  $$ (NUMBER, WHEN, WHO, WHERE, WHAT)
(   1,<2022-11-17 16:14:22.31 +0400>,<she>,<DPX200>,
      <continue with go, POWCHK disabled, PULCHK disabled
       configuration hash MD5:
       00 E9 B6 7A A2 85 ED C7 34 08 36 98 17 FE 4E 26
       data hash MD5: 16K
       31 63 B2 40 0E A5 6B E1 FE A4 09 B6 20 F3 D8 0A>)
$$ ##END=
$$ 
$$ hash MD5
$$ C2 00 82 44 B9 0C FB 55 EE 48 03 56 B9 F5 A0 92
##$RELAX= 
##$RELAX= 
##$RELAX= 
##$RELAX= 
##$RELAX= 
##$RELAX= 
$$ Bruker specific parameters
$$ --------------------------
##$DU= <F:/spectra>
##$EXPNO= 1
##$NAME= <H-F>
##$PROCNO= 1
##$TYPE= <nmr>
##$USER= <she>
##$AMP= (0..31)
100 100 100 100 100 100 100 100 100 100 100 100 100 100 100 100 100 100 
100 100 100 100 100 100 100 100 100 100 100 100 100 100 
##$AQSEQ= 0
##$AQ_mod= 1
##$AUNM= <au_zg>
##$AUTOPOS= <>
##$BF1= 200.13
##$BF2= 200.13
##$BF3= 200.13
##$BF4= 200.13
##$BF5= 200.13
##$BF6= 200.13
##$BF7= 200.13
##$BF8= 200.13
##$BYTORDA= 1
##$CFDGTYP= 0
##$CFRGTYP= 5
##$CHEMSTR= <none>
##$CNST= (0..31)
1 1 145 1 1 1 1 1 1 1 1 1 1 1 1 1 1 1 1 1 1 1 1 1 1 1 1 1 1 1 1 1 
##$CPDPRG= <>
##$CPDPRG1= <>
##$CPDPRG2= <>
##$CPDPRG3= <>
##$CPDPRG4= <mlev>
##$CPDPRG5= <mlev>
##$CPDPRG6= <mlev>
##$CPDPRG7= <mlev>
##$CPDPRG8= <mlev>
##$CPDPRGB= <>
##$CPDPRGT= <>
##$D= (0..31)
0 1.2 0 0 0 0 0 0 0 0.06 0 0.03 0 0 0 0 0.0002 0 0 0 0 0 0 0 0 0 0 0 0 
0 0 0 
##$DATE= 1668686885
##$DBL= (0..7)
120 120 120 120 120 120 120 120 
##$DBP= (0..7)
150 150 150 150 150 150 150 150 
##$DBP07= 0
##$DBPNAM0= <>
##$DBPNAM1= <>
##$DBPNAM2= <>
##$DBPNAM3= <>
##$DBPNAM4= <>
##$DBPNAM5= <>
##$DBPNAM6= <>
##$DBPNAM7= <>
##$DBPOAL= (0..7)
0.5 0.5 0.5 0.5 0.5 0.5 0.5 0.5 
##$DBPOFFS= (0..7)
0 0 0 0 0 0 0 0 
##$DE= 6
##$DECBNUC= <off>
##$DECIM= 32
##$DECNUC= <off>
##$DECSTAT= 4
##$DIGMOD= 1
##$DIGTYP= 9
##$DL= (0..7)
0 120 120 120 120 120 120 120 
##$DP= (0..7)
150 150 150 150 150 150 150 150 
##$DP07= 0
##$DPNAME0= <>
##$DPNAME1= <>
##$DPNAME2= <>
##$DPNAME3= <>
##$DPNAME4= <>
##$DPNAME5= <>
##$DPNAME6= <>
##$DPNAME7= <>
##$DPOAL= (0..7)
0.5 0.5 0.5 0.5 0.5 0.5 0.5 0.5 
##$DPOFFS= (0..7)
0 0 0 0 0 0 0 0 
##$DQDMODE= 0
##$DR= 18
##$DS= 0
$$ [...]
##$SUBNAM2= <"">
##$SUBNAM3= <"">
##$SUBNAM4= <"">
##$SUBNAM5= <"">
##$SUBNAM6= <"">
##$SUBNAM7= <"">
##$SUBNAM8= <"">
##$SUBNAM9= <"">
##$SW= 18.0517283424941
##$SWIBOX= (0..15)
0 0 2 0 0 0 0 0 0 0 0 0 0 0 0 0 
##$SW_h= 3612.71676300578
##$TD= 16384
##$TD0= 1
##$TE= 0
##$TE2= 300
##$TE3= 300
##$TEG= 300
##$TL= (0..7)
0 120 120 120 120 120 120 120 
##$TP= (0..7)
150 150 150 150 150 150 150 150 
##$TP07= 0
##$TPNAME0= <>
##$TPNAME1= <>
##$TPNAME2= <>
##$TPNAME3= <>
##$TPNAME4= <>
##$TPNAME5= <>
##$TPNAME6= <>
##$TPNAME7= <>
##$TPOAL= (0..7)
0.5 0.5 0.5 0.5 0.5 0.5 0.5 0.5 
##$TPOFFS= (0..7)
0 0 0 0 0 0 0 0 
##$TUNHIN= 0
##$TUNHOUT= 0
##$TUNXOUT= 0
##$USERA1= <user>
##$USERA2= <user>
##$USERA3= <user>
##$USERA4= <user>
##$USERA5= <user>
##$V9= 5
##$VALIST= <valist>
##$VCLIST= <CCCCCCCCCCCCCCC>
##$VD= 0
##$VDLIST= <DDDDDDDDDDDDDDD>
##$VPLIST= <PPPPPPPPPPPPPPP>
##$VTLIST= <TTTTTTTTTTTTTTT>
##$WBST= 1024
##$WBSW= 4
##$XGAIN= (0..3)
0 0 0 0 
##$XL= 0
##$YL= 0
##$YMAX_a= 758174
##$YMIN_a= -912521
##$ZGOPTNS= <>
##$ZL1= 120
##$ZL2= 120
##$ZL3= 120
##$ZL4= 120
##$ABSF1= 10
##$ABSF2= 0
##$ABSG= 5
##$ABSL= 3
##$ALPHA= 0
##$AQORDER= 0
##$ASSFAC= 0
##$ASSFACI= 0
##$ASSFACX= 0
##$ASSWID= 0
##$AUNMP= <proc_1d>
##$AZFE= 0.1
##$AZFW= 0.1
##$BCFW= 1
##$BC_mod= 2
##$BYTORDP= 1
##$COROFFS= 0
##$CY= 11.3945322036743
##$DATMOD= 1
##$DC= 2
##$DFILT= <>
##$DTYPP= 0
##$F1P= 2.36226072786647
##$F2P= -0.459571619588291
##$FCOR= 0.5
##$FTSIZE= 0
##$FT_mod= 4
##$GAMMA= 1
##$GB= 0.15
##$INTBC= 1
##$INTSCL= 1
##$ISEN= 128
##$LB= 0.24
##$LEV0= 0
##$LPBIN= 0
##$MAXI= 10000
##$MC2= 0
##$MEAN= 0
##$ME_mod= 0
##$MI= 1.114404
##$NCOEF= 0
##$NC_proc= 0
##$NLEV= 6
##$NOISF1= 3.799351
##$NOISF2= 2.8
##$NSP= 1
##$NTH_PI= 0
##$NZP= 0
##$OFFSET= 15.70392
##$PC= 1
##$PHC0= -18030.84
##$PHC1= 9.8007
##$PH_mod= 1
##$PKNL= yes
##$PPARMOD= 0
##$PSCAL= 0
##$PSIGN= 0
##$REVERSE= no
##$SF= 200.130013532006
##$SI= 16384
##$SIGF1= 3
##$SIGF2= 2
##$SINO= 400
##$SIOLD= 16384
##$SREGLST= <1H.CDCl3>
##$SSB= 0
##$STSI= 0
##$STSR= 0
##$SW_p= 3612.71676300578
##$SYMM= 0
##$S_DEV= 0
##$TDeff= 0
##$TDoff= 0
##$TI= <>
##$TILT= no
##$TM1= 0
##$TM2= 0
##$TOPLEV= 0
##$USERP1= <user>
##$USERP2= <user>
##$USERP3= <user>
##$USERP4= <user>
##$USERP5= <user>
##$WDW= 1
##$XDIM= 8192
##$YMAX_p= 0
##$YMIN_p= 0
$$ End of Bruker specific parameters
$$ ---------------------------------
##NTUPLES= NMR FID
##VAR_NAME=  TIME,          FID/REAL,        FID/IMAG
##SYMBOL=    X,             R,               I
##VAR_TYPE=  INDEPENDENT,   DEPENDENT,       DEPENDENT
##VAR_FORM=  AFFN,          ASDF,            ASDF
##VAR_DIM=   8192,          8192,            8192
##UNITS=     SECONDS,       ARBITRARY UNITS, ARBITRARY UNITS
##FACTOR=    0.0002768,     1,               1
##FIRST=     0,             0,               0
##LAST=      2.2672688,     0,               0
##MIN=       0,             -912521,         0
##MAX=       2.2672688,     758174,          0
$$ Real data points
##PAGE= N=1
##DATA TABLE= (X++(R..R)), XYDATA
$$ [...]
$$ plain form
2791 3214 -276 -4001 10 -807 -5456 -1171 2656 -1918 -1284 4643 937 -340 2944 1783 -3190
2806 -3190 -1041 1404 -3469 -3230 2920 240 -1955 3916 3673 -1834 1206 4390 -2389 -2158 814 -2018
2822 -2018 -4938 2 1827 -2298 839 5797 -158 -424 3892 216 -2851 -95 278 -6181 -1724
2837 -1724 2778 -1714 -1180 5111 2430 -1790 3076 2645 -3063 -823 1812 -2445 -3143 2091 558 -1797
2853 -1797 2765 4268 -1754 -301 3157 -1151 -4017 1200 -671 -3840 296 2334 -2675 247 4618
2868 4618 739 -1601 2090 1338 -4640 -947 1780 -3443 -1912 3695 -165 87 4669 2695 -2836
2883 -2836 928 2231 -4451 -2460 852 -1974 -2930 3143 1787 -905 2044 4334 -640 -718 3319 -1961
2899 -1961 -4635 155 -1445 -4743 -702 4417 119 682 4613 2576 -1517 2017 502 -5177 -1410
$$ packed form
2791C214l490l725M011q17m649M285L827m574O34N927l706j277L284j161m973
2806c190K149K445m873K39O150k680k195N871k43n507L040L184o779K31K972k832
2822b018k920M940J825m125L137M958n955k66M316l676l067K756L73o459M457
2837a724M502m492N34O291k681m220M866m31n708K240K635m257o98N234j533k355
2853a797M562J503o022J453L458m308k866N217j871l169M136K038n009K922M371
2868D618l879k340L691p52n978L693K727n223J531N607l860K52M582j974n531
2883b836L764J303o682J991L312k826r56O073j356k692K949K290m974p8M037n280
2899a961k674M790j600l298M041N119m298N63L931k037m093L534j515n679L767
$$ plain form
2914 -1410 677 -3189 -2368 3054 996 -1185 3900 4162 -1544 201 2275 -2008 -3253 293 -1682
2929 -1682 -4433 1757 1578 -1180 1577 4544 939 -1045 3084 586 -4279 234 386 -2837 -1358
2944 -1358 3406 679 50 4441 1322 -2100 244 1568 -3792 -2457 1088 -3325 -3270 2704 1730 -695
2960 -695 2683 2658 -2562 -1819 1874 -3534 -4280 700 119 -2661 2458 3761 119 817 4148 -456 -3225
2977 -3225 1697 -1503 -4023 -571 1819 -2622 823 3909 1474 -495 4194 1575 -3028 -43 -180
2992 -180 -4108 -2689 928 -1710 -1846 3509 3153 -647 2947 5219 -1330 -1952 1655 -2109 -4514 933
3008 933 294 -3474 748 3174 409 -32 3398 -734 -2068 463 -287 -4374 -1454 622 -2126 -762
3024 -762 3012 1745 -1030 3167 2339 -2808 -1242 964 -2513 -2575 2079 -407 -1641 3048 2259 -968
$$ packed form
2914a410K087l866Q21N422k058k181N085K62n706J745K074m283j245L546j975
2929a682k751O190j79k758K757K967l605j984M129k498m865M513J52l223J479
2944a358M764k727o29M391l119l422K344J324n360J335L545m413N5N974r74k425
2960f95L378k5n220P43L693n408p46M980n81k780N119J303l642O98L331m604k769
2977c225M922l200k520L452K390m441L445L086k435j969M689k619m603K985j37
2992a80l928J419L617k638j36N355l56l800L594K272o549o22L607l764k405N447
3008I33o39l768M222K426k765m41L430m132j334K531p50m087K920K076k748J364
3024g62L774j267k775M197q28n147J566K206l477o2M654k486j234M689p89l227
$$ plain form
3040 -968 1673 3323 -1417 -2547 758 -1890 -3967 40 -170 -2899 643 2529 -248 537 3729 -980
3056 -980 -3048 162 -516 -4206 -1282 2303 -235 -123 4614 2422 -1166 1550 2033 -3332 -1255 190
3072 190 -3305 -3406 1649 579 -684 2592 3353 -1000 -123 2693 -1484 -3954 -541 -1848 -3960 -238
3088 -238 725 -1463 1012 5020 344 -519 2932 803 -3406 -1025 -420 -3828 -2411 1768 -1006 52
3104 52 2995 2158 26 2404 2660 -3302 -1627 832 -2188 -3425 1051 -68 -1501 2450 4713 -170
3120 -170 65 3045 -434 -2427 -91 -1946 -3743 -719 819 -1657 536 3288 -33 -630 1599 1150
3136 1150 -3503 -1164 1298 -3410 -1484 2608 235 -350 3863 2770 -704 1307 1965 -2583 -3023 396
3152 396 -1649 -2569 1479 2709 -689 2142 3836 501 -930 1538 -660 -4152 -467 -447 -2590 -138
$$ packed form
3040i68K641J650m740j130L305k648k077M007k10k729L542J886k777P85L192m709
3056i80k068L210o78l690K924L585k538J12M737k192l588K716M83n365K077J445
3072A90l495j01N055j070j263L276P61m353Q77K816m177k470L413j307k112L722
3088b38R63k188K475M008m676q63L451k129m209K381O05l408J417M179k774J058
3104E2K943q37k132K378K56n962J675K459l020j237M476j119j433L951K263m883
3120a70K35K980l479j993K336j855j797L024J538k476K193K752l321n97K229m49
3136A150m653K339K462m708J926M092k373n85M213j093l474K011O58m548m40L419
3152C96k045r20M048J230l398K831J694l335j431K468k198l492L685K0k143K452
$$ plain form
3168 -138 2701 616 81 4217 1496 -575 2286 155 -3778 -2668 522 -3188 -1933 1835 2073 -575
3184 -575 3650 3032 -537 823 16 -2531 -3929 -7 -885 -2926 848 1242 178 2067 5103 -36
3200 -36 -286 1652 -275 -3288 -930 -310 -3266 -986 1354 -302 94 2487 1557 -1173 818 1630 -3406
3217 -3406 -1919 -284 -2415 -2318 1433 1033 -352 2528 2769 -499 -119 1677 -1812 -3608 3 -42 -1369
3234 -1369 1536 2665 -950 835 2603 367 -2320 122 -1333 -4078 -1565 390 -2279 -295 2089
3249 2089 333 188 2996 1102 -2190 -153 655 -3345 -2662 712 -762 -501 2823 2685 264 2349
3265 2349 3122 -1298 -1281 781 -2694 -2801 -1087 228 -2483 1068 3090 901 883 3144 686 -2383
3281 -2383 -442 -1293 -4317 -1324 484 -2250 -156 3178 2233 -163 2657 2864 -1949 -487 218 -2348
$$ packed form
3168a38K839k085n35M136k721k071K861k131l933J110L190l710J255L768K38k648
3184e75M225o18l569J360q07k547j398L922q78k041L774L94j064J889L036n139
3200c6k50J938j927l013K358O20k956K280K340j656L96K393r30k730J991Q12n036
3217c406J487J635k131R7L751m00j385K880K41l268L80J796l489j796L611m5j327
3234a369K905J129l615J785J768k236k687K442j455k745K513J955k669J984K384
3249B089j756j45K808j894l292K037Q08m000O83L374j474K61L324j38k421K085
3265B349P73m420J7K062l475j07J714J315k711L551K022k189j8K261k458l069
3281b383J941q51l024K993J808k734K094L334r45k396K820K07m813J462P05k566
$$ plain form
3297 -2348 -2580 257 -494 -854 1808 2119 -163 625 2490 -180 -2180 340 -1488 -4412 -911 767
3313 767 112 153 3355 694 372 2981 494 -1717 222 440 -3389 -1510 244 -1093 -977 3417 1720
3330 1720 -130 1035 964 -1644 -2272 -404 -2384 -3023 1353 654 -614 1895 3104 -548 587 1827
3346 1827 -719 -3010 -266 -839 -2536 213 642 -816 1312 4629 1306 -92 1783 1200 -2963 -1235
3362 -1235 -823 -2481 -1438 1057 108 -754 3390 2331 -631 627 2266 -1377 -3111 488 -1654 -3028
3378 -3028 1145 369 -536 1717 3197 1204 -9 1394 -946 -2992 -1101 -678 -2609 -1674 482 -521
3394 -521 396 2788 940 -510 1070 640 -2201 -1998 610 -1825 -634 931 889 329 2398 2307 -136
3411 -136 -657 1236 -985 -756 1368 -1015 -2162 342 468 -131 1327 2583 840 -516 1221 -1842
$$ packed form
3297b348k32K837p51l60K662L11k282P88J865k670k000K520j828k924L501J678
3313G67o55M1L202k661l22K609k487k211J939K18l829J879J754j337J16M394j697
3330A720j850J165p1k608o28J868j980o39M376o99j268K509J209l652J135J240
3346A827k546k291K744n73j697K749M29j458K128L317l323j398J875n83m163J728
3362a235M12j658J043K495r49q62M144j059k962J258J639l643j734L599k142j374
3378c028M173p76r05K253J480j993j213J403k340k046J891M23j931R35K156j003
3394e21R17K392j848j450J580m30k841K03K608k435J191J565m2n60K069r1k443
3411a36n21J893k221K29K124k383j147K504J26n99J458J256j743j356J737l063
$$ plain form
3427 -1842 -3220 -466 -1560 -2189 -409 3393 471 607 3494 869 -752 520 332 -3399 -1754 491
3443 491 -1052 -1257 526 1065 509 1198 2745 -379 186 2541 -1455 -2139 -975 -576 -2129 -409 2022
3460 2022 165 728 2725 1576 -1355 772 -136 -2095 -1535 -1044 -2686 -965 1003 275 -235 3076
3476 3076 2270 -1253 555 -171 -2675 -2426 25 -1878 -935 810 1084 -40 983 2282 40 -954
3492 -954 388 -843 -3015 -632 369 -2473 1414 1794 -625 -89 1955 -145 -724 304 -530 -1895
3508 -1895 -829 218 -1767 -882 2009 1863 -400 1681 934 -1122 -1163 -172 -1370 -1629 656 72 -719
3525 -719 1348 3079 -433 468 2665 -368 -1142 -753 -13 -2055 -804 312 -1536 266 2500 1133
3541 1133 213 1994 354 -1176 -595 -349 -2931 -2027 1191 -783 -51 1752 769 -104 1272 3454 -1585
$$ packed form
3427a842j378K754j094o29J780L802k922J36K887k625j621J272j88l731J645K245
3443D91j543k05J783N39n56O89J547l124N65K355l996o84J164L99j553J720K431
3460B022j857N63J997j149k931K127r08j959N60M91j642J721J968p28n10L311
3476C076q06l523J808p26k504K49K451j903R43J745K74j124J023J299k242r94
3492i54J342j231k172K383J001k842L887L80k419N36K044k100n79J028q34j365
3508a895J066J047j985Q85K891j46k263K081p47k056m1R91j198k59K285n84p91
3525g19K067J731l512R01K197l033p74L89P40k042J251J116j848J802K234j367
3541A133r20J781j640j530N81K46k582R04L218j974P32J803r83q73J376K182n039
$$ plain form
3558 -1585 -714 -93 -2343 -1543 -137 -422 -996 1733 2485 -939 1396 2013 -451 -1505 64 -974 -3147
3575 -3147 -968 -7 -416 -437 2426 1008 -104 2270 787 -455 470 797 -1769 -1058 16 273 -243
3592 -243 769 987 -779 1222 2023 -1320 -1639 720 -1316 -1552 994 810 -261 740 1829 751
3608 751 -93 1421 -1230 -2317 -606 -907 -1587 -273 1225 -377 202 2605 68 -234 780 512 -924
3625 -924 -645 662 -2116 -564 792 459 -69 1634 3063 87 971 834 -995 -1069 -789 -1230 -2254
3642 -2254 -61 711 -1398 928 1361 622 387 1025 -161 -3090 -1013 -745 -2366 -524 1259 -77
3658 -77 740 3387 1412 525 828 792 -1611 -1355 277 -879 -541 1499 471 -987 1503 2539 51
3675 51 -120 389 -1437 -1268 461 -767 -1820 -444 2135 559 720 1770 -320 -1195 327 -799 -1691
$$ packed form
3558a585Q71O21k250Q00J406k85n74K729P52l424K335O17k464j054J569j038k173
3575c147K179R61m09k1K863j418j112K374j483j242R25L27k566P11J074K57n16
3592b43J012K18j766K001Q01l343l19K359k036k36K546j84j071J001J089j078
3608G51q44J514k651j087J711l01o80J314J498j602N79K403k537l02J014k68j436
3625i24K79J307k778J552J356l33n28J703J429k976Q84j37j829p4K80m41j024
3642b254K193P72k109K326M33p39k35O38j186k929K077K68j621J842J783j336
3658g7Q17K647j975q87L03l6k403K56J632j156L38K040j028j458K490J036k488
3675E1j71N09j826J69J729j228j053J376K579j576J61J050k090q75J522j126q92
$$ plain form
3692 -1691 36 -4 -1479 -1029 1392 -1162 -64 1175 1360 -589 -396 267 -1083 -1094 -354 -710 -637 1383
3710 1383 833 -405 1201 2174 -178 -163 1034 -1507 -1246 -905 -323 19 -251 1800 -475 314 1941
3727 1941 785 -629 -94 -407 -2458 -1494 -718 -264 -520 1477 780 -645 2667 1723 -498 -567 403 -1538
3745 -1538 -1727 -304 -797 -1742 1463 1305 480 697 960 -490 -133 1934 -956 -2107 123 49 -1009
3762 -1009 370 2297 49 582 2794 4 11 1014 -408 -1438 -586 363 -690 -48 1839 -81 -72
3779 -72 1221 1621 -1292 242 1002 -1034 -1369 818 -174 -657 1032 2123 -874 -344 1561 -160 -1658
3796 -1658 642 57 -1677 676 -20 -1042 156 1276 1352 37 1625 1142 -2167 -549 266 -1156
3812 -1156 -988 667 -268 -665 774 1096 -164 1178 489 -916 -578 82 -1228 -2294 283 -144 -1004
$$ packed form
3692a691J727m0j475M50K421k554J098J239J85j949J93O63j350j1P40l56P3K020
3710A383n50j238J606R73k352J5J197k541K61L41N82L42k70K051k275P89J627
3727A941j156j414N35l13k051R64P76M54k56J997o97j425L312r44k221o9R70j941
3745a538j89J423m93r45L205j58q25K17K63j450L57K067k890j151K230p4j058
3762a009J379J927k248N33K212k790PJ003j422j030Q52R49j053O42J887j920R
3779g2J293M00k913J534P60k036l35K187r92m83J689J091k997N30J905j721j498
3796a658K300n85j734K353o96j022J198J120P6j315J588m83l309J618Q15j422
3812a156J68J655r35l97J439L22j260J342o89j405L38O60j310j066K577m27q60
$$ plain form
3829 -1004 824 2127 873 609 827 -74 -841 -281 -96 -1436 -1007 -178 -264 -142 1926 719 -151 1740
3847 1740 1180 -726 -908 -176 -1136 -1720 1364 383 -638 903 688 515 655 407 -102 -886 244 105
3865 105 -1321 -419 -233 548 165 1423 524 -692 684 -800 -971 132 -79 -1345 -49 1220 -774
3882 -774 235 988 45 -83 -35 425 -650 -521 659 -1378 -1012 828 751 286 800 531 -191 -65 773
3901 773 -977 -1272 -289 -141 -992 407 773 -97 -103 1966 333 -441 339 -423 -1115 -8 -198 -850 -888
3920 -888 724 781 -236 1698 545 -683 758 1646 -1288 -1010 324 -838 -2096 -81 876 -523
3936 -523 503 1992 195 148 1507 -1054 -1546 -428 74 -1744 -126 -67 -763 190 855 339 234 730
3954 730 929 -1412 131 -352 -1694 293 680 -532 -214 908 -301 161 -631 -237 -1649 -525 15
$$ packed form
3829a004J828J303j254k64K18r01p67N60J85j340M29Q29q6J22K068j207q70J891
3847A740n60j906j82P32r60n84L084r81j021J541k15j73J40k48n09p84J130j39
3865A05j426R02J86P81l83J258q99j216J376j484j71J103k11j266J296J269j994
3882g74J009P53r43j28M8M60j075J29J180k037L66J840p7m65N14k69p22J26Q38
3901G73j750k95R83J48q51J399L66q70oK069j633p74P80p62o92J107j90o52l8
3920h88J612N7j017J934j153j228J441Q88k934K78J334j162j258K015R57j399
3936e23J026J489j797m7J359k561m92J118N02j818J618N9o96R53O65n16j05M96
3954G30J99k341J543m83j342J987L87j212L18J122j209M62p92L94j412J124N40
$$ plain form
3971 15 -74 -835 1027 1465 -770 -83 1377 387 -911 1027 443 -1873 432 -150 -538 471 1265 -569
3989 -569 959 1464 -359 -1357 -815 -17 -841 -1086 788 -619 -499 1379 1211 293 884 1025 -65 -701
4007 -701 260 -1692 -569 255 -71 -63 228 732 -973 91 661 289 -683 1047 -1177 -1454 -38 183
4025 183 -471 -475 338 -1014 199 412 204 -122 362 681 -1423 -662 1195 -807 159 582 811 -405 265
4044 265 1011 -381 -842 -184 -296 -1161 161 376 -842 443 1004 442 -603 676 -27 -644 348 923
4062 923 -1018 -327 543 -459 -221 815 253 273 286 -548 -1257 939 -753 -878 -379 977 371 220 1485
4081 1485 1027 153 145 1282 165 -135 -349 -445 -715 608 632 287 347 260 -143 556 1172 801 -904 -177
4101 -177 -803 -906 372 246 -843 -567 1240 778 153 1202 1574 -1399 -164 -266 -738 -1160 472 367
$$ packed form
3971A5q9p61J862M38k235O87J460r90j298J938n84k316K305n82l88J009P94j834
3989e69J528N05j823r98N42P98q24k45J874j407J20J878j68r18N91J41j090o36
4007g01R61j952J123Q24l26QK91N04j705J064N70l72r72J730k224k77J416K21
4025A83o54mQ13j352J213K13k08l26M84L19k104P61J857k002R66M23K29j216O70
4044B65P46j392m61O58j12q65J322K15j218J285N61n62j045J279p03o17R92N75
4062I23j941O91Q70j002K38J036n62K0J3q34p09K196j692j25M99J356o06j51J265
4081A485m58q74qJ137j117l00k14r6k70J323K4l45O0q7m03O99O16l71j705P27
4101a77o26j03J278j26j089K76J807m62o25J049L72k973J235j02m72m22J632j05
$$ plain form
4119 367 -175 603 776 11 481 1024 -131 -352 -542 -438 -554 518 230 -515 58 1364 55 -709 1761
4138 1761 -543 -624 359 -250 -679 559 1475 -593 -667 995 -16 -496 1252 -554 -435 459 -38 -814
4156 -814 109 936 -366 155 915 502 -368 658 1149 -428 -373 14 365 -751 85 1569 161 602
4174 602 739 310 -694 556 -388 -1578 -765 320 -1291 -380 331 -424 -39 837 385 -219 259 446
4192 446 -917 -560 -260 -566 -231 206 925 -196 588 955 -582 -805 -80 -175 -813 -457 -42 -1008 273
4211 273 334 -491 -237 295 422 -1087 200 404 443 40 -457 -488 -508 816 424 -223 432 324 -162 276
4231 276 -225 -391 -1144 1369 -429 -913 270 1058 -945 -105 965 -223 -675 63 506 -1014 425
4248 425 185 -449 -886 -260 -1044 -872 712 66 -627 748 712 -831 -145 37 155 -948 528 539 -156
$$ packed form
4119C67n42P78J73p65M70N43j155k21j90J04j16J072k88p45N73J306j309p64K470
4138A761k304q1R83o09m29J238R16k068p4J662j011m80J748j806J19Q94m97p76
4156h14R23Q27j302N21P60m13q70J026M91j577N5L87L51j116Q36J484j408M41
4174F02J37m29j004J250r44j190Q13J085j611R11P11p55L85Q76m52o04M78J87
4192D46j363L57L00l06L35M37P19j121P84L67j537k23P25r5o38L56M15r66J281
4211B73O1q25K54N32J27j509J287K04L9m03m97l1k0J324l92o47O55j08m86M38
4231B76n01j66p53K513j798m84J183P88k003Q40J070j188m52P38M43j520J439
4248D25k40o34m37O26p84J72J584o46o93J375l6j543O86J82J18j103J476J1o95
$$ plain form
4267 -156 265 651 -600 -109 139 -37 -403 1221 429 251 379 947 -117 45 295 -458 -172 1432 526
4286 526 -902 509 391 -653 168 807 -122 881 745 985 5 549 852 -569 -378 382 -93 -123 262
4305 262 833 -149 309 -490 -1203 326 531 447 -810 531 -465 -252 765 700 302 -202 2102 732 -658
4324 -658 548 388 -674 579 718 -610 382 525 -14 -715 895 1 -845 1110 -37 482 -1083
4341 -1083 1693 -288 -835 1226 642 -603 59 70 -547 782 436 -241 -157 187 391 -92 -87 445 -664
4360 -664 -801 54 -318 -12 447 338 87 -139 -601 495 -237 1115 818 -1021 1256 1176 -1102 -588 -257
4379 -257 -734 -1107 682 720 -977 338 1241 -635 -358 295 -244 -501 184 276 -217 249 595 -465 -369
4398 -369 978 -511 484 381 395 105 932 -282 -600 303 -238 -1049 181 1180 -253 149 374 202 -1283
$$ packed form
4267a56M21L86j251M91K48j76l66J624p92j78J28N68j064J62K50p53K86J604r06
4286E26j428J411j18j044Q21O39r29J003j36K40r80N44L03j421J91P60m75l0L85
4305B62N71r82M58p99p13J529K05q4j257J341r96K13J017o5l98n04K304j370j390
4324f58J206j60j062J253J39j328R92J43n39p01J610q94q46J955j147N19j565
4341a083K776j981n47K061n84j245O62J1o17J329l46o77Q4L44K04m83NN32j109
4360f64j37Q55l72L06M59j09k51k26m62J096p32J352k97j839K277q0k278N14L31
4379b57m77l73J789L8j697J315R03j876K77O53n39k57O85R2m93M66L46j060R6
4398c69J347j489R95j03J4k90Q27j214l18R03n41q11J230R99j433M02K25j72j485
$$ plain form
4417 -1283 248 1619 -367 -69 71 337 -1337 -420 -216 -1159 -210 196 97 -554 1195 -169 478 -94
4435 -94 2 -841 -476 85 -238 -813 98 546 -1294 13 504 -1440 238 261 -396 31 348 -465 -751 191
4455 191 767 -72 -652 497 -8 -1081 32 173 -153 507 411 -260 -122 746 -706 -293 262 114 -599
4474 -599 263 -579 -86 56 89 306 -318 1102 -557 -113 1 -594 -54 -656 944 273 -261 422 961
4493 961 193 782 1314 -1212 -527 1162 -907 -168 390 -355 -692 -1406 -546 -940 191 147 1217 205
4511 205 800 425 620 -111 -342 -184 232 -248 524 -148 837 425 1053 -37 720 -4 -46 141 -466 -692
4531 -692 3 929 -502 -730 476 61 -187 928 916 470 1112 651 -900 395 126 280 -903 -224
4549 -224 442 1245 329 -265 -412 261 235 -220 -352 822 -20 -954 306 -10 -472 870 -289 -803 83
$$ packed form
4417a283J531J371j986K98J40K66j674R17K04r43R49M06r9o51J749j364O47n72
4435i4R6q43L65N61l23n75R11M48j840J307M91j944J678K3o57M27L17q13k86R42
4455A91N76q39n80J149n05j073J113J41l26O60r6o71J38Q68j452M13N55j48p13
4474e99Q62q42M93J42L3K17o24J420j659M44J14n95N40o02J600o71n34O83N39
4493I61p68N89N32k526O85J689k069P39N58p45l37p14Q60l94J131m4J070j012
4511B05N95l75J95p31k31J58M16m80P72o72R85m12O28j090P57p24m2J87o07k26
4531f92O95R26j431k28J206m15k48J115j2m46O42m61j551J295k69J54j183O79
4549b24O66Q03r16n94j47O73k6m55j32J174q42r34J260l16m62J342j159n14Q86
$$ plain form
4568 83 -213 142 -397 60 -16 -52 -154 668 634 -66 -198 -14 -290 -527 -118 479 1047 752 393 261 568
4589 568 56 -291 1617 -425 59 856 -317 -473 -405 249 476 -12 9 472 -29 135 172 302 -727 630
4609 630 -1056 -582 -139 -734 -1160 90 564 411 -580 -223 532 -789 519 -404 834 -634 810 -280
4627 -280 -350 -784 -107 -562 108 104 -400 585 339 25 489 -25 839 -165 -295 465 -242 -789 532 54
4647 54 911 390 304 -1246 -14 1012 661 343 736 -486 -677 848 627 1 131 569 -270 385 120
4666 120 1131 -926 143 463 -48 1301 464 -1250 -807 -299 872 -138 -81 147 -321 -138 986 -137
4684 -137 47 -437 -514 -431 464 38 -808 -493 -607 99 492 -345 392 -41 -261 654 -1143 133 178 -462
4704 -462 -552 -125 1454 18 381 369 -111 -491 -521 -165 -430 118 -148 -691 108 183 -277 534 -66 1220
$$ packed form
4568H3k96L55n39M57p6l6j02Q22l4p00j32J84k76k37M09N97N68k95l59j32L07
4589E68n12l47J908k042M84P97j173j56O8O54K27m88K1M63n01J64L7J30j029J357
4609F30j686M74M43n95m26J250M74j53r91L57P55j321J308r23J238j468J444j090
4627b80p0m34O77m55O70mn04R85k46l14M64n14Q64j004j30P60p07n47J321m78
4647E4Q57n21q6j550J232J026l51l18L93j222j91J525k21o26J30M38q39O55k65
4666A20J011k057J069L20n11J349q37j714M43N08J171j010N7K28m68J83J124j123
4684a37J84m84p7Q3Q95m26q46L15j14P06L93q37P37m33k20R15j797J276M5o40
4704d62r0M27J579j436L63j2m80l80l0L56k65N48k66n43P99P5m60Q11o00J286
$$ plain form
4724 1220 -313 425 -670 -273 -645 704 -388 -149 1400 -482 -327 -221 755 -444 975 -36 -397
4741 -397 -865 316 400 104 -434 387 81 -400 -289 -7 -475 -204 -1020 264 17 247 -622 529 595 -28
4761 -28 21 -482 -151 -948 843 1129 -159 -496 1580 -810 -310 -440 -65 343 1346 320 -631 314 61
4780 61 -1029 -720 1213 687 -187 -209 918 440 -609 1653 -199 -660 -952 -740 -510 -426 314 -324 159
4799 159 876 -138 25 578 -489 331 9 -189 46 100 620 -317 -579 260 375 -268 -791 41 -1396
4818 -1396 719 70 -356 -160 1206 644 -978 -984 927 176 -180 598 176 -574 516 868 -937 -919 -606
4837 -606 -845 -86 -501 -247 1259 942 -625 174 204 486 -771 -885 696 405 -246 -174 396 375 940 704
4857 704 161 429 756 -902 -558 139 321 140 501 148 -472 117 311 -342 41 308 -315 -366 -895 444
$$ packed form
4724A220j533P38j095L97l72J349j092K39J549j882J55J06R76j199J419j011l61
4741c97m68J181Q4k96n38Q21l06m81J11K82m68K71q16J284k47K30q69J151O6o23
4761b8M9n03L31p97J791K86j288l37K076k390N00j30L75M08J003j026r51R45k53
4780F1j090L09J933n26q74k2J127m78j049K262j852m61k92K12K30Q4P40o38M83
4799A59P17j014J63N53j067Q20l22j98K35N4N20r37k62Q39J15o43n23Q32j437
4818a396K115o49m26J96J366n62j622oJ911p51l56P78m22p50J090L52j805J8L13
4837f06k39P59m15K54J506l17j567P99L0K82j257j14J581k91o51P2N70k1N65k36
4857G04n43K68L27j658L44O97J82j81L61l53o20N89J94o53L83K67o23n1n29J339
$$ plain form
4877 444 -74 432 167 446 -1003 400 70 -300 -446 -88 -81 233 -219 286 315 -364 633 67 19 433 -329
4898 -329 -606 987 667 -786 685 -26 210 1315 914 -84 37 736 -305 -222 -481 -356 -875 39 -22
4917 -22 -784 -642 486 482 -309 -634 -367 -512 90 -502 293 107 187 320 440 -129 -529 -274 -283 77 166 554
4939 554 149 -313 -639 293 560 -184 388 409 -221 58 435 -394 -720 -659 1577 78 -145 135 -316 -1269
4959 -1269 200 143 -472 393 1076 -1143 -519 1073 703 -531 472 411 -422 -378 944 170 313 19 59
4978 59 -173 -697 338 83 -252 -239 432 780 834 537 17 440 373 363 -71 -400 -59 -216 959 669 -761
4999 -761 689 589 -479 -105 92 -424 531 582 284 506 384 -42 -446 -1345 -520 38 -667 80 -659 -491
5019 -491 545 857 -1009 198 -71 -160 786 90 -547 -345 -118 43 215 -87 -137 74 -167 -329 716
$$ packed form
4877D44n18N06k65K79j449J403l30l70j46L58PL14m52N05K9o79R97n66m8M14p62
4898c29k77J593l20j453J471p11K36J105m01r98J21O99j041Q3k59J25n19R14o1
4917b2p62J42J128mp91l25K67j45O02n92P95j86Q0J33J20n69m00K55rL60Q9L88
4939E54m05m62l26R32K67p44N72K1o30K79L77q29l26O1K236j499k23K80m51r53
4959a269J469n7o15Q65O83k219O24J592l70j234J003o1q33M4J322p74J43k94M0
4978E9k32n24J035k55l35J3O71L48N4k97n20M23o7j0m34l29L41j57J175k90j430
4999g61J450j00j068L74J97n16R55N1k98K22j22m26m04q99Q25N58p05P47p39J68
5019d91J036L12j866J207k69q9R46o96o37K02K27J61J72l02n0K11k41j62J045
$$ plain form
5038 716 -120 -199 -49 70 116 -231 -821 -991 420 -532 199 744 -736 -46 -97 837 -376 -309 -138 -316
5058 -316 -1541 414 -477 -847 1161 -24 185 -6 1224 -518 -264 639 768 -122 -63 -46 -842 194
5076 194 431 1418 -776 377 103 196 5 -202 -1283 109 249 -557 -346 384 492 -9 -213 1342 -478
5095 -478 -821 89 883 -435 -56 184 -331 -806 723 -106 -716 449 267 -356 -161 360 158 -730 -20
5114 -20 -426 -624 -122 434 -438 -215 710 134 -434 -1024 795 319 193 -712 -213 -559 703 169 306 -405
5134 -405 -990 -953 463 366 -690 207 -88 1080 -209 615 405 339 656 -248 -633 -66 -93 -360 -93 88
5154 88 -138 -399 218 -26 440 378 932 -254 -352 197 -165 -397 -19 246 -170 206 -44 514 -355 432 -129
5175 -129 -100 321 415 -338 -399 665 -233 -185 101 651 414 1109 676 28 -157 -179 -754 -1444 112 -194 -278
$$ packed form
5038G16q36p9J50J19M6l47n90j70J411r52P31N45j480O90n1R34j213O7J71j78
5058c16j225J955q91l70K008j185K09j91J230j742K54R03J29q90N9J7p96J036
5076A94K37R87k194J153k74R3j91k07j081J392J40q06K11P30J08n01k04J555j820
5095d78l43R10P94j318L79K40n15m75J529q29o10J165j82o23J95N21k02q88P10
5114b0m06j98N02N56q72K23R25n76n68n90J819m76j26r05M99l46J262n34J37p11
5134d05n85L7J416r7j056Q97k95J168j289Q24k10o6L17r04l85N67k7k67K67J81
5154H8k26k61O17k44M66o2N54j186r8N49l62k32L78K65m16L76k50N58q69P87n61
5175a29K9M21R4p53o1J064q98M8K86N50k37O95m33o48j85k2n75o90J556l06q4
$$ plain form
5196 -278 -973 0 323 -669 55 -813 -397 -211 337 -888 -136 312 -26 575 -361 -241 937 -662 -58
5215 -58 -160 154 805 451 218 -13 208 1001 630 231 -1176 1148 348 -144 -62 446 -299 99 -73 -500
5235 -500 522 -590 387 -316 337 -98 120 -171 25 120 -394 -1073 1028 -558 -56 529 163 -292 -218
5254 -218 -331 -999 -252 425 34 141 261 -37 -156 390 969 -41 404 429 439 -473 -111 308 -37 220
5274 220 35 -19 586 448 -345 -86 218 557 -617 825 -428 182 -4 42 -516 -129 398 -613 823
5293 823 1071 397 -266 473 81 78 570 1028 670 -363 199 496 -888 -316 -102 -152 -783 -330 726 168
5313 168 495 459 127 242 552 -429 -288 -468 172 -37 50 -50 -1202 344 663 518 61 669 -258 -1664
5333 -1664 659 144 -347 -124 1015 -1087 -1276 45 -393 -350 195 820 264 -155 176 -696 72 440 65
$$ packed form
5196b78o95R73L23r92P24q68M16J86N48j225P52M48l38O01r36J20J178j599O04
5215e8j02L14O51l54k33k31K21P93l71l99j407K324q00m92Q2N08p45L98j72m27
5235e00J022j112R77p03O53m35K18k91J96R5n14o79K101j586N02N85l66m55P4
5254b18j13o68P47O77l91J07J20k98j19N46N79j010M45K5J0r12L62M19l45K57
5274B20j85n4O05j38p93K59L04L39j174J442j253O10j86M6n58L87N27j011J436
5293H23K48o74o63P39l92lM92M58l58j033N62K97j384N72K14n0o31M53J056n58
5313A68L27l6l32J15L10r81J41j80O40k09Q7j00j152J546L19j45m57O08r27j406
5333a664K323n15m91K23J139k102j89J321m38M3N45O25n56m19L31q72P68L68l75
$$ plain form
5352 65 -136 38 210 -294 509 759 670 606 662 -8 -269 704 -76 -84 792 910 -101 -914 -488 -458 180 871
5374 871 1008 -133 -215 -358 260 27 -499 -895 -1320 -82 -195 -248 532 60 152 -442 -255 783 224 495
5394 495 -361 280 -983 844 470 -292 182 -215 -823 53 555 522 -140 338 195 230 403 1262 -462 -275
5414 -275 50 124 -185 26 986 -856 259 72 207 59 -114 -973 -371 277 367 -850 -108 12 166 494
5434 494 260 12 -121 1165 301 -730 1174 652 -22 -98 -3 525 -89 -347 -1211 -822 523 -1222 -698
5453 -698 263 -250 -535 252 907 -693 -1083 -80 -152 237 -904 -201 -58 598 791 187 -268 -29 590
5472 590 386 116 456 -924 -92 258 -655 -497 472 404 1068 -334 45 232 -170 -446 -688 224 256 1294
5492 1294 -287 -622 -469 -287 -719 -37 159 -1131 -38 250 -31 252 -786 801 152 -376 -582 103
$$ packed form
5352F5k01J74J72n04Q03K50q9o4N6o70k61R73p80qQ76J18j011q13M26L0O38O91
5374H71J37j141q2j43O18k33n26l96m25J238j13n3P80m72R2n94J87J038n59K71
5394D95q56O41j263J827l74p62M74l97o08Q76N02l3o62M78j43L5J73Q59j724J87
5414b75L25P4l09K11R60j842J115j87J35j48j73q59O02O48R0j217P42J20J54L28
5434D94k34k48j33J286q64j031J904n22o74p6R5N28o14k58q64L89J345j745N24
5453f98R61n13k85P87O55j600l90J003p2L89j141P03J43O56J93o04m55K39O19
5472E90k04k70L40j380Q32L50r13J58R69o8O64j402L79J87m02k76k42R12L2J038
5492A294j581l35J53J82m32O82J96j290J093K88k81K83j038J587o49n28k06O85
$$ plain form
5510 103 15 -2 230 -9 777 -1028 -397 441 588 -1367 359 605 -477 362 -230 403 734 -704 -239
5529 -239 -749 223 98 -529 -500 -110 -715 313 4 100 -669 543 572 143 -420 148 344 -465 826 260
5549 260 211 -1079 507 -378 -1000 139 -712 320 1282 415 -312 -455 477 258 -2 -692 -948 -694 521
5568 521 606 -457 -803 -96 -133 -638 415 355 181 437 -573 -670 -8 77 -120 -179 319 -153 -296 12 404
5589 404 -1174 -402 696 79 383 -577 329 -219 -744 -306 -614 179 743 -750 -202 -217 -105 193 95 380
5609 380 -645 182 568 -962 -342 978 -127 249 115 307 127 10 1176 368 -118 185 -124 -557
5627 -557 845 89 -80 1036 646 1030 -157 -156 302 124 -628 269 -623 -127 -505 136 -131 -245 -166 -131
5647 -131 202 407 -447 -781 486 528 64 227 -28 -461 309 799 -136 -415 255 -1367 -7 177 576
$$ packed form
5510A03q8j7K32k39P86j805O31Q38J47j955J726K46j082Q39n92O33L31j438M65
5529b39n10R72j25o27K9L90o05J028l09R6p69J212K9m29n63N68J96q09J291n66
5549B60m9j290J586q85o22J139q51J032R62q67p27j43R32k19k60o90k56K54J215
5568E21Q5j063l46P07l7n05J053o0j74K56j010r7O62Q5j97n9M98m72j43L08L92
5589D04j578P72J098o17L04r60R06n48n25M38l08P93N64j493N48j5J12K98r8K85
5609C80j025Q27L86j530O20J320j105L76j34J92j80j17J166q08m86L03l09m33
5627e57J402p56j69J116l90L84j187JM58j78p52Q97q92M96l78O41k67j14P9L5
5647a31L33K05q54l34J267M2m64J63k55m33P70M90r35k79O70j622J360J84L99
$$ plain form
5666 576 -243 711 644 -384 543 1409 767 -56 -363 218 -223 -593 -392 -502 328 232 -682 -398 253 -247
5686 -247 678 406 716 68 -392 1067 -801 -619 1131 1261 -266 -250 343 287 -462 235 715 -105 -116 495
5706 495 -26 -378 -310 -194 -574 -158 891 -723 547 996 73 680 -354 -329 -174 -636 1012 -1017 -1000
5725 -1000 393 760 553 136 693 307 200 585 194 -462 273 252 -73 62 161 14 130 289 -892 125
5745 125 610 713 -241 255 -81 -1137 1410 -357 -1534 417 215 -704 -205 898 123 -138 -1023 65
5763 65 -880 -650 -76 -39 -25 1 370 162 191 321 -18 1030 228 472 431 910 -1062 -713 167 1051 -215
5784 -215 210 468 -296 -211 115 -177 729 47 892 -296 1300 28 -162 226 -218 -147 -514 -33 64 -39
5804 -39 -524 46 -413 -358 905 -88 -578 195 -134 -468 -133 717 -263 175 387 301 -403 -364 648 288 411
$$ packed form
5666E76q19R54o7j028R27Q66o42q23l07N81m41l70K01j10Q30r6r14K84O51n00
5686b47R25k72L10o48m60J459j868J82J750J30j527J6N93n6p49O97M80q20j1O11
5706D95n21l52O8J16l80M16J049j614J270M49r23O07j034K5J55m62J648k029J7
5725a000J393L67k07m17N57l86j07L85l91o56P35k1l25J35R9j47J16J59j181J017
5745A25M85J03r54M96l36j056K547j767j177J951k02r19M99J103p75k61q85J088
5763F5r45K30N74L7J4K6L69k08K9J30l39J048q02K44m1M79j972L49Q80Q84j266
5784b15M25K58p64Q5L26k92R06o82Q45j188J596j272j90L88m44P1l67M81R7j03
5804c9m85N70m59N5J263r93m90P73l29l34L35Q50r80M38K12q6p04L9J012l60J23
$$ plain form
5825 411 949 896 -57 141 -101 -322 -177 -559 -338 -386 863 525 -337 -50 -423 234 140 -313 -624 -264 97
5846 97 450 -146 -90 -1118 811 -18 -1289 491 -501 372 -635 -756 -30 -150 58 -462 -147 -332 -40
5865 -40 -54 -151 17 -1009 10 315 -144 866 -373 -962 350 23 -1363 698 927 -173 -136 35 696
5884 696 416 -176 283 -489 6 863 -221 1197 -270 129 -914 -1059 -814 86 501 -229 487 -428 853
5903 853 -21 -1099 436 -270 -595 -475 372 -1127 -101 173 -384 1063 -478 47 190 -127 -376 -363
5921 -363 -329 -149 -139 -742 -63 -62 -554 -233 576 217 -84 1001 830 24 72 -365 -753 809 290 -619 605
5942 605 -186 -810 184 778 -748 -286 403 9 -415 -551 595 -951 371 222 -220 234 496 547 -515
5961 -515 36 149 547 87 878 494 -628 157 670 130 683 373 -73 500 161 -341 -509 1460 -133
$$ packed form
5825D11N38n3r53J98k42k21J45l82K21m8J249l38q62K87l73O57r4m53l11L60L61
5846I7L53n96N6j028J929q29j271J780r92Q73j007j21P26j20K08n20L15j85K92
5865d0j4r7J68j026J019L05m59J010j239n89J312l27j386K061K29j100L7J71O61
5884F96k80n92M59p72M95Q57j084J418j467L99j043j45K45R00M15p30P16r15J281
5903H53q74j078J535p06l25J20Q47j499J026K74n57J447j541N25J43l17k49J3
5921c63L4J80J0o03O79Jm92L21Q09l59l01J085j71q06M8m37l88J562n19r09J224
5942F05p91o24R94N94j526M62O89l94m24j36J146j546J322j49m42M54K62N1j062
5961e15N51J13L98m60P91l84j122P85N13n40N53l10m46N73l39n02j68J969j593
$$ plain form
5980 -133 101 410 -338 -452 -240 -431 -132 -124 -1062 156 -250 108 751 359 -382 -289 -525 -408 -199 248 -556
6001 -556 -169 79 7 -384 -120 -301 859 545 -156 29 184 171 -64 -634 712 80 543 594 -520 446
6021 446 194 332 -27 -111 527 481 -791 -56 178 -506 -300 462 351 -160 96 -406 -88 -373 -630 -466
6041 -466 -191 -1046 229 -221 -155 255 162 468 589 -336 -263 -14 -1199 -738 184 147 916 -317 138 -299
6061 -299 661 1000 319 -137 -929 -179 -46 -19 280 -198 -651 1022 212 -1021 -624 406 -402 -328 8 -576
6081 -576 69 -615 -91 -100 241 642 177 37 64 987 -944 -285 -1366 -570 160 995 232 133 884 248 -836
6102 -836 774 97 574 -921 -334 313 -33 809 242 354 -178 708 -692 -954 366 -15 187 496 29
6121 29 -652 301 156 -594 750 801 29 422 645 -327 -982 -126 -35 -580 358 594 -189 -519 -119 210 -311
$$ packed form
5980a33K34L09p48j14K12j91K99Qr38J218m06L58O43l92p41R3k36J17K09M47q04
6001e56L87K48p2l91K64j81J160l14p01J85J55j3k35n70J346o32M63N1j114R66
6021D46k52J38l59q4O38m6j272P35K34o84K06P62j11n11K56n02L18k85k57J64
6041d66K75q55J275m50O6M10r3L06J21r25P3K49j185M61R22l7P69j233M55m37
6061b99R60L39o81m56p92P50J33K7K99m78m53J673q10j233L97J030q08P4L36n84
6081e76O45o84N24rL41M01m65j40K7R23j931O59j081P96P30Q35p63r9P51o36j084
6102h36J610o77M77j495N87O47l46Q42n67J12n32Q86j400k62J320l81K02L09m67
6121B9o81R53j45p50J344N1p72L93K23r72o55Q56R1n45R38K36p83l30M00L29n21
$$ plain form
6142 -311 -662 241 -266 -208 79 -706 -927 -147 -105 -867 333 466 433 -303 349 -647 -188 -728 212 -688 189
6163 189 -227 124 558 -324 -139 186 -73 -507 88 -537 1493 300 572 -468 338 -389 -740 555 -145
6182 -145 453 106 -922 686 611 -46 -64 853 1033 807 27 422 291 530 -257 -218 -783 -316 -594 -321
6202 -321 473 591 -71 -72 408 -541 -456 -87 59 -286 -309 221 -426 -80 -411 639 -55 272 -148 -57 203
6223 203 -471 -363 -813 -736 -49 -883 236 963 -589 1006 371 504 -815 462 -160 -86 -350 -355 -380 561
6243 561 433 -112 -261 710 318 324 95 -457 -174 103 621 -392 254 -1 315 -335 -85 384 677 -821
6263 -821 33 53 -633 34 613 212 -411 440 1166 703 401 -44 -474 -115 -181 -192 140 -533 42 119 333
6284 333 804 -387 1171 -658 382 -78 -489 22 -563 -842 -1412 141 135 685 652 610 81 -676 -169 252
$$ packed form
6142c11l51R03n07N8K87p85k21P80M2p62J200J33l3p36O52r96M59n40R40r00Q77
6163A89m16L51M34q82J85L25k59m34N95o25K030j193K72j040Q06p27l51J295p00
6182a45N98l47j028J608p5o57j8R17J80k26p80L95j31K39p87L9n65M67k78K73
6202c21P94J18o62jM80r49Q5L69J46l45k3N30o47L46l31J050o94L27m20R1K60
6223B03o74J08m50P7O87q34J119P27j552J595o35J33j319J277o22P4k64nk5R41
6243E61j28n45j49R71l92Ok29n52K83K77N18j013O46k55L16o50K50M69K93j498
6263h21Q54K0o86O67N79m01o23Q51P26m63l02m45m30L59o6j1L32o73N75P7K14
6284C33M71j191J558j829J040m60m11N11n85k79n70J553oN50l3m2n29p57N07M21
$$ plain form
6304 252 -281 -376 -623 353 -427 145 661 436 1181 1095 267 -1280 240 207 208 -602 -307 -530 -1134 594 -154
6325 -154 -562 265 676 -122 -197 634 -103 -250 -468 -37 -678 539 -232 -654 -64 865 -360 -467 -1271 -1125
6345 -1125 377 -226 -700 -555 377 798 14 316 1007 -945 -919 738 -1400 -1631 -184 -600 -185 158
6363 158 1303 327 377 1200 -345 -445 -152 179 -662 -21 1110 397 83 608 -223 -59 61 60 -134 51
6383 51 54 -1046 237 -621 794 132 -218 383 521 276 842 305 -543 286 628 -1129 -661 866 -64
6402 -64 -611 444 227 354 76 -28 -1423 843 49 321 276 599 -146 3 -56 302 372 -166 216 169 73
6423 73 -1079 290 201 386 940 -233 271 365 1391 220 1578 69 -1100 -1194 -1207 598 -368 -121 -206
6442 -206 707 531 -475 32 493 -85 -1025 -307 608 165 -205 -334 815 -344 17 589 626 -260 -261 -963
$$ packed form
6304B52n33r5k47R76p80N72N16k25P45q6q28j547J520l3Jq10K95k23o04J728p48
6325a54m08Q27M11p98p5Q31p37j47k18M31o41J217p71m22N90R29j225j07q04J46
6345a125J502o03m74J45R32M21p84L02O91j952K6J657k138k31J447m16M15L43
6363A58J145r76N0Q23j545j00K93L31q41O41J131p13l14N25q31J64J20jj94J85
6383E1Lj100J283q58J415o62l50O01J38k45N66n37q48Q29L42j757M68J527r30
6402f4n47J055k17J27k78j04j395K266p94K72m5L23p45J49n9L58P0n38L82m7r6
6423G3j152J369q9J85N54j173N04R4J026j171J358j509j169r4j3J805r66K47q5
6442b06R13j76j006N07M61n78r40P18R15m43l70j29J149j159L61N72L7q86jp02
$$ plain form
6462 -963 -414 -244 376 -501 69 -217 -192 993 879 152 218 263 -662 -366 -191 -318 -634 -595 114 -281 -160
6483 -160 845 1436 170 -412 214 105 -87 90 710 426 475 518 -420 41 -229 -251 377 11 -644 -112
6503 -112 -1280 413 -641 -81 382 -36 293 800 1454 -505 -1072 -702 -427 1016 648 -763 140 417
6521 417 653 71 628 -70 -1736 -180 -173 -1378 -792 386 -1067 -521 525 177 -491 -267 385 -461 566
6540 566 492 135 -707 -644 -567 323 -122 263 404 -575 616 699 -543 -416 192 -821 503 633 -396 -402
6560 -402 27 -189 361 -522 -327 -288 -860 -521 -612 -164 -276 184 -303 -163 744 -53 235 566 -753 -208
6580 -208 -579 151 -1016 694 -53 -376 -67 -225 910 -109 -66 -372 -790 -572 -225 -695 -1339 47 558
6599 558 -416 420 2268 -65 -415 96 -704 -234 -719 -665 12 -406 -428 -190 -241 -71 568 -197 400 -109
$$ packed form
6462i63N49J70O20q77N70k86K5J185j14p27O6M5r25K96J75j27l16L9P09l95J21
6483a60J005N91j266n82O26j09j92J77O20k84M9M3r38M61k70k2O28l66o55N32
6503a12j168J693j054N60M63m18L29N07O54j959n67L70K75J443l68j411R03K77
6521D17K36n82N57o98j666J556Pj205N86J178j453N46J046l48o68K24O52q46J027
6540E66p4l57q42O3P7Q90m45L85J41r79J191Q3j242J27O08j013J324J30j029o
6560d02M29k16N50q83J95L9n72L39r1M48j12M60m87J40R07p97K88L31j319N45
6580b08l71P30j167J710p47l23L09j58J135j019M3l06m18K18L47m70o44J386N11
6599E58r74Q36J848k333l50N11q00M70m85N4O77m18k2K38n1J70O39p65N97n09
$$ plain form
6619 -109 -599 -900 586 -1314 -676 178 512 889 -452 337 -67 -445 -131 -1046 -746 -308 -92 -902 791
6638 791 515 71 577 64 -657 -530 127 236 -385 155 -615 -726 305 201 -830 870 78 138 463
6657 463 1108 -432 -1125 -443 -512 -33 -1028 176 313 413 -136 954 911 -121 -133 -177 -13 -696 -999 -58
6677 -58 156 209 -95 364 406 376 -419 375 -355 -438 -924 -495 -566 240 263 -244 -511 -384 -150 -193 246 -702 -920
6700 -920 -407 -461 238 -23 488 1687 -680 318 -77 -95 -870 582 -350 -46 159 5 557 204 630 418
6720 418 -143 457 -530 -233 -108 -848 -38 -477 1027 -222 1152 811 788 642 406 -392 -147 -42 -614
6739 -614 -77 -961 64 14 -716 33 -191 193 181 -380 -1186 -427 -701 -202 -284 555 -772 -325 510 138
6759 138 758 90 268 -124 -479 639 -311 -441 187 -644 -917 105 413 -45 -197 39 161 -236 557
$$ packed form
6619a09m90l01J486j900O38Q54L34L77j341P89m04l78L14r15L00M38K16q10J693
6638G91k76m44N06n13p21J27O57J09o21N40p70j11J031j04j031J700p92O0L25
6657D63O45j540o93O82o9M79r95J204J37J00n49J090m3j032j2m4J64o83l03R41
6677e8K14N3l04M59M2l0p95P94p30q3m86M29p1Q06K3n07k67J27K34m3M39r48k18
6700i20N13n4O99k61N11J199k367R98l95j8p75J452r32L04K05j54N52l53M26k12
6720D18n61O00r87K97J25p40Q10m39J504j249J374l41k3j46k36p98K45J05n72
6739f14N37q84J025n0p30P49k24L84j2n61q06P59k74M99q2Q39j327M47Q35l72
6759A38O20o68J78l92l55J118r50j30O28q31k73J022L08m58j52K36J22l97P93
$$ plain form
6778 557 -445 -637 320 142 -646 177 571 228 -58 -540 766 -218 -893 -693 -629 -1020 326 10 964
6797 964 48 427 445 595 457 74 510 -552 -586 -1049 -43 -176 179 -538 1095 -383 512 463 433 -419
6817 -419 220 -564 -557 -795 -131 -677 -208 -197 -360 13 159 340 301 -170 -57 -1464 62 -9 517 310 -128
6838 -128 736 -132 -54 697 221 -20 -6 -1014 -336 247 -166 39 69 388 715 67 1525 106 97 498 -94
6859 -94 -99 -1033 -159 -356 159 24 576 822 268 873 -169 -1054 -191 -1161 -811 499 1568 -547 145 414
6879 414 -32 473 934 918 -626 -1211 -40 401 -242 6 291 -349 916 18 -39 783 1078 -659 280
6898 280 -317 -409 142 59 -299 -50 284 1095 883 -345 -853 -316 -805 879 172 -365 -212 555 -345 343
6918 343 521 -194 1112 214 -429 -302 -28 -94 62 -229 366 1254 157 586 -343 -427 185 -281 64 -983
$$ packed form
6778E57j002j92R57j78p88Q23L94l43k86m82J306r84o75K00O4l91J346l16R54
6797I64r16L79J8J50j38l83M36j062l4m63J006j33L55p17J633j478Q95m9l0q52
6817d19O39p84Pk38O64n46M69J1j63L73J46J81l9m71J13j407J526p1N26k07m38
6838a28Q64q68P8P51m76k41J4j008O78N83m13K05L0L19L27o48J458j419rM01n92
6859i4nr34Q74j97N15j35N52K46n54O05j042q85Q63r70L50J310J069k115O92K69
6879D14m46N05M61j6j544n85J171M41o43K48K85o40J265q98n7Q22K95j737R39
6898B80n97r2N51q3l58K49L34Q11k12j228n08N37m89J684p07n37J53P67r00O88
6918C43J78p15J306q98o43J27K74o6J56k91N95Q88j097M29r29q4O12m66L45j047
$$ plain form
6938 -983 -539 -244 -221 -573 136 269 850 921 650 -358 903 -599 -628 -199 -316 -988 -885 -1422 -140 -630
6958 -630 -518 -627 18 229 126 -841 -418 544 -162 182 -108 218 -28 153 505 -71 -441 -362 58 -482
6978 -482 -277 -329 -683 792 491 -348 422 517 223 251 -466 -57 -689 213 143 451 326 634 -487 -771 56
6999 56 -424 -522 -20 32 -492 -432 89 -45 541 -88 -87 353 178 621 347 -495 617 -105 -532 -184 -621 -34
7021 -34 765 -407 798 466 231 507 251 481 264 -647 197 -300 -650 -238 926 -532 317 515 377
7040 377 619 442 -47 -82 -1302 -466 21 411 -74 -790 515 785 716 -477 -70 -235 2 58 -411 -62
7060 -62 -845 -746 981 -128 207 383 -255 -723 615 -250 -1406 302 240 274 323 938 992 99 436 -246
7080 -246 -251 -117 260 -593 -942 1771 860 -35 470 234 157 971 -330 -599 -762 242 -647 -31 160 918
$$ packed form
6938i83M44K95K3l52P09J33N81P1k71j008J261j502k9M29j17o72J03n37J282m90
6958f30J12j09O45K11j03r67M23R62p06L44k90L26k46J81L52n76l70P9M20n40
6978d82K05n2l54J475l01q39P70R5k94K8p17M09o32R02p0L08j25L08j121k84Q27
6999E6m80r8N02N2n24O0N21j34N86o29JM40j75M43k74q42J112p22m27L48m37N87
7021c4P99j172J205l32k35K76k56K30k17r11Q44m97l50M12J164j458Q49J98j38
7040C77K42j77m89l5j220Q36M87L90m85p16J305K70o9j193M07j65K37N6m69L49
7060f2p83R9J727j109L35J76o38m68J338q65j156J708o2L4M9O15N4q93L37o82
7080b46nJ34L77q53l49K713r11q95N05k36p7Q14j301k69j63J004q89O16J91P58
$$ plain form
7100 918 468 785 365 355 519 420 -70 -703 -540 -422 127 -402 445 836 -733 628 1173 -90 1178
7119 1178 522 160 164 -375 -502 756 -106 -879 327 23 903 -168 174 836 18 201 -637 259 -170
7138 -170 -746 -386 31 -400 522 -312 99 547 479 -108 6 -584 -460 -433 -1198 38 411 579 848 -44
7158 -44 70 1083 280 427 -549 641 -247 -34 -303 108 -29 177 367 -195 -373 -501 -879 -53 -283 -1153
7178 -1153 516 99 -338 1308 1388 1203 -143 -137 -455 -525 -409 -678 -1035 -1133 73 -798 33 42 1397 -505
7198 -505 416 8 544 -322 -1095 354 321 646 -176 602 414 -139 -339 68 295 -510 117 963 -133 -375
7218 -375 -386 393 241 -704 754 592 275 -1 287 -408 -1363 -329 -1398 909 -423 -546 400 -624
7236 -624 -72 -392 669 -469 180 -1321 42 332 513 413 -296 -1582 124 1398 529 -338 1421
$$ packed form
7100I18m50L17m20j0J64r9m90o33J63J18N49n29Q47L91j569J361N45j263J268
7119A178o56l62Mn39j27J258q62p73J206l04Q80j071L42O62q18J83q38Q96m29
7138a70n76L60M17m31R22q34M11M48o8n87J14n90J24K7p65J236L73J68K69q92
7158d4J14J013q03J47r76J190q88K13k69M11j37K06J90n62j78j28l78Q26k30q70
7178a153J669m17m37J646Q0j85j346Ol18p0J16k69l57r8J206q71Q31RJ355j902
7198e05R21m08N36q66p73J449l3L25q22P78j88n53k00M07K27q05O27Q46j096k42
7218c75j1P79j52r45J458j62l17k76K88o95r55J034j069K307j332j23R46j024
7236f24N52l20J061j138O49j501J363K90J81j00p09j286J706J274q69q67J759
$$ plain form
7253 1421 699 -333 222 -205 447 -1059 356 -285 626 -359 -410 -488 -102 -767 -755 537 1289 -134 421
7272 421 273 8 105 376 473 -486 -435 595 -375 -621 -759 -246 -312 428 248 311 396 938 -86 258 -23
7293 -23 -21 277 6 257 216 483 259 84 201 764 -460 -1052 21 -452 -357 -380 -345 163 -525 -313 990
7314 990 1500 -104 971 -243 -700 76 143 -943 -81 -660 714 -94 351 -28 -871 1030 -655 379
7332 379 367 573 103 230 -274 159 290 266 20 41 -29 -201 -4 599 754 18 -396 -1113 38 198 396
7353 396 -348 324 209 324 569 -492 -1257 -109 7 -554 -507 576 -178 990 759 -515 663 447
7371 447 -483 991 475 -208 405 -437 376 -709 -339 656 251 425 1212 -429 588 -345 -161 -62 787
7390 787 202 1249 312 809 -63 217 1093 -110 -175 1003 422 90 -54 283 867 -224 203 352 573
$$ packed form
7253A421p22j032N55m27O52j506J415o41R11r85n1p8L86o65J2J292P52j423N55
7272D21j48k65R7K71R7r59N1J030r70k46j38N13o6P40j80O3Q5N42j024L44k81
7293b3KK98k71K51m1K67k24j75J17N63j224n92J073m73R5k3L5N08o88K12J303
7314I90N10j604J075j214m57P76O7j086Q62n79J374q08M45l79q43J901j685J034
7332C79j2K06m70J27n04M33J31k4k46K1p0j72J97O03J55p36m14p17J151J60J98
7353C96p44O72j15J15K45j061p65J148J16n61M7J083p54J168k31j274J178k16
7371D47r30J474n16o83O13q42Q13j085L70R95m05J74P87j641J017r33J84R9Q49
7390G87n85J047r37M97q72K80Q76j203o5J178n81l32j44L37N84j091M27J49K21
$$ plain form
7409 573 229 598 -193 -873 -833 339 242 1318 -1007 421 -807 517 -499 815 812 200 -355 367 -632
7428 -632 -51 405 123 -310 73 -72 493 255 -707 -491 -1043 -32 -1239 -31 82 -3 447 -806 51
7447 51 -89 -559 -459 413 -503 215 -269 -143 128 499 289 -444 -199 -357 -456 103 -93 -423 -160 544 64
7468 64 59 757 -299 374 -291 278 -730 -176 -62 -392 185 -241 -440 -1360 -965 751 186 -966 239
7487 239 186 287 149 78 -1152 -288 -262 -75 316 -43 1235 333 841 74 -386 336 631 -702 124 -1010
7507 -1010 -4 558 -130 -150 1123 129 -164 58 927 -523 -403 -51 453 -777 313 765 -482 632
7525 632 -729 236 -55 160 817 -168 -370 336 -263 -867 -258 -442 -1 365 918 -134 264 -259 175
7544 175 237 -1282 -645 -705 -476 -412 849 11 35 -583 -116 117 232 207 -172 558 120 -748 369 1442
$$ packed form
7409E73l44L69p91o80M0J172r7J076k325J428j228J324j016J314lo12n55P22r99
7428f32N81M56k82m33L83j45N65k38r62K16n52J011j207J208J13q5M50j253Q57
7447E1j40m70J00Q72r16P18m84J26K71L71k10p33K45j58r9N59j96l30K63P04m80
7468F4nO98j056O73o65N69j008N54J14l30N77m26j99r20L95J716n65j152J205
7487B39n3J01j38p1j230Q64K6J87L91l59J278r02N08p67m60P22K95j333Q26j134
7507a010J006N62o88k0J273r94k93K22Q69j450J20L52N04j230J090M52j247J114
7525F32j361R65k91K15O57r85k02P06n99o04O09j84M41L66N53j052L98n23M34
7544A75O2j519O37o0K29O4J261q38K4o18M67K33J15k5l79P30m38q68J117J073
$$ plain form
7564 1442 342 1140 302 508 927 -31 -1391 -862 -295 591 986 -971 60 -242 1134 328 516 163
7582 163 -447 98 -1097 -472 -521 -156 157 -406 104 -260 168 21 -113 373 589 846 -220 304 -94 635
7602 635 -157 -178 -75 -567 -484 230 -221 572 233 -414 148 440 -750 536 556 434 306 -529 -168 -592
7622 -592 -485 -77 222 685 1157 849 271 -757 234 -994 -189 -243 270 0 -111 -474 169 -209 -402 401
7642 401 -1133 419 60 359 553 -152 76 -144 134 704 80 142 -27 70 246 -456 -21 -340 1313 202
7662 202 -507 528 -454 -123 -349 52 -205 -585 400 -573 205 134 -569 685 647 242 -128 -431 936 957
7682 957 -219 -120 192 -113 -77 511 52 -346 -60 -246 -1017 -51 -292 -212 -502 -488 560 -555 133 36 235
7703 235 -170 145 -501 131 301 -355 -6 599 -275 -898 -397 302 279 -513 454 -231 7 163 131 -443 240
$$ packed form
7564A442j100P98q38K06M19r58j360N29N67Q86L95j957J031l02J376q06J88l53
7582A63o10N45j195O25m9L65L13n63N10l64M28j47j34M86K16K57j066N24l98P29
7602F35p92k1J03m92Q3P14m51P93l39o47N62K92j190J286K0j22j28q35L61m24
7622e92J07M08K99M63M72l08n78j028R91j228Q05n4N13k70j11l63O43l78j93Q03
7642D01j534J552l59K99J94p05K28k20K78N70o24O2j69R7J76p02M35l19J653j111
7662B02p09J035r82L31k26M01k57l80R85r73P78p1p03J254l8m05l70l03J367K1
7682I57j176R9L12l05L6N88m59l98K86j86p71R66k41Q0k90J4J048j115O88r7J99
7703B35m05L15o46O32J70o56L49O05q74o23N01O99k3p92R67o85K38J56l2n74O83
$$ plain form
7724 240 1120 718 538 503 -1701 401 353 435 -189 387 -322 139 -183 -815 887 337 -236 -43 -690 307
7744 307 600 567 491 130 414 -768 -563 428 219 -45 -247 -1311 340 -334 124 -700 -562 -462 -148 437
7764 437 -516 133 73 -225 280 -264 57 -28 152 -498 832 434 -1146 353 670 389 279 150 -1120
7783 -1120 -714 -434 -719 404 408 -171 -1139 757 226 -569 38 -954 -28 551 356 432 -55 -285 472 528
7803 528 488 376 400 -878 443 601 527 209 395 526 -406 999 295 -477 -137 -287 -634 -23 48 -194
7823 -194 -408 -228 149 410 -265 130 -657 -344 101 -677 194 430 419 1376 283 -180 -25 -477 48 -154
7843 -154 211 -429 508 -796 1048 240 -1175 357 236 -17 123 -670 -58 -350 -588 -147 -218 334 288
7862 288 481 546 414 -1112 -417 855 -136 548 176 -216 6 -333 379 -274 -582 -68 48 -508 -435 -50
$$ packed form
7724B40Q80m02j80l5k204K102m8Q2o24N76p09M61l22o32J702n50n73J93o47R97
7744C07K93l3p6l61K84j182K05R91k09k64k02j064J651o74M58q24J38J00L14N85
7764D37r53O49o0k98N05n44L21q5J80o50J330l98j580J499L17k81j10j29j270
7783a120M06K80k85J123Mn79r68J896n31p95O07r92R26N79j95P6m87k30P57N6
7803E28m0j12K4j278J321J58p4l18J86J31r32J405p04p72L40j50l47O11P1k42
7823a94k14J80L77K61o75L95p87L13M45p78Q71K36j1R57j093m63J55m52N25k02
7843a54L65o40R37j304J844q08j415J532j21k53J40p93O12k92k38M41p1N52m6
7862B88J93O5j32j526O95J272r91O84l72l92K22l39P12o53l08N14J16n56P3L85
$$ plain form
7882 -50 -75 -88 482 813 -447 -240 -121 -303 -172 262 -84 382 49 -142 123 266 364 950 38 530 -406
7903 -406 544 329 -995 -15 803 1147 -462 638 -805 341 -245 554 -739 -425 501 140 -223 -458
7921 -458 206 -801 250 43 651 87 176 -195 -133 -467 -420 -466 -324 19 28 531 -142 -103 -523 -1097 12
7942 12 1094 332 -62 194 24 -638 -168 -564 -1056 -130 -945 -234 113 71 -671 299 -30 -200 -649 566
7962 566 -141 -548 22 -29 527 860 687 -388 159 -388 54 -607 -98 974 -179 -230 522 -841 639
7981 639 288 -488 1096 737 22 -252 169 49 -15 -601 -149 19 798 163 -69 216 -953 22 -418 -436
8001 -436 -612 424 -44 332 -819 -168 651 -425 167 387 244 465 -69 114 -97 96 892 225 -974
8020 -974 -433 387 -341 415 -888 586 -348 -712 -275 -524 78 -1051 -71 -706 -117 -369 89 197 -172
$$ packed form
7882e0k5j3N70L31j260K07J19j82J31M34l46M66l33j91K65J43R8N86r12M92r36
7903d06R50k15j324R80Q18L44j609J100j443J146n86P99j293L14R26l61l63k35
7921d58O64j007J051k07O08n64Q9l71O2l34M7m6J42L43RN03o73L9m20n74J109
7942A2J082p62l94K56j70o62M70l96m92R26q15P11L47m2p42R70l29j70m49J215
7962E66p07m07N70n1N56L33j73j075N47n47M42o61N09J072j153n1P52j363J480
7981F39l51p76J584l59p15k74M21j20o4n86M52J68P79o35k32K85j169R75m40j8
8001d36j76J036m68L76j151O51Q19j076N92K20j43K21n34J83k11J93P96o67j199
8020i74N41Q20p28P56j303J474r34l64M37k49O02j129R80o35N89k52M58J08l69
$$ plain form
8039 -172 329 -100 -28 375 -216 -66 890 -769 321 -381 360 393 -45 112 139 -870 -423 -66 254 -234
8059 -234 -487 -174 -303 434 89 347 72 -810 -91 312 -427 9 32 1787 750 -21 -33 191 799 122
8079 122 -576 505 1024 595 -580 -541 314 37 -396 1018 -151 -329 916 -79 33 -296 436 175 80
8098 80 580 390 -1208 613 612 460 465 -10 363 342 -25 -106 -70 -108 348 -118 157 1060 -99 603 680 564
8120 564 -1304 -127 -113 178 -191 171 -497 624 -284 -720 511 -566 51 -233 -246 -73 225 -196 -373
8139 -373 18 -229 21 231 -68 63 -350 261 165 -23 -537 -260 -91 190 731 -873 1115 207 1212
8158 1212 485 -879 -682 493 464 519 -966 255 796 -369 -177 -214 -178 633 920 -348 -41 -113 -205 -453
8178 -453 -202 -458 -134 153 1815 -139 81 188 -217 214 88 -812 34
$$ packed form
8039a72N01m29P2M03n91J50R56j659J090p02P41L3m38J57K7j009M47L57L20m88
8059b34k53L13j29P37l45K58k75q82P19M03p39M36K3J755j037p71j2K24O08o77
8079A22o98J081N19m29j175L9Q55k77m33J414j169j78J245r95J12l29P32k61r5
8098H0N00j90j598J821jj52Nm75L73k1l67q1L6l8M56m66K75R03j159P02P7j16
8120E64j868J177J4K91l69L62o68J121r08m36J231j077O17k84j3J73K98m21j77
8139c73L91k47K50K10k99J31m13O11r6j88n14K77J69K81N41j604J988r08J005
8158A212p27j364J97J175k9N5j485J221N41j165J92l7L6Q11K87j268L07p2r2k48
8178d53K51k56L24K87J662j954K20J07m05M31j26r00Q46
8191C4
$$ Imaginary data points
##PAGE= N=2
##DATA TABLE= (X++(I..I)), XYDATA
$$ plain form
0 0 0 0 0 0 0 0 0 0 0 0 0 0 0 0 0 0 0 0 0 -6 108 -108 108 -108 108 -108 151 -216 216 -216 285 -324 331 -414 436
35 436 -512 560 -634 704 -781 877 -974 1076 -1185 1306 -1435 1593 -1749 1930 -2120 2336
51 2336 -2581 2843 -3137 3476 -3853 4295 -4798 5396 -6112 6983 -8066 9464 -11343 14012
65 14012 -18066 24847 -38366 74922 -361158 -912521 412949 305829 -514136 192108 533547
76 533547 -298039 117714 758174 -54157 -281603 566170 218269 -446516 138344 332067
86 332067 -359910 -99064 455939 -63962 -276271 378667 199721 -407537 -2396 248870
96 248870 -402940 -337105 234922 -190591 -472677 234414 201654 -377598 121112 474275
106 474275 -222718 -161534 424205 -109505 -442135 242271 109399 -469595 77274 369307
$$ packed form
0@%%%%%%%%%%%%%%%%%%%oJ14k16K16k16K16k16K59l67M32m32N01o09O55p45Q50
35D36r48J072j194J338j485J658j851K050k261K491k741L028l342L679m050M456
51B336m917N424n980O613p329Q148r093J0194j1508J3095j5049J7530k0807K5355
65A4012l2078M2913o3213J13288m36080n51363J325470j07120q19965P06244L41439
76E33547q31586M15753O40460q12331k27446Q47773l47901o64785N84860J93723
86C32067o91977K60846N55003n19901k12309O54938j78946o07258M05141K51266
96B48870o51810O5835N72027m25513k82086P07091l2760n79252M98710L53163
106D74275o96993O1184N85739n33710l32630O84406j32872n78994N46869K92033
$$ plain form
116 369307 -272777 -84843 470528 -39298 -282761 299605 99968 -419439 18408 220186
126 220186 -310816 -142525 349115 -7466 -195858 315679 236691 -210541 101321 313562
136 313562 -179624 -159957 271300 -33069 -279959 213099 203877 -257757 51040 324417
146 324417 -195201 -220186 230231 -106219 -410366 70246 51545 -393758 -43758 246086
156 246086 -205320 -131370 320193 -15650 -263281 187842 117015 -306105 11507 250929
166 250929 -151859 -75305 342739 88737 -113785 279384 234957 -163145 45014 225112
176 225112 -179946 -196461 171548 -37764 -257861 126484 171723 -192985 8207 249727
186 249727 -127755 -191479 160482 -57781 -327864 30189 83113 -265801 -33168 257957
$$ packed form
116C69307o42084J87934N55371n09826k43463N82366j99637n19407M37847K01778
126B20186n31002J68291M91640l56581j88392N11537p8988m47232L11862K12241
136C13562m93186J9667M31257l04369k46890M93058r222m61634L08797K73377
146C24417n19618k4985M50417l36450l04147M80612j8701m45303L50000K89844
156B46086m51406P3950M51563l35843k47631M51123p0827m23120L17612K39422
166B50929m02788P6554M18044k54002k02522L93169m4427l98102K08159J80098
176B25112m05058j6515L68009k09312k20097L84345M5239l64708K01192K41520
186B49727l77482o3724L51961k18263k70083L58053N2924l48914K32633K91125
$$ plain form
196 257957 -62906 -85803 274464 71637 -189041 113713 116288 -241873 -69412 160769
206 160769 -133719 -141066 206265 68579 -133488 153700 183660 -139513 -27392 158821
216 158821 -122906 -180693 114399 5364 -190736 86150 175038 -95666 16858 230529
226 230529 -24015 -121083 138008 17471 -218406 12494 97403 -167097 -52175 184630
236 184630 -30879 -105864 161639 58688 -173445 27326 85931 -188216 -102918 115252
246 115252 -74146 -130091 139428 81972 -107710 84968 152776 -101762 -51832 127856 -62091
257 -62091 -144206 93782 51651 -122065 67828 167819 -49074 -8191 165199 -17901 -130005
268 -130005 65895 11858 -181138 -18833 91748 -97200 -44276 157207 16340 -82401
$$ packed form
196B57957l20863k2897L60267k02827k60678L02754K575l58161J72461K30181
206A60769k94488p347L47331j37686k02067K87188K9960l23173J12121J86213
216A58821k81727n7787K95092j09035j96100K76886Q8888k70704J12524K13671
226B30529k54544r7068K59091j20537k35877K30900Q4909k64500J14922K36805
236A84630k15509p4985K67503j02951k32133K00771N8605k74147Q5298K18170
246A15252j89398n5945K69519n7456j89682J92678O7808k54538M9930J79688j89947
257f2091q2115K37988m2131j73716J89893R9991k16893M0883J73390j83100j12104
268a30005J95900n4037j92996J62305J10581j88948N2924K01483j40867r8741
$$ plain form
278 -82401 109658 64062 -143322 -23060 64830 -136476 -107581 91732 -17464 -97125 115473
289 115473 114496 -64641 50625 140035 -67727 -83590 82021 -38632 -151023 38693 61731
300 61731 -95139 28949 155553 -14209 -28451 132451 15599 -124198 21932 26640 -149553
311 -149553 -55863 78057 -58460 -64227 115959 47119 -73097 64632 78944 -100898 -48651
322 -48651 65728 -70933 -102809 69940 30679 -73707 67241 119476 -35853 2603 112008
333 112008 -22367 -86682 53329 11017 -109241 13937 83148 -50992 -9227 118955 4414
344 4414 -68669 60621 17732 -124418 -31961 33325 -97895 -63873 79637 2263 -51517
355 -51517 87959 72888 -61957 8495 64119 -78953 -82008 42575 -26986 -88332 52464
$$ packed form
278h2401J92059m5596k07384J20262Q7890k01306K8895J99313j09196p9661K12598
289A15473r77j79137J15266Q9410k07762j5863J65611j20653j12391J89716K3038
300F1731j56870J24088J26604j69762j4242J60902j16852j39797J46130M708j76193
311a49553R3690J33920j36517n767J80186o8840j20216J37729J4312j79842N2247
322d8651J14379j36661l1876J72749l9261j04386J40948N2235j55329L8456J09405
333A12008j34375o4315J40011m2312j20258J23178O9211j34140M1765J28182j14541
344D414p3083J29290m2889j42150R2457O5286j31220L4022J43510p7374n3780
355e1517J39476j5071j34845P0452N5624j43072l055J24583o9561o1346J40796
$$ plain form
366 52464 73142 -32868 46173 122687 -6912 -32172 70219 -12845 -110633 -2157 15160
377 15160 -93431 -15706 89297 -4315 -10688 110534 51236 -49702 36916 39920 -96271
388 -96271 -55071 31633 -62298 -73117 62613 34902 -43666 60876 91094 -40261 -21195
399 -21195 54966 -55001 -102304 10440 -17367 -102420 5206 67012 -37349 -904 103940
410 103940 9696 -51747 54035 23861 -92283 -8525 52077 -55282 -24421 99422 26426
421 26426 -27721 92899 76379 -51075 13162 62143 -66199 -66860 46733 -20284 -75731 47821
433 47821 56437 -52496 13739 77487 -47247 -67419 36028 -32410 -115181 -4111 20339
444 20339 -80157 -7681 89218 -6067 -24870 88902 28381 -74384 19360 36225 -91348
$$ packed form
366E2464K0678j06010P9041P6514j29599k5260J02391q3064r7788J08476J7317
377A5160j08591P7725J05003r3612o373J21222n9298j00938Q6618L004j36191
388i6271M1200Q6704r3931j0819J35730k7711p8568J04542L0218j31355J9066
399b1195P6161j09967m7303J12744k7807q5053J07626O1806j04361L6445J04844
410A03940r4244o1443J05782l0174j16144Q3758O0602j07359L0861J23843p2996
421B6426n4147J20620j6520j27454O4237M8981j28342o61J13593o7017n5447J23552
433D7821Q616j08933O6235O3748j24734k0172J03447o8438q2771J11070K4450
444B0339j00496P2476R6899r5285j8803J13772o0521j02765R3744J6865j27573
$$ plain form
455 -91348 -39688 66998 -25386 -43611 93989 63096 -33613 65355 89929 -49696 -25662
466 -25662 58231 -53638 -91376 41625 13221 -79533 36704 91725 -30642 -489 96564
477 96564 -11072 -72833 34473 -5744 -116514 -22535 36477 -71878 -33679 88915 7872
488 7872 -49164 68886 45811 -77086 -4905 48171 -79519 -66299 55485 -18390 -70572
499 -70572 66204 68230 -44955 34912 95740 -36222 -40521 70885 -12885 -83942 43981
510 43981 41636 -70595 19396 97588 -26222 -24409 94223 6221 -82254 30421 26112 -97747
522 -97747 -18897 64048 -48452 -44468 81871 7961 -71379 49254 44620 -91385 -26666 55757
534 55757 -68536 -77286 61770 8772 -71585 55810 74534 -55742 1953 83181 -47217
$$ packed form
455i1348N1660J06686r2384j8225J37600l0893r6709R8968K4574j39625K4034
466b5662Q3893j11869l7738J33001k8404r2754J16237N5021j22367L0153R7053
477I6564j07636o1761J07306m0217j10770R3979N9012j08355L8199J22594q1043
488G872n7036J18050k3075j22897P2181N3076j27690J3220J21784p3875n2182
499g0572J36776K026j13185P9867O0828j31962m299J11406q3770p1057J27923
510D3981k345j12231Q9991P8192j23810J813J18632q8002q8475J12675m309j23859
522i7747P8850Q2945j12500L984J26339p3910p9340J20633m634j36005O4719Q2423
534E5757j24293q750J39056n2998q0357J27395J8724j30276N7695Q1228j30398
$$ plain form
545 -47217 -66620 65055 -675 -94775 37927 70631 -54714 12238 117064 -2648 -35704
556 -35704 87538 17475 -93134 19784 41519 -92200 -27522 80645 -31619 -54453 88146
567 88146 34261 -73721 36119 58965 -90148 -48820 52112 -60800 -91119 54670 19230
578 19230 -78163 41496 83638 -52787 -11702 94524 -23848 -75884 57715 15197 -97372
589 -97372 19547 76283 -53627 -11230 109822 -1174 -57783 76404 32838 -92768 9736
600 9736 60908 -77590 -40887 80124 -21241 -64414 78523 45142 -76846 22253 68471
611 68471 -74635 -48639 69387 -26478 -76828 59643 37981 -71212 26178 80335 -52793
622 -52793 -34279 75841 -25736 -91808 37486 23220 -90948 9263 82714 -42780 -25905
$$ packed form
545d7217j9403J31675o5730r4100J32702L2704j25345O6952J04826j19712l3056
556c5704J23242p0063j10609J12918K1735j33719O4678J08167j12264k2834J42599
567H8146n3885j07982J09840K2846j49113M1328J00932j12912l0319J45789l5440
578A9230r7393J19659M2142j36425M1085J06226j18372n2036J33599m2518j12569
589i7372J16919N6736j29910M2397J21052j10996n6609J34187m3566j25606J02504
600I736N1172j38498L6703J21011j01365m3173J42937l3381j21988R9099M6218
611F8471j43106K5996J18026r5865n0350J36471k1662j09193R7390N4157j33128
622e2793J8514J10120j01577o6072J29294j4266j14168J00211P3451j25494J6875
$$ plain form
633 -25905 95860 -804 -73442 55014 33610 -96176 -4076 66706 -64710 -40158 97327
644 97327 11859 -51324 84462 63776 -69438 10521 68032 -70345 -60082 60470 -24374
655 -24374 -85800 51692 46356 -67457 20892 87751 -41814 -43665 66844 -20189 -99198 22969
667 22969 24280 -87764 -4135 81966 -33942 -30298 97407 22121 -62956 53018 48542 -85307
679 -85307 -16148 65384 -55868 -54673 81776 14287 -64779 60836 64580 -69974 -2965 74211
691 74211 -54933 -64183 59626 -11060 -85609 39193 54239 -63224 6459 86573 -32374
702 -32374 -48101 66033 -264 -83885 25573 44497 -70261 -9136 80326 -23946 -40557
713 -40557 77829 20502 -73039 25803 43655 -78869 -28333 65897 -35306 -54474 73511
$$ packed form
633b5905J21765r6664p2638J28456k1404j29786R2100P0782j31416K4552J37485
644I7327q5468o3183J35786k0686j33214P9959N7511j38377J0263J20552q4844
655b4374o1426J37492n336j13813Q8349O6859j29565j851J10509q7033p9009J22167
667B2969J311j12044Q3629Q6101j15908L644J27705p5286q5077J15974m476j33849
679h5307O9159Q1532j21252J195J36449o7489p9066J25615L744j34554O7009P7176
691G4211j29144r250J23809p0686p4549J24802J5046j17463O9683Q0114j18947
702c2374j5727J14134o6297q3621J09458J8924j14758O1125Q9462j04272j6611
713d0557J18386n7327r3541R8842J7852j22524N0536R4230j01203j9168J27985
$$ plain form
724 73511 28228 -61990 41428 62944 -61722 -18879 63884 -44890 -68966 52062 7091
735 7091 -71083 38095 66864 -45302 526 81321 -21820 -53523 49051 1876 -83421
746 -83421 10958 40827 -62089 -14924 76717 -7144 -37054 71005 29833 -65091 15478 43933
758 43933 -68064 -36985 54706 -28279 -56997 59173 33930 -54836 33010 67864 -46967
769 -46967 -22753 61512 -28583 -68857 41142 14610 -70379 19225 60405 -40847 -11860 73906
781 73906 -9942 -51695 45500 16480 -70381 4844 45404 -50248 -25033 63552 -5581 -47161
793 -47161 46810 27698 -60340 5778 47670 -50135 -34097 55620 -8192 -49108 48568 37907
805 37907 -50523 12890 59462 -38050 -32841 52773 -10530 -58246 37561 33612 -50752 11476
$$ packed form
724G3511m5283r0218J03418K1516j24666M2843Q2763j08774k4076J21028m4971
735G091p8174J09178K8769j12166M5828Q0795j03141l1703J02574m7175q5297
746h3421R4379K9869j02916M7165R1641q3861k9910J08059m1172r4924Q0569K8455
758D3933j11997L1079R1691q2985k8718J16170k5243q8766Q7846L4854j14831
769d6967K4214Q4265r0095m0274J09999k6532q4989Q9604M1180j01252K8987Q5766
781G3906q3848m1753R7195k9020q6861P5225M0560r5652K5215Q8585o9133m1580
793d7161R3971j9112q8038O6118M1892r7805J6038Q9717o3812m0916R7676j0661
805C7907q8430O3413M6572r7512N209Q5614o3303m7716R5807l949q4364O2228
$$ plain form
817 11476 60496 -31061 -25977 53693 -9900 -64634 22145 16451 -65644 -7130 47159 -30966
829 -30966 -25068 58975 7909 -42061 34162 30587 -52944 -7386 41536 -33959 -35248 49701 11278
842 11278 -36941 40425 46494 -32801 4743 52705 -26518 -40492 33336 -6426 -59885 15442
854 15442 28675 -43394 -2933 53857 -16972 -28768 44218 5223 -51499 15411 25359 -47977
866 -47977 -10891 45211 -17315 -26587 49484 17802 -37935 24487 35591 -39757 -14500 37659
878 37659 -22706 -37824 33320 8580 -44607 16079 34230 -36583 -13873 38796 -18914 -40079
890 -40079 28219 11363 -41505 15603 40044 -23664 -3321 51671 -3492 -30377 34836 14260
902 14260 -42910 6675 32700 -30502 -13036 43839 -3467 -28298 32124 15703 -44082 -1015
$$ packed form
817A1476M9020r1557N084P9670o3593n4734Q6779n694q2095N8514N4289p8125
829c0966N898Q4043n1066m9970P6223l575q3531M5558M8922p5495j289Q4949l8423
842A1278m8219P7366O069p9295L7544M7962p9223j3974P3828l9762n3459P5327
854A5442J3233p2069M0461N6790p0829j1796P2986l8995n6722O6910R948p3336
866d7977L7086N6102o2526r272P6071l1682n5737O2422J1104p5348K5257N2159
878C7659o0365j5118P1144k4740n3187O0686J8151p0813K2710N2669n7710k1165
890d0079O8298j6856n2868N7108K4441o3708K0343N4992n5163k6885O5213k0576
902A4260n7170M9585K6025o3202J7466N6875m7306k4831O0422j6421n9785M3067
$$ plain form
914 -1015 21589 -42707 -32225 24057 -14525 -38845 27013 22458 -28937 13581 43078 -17713
926 -17713 -14528 36374 -6128 -37328 20503 18956 -33806 7469 44689 -9673 -9226 45210 8874
939 8874 -32086 17839 15332 -43001 -13851 21495 -30627 -29982 29596 3386 -32026 23066 28344
952 28344 -25851 -2251 32211 -18229 -26051 27184 2515 -33004 16461 27827 -23425 1355
964 1355 40297 -7145 -20630 27755 4512 -36175 4889 16934 -32103 -12223 28923 -13610
976 -13610 -27744 24297 9384 -31434 8318 25620 -25574 -11507 32550 -4324 -20601 30857
988 30857 18949 -22544 14649 31979 -21074 -11991 30836 -7399 -28273 20918 12309 -31260
1000 -31260 4775 26773 -20825 -14708 25792 -10510 -34422 10986 5603 -37739 -4361 24723
$$ packed form
914a015K2604o4296J0482N6282l8582k4320O5858m555n1395M2518K9497o0791
926a7713L185N0902m2502l1200N7831j547n2762M1275L7220n4362M47N4436l6336
939H874m0960M9925k507n8333K9150L5346n2122O45N9578k6210l5412N5092N278
952B8344n4195K3600L4462n0440p822N3235k4669l5519M9465J1366n1252K4780
964A355L8942m7442j3485M8385k3243m0687M1064J2045m9037J9880M1146m2533
976a3610j4134N2041j4913m0818L9752J7302n1194J4067M4057l6874j6277N1458
988C0857j1908m1493L7193J7330n3053R083M2827l8235k0874M9191q609m3569
1000c1260L6035K1998m7598O117M0500l6302k3912M5408n383m3342L3378K9084
$$ plain form
1012 24723 -19064 -14225 32320 5574 -20067 23689 22601 -22303 1968 26202 -20085 -19927 27977
1025 27977 2268 -25309 19949 23948 -24029 151 31788 -14279 -21394 23022 -2728 -36891
1037 -36891 6457 12812 -32500 -5725 31010 -11751 -17546 30988 8232 -26688 15530 22922
1049 22922 -25943 -6304 28099 -13361 -23929 23756 8048 -26857 12564 25506 -24176 -9778
1061 -9778 29560 -9074 -25979 20784 8558 -33102 3283 20956 -24929 -12358 30802 -4489
1073 -4489 -24266 25677 15037 -27805 8227 30572 -18168 -10406 31108 -5586 -28251 20261
1085 20261 11759 -31025 5009 27369 -20366 -14348 28952 -2520 -26301 19894 14328 -30322
1097 -30322 -1452 23362 -22955 -19529 26328 -1076 -27458 19083 19687 -25580 1310 32469
$$ packed form
1012B4723m3787M839M6545k6746k5641M3756j088m4904K4271K4234m6287J58M7904
1025B7977k5709k7577M5258L999m7977K4180L1637m6067p115M4416k5750l4163
1037c6891M3348O355m5312K6775L6735m2761n795M8534k2756l4920M2218P392
1049B2922m8865J9639L4403m1460j0568M7685j5708l4905L9421J2942m9682J4398
1061i778L9338l8634j6905M6763j2226m1660L6385J7673m5885J2571M3160l5291
1073d489j9777M9943j0640m2842L6032K2345m8740P762M1514l6694k2665M8512
1085B0261q502m2784L6034K2360m7735O018M3300l1472k3781M6195n566m4650
1097c0322K8870K4814m6317L426M5857k7404k6382M6541O04m5267K6890L1159
$$ plain form
1109 32469 -13234 -16732 29886 1151 -31126 13965 16805 -29162 -1341 30566 -14632 -17215
1121 -17215 30859 4442 -28286 18689 21200 -29527 -5994 26045 -18047 -23901 25462 2843
1133 2843 -30547 15178 20787 -27430 -2683 29888 -12738 -21649 26778 4831 -31737 10100
1145 10100 19708 -26874 -6751 32060 -10490 -22773 27421 10229 -28228 13658 27420 -23954
1157 -23954 -7237 32521 -13252 -27750 23867 8368 -33939 8896 24081 -27796 -10828 32324
1169 32324 -9306 -24026 26072 8636 -33510 6944 23181 -27504 -12793 29726 -8960 -26790
1181 -26790 24677 13715 -27964 11227 32162 -19406 -9757 33360 -5901 -28938 20865 11454
1193 11454 -31498 3508 27043 -21790 -14159 32351 -3593 -27838 24364 16400 -31419 512
$$ packed form
1109C2469m5703l498M6618k8735l2277M5091K840m5967K7821L1907m5198k583
1121a7215M8074k6417l2728M6975K511n0727K3533L2039m4092n854M9363k2619
1133B843l3390M5725N609m8217K4747L2571m2626q911M8427k1947l6568M1837
1145A0100R608m6582K0123L8811m2550j2283N0194j7192l8457M1886J3762n1374
1157b3954J6717L9758m5773j4498N1617j5499m2307M2835J5185n1877J6968M3152
1169C2324m1630j4720N0098j7436m2146M0454J6237n0685J4711M2519l8686j7830
1181b6790N1467j0962m1679L9191K0935n1568R649M3117l9261k3037M9803r411
1193A1454m2952L5006K3535m8833P631M6510l5944k4245N2202p964m7819L1931
$$ plain form
1205 512 25763 -25305 -17567 29095 -5719 -30465 22349 17500 -30238 6327 33307 -19369 -14468
1218 -14468 31935 -3716 -30173 17155 12794 -32930 857 27389 -20681 -18342 31112 -1015
1230 -1015 -26793 21477 19497 -28453 -8 28149 -19659 -20677 28424 2184 -29307 18238
1242 18238 23195 -25177 1587 34779 -12793 -16017 30649 1317 -31434 13647 16254 -33612
1254 -33612 -6532 26464 -18613 -22366 27551 1617 -30305 15411 18835 -30337 -5734 26987
1266 26987 -18768 -22784 26352 3377 -29248 17012 23783 -22816 687 34817 -9613 -17731
1278 -17731 29337 7596 -27976 13572 22560 -26692 -5878 31018 -13926 -23045 24734 5263
1290 5263 -30881 11126 22023 -26375 -8528 27180 -13578 -25011 25035 6380 -32868 9282
$$ packed form
1205E12K5251n1068P738M6662l4814k4746N2814m849m7738L6565K6980n2676M901
1218a4468M6403l5651k6457M7328m361m5724L3787K6532m8070K339M9454l2127
1230a015k5778M8270j980m7950K8445K8157m7808j018M9101k6240l1491M7545
1242A8238M957m8372K6764L3192m7572l224M6666k9332l2751M5081K607m9866
1254c3612K7080L2996m5077l753M9917k5934l1922M5716L424m9172K4603L2721
1266B6987m5755m016M9136k2975l2625M6260O771m6599K3503L4130m4430q118
1278a7731M7068k1741l5572M1548Q988m9252K0814L6896m4944r119M7779j9471
1290E263l6144M2007J0897m8398J7847L5708m0758j1433N0046j8655l9248M2150
$$ plain form
1302 9282 22368 -26439 -9395 29196 -10428 -22112 25907 10316 -26483 11099 24799 -23129
1314 -23129 -9065 26841 -11290 -26600 20229 8098 -28348 10156 26289 -19048 -6431 33153
1326 33153 -4042 -22683 22942 10756 -30055 4575 22389 -22546 -10660 28733 -3764 -21211
1338 -21211 25084 14661 -25303 6213 23533 -24913 -16232 21760 -11692 -29946 17148 9125
1350 9125 -29295 5136 26004 -16967 -9566 27490 -3708 -24817 15664 10615 -27232 1850
1362 1850 24178 -15721 -10315 31225 2570 -18021 21719 17788 -21691 4567 23433 -17247
1374 -17247 -14385 24104 -2394 -24944 17162 15173 -23790 2635 24136 -16741 -15719 21141
1386 21141 -4150 -28076 11792 11029 -27078 -1959 22564 -15733 -16328 22667 -960 -24967 14134
$$ packed form
1302I282J3086m8807J7044L8591l9624j1684M8019j5591l6799L7582J3700m7928
1314b3129J4064L5906l8131j5310M6829j2131l6446L8504J6133m5337J2617L9584
1326C3153l7195j8641M5625j2186m0811L4630J7814m4935J1886L9393l2497j7447
1338b1211M6295j0423l9964L1516J7320m8446Q681L7992l3452j8254M7094q023
1350I125l8420L4431K0868m2971P401L7056l1198k1109M0481n049l7847K9082
1362A850K2328l9899N406M1540k8655k0591L9740l931l9479K6258J8866m0680
1374a7247K862L8489k6498k2550M2106j989l8963K6425K1501m0877J022L6860
1386B1141k5291k3926L9868p63l8107K5119K4523l8297n95L8995k3627k4007L9101
$$ plain form
1399 14134 14182 -23389 -286 25331 -11362 -12929 25241 4465 -21719 13311 15680 -22080 -2272
1412 -2272 23647 -11834 -14101 23813 5877 -20054 14349 18568 -19336 -3303 21326 -14150
1424 -14150 -19499 17226 1055 -26016 9619 16896 -18847 -2622 24599 -7368 -16873 18421
1436 18421 2491 -26643 5491 12829 -23323 -7994 22648 -7514 -14666 23807 9751 -19736
1448 -19736 8973 17337 -19418 -9005 18594 -9587 -19129 16695 6940 -19957 10699 22656
1460 22656 -13350 -3752 23553 -5333 -16889 15749 5969 -22549 3934 17632 -15174 -7809
1472 -7809 20764 -3643 -17420 15086 7433 -23302 133 15219 -17335 -11251 18450 -4370
1484 -4370 -18394 11587 7696 -20966 2948 16705 -14475 -10147 19372 -210 -15752 14835
$$ packed form
1399A4134M8l7571K3103K5617l6693j567L8170k0776k6184L5030K369l7760J9808
1412b272K5919l5481k267L7914j7936k5931L4403M219l7904J6033K4629l5476
1424a4150n349L6725j6171k7071L5635P277l5743J6225K7221l1967r505L5294
1436A8421j5930k9134L2134P338l6152J5329L0642l0162p152L8473j4056k9487
1448a9736K8709Q364l6755J0413K7599k8181r542L5824r755k6897L0656J1957
1460B2656l6006R598K7305k8886j1556L2638r780k8518K6483J3698l2806P365
1472g809K8573k4407j3777L2506p653l0735K3435J5086l2554O084K9701k2820
1484d370j4024K9981l891k8662K3914J3757l1180M328K9519j9582j5542L0587
$$ plain form
1496 14835 12944 -14229 4838 19276 -11669 -10190 17101 -2241 -18642 10835 11691 -17050 2176
1509 2176 20498 -9086 -10007 17765 -936 -20303 6160 6607 -22268 -4932 16091 -10135 -10691
1522 -10691 19741 3889 -13993 13382 12753 -15163 -3228 15244 -11970 -13983 13964 1522
1534 1522 -16136 11633 17535 -10287 1304 19766 -6937 -14162 12691 668 -19818 2393
1546 2393 10391 -15706 -4076 18366 -2768 -9259 16842 6821 -16934 3527 11570 -16364 -7466
1559 -7466 14992 -5408 -13026 14789 7225 -14303 7310 15866 -12151 -7138 14651 -5667 -15355
1572 -15355 10840 6485 -15234 5639 15669 -10401 -4856 15814 -3807 -15215 9313 6036
1584 6036 -17844 1357 14368 -8606 -4926 18417 2131 -13048 9085 5418 -16312 -2664
$$ packed form
1496A4835j891k7173J9067J4438l0945J479K7291j9342j6401K9477Q56k8741J9226
1509B176J8322k9584r21K7772j8701j9367K6463M47k8875J7336K1023k6226n56
1522a0691L0432j5852j7882K7375o29k7916J1935J8472k7214k013K7947j2442
1534A522j7658K7769N902k7822J1591J8462k6703p225K6853j2023k0486K2211
1546B393P998k6097J1630K2442k1134o491K6101j0021k3755K0461Q043k7934Q898
1559g466K2458k0400p618K7815p564k1528K1613Q556k8017N013K1789k0318r688
1572a5355K6195m355k1719K0873J0030k6070N545K0670j9621j1408K4528l277
1584F036k3880J9201J3011k2974L680K3343j6286j5179K2133l667k1730J3648
$$ plain form
1596 -2664 12332 -13079 -10070 14609 982 -13336 12379 13200 -13070 1138 13262 -11219 -13719
1609 -13719 9679 -2881 -16756 7304 10908 -11528 2352 18555 -4139 -5410 16234 2421
1621 2421 -15931 4158 6814 -16587 -3861 14883 -4384 -6805 17143 7961 -10694 8580 10947
1634 10947 -13840 -6308 10490 -11820 -16394 8546 -195 -16414 5291 13850 -11589 -3664 14322
1647 14322 -6340 -13161 9428 1888 -16969 3441 10992 -11219 -2446 18365 568 -7324 15735
1660 15735 8311 -13016 4447 12192 -10568 -4957 14908 -994 -11664 11170 7665 -14058 1649
1673 1649 11018 -13064 -8882 10638 -5474 -16293 7976 6588 -13258 2214 13503 -10250 -9279
1686 -9279 12961 -3172 -15088 8812 7127 -13983 2564 15983 -5017 -4162 17285 1408 -12828
$$ packed form
1596b664J4996k5411L009K4679j3627j4318K5715Q21k6270J4208J2124k4481k500
1609a3719K3398j2560j3875K4060L604k2436J3880J6203k2694j271K1644j3813
1621B421j8352K0089K656k3401J2726J8744j9267k421K3948r182j8655J9274K367
1634A0947k4787P532J6798k2310m574K4940q741j6219K1705Q559k5439P925J7986
1647A4322k0662o821K2589p540j8857K0410P551k2211Q773K0811j7797p892K3059
1660A5735p424k1327J7463P745k2760N611J9865j5902j0670K2834l505k1723J5707
1673A649R369k4082M182J9520j6112j0819K4269j388j9846J5472J1289k3753R71
1686i279K2240j6133j1916K3900j685k1110J6547J3419k1000Q55K1447j5877j4236
$$ plain form
1699 -12828 8135 6504 -16651 -3174 10393 -9833 -9410 14398 1557 -12063 11748 12006 -10674
1712 -10674 -363 13009 -8974 -12218 10557 -855 -13463 7834 12409 -9233 1183 17329
1724 17329 -4116 -8942 11919 322 -19428 326 5558 -16901 -6797 12708 -6295 -11263
1736 -11263 12032 3363 -14561 4503 9181 -14034 -4350 14095 -5705 -9254 14167 6759 -9281
1749 -9281 9144 15108 -6729 -25 16476 -2817 -8753 12624 4928 -13287 4029 10324 -11029
1762 -11029 -5714 11462 -6442 -15606 7419 195 -18014 -279 9276 -12050 -5513 13767 -2856
1775 -2856 -11596 10353 6255 -14614 2088 11848 -12058 -6111 16391 244 -9151 15055 10560
1788 10560 -10729 4676 12792 -10832 -9073 10609 -6697 -16908 7041 6029 -13663 2918
$$ packed form
1699a2828K0963j631k3155J3477J3567k0226M23K3808j2841j3620K3811K58k2680
1712a0674J0311J3372k1983l244K2775j1412j2608K1297M575k1642J0416J6146
1724A7329k1445m826K0861j1597j9750J9754N232k2459J0104J9505j9003m968
1736a1263K3295q669j7924J9064M678k3215R684J8445j9800l549K3421p408j6040
1749i281J8425N964k1837O704J6501j9293n936K1377p696j8215J7316O295k1353
1762a1029N315J7176j7904r164K3025p224j8209J7735R555k1326O537J9280j6623
1775b856q740K1949m098k0869J6702R760k3906N947K2502j6147r395K4206m495
1788A0560k1289J5405Q116k3624J759J9682j7306j0211K3949j012j9692J6581
$$ plain form
1800 2918 15498 -7052 -4798 14492 -463 -13217 6477 6083 -15566 -1829 12331 -6967 -4049
1813 -4049 16321 4014 -9695 10306 8902 -14392 -2639 10354 -12136 -13078 9531 -2515 -15695
1826 -15695 7615 9586 -11419 491 15430 -7445 -9790 12030 553 -14281 7702 10565
1838 10565 -10388 1446 17197 -3003 -4787 15897 4241 -11802 6661 8336 -12698 -1122
1850 -1122 12689 -6206 -11232 10288 1859 -15359 3026 7102 -15043 -6466 9752 -8532 -11626
1863 -11626 10244 2634 -11953 7048 12600 -9245 -1857 12892 -4280 -10428 10524 3305 -12982
1876 -12982 6443 12428 -7587 214 15829 -2517 -10168 9475 2064 -14925 1002 6757 -13070
1889 -13070 -5146 11893 -3325 -8593 13234 6829 -11340 4848 10932 -9822 -6608 10324 -5798
$$ packed form
1800B918J2580k2550K254J9290j4955j2754J9694l94k1649J3737J4160j9298K918
1813d049K0370j2307j3709K0001j404k3294J1753J2993k2490r42K2609j2046j3180
1826a5695K3310J971k1005J1910J4939k2875k345K1820j1477j4834K1983K863
1838A0565k0953J1834J5751k0200j784K0684j1656j6043J8463J675k1034J1576
1850a122J3811j8895n026K1520q429j7218J8385M076k2145Q577J6218j8284l094
1863a1626K1870p610j4587J9001N552k1845P388J4749j7172o148K0952p219j6287
1876a2982J9425N985k0015P801J5615j8346p651J9643p411j6989J5927N755j9827
1889a3070P924J7039j5218n268K1827o405j8169J6188O084k0754L214J6932j6122
$$ plain form
1902 -5798 -12822 8520 5340 -10504 5860 13883 -6675 -3841 13093 -4547 -12923 5906 2030
1915 2030 -16688 -344 9232 -9437 -5081 13790 187 -8588 9864 6500 -11169 2935 10253
1928 10253 -8433 -6268 11294 371 -9263 10534 8203 -10126 2093 12882 -6925 -6768 10718
1941 10718 -2385 -13031 6418 5400 -11656 -607 11311 -7141 -8319 10920 -1767 -12689
1953 -12689 6356 6271 -11299 -301 11578 -5431 -4992 12394 1442 -10949 5959 6851 -11844
1966 -11844 -463 9625 -5561 -6542 11176 3213 -8805 7637 6899 -9489 -1583 9808 -8379
1979 -8379 -10433 9015 -46 -11823 5749 8577 -8523 457 11871 -4992 -7563 8202 191
1992 191 -12193 2335 6158 -11119 -2438 11375 -3269 -5661 11036 4785 -8894 4566 7908
$$ packed form
1902e798p024K1342l180j5844J6364Q023k0558K834J6934j7640q376J8829l876
1915B030j8718J6344R576j8669M356J8871j3603q775J8452l364j7669J4104P318
1928A0253j8686K165J7562j0923r634J9797k331j8329J2219J0789j9807J57J7486
1941A0718j3103j0646J9449j018j7056J1049J1918j8452j178J9239j2687j0922
1953a2689J9045q5j7570J0998J1879j7009M39J7386j0952j2391J6908Q92j8695
1966a1844J1381J0088j5186r81J7718p963j2018J6442p38j6388P906J1391j8187
1979h379k054J9448r061j1777J7572K828j7100Q980J1414j6863k571J5765q011
1992A91j2384J4528L823j7277Q681J3813j4644k392J6697o251j3679J3460L342
$$ plain form
2005 7908 -9395 -3915 8992 -5071 -8794 9326 3571 -9600 4708 9347 -7951 -2997 10539
2018 10539 -3587 -9807 7431 2447 -11547 2359 7496 -7872 -2736 10104 -3801 -7453 6818
2031 6818 3487 -9970 1398 8620 -7784 -3264 10259 -676 -7383 8437 4058 -10746 1713
2044 1713 8720 -8002 -4365 9863 -1856 -8375 7909 4842 -8913 1822 8966 -7085 -5904
2057 -5904 8189 -2584 -10299 6597 5551 -7751 3082 11046 -3821 -3500 9933 -1448 -9426
2070 -9426 5113 2523 -10741 -1627 6964 -3970 -4961 10183 1654 -7123 5327 4569 -9714 -2065
2084 -2065 5651 -6688 -7272 6817 -70 -7048 6487 7659 -5016 1262 10621 -4166 -5495 7229
2098 7229 628 -8407 4164 4472 -7539 21 8783 -3317 -4597 7830 1968 -9300 1608 4328
$$ packed form
2005G908j7303N480J2907j4063l723J8120n755j3171J4308M639j7298M954J3536
2018A0539j4126o220J7238m984j3994J3906N137j5368N136J2840j3905l652J4271
2031F818l331j3457J1368P222j6404M520J3523j0935o707J5820m379j4804J2459
2044A713P007j6722L637J4228j1719o519J6284l067j3755J0735P144j6051J181
2057e904J4093j0773p715J6896j046j3302J0833P964j4867L21J3433j1381p978
2070i426J4539k590j3264R114Q591j0934r91J5144q529q777J2450p58j4283P649
2084b065P716j2339n84J4089o887o978J3535J172j2675O278R359j4787j329J2724
2098G229o601r035J2571L08j2011P560Q762j2100j280J2427n862j1268J0908K720
$$ plain form
2112 4328 -8359 -2886 7399 -4984 -5889 5923 1737 -8788 4018 6453 -6409 -1650 8273
2125 8273 -2481 -6732 7137 3609 -6679 3790 7104 -5499 -2176 8644 -2784 -6362 7370
2138 7370 2072 -8563 1980 6049 -6374 -1798 7455 -1869 -7885 5843 2016 -8111 -300 5990
2152 5990 -6304 -3352 8250 -148 -5298 6267 4577 -6173 -3 6418 -5613 -5569 4808 -2068
2166 -2068 -7117 5450 3989 -7406 1513 8822 -3652 -4905 6624 -114 -7205 3309 2532 -8845
2180 -8845 -190 6255 -3968 -3713 7956 2299 -6340 4995 5039 -7142 -444 7152 -4467 -5145 4913
2195 4913 -303 -7432 2813 5129 -6273 -1880 7508 -3839 -5751 4989 720 -7667 2183 3433
2209 3433 -8033 -2027 6116 -2531 -4099 7445 2127 -5330 3723 6816 -5780 -49 8634 -1597
$$ packed form
2112D328j2687N473J0285j2383r05J1812m186j0525J2806K435j2862M759R923
2125H273j0754m251J3869l528j0288J0469L314j2603L323J0820j1428l578J3732
2138G370n298j0635J0543M069j2423M576R253r324o016J3728l827j0127P811O290
2152E990j2294K952J1602q398n150J1565j690j0750O170O421j2031M4J0377o876
2166b068n049J2567j461j1395Q919P309j2474j253J1529o738p091J0514p77j1377
2180h845Q655O445j0223K55J1669n657q639J1335M4j2181O698P596j1619o78J0058
2195D913n216p129J0245K316j1402M393R388j1347j912J0740m269q387R850J250
2209C433j1466O006Q143q647j568J1544n318p457R053L093j2596N731Q683j0231
$$ plain form
2223 -1597 -4961 5280 1809 -6526 1646 5325 -5020 -1564 7295 -1988 -5125 5375 1670 -6888
2237 -6888 1002 4079 -6704 -3701 6183 -2314 -6439 4830 2363 -5872 762 5393 -4377 -2278
2251 -2278 7260 -1879 -6640 4060 2162 -7158 773 5941 -3897 -2750 6774 -574 -5589 4124 4111
2266 4111 -6134 723 5419 -5028 -3755 5854 -1214 -6019 5108 3512 -5296 647 6895 -3574
2280 -3574 -2945 7101 401 -5781 2696 3457 -5529 -1428 5342 -4281 -4560 5048 511 -5658 4419
2295 4419 4138 -6192 -293 5852 -3596 -4882 4283 297 -7693 1799 5293 -5921 -49 6942 -1886
2310 -1886 -3075 7045 1850 -6098 2138 5195 -5615 -2248 6416 -2710 -4989 4713 2320 -5299
2324 -5299 3470 5998 -3944 -2186 6242 -1376 -6285 3432 124 -7122 1555 4385 -5015 -2058 6251
$$ packed form
2223a597l364J0241l471q335Q172L679j0345L456Q859r283l137J0500l705q558
2237f888P890L077j0783L003R884q497m125J1269k467q235O634M631r770K099
2251b278R538r139m761J0700j898r320P931N168r838J147R524p348n015R713j3
2266D111j0245O857M696j0447J273R609p068m805J1127j596q808N943O248j0469
2280c574O29J0046o700o182Q477P61q986M101O770r623k79R608m537o169J0077
2295D419k81j0330N899O145r448j286R165l986p990R492L494j1214N872O991q828
2310a886j189J0120n195p948Q236L057j0810L367Q664r126k279R702k393p619
2324e299Q769K528r942J758Q428p618m909R717l308p246Q677K830r400K957Q309
$$ plain form
2339 6251 -1879 -5553 4609 2743 -6397 2224 5140 -4468 -2275 5999 -690 -5094 4676 2618 -4833
2354 -4833 1345 6460 -4688 -2252 5978 -710 -6246 4272 2081 -6084 371 5639 -5858 -2663
2368 -2663 5965 33 -5097 4649 3565 -5574 -156 6244 -4245 -3816 5588 -1061 -5981 3440 3142
2383 3142 -6272 773 6373 -3052 -2461 7465 -382 -6088 3496 2833 -6867 -2012 5543 -4009 -4430 6162
2399 6162 1460 -3941 4311 4198 -3623 61 6033 -2820 -4669 5161 -108 -6216 2729 4003 -5454
2414 -5454 -491 6917 -2428 -2895 5740 1299 -6352 1285 3467 -6571 -1483 4211 -3362 -4546 5152
2429 5152 732 -5673 4153 5487 -5674 -1273 5729 -2444 -4975 5706 1128 -5967 2665 5240
2443 5240 -4561 -1849 5597 -2469 -4052 4302 495 -6650 2230 3615 -4130 -2505 5298 -1568 -5609
$$ packed form
2339F251q130l674J0162j866r140Q621K916r608K193Q274o689m404R770k058p451
2354d833O178N115j1148K436Q230o688n536J0518k191q165O455N268j1497L195
2368b663Q628n932n130R746j084r139N418O400j0489M29R404o649m920R421k98
2383C142r414P045N600r425N91R926p847n706R584o63r700M855P555r552m21J0592
2399F162m702n401Q252j13p821L684N972q853j849R830n269o108Q945J274r457
2414e454M963P408r345m67Q635m441p651P637K182j0038N088N694p573j184R698
2429E152m420o405R826J334j1161M401P002q173k531J0681m578p095Q632K575
2443E240r801K712P446q066j583Q354l807p145Q880J385p745J625P803o866m041
$$ plain form
2458 -5609 4443 -736 -6978 980 4894 -5425 -2718 6685 -641 -3906 4470 3260 -6002 391
2472 391 4058 -5908 -3528 5489 -2236 -4580 6339 4249 -3817 2032 5871 -5016 -3720 4236 -2596
2487 -2596 -6693 2820 2665 -6297 954 6307 -2480 -856 6961 103 -4237 3593 2076 -6857 -467
2502 -467 3990 -4813 -3240 6411 889 -3746 4328 4213 -4182 1606 3632 -3777 -3517 4169 -787 -5847
2518 -5847 3532 3093 -3583 1153 7462 -1737 -2723 4427 609 -6122 2119 2392 -5940 31 5290 -1678
2534 -1678 -2596 6458 260 -4832 2040 2526 -5111 -887 5421 -2467 -3333 5000 935 -4165 3140 2910
2550 2910 -4755 -1587 3844 -3097 -4697 3666 668 -4811 2801 4494 -3455 474 5886 -1115 -3694
2565 -3694 4015 -624 -6831 484 3655 -3381 60 5947 -1152 -2426 5270 2791 -5379 750 2227
$$ packed form
2458e609J0052n179o242P958L914j0319K707R403p326l265Q376j210r262O393
2472C91L667r966K380R017p725k344J0919k090q066N849L839j0887J296P956o832
2487b596m097R513j55q962P251N353q787J624P817o858m340P830j517q933O390
2502d67M457q803J573R651n522m635Q074j15q395N788K026p409K60P686m956n060
2518e847R379m39o676M736O309r199r86P150l818o731Q241K73q332N971N259o968
2534a678r18R054o198n092O872M86p637M224O308p888q66Q333m065n100P305k30
2550B910p665L168N431o941j600Q363k998n479P612J693p949L929N412p001k579
2565c694P709m639o207P315L171p036L441N887p099j274P696k479q170O129J477
$$ plain form
2580 2227 -5043 -3555 3715 -2660 -3488 4798 3098 -2974 2289 4426 -3965 -1708 3642 -3454 -5418
2595 -5418 2986 1663 -5948 1952 5380 -2194 643 6594 -1118 -3621 3776 930 -6365 29 3121
2610 3121 -3338 -833 6109 -1 -3804 5315 3698 -5017 92 2485 -5140 -2895 4413 -1629 -3761
2625 -3761 4059 2518 -3253 1568 3897 -3294 -2199 4244 -323 -4915 2438 2674 -2510 1414 4154
2640 4154 -2772 -1441 4407 -955 -4812 1520 1035 -5749 -86 4048 -1434 -504 4780 1392 -3426
2655 -3426 2470 2098 -4957 -1530 2314 -3324 -2774 3872 1140 -2384 3823 4096 -2586 177 3393 -3206
2671 -3206 -4530 2061 -1153 -5384 786 2815 -3039 1344 5133 -784 -2245 3439 -13 -4382 -187
2686 -187 1331 -4825 -1170 3226 -605 -918 5664 2763 -1566 3333 3066 -3269 -2284 2100 -2189 -3891
$$ packed form
2580B227p270J488P270o375q28Q286j700o072N263K137q391K257N350p096j964
2595e418Q404j323p611P900L428p574K837N951p712k503P397k846p295O394L092
2610C121o459K505O942o110l803R119j617q715N109K393p625K245P308o042k132
2625c761P820j541n771M821K329p191J095O443m567m592P353K36n184L924K740
2640D154o926J331N848n362l857O332m85o784N663M134n482R30N284l388m818
2655c426N896l72p055L427L844n638N50O646k732l524O207K73o682K763L216o599
2671c206j324O591l214m231O170K029n854M383L789n917j461N684l452m369M195
2686a87J518o156L655M396l831l13O582k901m329M899k67o335R85M384m289j702
$$ plain form
2702 -3891 2525 2217 -2722 2384 5526 -1988 -156 3458 -1941 -4365 718 -923 -5262 -649 3194
2717 3194 -3459 -240 4927 172 -2667 3000 1626 -4799 -144 2097 -3684 -1414 4595 1226 -1220
2732 -1220 4104 3221 -3414 1034 2360 -4159 -3096 2139 -1152 -2975 3329 3030 -1648 2232 3431
2747 3431 -1609 -2047 3007 -1797 -5157 -180 720 -3226 610 3953 -407 385 4892 882 -2864 1305
2763 1305 1469 -6530 -1968 434 -2058 -2421 4095 1960 -1795 4216 3279 -2771 -993 2376 -3196 -4676
2779 -4676 1617 -1552 -3145 2828 3639 -1209 1679 4631 33 -1879 2462 -148 -4758 426 726
2794 726 -4070 -518 3937 -574 -1556 3851 1460 -3539 561 1234 -4330 -2829 1514 -2616 -3116 2888
2810 2888 2708 -1085 2832 3673 -2017 -1736 2780 -2383 -3062 1869 536 -2341 1194 4066 -1344 -137
$$ packed form
2702c891O416l08m939N106L142p514J832L614n399k424N083j641m339M613L843
2717C194o653L219N167m755k839N667j374o425M655K241n781K270O009l369k446
2732a220N324q83o635M448J326o519J063N235l291j823O304k99m678L880J199
2747C431n040m38N054m804l360M977R00l946L836L343m360P92M507m010l746M169
2763A305J64p999M562K402k492l63O516k135l755O011r37o050J778L369n572j480
2779d676O293l169j593N973Q11m848K888K952m598j912M341k610m610N184L00
2794G26m796L552M455m511r82N407k391m999M100O73n564J501M343m130n00O004
2810B888j80l793L917Q41n690K81M516n163o79M931j333k877L535K872n410J207
$$ plain form
2826 -137 3672 -744 -3310 1618 -598 -4717 -1018 2761 -2199 -219 4249 812 -1028 3342 1432
2841 1432 -3362 -951 1057 -4694 -3023 3012 -246 -1552 3754 2820 -829 1642 3659 -1500 -2808
2856 -2808 1173 -2056 -4854 704 1642 -1832 1214 4720 77 -131 4372 -94 -3508 -8 -319 -5287
2872 -5287 -2252 2075 -1674 -1300 5543 2386 -1129 2535 2295 -3221 -1572 2575 -2810 -4675 1908
2887 1908 91 -2953 2553 3218 -1383 1741 3775 -1045 -3408 902 -656 -3865 669 2144 -1998
2902 -1998 551 4654 -581 -874 3274 1560 -3873 389 1896 -3902 -1747 2965 24 -1167 4750
2917 4750 2329 -1514 943 2513 -2995 -1683 1824 -2115 -3453 2315 1178 -1823 2062 4488 -2052
2932 -2052 -1750 2627 -3208 -4571 833 141 -4895 -528 2270 -752 1118 5566 1451 -99 2200
$$ packed form
2826a37L809m416k566M928k216m119L699L779m960J980M468l437j840M370j910
2841A432m794K411K008n751J671O035l258j306N306r34l649K471K017n159j308
2856b808L981l229k798N558R38l474L046L506m643k08M503m466l414L500l11m968
2872e287L035M327l749L74O843l157l515L664k40n516J649M147n385j865O583
2887A908j817l044N506O65m601L124K034m820k363M310j558l209M534J475m142
2902a998K549M103n235k93M148j714n433M262J507n798K155M712k941j191N917
2917D750k421l843K457J570n508J312L507l939j338N768j137l001L885K426o540
2932b052L02M377n835j363N404o92n036M367K798l022J870M448m115j550K299
$$ plain form
2947 2200 285 -5045 -2053 724 -4007 -1665 3228 1152 -600 4736 3135 -1052 493 1561 -3361
2962 -3361 -4082 528 -1378 -4592 1687 2068 -1688 2611 5016 -550 -858 2862 -1141 -4449 -899 -209
2978 -209 -4492 -537 3018 238 278 5768 2013 -2045 1502 1360 -3013 -694 282 -2322 -1779 2367
2994 2367 1638 -1999 2948 2659 -1824 305 1143 -2412 -3411 1063 -1280 -2943 1706 2634 -803 1612
3010 1612 3814 -125 -2426 1197 -705 -5040 -1458 -5 -3588 -892 3931 -298 -615 4013 1727
3025 1727 -2711 -365 -258 -3681 -2941 1504 -1523 -2242 2775 3328 -706 3435 3919 -1187 -975 1011
3041 1011 -1903 -4223 325 562 -3032 990 4146 -420 545 4422 -129 -3210 1065 -549 -5309
3056 -5309 -2336 -445 -3366 -1429 3556 1077 -18 3528 3049 -3228 464 1960 -2891 -3315 960
$$ packed form
2947B200j915n330K992K777m731K342M893k076j752N336j601m187J545J068m922
2962c361p21M610j906l214O279L81l756M299K405n566l08L720m003l308L550O90
2978b09m283L955L555k780M0N490l755m058L547j42m373K319R76k604N43M146
2994B367p29l637M947k89m483K129Q38l555r99M474k343j663M649R28l437K415
3010A612K202l939k301L623j902m335L582J453l583K696M823m229l17M628k286
3025A727m438K346J07l423P40M445l027p19N017N53m034M141M84n106K12J986
3041A011k914k320M548K37l594M022L156m566R65L877m551l081M275j614m760
3056e309K973J891k921J937M985k479j095L546m79o277L692J496m851m24M275
$$ plain form
3071 960 -1141 -1198 2428 2705 575 1530 4428 39 -1473 1883 -1876 -4219 487 232 -2289 22
3087 22 2836 -471 201 3369 981 -3524 1744 168 -3909 -1513 1020 -768 -1221 3872 1585 -1677
3103 -1677 2581 1010 -3674 -734 1164 -3242 -3780 1289 106 -1028 2823 3037 -969 1233 3438
3118 3438 -570 -2322 763 -2047 -3437 845 775 -610 1829 4338 -52 -335 4024 594 -3946 117
3134 117 -1565 -4523 -1937 1395 -2067 -203 3659 2719 -523 2159 2172 -2690 -2263 1016 -2184 -2288
3150 -2288 980 154 -1541 1196 3774 208 1767 3427 -780 -2946 -55 -1175 -3606 -243 1885
3165 1885 -1714 159 3809 590 -1209 1756 -185 -2077 -236 35 -3607 -1486 1847 -962 -727
3180 -727 3193 2436 -1602 1739 1911 -2456 -2680 493 -1668 -2455 1860 1300 -1864 1780 2570 -456 32
$$ packed form
3071I60k101n7L626K77k130R55K898m389j512L356l759k343M706k55k521K311
3087B2K814l307O72L168k388m505N268j576m077K396K533j788m53N093k287l262
3103a677M258j571m684K940J898m406n38N069j183j134L851K14m006K202K205
3118C438m008j752L085k810j390M282p0j385K439K509m390k83M359l430m540M063
3134A17j682k958K586L332l462J864L862r40l242K682J3m862M27L279l200j04
3150b288L268q26j695K737K578l566J559J660m207k166K891j120k431L363K128
3165A885l599J873L650l219j799K965j941j892J841K71l642K121L333k809K35
3180g27L920p57m038L341J72m367k24L173k161p87M315n60l164L644P90l026M88
$$ plain form
3197 32 1602 -590 -3130 -474 58 -2478 -388 1881 150 162 3785 1840 -469 2057 319 -3716
3213 -3716 -1153 1216 -2510 -1729 2452 1526 110 3095 2525 -673 391 1820 -3660 -4157 -292 -1839
3229 -1839 -1802 591 3203 -170 2222 3336 631 410 1606 298 -3890 -986 331 -2493 -1217 2252
3245 2252 509 1430 3821 1869 -771 575 1077 -2779 -2770 64 -2455 -1428 2057 1313 -1060 2549
3261 2549 3194 56 -406 955 -1429 -2872 -55 -1397 -2123 893 1942 -628 967 3222 274 -1225
3277 -1225 1432 -83 -4362 -1085 -737 -1461 -570 2841 491 1220 3229 1659 -1660 456 929 -3660
3293 -3660 -2850 582 -896 -1519 2347 2454 -620 2422 1919 -1467 -565 578 -1638 -3791 -1306 -1515
3309 -1515 -1628 1514 2542 1457 699 3529 244 -2820 48 -949 -3660 -1088 -431 -1672 -51 2591
$$ packed form
3197C2J570k192k540K656N32k536K090K269j731J2L623j945k309K526j738m035
3213c716K563K369l726P81M181r26j416K985n70l198J064J429n480m97L865j547
3229a839L7K393K612l373K392J114k705k21J196j308m188K904J317k824J276L469
3245B252j743R21K391j952k640J346N02l856RK834k519J027L485p44k373L609
3261B549O45l138m62J361k384j443K817j342p26L016J049k570J595K255k948j499
3277a225K657j515m279L277L48p24Q91L411k350P29K009j570l319K116M73m589
3293c660Q10L432j478o23L866J07l074L042n03l386R02J143k216k153K485k09
3309a515j13L142J028j085p58K830l285l064K868r97k711K572O57j241J621K642
$$ plain form
3325 2591 2274 998 2298 2041 -175 -808 881 -2287 -2636 662 -791 -1699 2033 2288 81 934 2829
3342 2829 661 -922 -517 -2122 -3700 51 -258 -2438 29 3350 777 1250 2303 872 -1451 -45
3358 -45 -79 -3522 -1963 358 -294 -364 2049 1398 246 1861 1619 -1289 -1361 359 -1473 -2012 219 807
3376 807 -1420 1355 3227 522 250 2764 -1194 -2242 69 -1112 -2705 258 278 -1300 866 2791
3392 2791 959 194 2016 95 -2441 -296 -556 -2937 -1972 1902 42 -100 2911 3032 -71 2035
3408 2035 1288 -1547 -1951 -105 -1743 -2918 -16 416 127 1188 3638 558 1834 2666 -750 -2596
3424 -2596 780 -1026 -3049 -692 1824 -330 265 2745 1949 -188 2234 897 -1593 -1968 497 -3181
3440 -3181 -2179 684 -506 -288 1753 2320 -1378 984 2316 -1005 -1885 395 -1060 -2411 164 1653
$$ packed form
3325B591l17j276J300k57k216o33J689l168l49L298j453r08L732K55k207Q53J895
3342B829k168j583M05j605j578L751l09k180K467L321k573M73J053j431k323J406
3358d5l4l443J559K321o52p0K413o51j152J615k42k908p2J720j832n39K231N88
3376H07k227K775J872k705k72K514l958j048K311j181j593K963K0j578K166J925
3392B791j832p65J822j921k536K145k60k381R65L874j860j42L011J21l103K106
3408B035p47k835m04J846j638j175K902M32k89J061K450l080J276Q32l416j846
3424b596L376j806k023K357K516k154N95K480p96k137K422j337k490l75K465l678
3440c181J002K863j190K18K041N67l698K362J332l321q80K280j455j351K575J489
$$ plain form
3456 1653 -601 583 2694 32 -599 2108 383 -2456 -593 625 -2292 -518 2652 -213 557
3471 557 2730 1669 -341 1150 127 -2481 -1874 182 -1529 -2085 1238 1833 -58 2174 2709 -284
3487 -284 -715 555 -1676 -2169 21 -1252 -1664 324 1051 -84 585 2453 480 -485 860 -770 -2020
3504 -2020 -2208 -360 -1942 -838 1760 92 343 2809 1974 -306 733 597 -1960 -1588 774 -1405
3520 -1405 -1777 1534 924 47 1982 2477 -431 -534 943 -1473 -1962 -563 -879 -2019 486 1946 -465
3537 -465 771 2188 307 -782 593 -1134 -2377 -1348 594 -1741 -387 1226 526 -171 1739 1569
3553 1569 -1430 -1301 -449 -2473 -1884 728 -213 -1076 592 1833 181 720 2497 -439 -589 -405 -660
3570 -660 -2778 -428 -169 -1699 458 2124 544 1344 1436 402 -1465 301 224 -3269 -1350 585 -794
$$ packed form
3456A653k254J184K111k662o31K707j725k839J863J218k917J774L170k865P70
3471E57K173j061k010J491j023k608O07K056j711n56L323N95j891K232N35k993
3487b84m31J270k231m93K190j273m12J988P27j135O69J868j973r65J345j630j250
3504b020j88J848j582J104K598j668K51K466q35k280J039j36k557L72K362k179
3520a405l72L311o10q77J935M95k908j03J477k416m89J399l16j140K505J460k411
3537d65J236J417j881j089J375j727j243J029J942k335J354J613p00o97J910j70
3553A569k999J29Q52k024N89K612r41q63J668J241j652N39J777k936j50J84k55
3570f60k118K350K59j530K157J666j580Q00R2j034j867J766p7l493J919J935j379
$$ plain form
3587 -794 -362 2608 1541 207 1794 1772 -725 -1133 184 -1898 -2297 -386 -632 -1278 2160 2399 855
3604 855 1445 2893 144 -365 962 -915 -3380 -65 421 -1116 440 1798 513 -244 1392 1855
3620 1855 -1012 156 -897 -2965 -808 -97 -666 -644 1928 1937 -974 1008 848 -1926 -1052 779 -365
3637 -365 -1977 -119 -431 -291 736 2234 85 780 1840 -434 -2023 413 -715 -2344 -392 1336
3653 1336 -1243 -884 1914 845 -262 7 871 -1050 -33 430 -1702 -1121 661 -452 -469 2083 1789
3670 1789 -452 1067 1419 -1341 -1388 419 -1296 -1942 304 1031 -344 1051 1652 549 -670 1563
3686 1563 -786 -2785 -223 -1010 -3627 329 818 -772 997 2191 1182 36 1298 1021 -1551 -1279
3702 -1279 402 -1436 -1338 367 1014 -50 2260 1655 -371 428 1175 -725 -319 70 -4 -1309 240
$$ packed form
3587g94M32K970j067j334J587k2k497m08J317k082l99J911k46o46L438K39j544
3604H55N90J448k749n09J327j877k465L315M86j537J556J358j285p57J636M63
3620A855k867J168j053k068K157P11n69K2K572Rk911J982j60k774Q74J831j144
3637c65j612J858l12J40J027J498k149O95J060k274j589K436j128j629J952J728
3653A336k579L59K798j069j107K69Q64j921J017M63k132N81J782j113j7K552k94
3670A789k241J519L52k760m7J807j715o46K246P27j375J395O01j103j219K233
3686A563k349j999K562p87k617L956M89j590J769J194j009j146J262k77k572K72
3702a279J681j838R8J705O47j064K310o05k026P99P47j900M06L89p4j305J549
$$ plain form
3719 240 189 -1253 1467 1657 1256 3 1115 183 -2246 725 -802 -1474 -251 1434 578 28 2097
3736 2097 110 -668 630 465 -1518 -1395 -119 -1723 -782 2499 651 -482 834 1490 -520 -124
3752 -124 1403 -848 -1131 -1241 -90 -991 -22 1144 147 679 2375 -708 -230 1048 145 -2042 -11
3769 -11 -279 -27 -978 1384 689 -47 2016 632 3 157 244 -1902 -1981 -446 -992 -1228 1296 -175 -864
3788 -864 1283 1993 -453 542 721 -1110 -1779 -304 21 -800 48 1091 583 791 1281 371 218 1131
3806 1131 382 -1917 -309 220 -570 -85 969 957 -1212 996 1108 -513 -365 635 -1518 -1963 344
3823 344 -814 -1567 865 1256 657 351 1612 472 -407 468 -697 -1890 45 -462 -458 -506 1871 453
3841 453 -430 2090 -588 -562 -347 -322 -1232 -759 1108 -650 -1236 1577 557 616 291 563 -1272 -744 -136
$$ packed form
3719B40n1j442K720J90m01j253J112r32k429K971j527o72J223J685q56n50K069
3736B097j987p78J298j65j983J23J276j604R41L281j848j133J316O56k010L96
3752a24J527k251k83j10J151r01R69J166r97N32J696l083M78J278r03k187K031
3769a1k68K52r51K362o95p36K063j384o29J54Q7k146p9J535n46k36K524j471o89
3788h64K147P10k446R95J79j831o69J475L25q21Q48J043n08K08M90r10j53R13
3806A131p49k299J608N29p90M85J054j2k169K208J12j621J48J000k153m45K307
3823C44j158p53K432L91n99l06J261j140q79Q75j165j193J935n07Mm8K377j418
3841D53q83K520k678K6K15K5r10M73J867j758n86K813j020N9l25K72j835N28O08
$$ plain form
3860 -136 -1508 -1576 110 453 -623 635 1374 -695 703 1102 340 -556 81 -524 -647 -505 -200 -47
3878 -47 -106 1610 1388 603 1127 1530 -362 323 433 -1825 -2397 542 -551 -153 600 887 -766 834
3896 834 367 -515 -389 -82 -820 -1099 -8 71 -514 203 1323 -300 685 141 -516 -1610 570 -333 -1462
3915 -1462 -947 652 -48 -483 1735 -29 -135 933 -604 -1019 -183 389 32 -334 305 -491 -1211 302
3933 302 681 -730 -224 1683 -1811 -1504 534 -199 -1198 258 677 -507 523 994 543 80 80 -1543
3951 -1543 -1272 52 -599 -1487 -228 234 492 906 913 152 -452 33 1225 -987 -567 429 -1884 -1327 183
3970 183 74 361 598 1191 95 723 1953 -792 -988 -168 -584 -1078 -665 342 -660 -272 1284 -250
3988 -250 -548 624 -1014 -611 67 -535 -301 -491 203 -185 860 1435 683 -434 791 639 -325 -330 156
$$ packed form
3860a36j372o8J686L43j076J258P39k069J398L99p62q96O37o05j23J42L05J53
3878d7n9J716k22p85N24M03j892O85J10k258n72K939j093L98P53K87j653J600
3896H34m67q82J26L07p38k79J091P9n85P17J120j623R85n44o57j094K180r03j129
3915a462N15J599p00m35K218j764j06J068j537m15Q36N72l57l66O39p96p20J513
3933C02L79j411N06J907l494L07K038p33r99J456M19j184J030M71m51m63%j623
3951a543K71J324o51q88J259M62K58M14Pp61o04M85J192k212M20R96k313N57J510
3970A83j09K87K37N93j096O28J230k745j96Q20m16m94M13J007j002L88J556j534
3988b50k98J172j638M03O78o02K34j90O94l88J045N75p52j117J225j52r64nM86
$$ plain form
4007 156 -166 -998 635 364 -15 392 1118 -1031 -839 430 -572 -735 65 -235 -562 127 743 196 -61
4026 -61 569 -59 -1226 -829 149 -378 -494 -961 -1149 -1012 555 3 578 940 540 -597 -812 682 -1424
4045 -1424 -979 521 -877 -1265 901 1564 968 1151 1289 -481 178 765 36 -960 -654 143 -883 -42
4063 -42 1773 351 707 623 130 -405 -197 -557 -690 -459 -21 -1722 -670 464 87 674 755 22 102 863
4083 863 983 -796 -1315 215 -901 -420 439 513 -123 836 933 169 841 580 -786 -667 1050 284 -665
$$ packed form
4007A56l22q32J633k71l79M07P26k149J92J269j002j63Q00l00l27O89O16n47k57
4026f1O30o28j167L97R78n27j16m67j88J37J567n52N75L62m00j137k15J494k106
4045a424M45J500j398l88K166O63n96J83J38j770O59N87p29r96L06P97j026Q41
4063d2J815j422L56q4m93n35K08l60j33K31M38j701J052J134l77N87Q1p33Q0P61
4083H63J20j779n19J530j116M81Q59P4o36R59R7p64O72k61j366J19J717p66r49
$$ [...]
8191F51
##END NTUPLES=NMR FID
##END=
