##TITLE=1H_UK-23_7_1
 CD2Cl2
 108 sc, 
 27.10.2022
##JCAMPDX= 6.0         $$ Bruker NMR JCAMP-DX V2.0
##DATA TYPE= NMR FID
##DATA CLASS= NTUPLES
##ORIGIN= UXNMR, Bruker Analytische Messtechnik GmbH
##OWNER= root
$$ XWIN-NMR		Version 3.5
$$ Thu Oct 27 14:28:46 2022 Russian Standard Time (UT+4h)  she@DPX200
##.OBSERVE FREQUENCY= 200.1313499994
##.OBSERVE NUCLEUS= ^1H
##.DELAY= (6, 6)
##.ACQUISITION MODE= SIMULTANEOUS
##.ACQUISITION SCHEME= undefined
##.AVERAGES= 108
##.DIGITISER RES= 18
##SPECTROMETER/DATA SYSTEM= spect
##.PULSE SEQUENCE= zg30
##.SOLVENT NAME= CD2Cl2
##.SHIFT REFERENCE= (INTERNAL, CD2Cl2, 0, 15.7039)
##AUDIT TRAIL= $$ (NUMBER, WHEN, WHO, WHERE, WHAT)
$$ ##TITLE= Audit trail, XWIN-NMR		Version 3.5
$$ ##JCAMPDX= 5.01
$$ ##ORIGIN= Bruker BioSpin GmbH
$$ ##OWNER= she
$$ F:/spectra/data/she/nmr/H-F/1/audita.txt
$$ ##AUDIT TRAIL=  $$ (NUMBER, WHEN, WHO, WHERE, WHAT)
(   1,<2022-10-27 14:27:38.01 +0400>,<she>,<DPX200>,
      <continue with go, POWCHK disabled, PULCHK disabled
       configuration hash MD5:
       00 E9 B6 7A A2 85 ED C7 34 08 36 98 17 FE 4E 26
       data hash MD5: 16K
       54 E0 32 0E DD 18 D7 81 26 E6 D4 2A F9 C7 8E D5>)
$$ ##END=
$$ 
$$ hash MD5
$$ 77 6E 8E E4 E3 A5 A1 C1 9B 7A 52 AA E7 40 5B 35
##$RELAX= 
##$RELAX= 
##$RELAX= 
##$RELAX= 
##$RELAX= 
##$RELAX= 
$$ Bruker specific parameters
$$ --------------------------
##$DU= <F:/spectra>
##$EXPNO= 1
##$NAME= <H-F>
##$PROCNO= 1
##$TYPE= <nmr>
##$USER= <she>
##$AMP= (0..31)
100 100 100 100 100 100 100 100 100 100 100 100 100 100 100 100 100 100 
100 100 100 100 100 100 100 100 100 100 100 100 100 100 
##$AQSEQ= 0
##$AQ_mod= 1
##$AUNM= <au_zg>
##$AUTOPOS= <>
##$BF1= 200.13
##$BF2= 200.13
##$BF3= 200.13
##$BF4= 200.13
##$BF5= 200.13
##$BF6= 200.13
##$BF7= 200.13
##$BF8= 200.13
##$BYTORDA= 1
##$CFDGTYP= 0
##$CFRGTYP= 5
##$CHEMSTR= <none>
##$CNST= (0..31)
1 1 145 1 1 1 1 1 1 1 1 1 1 1 1 1 1 1 1 1 1 1 1 1 1 1 1 1 1 1 1 1 
##$CPDPRG= <>
##$CPDPRG1= <>
##$CPDPRG2= <>
##$CPDPRG3= <>
##$CPDPRG4= <mlev>
##$CPDPRG5= <mlev>
##$CPDPRG6= <mlev>
##$CPDPRG7= <mlev>
##$CPDPRG8= <mlev>
##$CPDPRGB= <>
##$CPDPRGT= <>
##$D= (0..31)
0 1.2 0 0 0 0 0 0 0 0.06 0 0.03 0 0 0 0 0.0002 0 0 0 0 0 0 0 0 0 0 0 0 
0 0 0 
##$DATE= 1666866074
##$DBL= (0..7)
120 120 120 120 120 120 120 120 
##$DBP= (0..7)
150 150 150 150 150 150 150 150 
##$DBP07= 0
##$DBPNAM0= <>
##$DBPNAM1= <>
##$DBPNAM2= <>
##$DBPNAM3= <>
##$DBPNAM4= <>
##$DBPNAM5= <>
##$DBPNAM6= <>
##$DBPNAM7= <>
##$DBPOAL= (0..7)
0.5 0.5 0.5 0.5 0.5 0.5 0.5 0.5 
##$DBPOFFS= (0..7)
0 0 0 0 0 0 0 0 
##$DE= 6
##$DECBNUC= <off>
##$DECIM= 32
##$DECNUC= <off>
##$DECSTAT= 4
##$DIGMOD= 1
##$DIGTYP= 9
##$DL= (0..7)
0 120 120 120 120 120 120 120 
##$DP= (0..7)
150 150 150 150 150 150 150 150 
##$DP07= 0
##$DPNAME0= <>
##$DPNAME1= <>
##$DPNAME2= <>
##$DPNAME3= <>
##$DPNAME4= <>
##$DPNAME5= <>
##$DPNAME6= <>
##$DPNAME7= <>
##$DPOAL= (0..7)
0.5 0.5 0.5 0.5 0.5 0.5 0.5 0.5 
##$DPOFFS= (0..7)
0 0 0 0 0 0 0 0 
##$DQDMODE= 0
##$DR= 18
##$DS= 0
$$ [...]
##$SUBNAM2= <"">
##$SUBNAM3= <"">
##$SUBNAM4= <"">
##$SUBNAM5= <"">
##$SUBNAM6= <"">
##$SUBNAM7= <"">
##$SUBNAM8= <"">
##$SUBNAM9= <"">
##$SW= 18.0517283424941
##$SWIBOX= (0..15)
0 0 2 0 0 0 0 0 0 0 0 0 0 0 0 0 
##$SW_h= 3612.71676300578
##$TD= 16384
##$TD0= 1
##$TE= 0
##$TE2= 300
##$TE3= 300
##$TEG= 300
##$TL= (0..7)
0 120 120 120 120 120 120 120 
##$TP= (0..7)
150 150 150 150 150 150 150 150 
##$TP07= 0
##$TPNAME0= <>
##$TPNAME1= <>
##$TPNAME2= <>
##$TPNAME3= <>
##$TPNAME4= <>
##$TPNAME5= <>
##$TPNAME6= <>
##$TPNAME7= <>
##$TPOAL= (0..7)
0.5 0.5 0.5 0.5 0.5 0.5 0.5 0.5 
##$TPOFFS= (0..7)
0 0 0 0 0 0 0 0 
##$TUNHIN= 0
##$TUNHOUT= 0
##$TUNXOUT= 0
##$USERA1= <user>
##$USERA2= <user>
##$USERA3= <user>
##$USERA4= <user>
##$USERA5= <user>
##$V9= 5
##$VALIST= <valist>
##$VCLIST= <CCCCCCCCCCCCCCC>
##$VD= 0
##$VDLIST= <DDDDDDDDDDDDDDD>
##$VPLIST= <PPPPPPPPPPPPPPP>
##$VTLIST= <TTTTTTTTTTTTTTT>
##$WBST= 1024
##$WBSW= 4
##$XGAIN= (0..3)
0 0 0 0 
##$XL= 0
##$YL= 0
##$YMAX_a= 189872
##$YMIN_a= -250559
##$ZGOPTNS= <>
##$ZL1= 120
##$ZL2= 120
##$ZL3= 120
##$ZL4= 120
##$ABSF1= 10
##$ABSF2= 0
##$ABSG= 5
##$ABSL= 3
##$ALPHA= 0
##$AQORDER= 0
##$ASSFAC= 0
##$ASSFACI= 0
##$ASSFACX= 0
##$ASSWID= 0
##$AUNMP= <proc_1d>
##$AZFE= 0.1
##$AZFW= 0.1
##$BCFW= 1
##$BC_mod= 2
##$BYTORDP= 1
##$COROFFS= 0
##$CY= 11.3945322036743
##$DATMOD= 1
##$DC= 2
##$DFILT= <>
##$DTYPP= 0
##$F1P= 2.36226072786647
##$F2P= -0.459571619588291
##$FCOR= 0.5
##$FTSIZE= 0
##$FT_mod= 4
##$GAMMA= 1
##$GB= 0.15
##$INTBC= 1
##$INTSCL= 1
##$ISEN= 128
##$LB= 0.24
##$LEV0= 0
##$LPBIN= 0
##$MAXI= 10000
##$MC2= 0
##$MEAN= 0
##$ME_mod= 0
##$MI= 1.114404
##$NCOEF= 0
##$NC_proc= 0
##$NLEV= 6
##$NOISF1= 3.799351
##$NOISF2= 2.8
##$NSP= 1
##$NTH_PI= 0
##$NZP= 0
##$OFFSET= 15.70392
##$PC= 1
##$PHC0= -18398.73
##$PHC1= 20.8007
##$PH_mod= 1
##$PKNL= yes
##$PPARMOD= 0
##$PSCAL= 0
##$PSIGN= 0
##$REVERSE= no
##$SF= 200.130013532006
##$SI= 16384
##$SIGF1= 3
##$SIGF2= 2
##$SINO= 400
##$SIOLD= 16384
##$SREGLST= <1H.CDCl3>
##$SSB= 0
##$STSI= 0
##$STSR= 0
##$SW_p= 3612.71676300578
##$SYMM= 0
##$S_DEV= 0
##$TDeff= 0
##$TDoff= 0
##$TI= <>
##$TILT= no
##$TM1= 0
##$TM2= 0
##$TOPLEV= 0
##$USERP1= <user>
##$USERP2= <user>
##$USERP3= <user>
##$USERP4= <user>
##$USERP5= <user>
##$WDW= 1
##$XDIM= 8192
##$YMAX_p= 0
##$YMIN_p= 0
$$ End of Bruker specific parameters
$$ ---------------------------------
##NTUPLES= NMR FID
##VAR_NAME=  TIME,          FID/REAL,        FID/IMAG
##SYMBOL=    X,             R,               I
##VAR_TYPE=  INDEPENDENT,   DEPENDENT,       DEPENDENT
##VAR_FORM=  AFFN,          ASDF,            ASDF
##VAR_DIM=   8192,          8192,            8192
##UNITS=     SECONDS,       ARBITRARY UNITS, ARBITRARY UNITS
##FACTOR=    0.0002768,     1,               1
##FIRST=     0,             0,               0
##LAST=      2.2672688,     0,               0
##MIN=       0,             -250559,         0
##MAX=       2.2672688,     189872,          0
$$ Real data points
##PAGE= N=1
##DATA TABLE= (X++(R..R)), XYDATA
$$ [...]
2388c50J53P50l27p73J255n69j86O0p1l75L28J3k52Q8O52k87O24j25q25O75j033
2409e75N74j80j15K29p5k49j8N87q3K34K0j09k71q5K1nl09J10K82M42n7m57P18
2432F29m49j81o2j05K66n30j031J550MMK45L06P4L12p15n57L91m91l83NO4M55
2454a99M48J51l06J29O06O6j272n5K09k61k35L53K26p53J108N21l75k57L39j8
2474D25q13M52j19j116P43l5J04P68J68L25j056R06k8j236K08R8n45l7O45K12
2494F9l58N59O09o62J9jo27j45J47j00p41J066O74k26N76m96k92N22l5m66o79
2515e87J13n28O01m14P95R9L9J91N53l12j21l82o5k45J02ln00M40R0M83M94o23
2537B20M2M99k21p54p20P47j80j75N13j80q5N72M37M17o14k25k6j40m64p39K58
$$ y = [-350, -197, 553, 226, -547, 708, 139, -47, 13, -58, -433, -105, -92, -344, -256, 396, 109, 733, 608, -217, 458, -575, -1, -181, -296, -67, -142, -391, -409, 178, 95, 329, 349, 240, -31, -116, -95, -100, -409, -299, -17, 425, 368, -89, 629, 180, -1, -63, -168, 98, -432, -1463, 87, 91, 95, 340, 646, 720, 1032, 317, -240, 151, -340, -723, -718, -654, -199, 249, 400, 94, 223, 829, 895, -377, -432, -223, -484, -719, -366, -140, -893, 215, 736, 361, 104, 443, 425, -388, 64, -55, -1171, -428, -463, -359, 409, 577, 902, -154, 752, 724, -512, -304, -206, -751, -788, -143, 69, -289, 270, 879, 217, 236, 235, -392, -537, -390, -490, -1231, -165, 509, 283, 859, 363, 71, 593, 558, 92, -587, -474, -1002, -401, -815, -20, 79, 118, 309, 862, 550, 429, 47, -18, -263, -161, -164, -664, -224, -134, 349, 843, 220, 262, 761, 540, -214, -934, -187, -367, -542, -29, -209, -294, 278, 715, 1132, 518, 293, 267, 127, -337, -1076, -818]
2558h18K85N96K20K97L55q36Q46m19n73l61k60j19n3P13m26N00L53N61M13o87
2578E87J07J44j113j83o6J72k71L14K88M71k08O51j58n87L29o86l56k38K36K38
2598c29k95J224j055P33L63J39j85J40p88l89n60M56j76k59J017l54O06O09l93
2617E04j97J54p71n43N67n64K87K89K62P21j29l91N88J44p07m5m94n30K25L68
2637b62k71L59J11J246j296J072j93n97O8k47j74n97L44l90L9Q39j41P46N4M46
2657A156l70k70m23o27R1m42kQ1R02L43M8k27MO91o26k61m07q11L61L78r10R10
2679d11P49M32K14l2n81L63l17m82m38n21O37K9m7Q24r3O29K29m60j10l14j56
2700A44o26n82K44k3M04J306L17k29M52k17q06m45n7l90m13L24Rk04O27O90M28
$$ y = [-818, -533, 63, 283, 580, 935, 99, 945, 526, -47, -408, -668, -787, -840, -127, -553, -53, 300, 861, 1274, 587, 694, 838, -275, -458, -524, -352, -623, -309, -21, 450, 242, 893, 735, 148, 477, -209, -565, -803, -567, -329, -624, 600, -455, 278, 641, 780, 595, 735, -53, -442, -1002, -546, -722, -981, 36, -318, 288, 897, 504, 307, 461, -310, -853, -286, -850, -563, -274, -12, 709, 580, 189, 777, 921, 214, 169, -325, -855, -630, -262, -533, -174, -63, 1183, -113, 959, 766, 169, 237, -10, -184, -781, -437, -827, -788, 51, -90, 656, 710, 1156, 786, 516, 93, -534, -443, -885, -887, -806, 96, 439, 487, 260, 264, 955, 329, 68, -339, -1150, -789, -411, -1321, -411, 338, 770, 984, 952, 371, 734, 417, -65, -503, -1024, -387, -358, -405, 419, 326, 955, 1184, 724, 614, 300, 144, -482, -1064, -820, -843, -439, 867, 1184, 955, 1407, 1190, 384, -61, -118, -508, -921, -597, -588, -792, -165, 525, 953]
2721I53q09J030M3r44o62J68j183l14J243n9J57Q91O34k12R7j47m42k75k01p48
2741g80j36L25J70P07O37l73O85m46k00K00k88p20p13k4j21N92J1Q22N29n40M53
2762G90p22M71m76l06j63o92R16j066Q00Q15J45K03M35k02j49l09n03j033K5m7
2782a068J65O8J151K86p1R50k43p83k24O27j341k44q91J035k2j60R57L64M36K61
2802A253o72o1m74j108M42m93L88M04l29J213L19k4K30l72o59J5p56l5j02k61
2822a082N50M8R0Q52L65K70K3m64o99j20r72k67Q58k06K98L60O30N90q6k67p13
2843E8J43p41l04l31J8L98R5P52M54K32k73M40o31N27q16r07m3N19p32K03R44
2864EM67M83Q6j64M7m09o79J12j323l4O55L12K45P33L2P8K08J10M1j016n6r11
$$ y = [953, 144, 1174, 1217, 273, -389, -221, -1404, -1718, -475, -534, -377, 514, 1148, 936, 1033, 886, 444, 169, -32, -780, -916, -591, -421, 286, 923, 550, 1235, 789, 589, 789, 501, -219, -932, -956, -1077, -485, -474, 348, 877, 337, 790, 68, 539, 63, -243, -406, -1098, -182, -1248, -448, 367, 512, 715, 1150, 948, 799, 490, -13, -1046, -1021, -1068, -903, -835, 316, 602, 531, 1481, 1238, 455, 231, 858, -483, -727, -1618, -583, -605, -765, 192, 556, 992, 1253, 581, 520, 46, -1062, -620, -1113, -725, -321, -650, 563, 882, 858, 1088, 716, 57, 72, -684, -719, -821, -1082, -532, -484, -394, 458, 823, 1093, 1116, 652, -47, -167, -1139, -1406, -548, -754, -456, -96, 534, 1124, 1038, 771, 58, 201, -540, -844, -1175, -1157, -759, -664, 88, 542, 774, 501, 941, 310, 837, 21, -886, -929, -410, -1142, -939, 5, 472, 955, 1041, 877, 924, 515, -164, -52, -1375, -1409, -754, -442, -197, 536, 568, 646, 854, 964, 1005, -11, -67, -978]
2886i78l06J7K83J133L11K85m6N4O49j262O4n71k22n69J36P2J104L5N31J3L02
2907A035Nk30q7j207M70o49o48Q11K40R98k15J159q00n4j37r08p1k88om79N11
2928e50J94m77R98Q07j93P84j211M93j050q5o59N07m15M80J76N27J025k69r09
2947A73J83L70m23r81K89j232P98P09j15k49J509K30o03L24n68q01r6K74j061
2966a270N76j78M38O01N86m51P27j19j3q68n48%k53o86N95L6J119O95K07m84O13
2987A323n89l03n31n62m72K10J07L70K73J27J048K91o24oJ09o05o85r0j27L2p4
3008g78N95N56K63R2J06P2k63j021k93k87j47l81J115M37m56R47K53N9m81j10
3028B78Q2j045q25J70J20N86L99L61L64O76n16J89L22j037l93m8o42q9O12j0N42
$$ y = [-978, -1284, -1267, -984, 149, 460, 745, 699, 753, 1402, 140, 204, -367, -589, -1158, -1022, -950, 154, 189, 720, 733, 1035, 1040, 810, 723, -484, -14, -663, -1311, -500, -260, 738, 523, 1682, 882, 828, 691, -217, -288, -576, -582, -1061, -550, -356, -833, 165, 972, 779, 1563, 352, 845, -205, -290, -949, -442, -857, -377, -201, 326, 1351, 1082, 173, 356, 726, 303, -678, -389, -1621, -823, -114, -229, -478, 1031, 1261, 658, 982, 414, -387, -483, -209, -1270, -694, -872, -434, 167, 753, 302, 1029, 910, 897, 29, -519, -519, -772, -1458, -863, -827, 292, 987, 1194, 710, 1323, 734, 431, -100, -662, -1134, -924, -817, -447, -174, -47, 1001, 1292, 668, 662, 771, 166, -519, -609, -736, -704, -778, -183, 373, 636, 728, 834, 906, 643, -378, -671, -958, -1105, -1486, -371, 66, -390, 557, 810, 869, 388, 278, 360, -685, -1510, -1340, -1220, -634, -235, 126, 490, 1166, 650, 839, 1161, 124, -269, -317, -959, -1048, -436, -446, 96]
3049I6N46R7O90o84m37m38l22k42q2j98j99P04L41Q59K01K77k66j09q70j10m78
3070f24K95r43Q42k19L90N80O12j25K46l40l27j011j51K61m93J83K54L27L79M14
3090E50Q02L6p18L0n26k34j573O83K03k12N24K99L33P27k6l52j50N8o43p21J85
3111g25J28r3N41O41N96k3O8K18p17l87k1j515P78l6k87rJ090M00k96M18K69n94
3133D44l25o46Jk06k57K3L46J97J407M0m38Q04k78m57l86k64o99n28L80O4R69
3154A91N41l22M40J02l88m11j07m68p04m13O26j60J180L72J41J24M46l4p77l41
3174C8o23k25o0P8r1L72M96N07N46L3j12m23q29n69L40n71J77O08k94N93O84K34
3196I09oJ82m14m83L16j003m50k5N14J37K56K65J100m53J4K99m9j578k3o28k2
$$ y = [96, 642, 739, 1429, 745, 308, -130, -452, -694, -776, -974, -1173, -469, -128, 731, 932, 1209, 943, 834, -36, -146, -624, -329, -1272, -430, -649, -259, 321, 933, 808, 1054, 714, 387, -624, -775, -514, -1007, -824, -570, -243, 136, 550, 1352, 1388, 670, 700, 174, -60, -1633, -950, -747, -959, -435, -136, 197, 924, 898, 546, 396, 454, -189, -910, -725, -597, -690, -149, 492, 1088, 1065, 1133, 1351, 634, 247, 226, -1289, -511, -547, -834, -843, 247, 647, 351, 769, 1038, 444, 119, -527, -526, -732, -989, -966, -620, -423, 984, 1024, 586, 1390, 1112, 655, 269, 5, -694, -1222, -842, -778, 191, 732, 410, 850, 952, 564, 153, 46, -422, -1126, -1539, -913, -1073, 107, 479, 620, 744, 1190, 1156, 379, 38, -585, -810, -870, -792, -883, -511, -15, 492, 1038, 1071, 959, 536, -293, -862, -522, -1093, -916, -308, -602, -9, 675, 909, 903, 1085, 671, 188, 504, -499, -949, -974, -460, -323, -67, 198, 1298, 845, 859, 1158, 1109, -469, -492, -1120, -1142]
3217a142k60R46o6L70R47R9L1k31q4m95k80l84q23J027o16M45O76J68J133m97
3237I64o73L14l48m66q78m24O21M93l59Q69M30J40L52l69p3p84o00J19n11N37
3257f46k98P78j01M11L35L27N05q60K65o46q27n63J47M77N40Q0O70o81J182n51
3277E44N9k21r20k6m45J58n5N92K97M73j86J078lk31q46n6r56j27k23J63m20J076
3299b75N69N41M83j22l16n60m08q8l40o89p0M46L30P9J002J46P3J49k51n30n50
3320c81r6l46k13O51J46K07L06M71j36M60r2r00k42j293O0R69k99M46m5J018k07
3341D84J512j484L41m36o78j70m53k6M25K22O53J44L24j54L68l24p69n30N63o91
3361f79K50q28Q01N34N81k63O56k63J0M0p74k68q92M22j68L53M08M64j46R11k83
$$ y = [-1142, -1402, -456, -522, -152, 795, 894, 925, 694, 610, 115, -165, -549, -1372, -345, -961, -516, 160, 328, 1461, 964, 291, 605, 257, -209, -1087, -1511, -890, -397, -756, 113, 543, 683, 1035, 666, 593, -191, -791, -672, -1183, -646, -944, -166, -267, 144, 479, 806, 1311, 451, 716, 70, -757, -1320, -1173, -696, -156, -76, 594, -87, 1095, 544, 603, 382, -538, -564, -1009, -851, -906, -314, -17, 456, 270, 1348, 1345, 1114, 268, 212, -744, -871, -1094, -931, -1351, -275, 294, 835, 1318, 1196, 880, 320, -88, -176, -516, -1205, -1275, -829, -499, -420, 582, 728, 801, 950, 699, 169, -381, -477, -823, -1036, -385, -239, -32, 274, 745, 609, 1069, 977, 77, -165, -1458, -1398, -429, -728, -282, -327, 691, 484, 1996, 512, 853, 417, -261, -431, -884, -910, -485, -263, 390, 534, 858, 704, 1072, 748, -21, -551, 12, -679, -429, -1257, -456, 78, 659, 396, 1052, 789, 799, 839, 65, -203, -1095, -673, -841, -488, -80, 384, 238, 1149, 866]
3382H66J73o85J32o65m59p27Q89l14O69r8J90J080l18l90j68J95r70L60q71L06
3402h05K19J55J089o77O16J31l18K82q71M89m63l56k58m9O72l06O18N03j20N27
3422A078m11n74L22j195L50j27l27J59M50M81K46j27R39o08j65j81m6p10j485
3441a931J174j54K25P40L50O38M74m61q24K08q09m98K9Q1J8J83N74M07K44L28
3461I96k70j96J28l72r63K40l95L03N51p9O91l06L49N98m65k72m63k62p68N90
3481c65o68J105o15R81l77J072j82m07o10k7j9j445L96P93l94J057k62L87O15
3500A035m02K24l37jr14p88N61L31m12L08L21Q89j92O46l35l13k58n66m77K52
3520d28q21J45J200M16K55m99N57k02j71m88J72r00k06J89J1J054l01N19Q4J81
$$ y = [866, 1039, 354, 486, -179, -638, -1365, -476, -790, -121, -219, -29, 1051, 733, 343, 175, 370, -600, -240, -1111, -805, -586, -431, 658, -19, 597, 728, 410, 692, -179, 310, -153, -509, -767, -816, -144, -450, 168, 671, 551, 1078, 667, 93, 415, -780, -430, -557, -884, -725, -275, 206, 452, 325, 1264, 656, 491, 310, 264, -446, -1931, -757, -911, -686, 54, 404, 1042, 1516, 1055, 231, 439, -370, -868, -839, -758, -740, -557, 17, 424, 668, 996, 726, 530, 658, 286, -677, -437, -832, -529, 22, -57, 634, 328, 677, 1275, 810, 538, 75, -187, -955, -365, -1033, 72, -543, 438, 61, 1133, 951, 544, -66, -93, -112, -1557, -1161, -368, -762, 295, 33, 420, 1035, 633, 857, 520, 519, -395, -1183, -622, -291, -703, -395, -74, 815, 623, 1269, 934, 621, 363, -203, -680, -428, -1249, -1104, 96, 512, 767, 268, 825, 623, 452, -36, 136, -764, -970, -781, -770, 284, -17, 502, 586, 767]
3540G67M16m54k5r63J59m85n28J08R30m01O38N53J63m61r5p5o47M25o25n35O26
3561e09QL99J43K03j09J47K92j03k50M6l01j348J76O65m01R49O32J47j1k90M28
3582I13p71l02l82m85M32J33L5N12k1J79K87K39j367N35o57M68l39O5K09j0K16
3603a11L02J048m76m29p7K72m65o21l38M71M3N31p38J048l4K48L15m32k34j98
3623A25j314R25J2n26R0Q58L51k78L98l4m19M93n43n75k16n59P39j92N07K68q8
3644B2Q62j63m53L12m58l48M20j064K57K69lK28L41L62l12j37O23m33m31n96K42
3665d60k25R4K96pM65N29K73k26L0r99P57r64q6J08m79M87PL68J115nl98j21M10
3688I69q72n17MN2m31R35j14L12M71K53j64l93m29K76j62p46J55rk15P52P7k74
$$ y = [767, 1183, 729, 704, -259, -100, -585, -1113, -1005, -75, -476, 162, 715, 878, 417, 322, 247, -400, 25, -600, -1135, -509, -501, -102, 41, 244, 135, 282, 574, 471, 221, 267, -34, -1382, -1206, -541, -942, 7, 639, 786, 775, 485, 913, 142, -160, -542, -1027, -595, -462, -427, 85, 64, 243, 530, 769, -598, -63, -720, -252, -591, -526, -317, -327, -111, 191, 1239, 763, 334, 257, 529, 64, -557, -895, -424, -381, 150, -588, 460, 426, 674, 989, 557, 323, 125, -1189, -264, -252, -778, -688, 170, 521, 243, 641, 607, 188, 681, 138, -437, -653, -1212, -473, -665, -158, 110, 22, 884, 721, 268, 580, 122, -226, 194, -870, -613, -344, -347, -119, 222, 584, 272, 135, 758, 325, -106, -702, -460, -685, -591, -295, -302, 163, 692, 965, 739, 769, -230, 527, -437, -523, -415, -894, -407, -400, -32, 1083, 1078, 680, 559, 969, 97, -420, -416, -364, -795, 140, 26, 338, 809, 1062, 898, 505, 76, 352, 190, -556, -401, -410, -625, 127, 204, -70]
3710g0O5P15k86m8p04L12r05k6M62N57n92N59K47N3N70r09O53l33k7p88r24Q37
3732e82K08M8M02M23J10M13o16l38Q2l99L7o53M35J68J54K09L86j31K83o16L11
3753C34L51n21j94n92Qp1N35K58J1L4K19n77J033p88M4l30l32l50Q2P42j45L93
3775A44M85m07K34k30j08J92l63j11qk5j30L12J98P1l01J41L5M31o79P4m52k46
3797g43M74j06k90L09P43M48J61l94m18J37l22l56j61J68m0M54R3P43l07K09j28
3818F74l15k11l11M81m65q14N32K60p4R51k68J46k42k7J31q05R3K38l27j76M57
3839g2m61L34K15O76J4k78J30n02m21L81o2p03M45m24N98Q51j85K97l80j63k83
3860GJ00k10o22Q94n25K61m59Q55q22Q95N46q07L42n35m32k07O8J40L93o03N45
$$ y = [-70, -5, 710, 424, 376, -328, -16, -921, -947, -485, 72, -520, 39, 286, 339, 909, 0, 653, 320, 293, -495, -1419, -582, -374, -326, 76, 499, 609, 1022, 406, 68, 150, -249, -212, -865, -430, -262, -108, 101, 487, 356, 639, 23, 334, 685, 164, -30, -622, -614, -685, -150, 108, 119, 153, 372, -205, 828, 40, 84, -246, -578, -928, -846, -104, -249, 144, 629, 222, 456, 226, 118, 310, -53, -164, -172, -197, -327, -15, 183, 254, -47, 94, 129, 560, -119, -45, -497, -743, -269, -375, -665, -356, 387, 835, 996, 602, 184, 321, -1, -357, -518, -350, -390, 64, 157, 900, 593, 802, 674, 359, 148, -163, 318, -147, -961, -429, -169, -243, 708, 440, 586, 344, 317, 448, -357, -264, -26, -353, -529, -72, -533, -199, 16, 692, 706, 428, 558, 56, -365, 16, -46, -749, -304, -728, -130, 721, 536, 833, 453, 290, 7, 107, -103, -725, 169, -356, -95, -554, 301, -521, 374, 920, 113, 455, -80, -512, -719, -651, -511, -118, -721, -176]
3881a76L49J34O43n58k07r6j10o41L64k39L72N29J69J99n04M83l84j9o86R0l71
3902f59k55O90K35j99K76K62k78Q3n6k32j13m08K29l2N06o59L55P10k87p9K0m10
3924c01K81P6J70o61L4k48Q76p32N10J149p98O22n82K09l98l31o1j66m57K48N27
3945c3L25N82o37J34K51r0k88p48j01M65j58j49j60K60P78M4O5q7p87N06j29l22
3967b79Q1n78K48M33M3N77n36N18k70k30L85l99K55q90J7q4N69J05K10m28Q35
3988E82o14P93j56n72j92P8p07K42O64j44R29j144K7M44K48o24J96o3M4l77o46
4009i92Q66l49Q04k0R2n21M95l07l2K42J4l95k97P1K45k46J9P05K38p11O93o62
4031d8k23m01j61n3O57K24j46N47nj61k45L96m55k0o10P47j37j3l27M72k15N79
$$ y = [-176, 173, 307, 950, 392, 185, 89, -21, -662, -298, -537, -165, 364, 533, 732, 228, 711, 327, 308, -378, -288, -659, -914, -224, 11, -188, 88, 350, 72, 155, 99, -133, -246, -654, -425, -457, 49, -610, -255, 455, 168, 89, 109, -301, -20, 56, 226, -435, -401, -649, 227, -505, 5, 1154, 356, 978, 396, 605, 207, -124, -185, -351, -808, -560, -33, 292, 874, 237, 371, 622, 532, 244, -504, -605, -140, -298, -447, -607, -347, 431, 475, 540, 453, -334, 172, 43, -279, -198, -776, -528, -95, -52, 525, -11, 507, 237, 7, 392, -7, 248, -642, -625, -709, -140, -35, 175, -253, 582, -32, 761, 605, 33, -159, -81, -788, -546, 118, -26, 903, -241, -214, 230, 478, -146, 50, -13, 31, -346, -992, -126, -475, 329, 309, 401, -120, 375, 68, 36, 278, 292, -103, -400, -329, -84, -330, -311, 394, 632, -79, 614, -48, -271, -672, -833, -886, -229, -5, -151, 396, 391, 230, -15, 381, -74, -94, -704, 43, -94, -107, -434, 38, -177, 402]
4053D02p27N23j55N70n53o19N39L78l65j19K61L22l83K82m65M19R7k82k47K08
4073H6l4l85L53j30K45K37L37o39j37j03M84p94N14l38K12J01j48m53J69M30M8
4094E5O8J18Q3p42J18L17j0n45j76Q67l67R49J22l70p88N57l23m51J91n71K64
4115f34N94N1J91q5K44m1M1l62J37l52P77q73l82J23N32M36j85K69o22J8l71J173
4137F79j027r5L52m1j86j25P22n8n60R00m55J159j356N9J52q72P30K48l85j66
4157c25M87L1J72j3L0m65k46M10K52j95o55K0M01R3l18Q99m63l97M58l1o0l97
4179c12j18K71L6J85K02l46Q7M2K36k69M98q02j29J58r9J88L54N4N39m97K72J65
4201G15r94L92m42P79p42N62p35M57l6J41m3J59r6q72R74j33l06J44j21K64J90
$$ y = [402, -325, 198, 43, 613, 60, -559, -20, 358, -7, -126, 135, 457, 74, 356, -109, 310, 407, 125, -122, 86, 52, -333, 20, -110, 135, 372, 709, 70, -67, -170, 314, -480, 34, -304, -92, 9, -139, -592, -423, 7, 55, 123, 241, 324, -418, -300, 17, 7, -538, -714, 153, -214, 735, 857, 487, -301, 256, -67, -518, -327, -898, -634, -40, 11, 202, 117, 361, 320, 361, -1, 136, -216, 561, -312, -694, -571, -39, 397, 212, 481, -141, -123, -494, 679, -348, -443, -91, -132, -318, -443, 279, 221, -339, 561, 106, 1265, -91, -32, 120, -752, -22, 226, -159, -325, 162, 193, 365, 352, 382, -83, -329, 81, 333, 138, -517, -497, -96, -3, -321, 578, 115, -282, 176, 145, 85, -312, -430, -159, -123, 62, 264, -82, 5, 47, 283, 14, 512, -290, -419, -261, -360, -172, 182, 236, 775, 278, 550, 715, -279, 113, -329, 450, -292, 270, -465, -8, -44, 97, 54, 213, 117, -755, 219, 86, -220, -76, -197, 67, 257]
4222B57l33K39P6K58m48N16m92j11k76k69Q21n9l21j01J65M2j55J9M36j90J35
4243B09k91j45n2q9K11k1r6P99r86P05j82J05j256J422n12K74l81o6O85l90O56
4264E99n65M46r02K75n15L91j25N52m7j30K85R6p24L40N61l56k63M21r88N78j51
4285b22M5j1Q92p24J11K69m52O41k85o94k0k52R51j62n12R65q26j54N22K95q4
4306B93k54k39J28R8j45j14J69L2J9O90r75k15N45R9R6j54j49l36K60q9O48q3
4328C24m15m80L67Q05m41j89l85L69l4k00K80q0N2J42M9m18K9Q47p82L10k05K04
4350A49J27m68K2j68K60L47N60p85M91q34M24J52j75K6l58M06K64q04O88m31K80
4371A73Rn13O12m12L45r23J122l94j40L74l89nJ81J28m39n7J71J17O5J18l04m5
$$ y = [257, -76, 163, 239, 497, 49, 565, 73, -38, -314, -583, 238, 179, -142, -243, -78, -36, -191, -172, 264, 74, 209, -82, -227, -279, -368, -157, -178, -274, 525, -461, 244, 62, 167, -1089, 333, -179, 95, -286, -352, 333, -57, 599, 34, 480, -422, -147, -662, -271, -396, 156, 109, -21, 264, 360, -364, -24, 537, 181, -82, 339, -649, -71, -222, -177, -188, 704, -20, 91, 360, -92, 549, 264, -430, -450, -702, 249, 87, -425, 540, -286, -440, 82, 377, 293, 39, -200, -72, 26, -119, -233, -64, -32, -13, 677, -298, -513, 32, 131, 227, 73, -76, -412, -152, -241, 407, 324, -91, -571, -204, 601, 160, -29, -414, -45, -79, -279, 1, -79, -27, 115, 164, -254, -225, 622, -160, 150, -55, 149, 276, -192, -170, -338, -78, 269, 829, 44, 535, -299, 125, 277, 102, 128, -230, 176, 440, -364, 324, -107, 173, 182, -331, 281, -131, 214, -709, 413, 19, -121, 253, -136, -141, 40, 168, -271, -328, -157, -40, 25, 143, -161, -206]
4393b06N36n70M92k99l5M70n70M0J95l2r9J46J57k68j0M90r8Q9l63k6N85j180
4415e56R88q25J42L3M17n6l02p4p6P1O06L19q71M40j24K02l48K61m03r2l8k3K72
4438c7O47o15m69L42l16k3Q63J33n62oJ95m39m7o5N30O23n00p2l35J28K45No9
4461A56j29l2K39l51j25N36k86l06L63K66l61J92k58m17J09p5P95j88Q4l87K46
4482G1k19J63L4O1j70M23m75j20N43N83j422P01J35K36k54m27R19j119K94J38
4502I5l67j20o9K02j94M08J20k03K90l38L42k9j21P27r00K56j80l68L49N0J06
4523E6k62j9K85k37K46l86K68j37N13k56k05L41j03K89l90L3L36p32k56O06k76
4544b86K78m9L8n92L85K19K1j00k10N78k25n53M15J31o69N57k3O8j7K14o32J68
$$ y = [-206, 330, -240, 252, -47, -82, 388, -182, -142, 53, 21, -78, 68, 225, -43, -53, 437, 339, 428, 65, 39, 624, -556, 432, -393, -251, -218, 199, 143, -159, -233, -309, -238, 368, 687, -184, 256, 132, 334, -14, 247, -156, -248, -286, -309, -37, 610, -5, -474, -132, -448, -471, 392, 525, -37, -43, 152, -287, -334, -399, 131, 754, 254, 182, -153, -25, 220, 225, 156, 27, -5, 234, -117, -242, 294, 8, -298, 65, 331, -30, 162, -96, -513, -404, -479, 316, 128, 212, -175, 71, -148, 15, 49, 110, -60, 363, -112, -232, 311, 894, -528, 173, 308, 544, 290, -137, 782, -337, -43, 95, -272, -392, -461, -259, -453, -45, 75, -128, 162, -176, 166, 137, 16, 743, -157, 99, -81, -449, -100, -50, 56, -206, -225, 60, -177, 69, -317, -49, -186, 327, 71, -134, 207, 104, 393, 3, 36, 372, -360, -616, -10, -286, -8, -57, -19, -611, -226, -7, 14, -86, -296, 282, 57, -496, -81, 50, -619, -62, -85, -17, -34, 180, -452, -284]
4566b84Q18J20r96qk41O96K07K8j82K87o43J065r38j56L38k17K03N18n65p0j60
4587a80K88k0j42MK47m57Q31o5j325O26J37q5q0N40j56m32M75m53M55K3k69P33
4609F95m01l34m93j59M53J22J26l50Q2P16q0m6K96m1j12p14M82j47N10k67l33
4630EJ47L01m23n8O26l65k35l9J24m20M31k65j51K4K77M28j70l95M15o38K59n
4652a27L22J03j22K91k54J0l49N40l64j62J75j02K98N9L54r68N31j76R36j031
4672c6K32k74p4J02J44k79j57N03j17k47J075p58m8L0J64l43m56M12M47l78N70
4693E12o32l90J190j010M10l83L96o28O84k97K70j09O97o54K71L20k65n91M16
4712B07K02j127K80N8M59n79M23J70M20p82K08L30p43L94O9o22L24P29r05N93
$$ y = [-284, 534, 654, -342, -350, -591, 105, 312, 340, 158, 445, -198, 867, -71, -227, 111, -106, 97, 615, 50, -20, -180, 108, 88, -54, -50, 197, -260, 571, 506, -819, -193, -56, -141, -221, 319, 163, -269, 206, -247, 208, 231, -38, 695, 294, -40, -533, -692, -239, -117, 9, -341, -259, 457, 377, 331, 627, 586, 474, -240, 242, 95, 605, 338, 5, 152, 453, 30, -28, 598, 233, -2, -41, 83, -337, 94, -171, -322, -298, -21, 407, 237, -158, 257, -381, -122, -127, 195, 298, 176, 467, 213, 223, -126, 414, 50, -112, 63, -39, 259, 318, 672, -296, 235, 59, 995, -36, 196, -78, -152, -50, 94, -185, -342, 161, 44, -203, 872, 114, 66, 96, 260, -83, -539, -127, 320, -58, 512, -120, -510, 680, -330, 80, -303, 93, -535, 149, -148, 122, 13, 710, 56, 327, 647, 382, -209, 207, 409, -718, -438, -380, 79, -500, -77, 93, 513, -269, -61, 269, -474, -80, -11, -633, -309, 420, -485, 108]
4732A08R2n06L81J12q34P50J38k50j51k79M43k62K93J3K04j33K43j92M48o40j30
4753a52n7K4Q44o58k93O44o07Q94o82M7L02p30M06j33j03l86Q70q97M68N63o18
4774b54Q65q07P14k92k10j31L95o11L73M25j51q23Q28l58L17Q1k97J10j1l70O69
4795D62p05L54J07p39O96q87M99k72n5K90j63L75L0m66M45L07j9K13j73n78J00
4816a79O22m37J81k64l2O74k26p23R92j008O92k32N9L5n95M17K02K20J78o18N6
4837A4K1j94j08M58L38j264P03k28N99k24j83J52p5N4p1j88L32n20K43j14j7k4
4859b96K95m22M98M40o18K21l0N91j89p00P52j299R13k2l50M7M37l39K08O67r28
4880a24N52m89l32L43k3K1J23J2J50J58j238J227p07P76n14J4J55n78M25o30P09
$$ y = [108, 200, -306, 75, 187, -647, 103, 241, -9, -160, -439, 4, -258, 35, 48, 252, 119, 362, 170, 618, -22, -152, -209, -185, 659, 1, -292, 352, -255, 639, -43, 4, 306, -424, -18, -151, -254, -640, 230, -667, -199, 364, -254, 611, -196, 518, 226, 16, -115, 280, -331, 42, 467, 316, -507, 321, -37, 280, 361, 64, 174, 163, -207, 462, -243, 111, 218, -521, 175, -712, -213, -485, -540, -250, -413, -38, -8, -474, -29, 278, 259, 472, 299, -279, -179, 443, 6, 187, -77, -109, 565, 339, -384, 608, -400, 292, 60, 119, 154, -441, -24, 178, 398, 576, -42, 14, 35, -159, -267, 191, 529, -735, -32, -260, 339, 115, -68, 84, 9, 63, -8, -196, 136, -384, -141, -255, -272, -296, -1, -423, 75, 515, -103, 118, 88, 679, 490, -210, 542, -757, 156, 134, -216, -169, 268, -71, 137, 804, -124, 428, -61, -393, -50, -73, -52, 71, 83, 233, 391, -847, 380, -327, 449, -65, -51, 104, -474, -49, -679, 30]
4901C0p51P55N11l88Kl46J77j90J80L27j83K75o22P08n94k4R9K60k98o3L17K29
4923D11K59p21l8K05j72k51J19j26L71N09n75j22l0k21M68N35o75p89L43Q35k12
4944A23j54N5M06n8n33O19m06k42P48o03L57l28J02K02J10n63J64K47k00r8J19
4965F7p2p13P88J03l38L41m8k13N01k13P3m04K08j23k60M69n27J96K16l25J54
4986a20R03j461O66o3N34q39k71O01J3j38N77J52l08L39m61j32J68M8l08K09K02
5007C11j51K59k47k61J79l6K69m70L89j003j57O65K26j63k09N24L5j65J84o5J40
5028B54J04l64m40J055m36o45M55j17K68k19O44o07J43n03K34n43R82l43L45K59
5048E26n8k48K7j29k37J76j33M9L65k60o30M02j97N95L7n24M57M21o41J06n53
$$ y = [30, -721, 34, 545, 157, 159, -187, -10, -200, -20, 307, 124, 399, -223, 485, -109, -133, -34, 226, -72, -135, 182, 411, 670, -51, -89, 116, -56, -307, -188, -314, 57, 566, -9, -131, -161, -382, 86, 621, -54, -843, -500, 335, 123, -31, 24, 430, 372, -161, 458, 52, -190, 558, -45, 312, -16, 86, 288, 398, -165, -1, 246, 46, -52, 67, -5, -718, 70, 173, -165, 176, 128, -85, 416, 203, 276, -128, 80, -43, -303, 166, -361, -165, 51, -274, -120, 783, -678, -12, -75, 459, -380, -651, -50, -37, -175, 402, 554, 246, 585, 124, -8, 160, 208, -100, 109, 311, 160, 419, 172, -89, 90, 54, 323, -147, 242, -761, -918, -253, -27, -190, -399, 125, 160, -5, 179, 114, 254, 358, -6, -446, 609, 173, -472, -17, -134, 134, -85, 559, -48, 95, -408, -174, -717, 265, -78, 267, 526, 468, 220, 247, 118, -119, 57, -76, -27, 338, 78, -552, -150, -347, 248, 285, -239, 218, 639, -2, 104, -449]
5069d49N77l23k90P55m00l06O60k84Q2P8l75O87m96j26N41k59j09j3r1P00k54
5090C05k38l23N36j59j86O12m95n05k57J069o26N6j57K18Q00q10l7r2R1M23j183
5111i58Q67K06J42n44Q94l76n13L42j15p7M88l34k72L13o86L02J92L32m7J88M
5132C48m78l27K55q7j51K62L54j29j41k92R27m62L52Kk55k68l30P01l51L72m00
5153i8O56k20k58n02K59R45p56l65J086q32L7N45n76O02l20m76M78J24l48M8o01
5174e72P37l81l05M83L00L4o8m55P61k18n13j64Q0K88L57n51K58L03n8o09Q56
5195E63q04L92k50LL85o81N11K20l90J32j74L50p21L41n00J039m25k52P98o45
5215a08J03q5K53j90J69l14L04L23m68M22n40O5K79n95O43K90n21m1L99j06O4
$$ y = [-449, 128, -195, -485, 270, -130, -436, 224, -60, 22, 100, -275, 412, -84, -210, 331, 72, -37, -50, -141, 559, 305, 67, -256, 280, 121, -65, 547, 52, -453, -710, 359, -267, -211, -368, -150, 650, -160, -197, -289, -198, 225, -958, -91, 115, 257, -287, 607, 231, -282, 60, -55, -132, 356, 22, -250, 63, -623, -321, -129, 203, 156, 344, 348, -130, -457, -202, -289, -440, -178, 176, 47, -94, -386, 541, 79, 431, 433, 178, -90, -420, 281, -70, 302, -98, 558, 338, 80, -422, -163, 782, 26, -339, 747, -85, -48, 497, -79, 523, 203, -273, 205, 329, -19, 29, -572, 165, -216, -521, -38, 262, 296, 228, -227, 534, 316, -197, -361, -281, 7, 364, -187, 71, 374, 316, -293, 563, -241, 151, -99, -96, 289, -392, 119, 339, -51, 81, -93, 257, -464, -123, -623, 416, -9, -261, 537, -108, -5, -90, 163, -27, 142, -172, 132, 455, -13, 409, -131, -66, 213, -382, 261, 551, 30, -11, 388, 282, 346]
5236C46m60J93j24M05k64n40R68r12N95j65L1R9J89K10r3k35k59K94n58j0L89
5257I9m98J61k97Q98L48o63L67k8j79m79K51L12n0K73j53l90n18J78O31kjN0L30
5280F40q06O0m56j6P34j92N37n84J79n1O9O4p89L34J5J20L72l5j21J34j06l89
5302b87J74j2J49l11L8j08NP92m34J52j25M8L61m66L84n08j23L37kj77K19q7k9
5325a0K06o26J084j0n11n87L72K33n02L61N59p01Q42o56l37j8o4L89p7p8K74n89
5347d46P61j22J10J73k09o73P54m19R6K62j90J00QN6o16M24l85N64p21N08q0K47
5369B02n39M95p39P7O61l18O54l66o38N75l00K35n03J320o79l90n2N5M5K1J59
5390b5k37K24l29K04j21R8j99M69p85O88L7k0J38K42o56Q3l6p9P4M57k66k19Q49
$$ y = [346, -114, 79, -45, 360, 96, -444, 524, -388, 207, 42, 73, 172, 361, 571, 478, 243, -16, 278, -280, -290, 99, -399, -238, -535, 363, 711, 48, 415, 387, 208, -271, -20, 292, 242, 515, 362, -28, -546, -368, 263, 261, 260, 310, 640, -166, -106, -562, -578, 156, -36, 501, -83, 96, 45, 114, 178, -611, -277, -262, -142, 230, 195, 74, 208, 102, -287, -113, -125, 24, -287, -249, -357, -352, 440, 6, 158, 33, 81, 442, -24, 360, -148, -271, 66, 64, -113, 106, 19, -10, 196, -430, 654, 644, 133, -454, -82, 151, -351, 10, 569, -132, 710, 54, -283, -301, -365, 24, -53, -131, 143, -446, 315, 193, 303, 476, 267, -406, 348, -71, 25, 287, 97, 197, 205, 261, -355, 69, -316, 248, -473, 35, -45, 202, -337, 158, -581, -504, 157, -161, 493, 127, -511, 64, -236, -1, -504, 816, 137, -253, -305, -250, -205, -184, -25, -262, -38, -367, -163, -284, -186, -385, 84, -701, -13, 24, 4, 142, 384, -272, -189, -225, -304, -230, 227, -39, -258, 591]
5413E91l54n41O60l88k80K72L60r08O03l18M43q9m19K68q3J04L54M00m70l72K61
5434I4L21m56P8P1N51l60J27n01K81K38n61q29J502m07l24R9j9L83q22L15N67
5455C48J08m72J00o17P36J67R3p73k37Q50n22K52q96P53Om58J36O20J02N7p71
5476d18O6J84K47o00K59k36N39j96j70M57R4m02K75P2j65K17m91K0M66J99l74
5497D3l09M91l44M8k89K78l21P94j81j14J55r32N46l0O9m01N59K25m16J35k1K09
5519A94o75M23J66j60J80M77j473N06O47n89J0L39q61L41L92j07M39o42M9O20
5539B76j67R6R9q70O94k44M78n58N0k75J48P05p39N13O6J6k71l95m52R74l50O16
5561D10p31M69j47K82q54N89L23j43j17l27N34M65n42o36R87r42K44L16j34l45
$$ y = [591, 237, -304, 356, -32, -312, -40, 320, -588, 15, -303, 140, 51, -368, -100, -183, -79, 275, 675, 205, -167, 94, 415, -41, 37, 108, 659, 299, 426, -75, 206, 444, -117, -946, 556, 149, -175, -76, -95, 288, -534, -219, 348, 456, -16, 84, -533, 203, 370, 463, -310, -547, 303, -219, 33, -863, -110, -104, -562, -426, 194, 296, 353, -418, -352, -168, 79, -521, -262, -498, 41, -155, -325, 132, 226, -176, 99, 171, 6, 223, -268, -248, 218, 417, 43, -266, 225, -119, -71, -360, -82, -403, 391, 210, 96, 251, -681, -135, -165, -96, -497, 62, 287, -129, 6, -15, 194, -481, -58, 108, -52, 128, 605, -868, -362, 285, -304, -294, 45, -816, -475, -83, -190, 249, -393, -344, 276, 109, 205, 304, -566, 128, -116, 362, -196, -146, -421, -273, 432, -307, 206, 272, 288, 17, -378, -830, 144, -206, 410, -321, 148, 1, 283, -571, 18, 341, 198, 81, -246, 288, 753, 211, -425, 562, -380, -136, 180, 46, -299]
5581b99l3j3R87m20k8j55l86J75MK12R4j72J17m87J04O40j80m47L50n4J88k55
5603e8K44R4J0l13l13M6M67m2m4l86L19K5j56N35q80L43K22J9L1M37n84k29J61
5626e2J57m86L49L61o45P01m62J14j18J4J64K72o85K03L50k11L63j008p7L97O53
5647C54k4k59k4Q0L58o07O7n2O08n96j91J30m1M22m5o6M3l55L97p54P8M04m06
5670d79J026j126K91M50m5k92P34o45N41Rl44l23j34M9J73O89n32m0q1l84P10
5691B47k82K77l16K09r9K14j95KL0j80l56J19K09M83m59N00p16Q20j060L59k51
5712d45L96r1l36j00P95l23q4J57J31n00L31kJ75k41K14m88K94k0OP53o93J58
5734H7n7l45M10j59J99l96L2L14l79N45m00P06l44k06n0j83n07Q23l38K81m86
$$ y = [-299, -332, -345, 642, 222, 194, 39, -347, -172, -168, 44, 138, -34, 83, -404, -300, 340, 160, -287, 63, 9, 197, -58, 186, 280, 290, -23, -336, -290, 177, 135, 91, -295, 24, 49, -107, 428, -452, -109, 113, 132, 163, 600, 16, -213, -52, 105, -381, -32, 329, -316, 385, -77, 37, -81, -67, 97, 369, -316, -113, 237, 26, 389, -619, -696, -299, 354, 330, 71, 47, 127, 485, -122, -55, -107, 501, -95, -286, -156, -197, 225, 180, 114, 157, -198, 199, -555, -477, -73, -479, 547, -579, -288, 162, 117, -175, 559, -86, 455, 464, 120, -203, -337, -288, -115, 574, 42, 2, -79, -463, 247, -35, 242, -74, 135, 36, 250, 55, 57, 87, -93, -449, -330, -121, 362, -97, 403, -313, 507, -553, -194, -445, -49, -140, -476, -576, 219, -104, -188, -31, 100, -400, -69, -71, 104, -137, 77, -411, -117, -137, -131, 622, -71, 87, 30, -315, 95, -64, 135, -261, -229, 85, -294, 251, -149, 557, 213, 7, -43, -226, -733, 90, -248, 33, -453]
5755d53M02J22P2L10o25N6L81P4l16R7k7j92L07l92Q5M32K4J56n48K39m40J14
5777a22N58k35l82L14K14p71K27j08M3r4K38l20N78k76k15M09o8n1k07R00m97
5798A35l12n4O22p79K81l32O68n33N13k64k36K70M22m04k12J64M76n06n2L48m6
5819A69j59k96N97l03Q8o72O40j67O5r6j61L55m62J16J20M8j07J72j54M78o73
5840d02j19L03j49L47l14L60pO3M6j37K99l03L59n41K43l90K13O45m33o17O62
5861A28N7m70M82J85L30p54n7k26Q2L03m10m68O38j07K00K99p93j7L59O72m54
5882b1M09o53J66m5l77K62O17k50k97l75K44L55o19J22lM89J28L51n61L00j76
5903F6L61j74j05m4r3O3m7k15R31j218K36L73K67n29o43R46j71k70j95J42P23
$$ y = [-453, -51, 71, 143, 453, -172, -116, 265, 339, 23, 120, 93, -99, 208, -184, -99, 333, 357, 513, -35, 204, -236, -122, 436, 201, -181, 133, 347, -424, -197, -305, -262, -356, -118, -438, 140, -136, -351, 58, -10, -61, -268, 632, 135, -177, -231, 391, -388, -107, -439, 229, -304, 209, -55, -291, -21, 401, -3, -215, -51, 425, -81, -133, 215, 169, 10, -286, 311, 8, 96, -576, 64, -103, -38, -134, -295, 60, -402, -286, -166, -118, -225, -53, -207, 271, -402, -521, -218, -367, -20, -334, 26, 19, 82, 128, -9, 290, -13, 346, -195, 48, -342, -129, 516, 83, -534, 128, 185, -285, 197, 382, 712, -42, -99, -325, -243, 60, -350, -818, -180, -287, -87, 212, -581, -598, -239, 433, -21, 388, -265, -99, -144, -521, -259, 358, 108, -189, -564, -320, 35, -584, -462, -465, 24, 152, 503, -58, 242, 66, 427, 253, 148, 104, 11, 74, 27, -188, 743, -475, -239, 134, 401, -128, -771, 175, 4, -266, -461, -319, 404]
5924D04m89M56k32J88p48q2P90n81M71km2o23M12o84P66L44M1q9K38L5q93kJ08
5947b14k56Q27j13j07k30j99K7J57m5J37m87P41K79o88L84l68M82o43L96p2J06
5968A14m91k09O09K43m53l2m20O68k34K73P23m88q40P56N9k87O15k88n59L38m17
5989c20l9L07M49n04O27o81L40k49J37k03N82j46p13L84K3J78m36l8K27K68O56
6010H49j146O16L78o18l68J86J87l46R7j5O60p6l61m73R98o54l51P88qp1k26K48
6032B94K07k27p1k90J06N60r83N93q08j36O45l99M66P45J2k87k12K6m97L92j01
6053C5j5o33J94K89j97J69J80M42k86J1K90l13K98r90R2M35r5K23J64J51j18k3
6075C03J05m20M06k73rp66N79j2j2k83O23M01o24n2L37k83m17M33K4l41R5O49
$$ y = [404, -85, 371, 139, 327, -421, -503, 287, -294, 177, 175, 133, -490, -78, -762, 4, 348, 389, 300, 538, 573, -320, -322, -214, -470, 357, 244, 137, -93, -292, -265, -108, -153, -16, -503, 238, 517, -171, 213, -155, 327, -316, 80, 8, 114, -377, -586, 23, 266, -187, -219, -639, 29, -205, 68, 791, 303, -537, 219, 278, -9, 606, 318, -241, 97, -320, -359, -52, 397, -107, 520, -161, 179, -70, 67, -136, 446, 300, -413, -29, -6, 172, -264, -302, -75, 193, 849, -297, 319, 697, 79, -289, -103, 84, -262, -165, -180, 480, 404, 43, -430, 568, -86, -437, 351, 343, 272, 46, 294, 501, 274, 203, -87, 19, 579, -404, 189, -619, -755, -110, -509, -43, 702, 714, 427, 215, 241, -256, 136, 35, 20, -613, -419, -130, -327, -158, 22, 464, 178, 189, 479, 166, 464, -526, -434, 1, -94, 129, 293, 444, 326, 303, 408, -12, 394, 121, 112, -654, -75, -87, -99, -382, 241, 642, 18, -34, 303, 20, -397, 36, 60, -281, -186, 463]
6097D63k48P5M2l81j04O30j029N50l40O06l50l49N41k3q3K11K01m42J92l35o3
6118b36M1J76l30K74K56K94o19O04K4k41K19l87O6o39j31O81k69k51j17K18M95
6139A28j21k67M89k33Q2M3j70k99J99K42l43J1M15Q7l87R3pk55O15q07L79p89
6161h95N10L04L65j80J08OJ67J11n27K0J07k43J71m11j10J01N89M58o47K27q0
6182A51o27M98n50L27k11r0K76L2L66J29m83M33k9p8o33O15p5k36k01N95l23M77
6204C63j26j85m80J39k80K12l44K27O33n21N69M66m52N64j254J73K40l57N40r4
6224C3k14O77q02j82M02N84n52j33k30K53L00j10Q9p06M64ll29M39J66m85J367
6245A028n39k5m47j38R0j56q8N02m87N44l09J94K37j44k8q6m39J57M30j25k66
$$ y = [463, 215, 290, 332, -49, -153, 477, -552, -2, -342, 264, -86, -435, 106, 83, 0, 211, 412, -30, 162, -173, -236, -195, -19, -349, -75, 181, 475, -144, 460, 484, 243, 462, 75, 141, -498, -629, 52, -217, -468, -585, -367, 128, 7, -260, 229, -4, 78, 121, -49, -348, -149, 93, -250, -239, 176, 263, -124, -31, -38, -293, 322, -485, -106, -895, -385, -81, 284, 104, 212, 218, 385, 496, -31, -11, 96, -147, 24, -387, -497, -396, 193, 651, 4, 231, 151, -476, 22, -528, -201, -412, -502, -226, -194, 172, 301, -182, 251, 222, 144, -489, 126, 51, -185, -386, 209, -114, 363, 237, 52, -428, -289, -569, -357, -701, -474, 159, -362, 207, 673, 221, 785, -469, -296, -56, -413, 127, 33, -181, 496, -306, -488, -86, 498, -54, -187, -417, -164, 136, 26, 115, -591, -127, -130, -459, -20, 146, -339, 1028, 489, 464, 17, -121, -31, -187, -275, 227, -260, 284, -25, 169, 406, 262, 234, 148, -291, -134, 296, 171, -95]
6266i5L9K50k76k81L41M63o84L93k53k06L68m86P60m60J89n80P46n20O47j11k59
6287a5K66n15K41n36l2M33m93N88J17R9n4l20L34l53M26j38j84L58o02L10k30
6308c00O77oM28o97J62k62k81k65M18N29r16L86Q4M98L8k85J95k02J1k16n43M45
6330a02J40k38J29K0K35l53O13m11L59n48L51J7o32N55k54K9k81R6O20l24j1k86
6352b76K95o4l82K80o25L55L53K68n31M64n67Q93q02M46p1L60J14q14N1k9N4K00
6374b8K8m1L54m40Q11r12K40J45k9l49j43K82K04L7M10k4m27m26M57r7K09j02
6396A59m15j26J48J012p28M57k9Q8j75l71O01o82k11O25o71J36M34p01Q65m9K12
6417E79n92K19k51J4m64K97M1l39lR03K43m60k5K04q46K28L22l20q3K88L8R9j95
$$ y = [-95, -56, 194, -82, -363, -22, 441, -243, 150, -103, -309, 59, -427, 333, -127, 62, -518, 228, -292, 355, 244, -15, 251, -264, -23, -559, -591, -158, -651, -63, 54, 153, 99, -221, 113, -240, 186, 48, -136, 222, -380, -70, -300, 377, 371, 799, 102, 264, 2, -279, -544, -126, 403, -513, -127, -43, 455, 493, 208, 403, 201, 212, -4, -547, -102, 38, -200, -71, -51, 184, -169, 444, 33, 392, -156, 195, 212, -420, 135, -119, -90, -371, -275, 345, 21, 10, -276, 19, -45, -427, -147, -772, -417, -64, 204, -327, 137, -430, 463, -339, 107, 36, 396, 510, -304, -253, -282, -228, -28, 0, -41, 313, -127, 684, -228, 12, 157, 128, -221, -364, -82, 122, 159, 569, 545, 118, -308, 149, 52, 261, 159, -256, -382, -234, 778, 50, 507, 478, 566, 391, 20, 621, -61, -272, 353, -318, -182, 252, -449, 416, 367, 579, -13, 206, -45, -31, -495, -198, -157, -496, -499, 404, 647, 187, 162, 366, -480, -252, 70, -250, -333, -45, -7, 92, -103]
6440a03J57Q0m66O67k83P5j87J06m0o1l41O08K69p24O34J78P7k71k16o94P91l31
6462g5K45o18L84k62L14J49R2l00L35O4r11k5K63K39j18j00Q4N45m87L88J01j09
6484A98L37p02j41K92K51n17J07R4J12L65n04m8l91R23j4k64l42Q6K57l42k0N86
6506C23l41N01r47P55J37j90m26K70j41j44J40N3j89N15K26q45M13K59m8m57O48
6527E12n51k15k78k3O01j39K11M89o73K57o30J60M23Q1o92O54l74L61L9J42O87
6548A042o94K2K39l70p06L78K34l04n29N33O30p0L65j94n29K19J46p17L39l94
6568c60j68M6N1j0N16j97Q0l30o1Q73p85J91q1K5P12o34l83O06k69K26j74M08
6590B82KJ26m61J81r86J039M7o72R57k11l14P3n68P84P6m93N32m49l99P83r86
$$ y = [-103, 54, 134, -332, 335, 52, 127, -60, 46, 6, -55, -396, 212, 481, -243, 391, 569, 646, 375, 159, -535, 256, -75, 170, -448, -64, -326, -12, 137, 229, -71, 264, 328, -583, -608, -345, -106, -224, -324, -240, 305, -182, 206, 307, 198, 535, -167, -308, -16, 235, -282, -175, -81, 31, 396, -108, -156, -547, 376, 362, 98, -244, -158, 99, -243, -263, 323, -18, 483, -464, 291, 428, 238, -188, 82, -59, -203, -63, -10, -199, 316, 542, -303, 110, 369, 321, -136, 512, -39, -254, -532, -555, 46, -93, 118, 607, -66, 191, -439, -279, 144, 225, -467, 187, -187, 174, 213, 355, 1042, 348, 370, 609, 239, -467, -89, 145, -159, -688, -155, 475, 405, 770, 576, 47, 266, 412, -305, 34, -360, -528, -482, -431, -441, 75, -122, -42, -372, -433, 440, -345, -154, -235, -210, 502, -132, -515, 91, -178, 48, -126, 282, 284, 410, -51, 130, -856, 183, 230, -442, 515, 304, -10, 63, -505, 279, 355, -138, 394, -55, -454, 329, -657]
6611f57P41j17O32r55m22P97k18Q0o83O03M38p54N37L41l04j16M1J22L79j80l42
6632c7L34j160P40j63m0P52l67j15O54m13Kj86l31J40K50M54o54P09n15k14j73
6653c33M83J56K84p29k10k36K89L52N5m00J71L95k16J49j15q3m1M92m81l27N45
6674B00o39m60R52K1L83q21J274n74k53M49n33j24l03M91K51n37M35j43k71L7
6694a65O21L47j039l90M03j83R9K19m30J006k90p9Q1o3n36M80K54n14j5M11l06
6715h9N64j61n85J24M71K63o57r2J10M9J73n45J15L56L03o51N98j70P2l72M3p84
6737h65J073o15MO24q30M00O2O39o96M86k88M21r25P30q8L4q40J401j423J203
6757E07p67J52L87l51M59J85J0o87k34L77L8n04L02L30L96k81L65q21L33m56n62
$$ y = [-657, 84, -33, 599, -356, -778, 19, -199, -119, -802, -199, 239, -515, 22, 363, 59, -57, -16, 106, 485, 305, -37, 297, -863, -123, -286, -326, 426, 59, -56, 598, 185, 187, 1, -330, -190, 60, 514, -140, 569, 54, -160, -333, 150, 306, 590, -139, -349, -585, -296, 56, 111, -289, -118, 277, 61, 210, 95, 12, -29, 463, -18, -345, 200, -439, -899, 53, 74, 457, -364, 910, 336, 83, 532, -1, -125, -428, 63, 314, -223, 212, 69, -202, -165, 456, 803, -236, -626, -223, -406, -307, -88, -518, 488, 198, 119, 200, 137, -399, 81, 335, -179, -194, 217, -89, 475, 314, -271, -147, 324, 587, -70, -162, -52, -3, 170, -375, -260, 96, 399, -252, 346, 176, 248, -124, -81, -865, 208, -407, -403, 221, -609, -209, -147, 492, -204, 282, -6, 415, -510, 220, 132, 166, -674, 727, -696, 507, -260, -108, 279, -72, 387, 572, 582, -105, -339, 38, 76, -428, -126, 204, 600, 319, 684, -137, 196, -260, -822]
6778h22M07J51J69k34M23L70m10K92m97Q32o07J18k33k3L64r60N55j14K02k9j8
6799f4N79l51m6O87o76m55J10K16n9r7P8J53k36J77N69m39m43J47N59r77O46j9
6821E9o49O40k64K42L84n65J80O00o42k84k16O13l41k02Q44l55K29k73K65K12
6841D77l89l1j55j0j73O70j4q10Q44o73K59M64j67k44qk74N13q19K83L50J66j99
6863F0l07L33J10n6k0j97L47m76j64P32k3l33L49m78N34J50k00M0m30K70o58N60
6885A43k36J03m19J062n52N5j78j59l76Q97j96m38R3M7j32P3j5j98O67P22m47
6906E16k05p3L66m19k13j25Q8k16j36J41J41J726j999N66L06n09l7r0o54M98N03
6927A75l15j73K24k0O68k11n01J29q2Q3J0J32k50K69l54R28p71P51l75p0p97R1
$$ y = [-822, -415, -264, -95, -329, 94, 464, 54, 346, -151, 681, 74, 192, -41, -64, 300, -660, -105, -219, -17, -46, -64, 515, 164, 118, 805, 129, -326, -216, 0, -59, -156, -78, 75, -161, 16, 585, 146, -297, -150, 409, -568, 78, 59, -590, 50, -214, 28, 412, -153, 27, 627, -15, -299, -515, 98, -243, -445, 399, 44, 273, 0, 265, 477, 88, 57, -98, -108, -281, 389, 375, -435, 409, -264, -5, 459, 292, 48, 40, -234, 279, -540, -257, 93, 259, 60, -247, 86, 196, 140, 120, -77, 270, -206, -370, 362, 339, 6, 355, -123, 411, 561, 361, 401, -29, 241, -417, 143, -93, 10, -409, 653, 101, 156, -22, -181, -557, 340, 144, -294, -201, -154, -286, -213, -228, -426, 241, 963, 516, 311, 238, 604, 185, -28, -153, -65, -281, -417, -276, -135, 1591, -408, 158, 464, -45, -82, -172, -826, -328, 175, -140, -313, -89, -109, 559, 348, -153, -24, -106, -23, -13, 119, -131, 138, -216, 712, -59, 692, 317, 247, -550, -459]
6949d59K31K63m18J056p87O05l63k49K92n97M12k59N1j46L12o0N91m44J91r0L74
6970E06l36k90J17n78N39J49q7J88n64K88K80J34q50j22J064L39o71N9n01L79
6990D3J34m55M21p4J7Q5o3L2O9L0m96K32k59k31N20k11L94J32o75j59J33O49m55
7013a87L88k41m23K99k23K18J99L41m73J85k94j16K31L59o08o3n1K77L12m60j09
7034d39N35J94m92M54Nl47n91P00p75J065p09M95K84j39q13j54J182K16j297R59
7054C33k61q62J023l4m50M66M7K27j89o50J65k04l6M55o8n54M64l1N94n89k51
7075d05O97j97P6J31k70q28pQ50N46o11J82l98N3k47K32L99J5k68P2P3K00r0n17
7098c12M25n76L23L04j051J310J74L9l25l66j64j88Q37r29j86P82K31m91n10O34
$$ y = [-459, -228, 35, -383, 673, -114, 491, 128, -121, 171, -426, -14, -273, -222, -368, -56, -116, 475, 31, 222, 132, 506, 170, -120, -3, -581, -42, 107, 20, 208, -356, -68, 212, 346, -504, -626, 438, 777, 106, 165, -336, 43, 177, -278, 143, 69, 86, 171, 108, 140, 209, 239, -257, -25, -284, -515, 5, -206, 188, 320, -355, -514, -381, 268, -187, 201, -40, -463, -164, -387, -169, 30, 371, -102, 83, -211, -327, -96, 263, -345, -408, -459, -182, 130, -330, -439, 96, 290, -202, 252, 257, -90, -681, 19, -756, 309, -400, 95, 379, 240, -573, -727, 455, 671, -626, 333, 72, -790, 233, 199, -251, 215, 262, 489, 300, -350, -185, -389, -425, 30, -38, -592, -128, -159, 435, -154, -405, 292, 95, 171, 302, 32, -796, -803, 47, 593, -18, 164, -234, -181, -428, -196, 203, 218, -50, 22, 95, 295, 205, -312, 113, -463, -140, 164, -887, 423, 597, 636, 311, -55, -219, -407, 430, -499, -685, 97, 328, -163, -673, -39]
7118c9J33m47J38M5k68O06J33N5p67O96j95K28p09M68M18l24l27Q5m09Q96k59
7139A57n27J088q17K9j12k47n5L29p76N82M12k4m19M28L0O64p20j23k45L83m32
7160c95qK07K03n75j43J011k11m96J49o0O08l87J81Lk46M3k04n67M50J071p47
7181a13J00L8l45L6J57N24n79K9j00q1N39k66Q8N50j263O87N78n70n67M99q54
7202i13N71M81o37O62l06O58q50L43M4K80l34n5m90j28M46N46q74J88O28j01K24
7223C83M69m66k56R6R8l37Q1j49N18K1m38J8l08Q5K55j65L44m06Q9M9j17q8J69
7246e5k55o4M88J63n94k7N43J22m67j70j1K79J00m41N19n38o2J441j155J47k37
7267b74L60l61m6M94J25m39M01m90K17M68p08O45k38o8l72j65N88k6m15M63j10
$$ y = [-39, 94, -353, -215, -170, -438, 168, 301, 356, -411, 285, 90, 318, -391, 77, 495, 171, -156, -71, -480, 416, 157, -370, 718, -99, -70, -182, -429, -484, -155, -931, -349, 63, 39, -380, 48, 78, 742, 22, -101, -346, 37, -395, -403, -196, 7, -568, -711, 300, 89, -407, -258, -318, 290, -97, 84, 87, -159, -116, -320, -887, -437, 634, -113, -13, 25, -320, -284, -127, 397, -182, -153, -253, -334, 205, -61, 27, 577, -686, 1, 579, 9, -558, -59, -913, -342, 139, -498, 164, -142, 516, -334, 9, 53, 333, -1, -56, -546, -674, -228, 318, -556, -368, 260, 159, 383, 852, 386, 130, 226, 324, -13, 68, -81, 437, 458, 20, 38, -270, -185, 70, -95, 249, -157, -68, -19, -136, -224, -55, -310, -374, 114, 277, -317, -344, 199, 321, -146, -316, -327, -48, 52, -389, 130, -408, -470, 971, -184, -37, -274, 86, -275, -321, 173, 298, -141, 260, -230, -13, 455, -253, 392, 154, 86, -286, -451, 137, 111, -304, 159, 49]
7288D9J46j49o3K74n04N0O54l17m59P0K82K1M11q70M43r8J61j19j56K73M24n51
7310b8k83j5J72k37O58k73N78p84L60m51Q1J6J55R7j05K28o81Q31n56N44o7k56
7332a6l61O31m10O28p91K80j13K00J03n77O21j39l04K02M29m46L39k21O4l25Q65
7353F59p25o7M31n19M29n68J30j27m27O29L84n29M12L21j70M00o85k67q4j99R01
7374C29n82R8K36PN6l7l2n69M84N14m44o58O84k04n4J58L67K5j18P46r12K73k3
7397C44J42n32j49L24k25lo6K46K0j68j29k83Q40m03M23k03p39O28l10O14r2K35
7419E14j79r27K36O12l29k68k08K37J10M48j4P4K13m33l0J19n37N12m75j86J79
7440c32N23K2l6L76j75m13J80j30K94K43k10L54k69j4n28j11mO4J75k74N9J95
$$ y = [49, 195, 46, -17, 257, -247, -197, 457, 140, -319, -249, 33, 54, 465, -405, 38, -60, 101, -18, -174, 99, 523, -28, -311, -326, -154, -391, 267, -6, 572, -212, 148, -303, -222, -206, -51, 46, -59, 169, -512, 319, -237, 307, 240, -16, -377, 254, -156, 472, -319, -39, -152, 48, 151, -426, 195, 56, -248, -46, 383, -63, 276, 55, 119, -206, 659, -66, -133, 298, -221, 208, -360, -230, -357, -784, -155, 229, -300, 112, 433, 263, 663, -22, -289, -373, -572, 329, -253, -155, 81, 88, 144, 107, 75, -494, -10, 504, 60, -598, 86, -118, -172, -14, 353, 378, 260, 1006, 94, 367, 344, 486, -46, -195, 129, -96, -99, -165, 81, 101, -67, -196, -479, 361, -42, 381, 178, -561, 67, -243, 371, 279, 514, 335, -592, -356, 256, -73, -341, -549, -312, -202, 246, 232, 306, 519, 86, 56, 175, -362, 150, -325, -511, -332, 191, 213, 177, 553, 378, -35, 145, 15, 309, 552, 342, 696, 427, 413, -115, -226, -230, -166, 9, -265, -206, -11]
7462a1J88m09K02k6K76l09o86N39M15k11k43M56l40L84k59j80M92o92L92K08M9
7483B35l02J41M00k22n39N89l23j38K98j4q05J093n76Q4L37l46L28k20J63n98
7503d15N39k1j15J00K67o98K32o6j6N19n42j53M39l20Q6K02l66L37m85K05L00
7524B9j61r7J44q4l71O15k98L89J49j064Q36M1l50Q15k13m80O11k91J67m05k93
7545c11M22n05K76j43m63p9O66M95m9p57K98J92j34K55m90N67L1J93n83J93l1
7566D3j25p6O91n0n74l9J86j51j0k61R70j121L72K03m03o9L15n2L25o73M22M58
7588C81m26p64M93N68K10j95n37P70p2q58K63M81K32n96j95M95M3k57N9k63K70
7609A02N2l01J02J89j22K18m02K59k74M06o4p26N89l31P00m20M37k49l96j64M48
$$ y = [-11, 177, -232, -30, -56, 220, -89, -775, -236, 179, -32, -275, 181, -159, 225, -34, -214, 278, -414, -22, 186, 235, -67, 74, 474, 252, -287, 302, -21, -159, 139, 125, -680, 413, -163, -79, 258, -88, 240, 20, 183, -415, 124, 103, -12, 88, 355, -343, -111, -177, -193, 326, -216, -369, 70, -250, -164, 38, -328, 9, -476, -271, 29, -132, -229, -85, -169, -540, 75, -223, 166, 315, -749, 87, 128, -222, 593, 380, -100, 511, 220, 387, -18, -311, 111, -394, -118, -261, -724, -803, -137, 358, 309, -448, -150, 42, -92, 163, -327, 240, 271, 464, -119, 74, 43, -82, -158, 533, 483, -91, -130, 56, -95, -105, -366, 604, -517, -145, 58, -345, -414, -99, -151, 174, -499, -77, 381, -45, -809, -316, 252, 462, 267, -270, 500, 428, -430, -167, 314, 546, -50, -245, 250, 293, 36, 95, -168, 102, 154, -147, -45, 144, 22, 240, -162, 97, -177, 229, 165, -561, 28, -303, 397, -23, 414, 165, -231, -395, 53]
7630E3l16Q55m91J6k94K0N80l71l88J6K79j00O9p52J379q80M02j51k44N93n3R5
7652C17k99LN1R3K85Q0j30l64l30J12M41n52k6O36l84r6k6N91m57l56M07k84M10
7675A22n6l12N11m04nkM66q0n26J95j35J33K86N0l79L5N41l4L51p98j40L52j83
7698a2M2k3l85L41J91k22J01j44j76L35P2J5k37R1K77L88q28K13j50j29J4N6N2
7721a18Q4K70j98J95k7n1M76j086L67N40l57O2Qj98J6j36N85k31m32k22J017l69
7743A95k80J58J93K17q79L68j41J16K09l07k19K07J33l00K6L09j76R2Q4N8L0j31
7765c8m08O52o11L74K38o80J67k48L87M61k94l39l79P29j51j68N51J48j8n46N05
7786C32k42O16n64p5k99L23k30k25K19P69j407q6O01L26k87L34j70K48J3k12K20
$$ y = [53, -263, 592, 101, 117, -177, -157, 423, 52, -336, -320, -41, -141, -72, -824, 555, -325, 77, -74, -318, 275, 222, 317, 18, 21, 72, 165, 450, 530, 400, 36, -294, -182, 259, -293, -319, 317, -67, -163, -189, 402, -55, -411, -4, -288, 122, 66, -246, 265, -139, -144, -146, 320, 240, -286, -91, -226, -93, 193, 243, -136, -101, 440, 406, 757, -41, -181, 171, -12, 30, 7, -378, -37, 154, -68, 33, -111, -287, 48, 120, 135, -102, -11, 266, 654, -174, 39, -111, -240, -226, -170, -118, -34, 236, 38, 233, 206, 155, 631, -455, -88, 452, 95, 157, 165, -33, -17, -153, 432, 201, -231, -453, 564, 195, -85, 73, 266, 483, -396, -28, -169, -53, 156, -151, -370, -163, -30, -330, -304, 5, -171, -79, 5, 63, 93, -38, -446, 206, -405, -31, 207, -473, -306, -554, -167, 294, 0, -339, -718, 11, -140, -308, 243, 391, 373, -173, 332, 90, 706, 142, 67, -232, 91, -139, -364, -145, 624, -783, -869, -268, 58, -229, 105, -65, 183, 196, -16, 204]
7807B04k59j38j12J85Q0L58q62L8J84J94K14j32l05K96Qk3k38L7K27q9m7L55L66
7830E41l36n89R78n64j87n94P32j99r7L04K17p6K72L7o30P24r68o6P88j07l08
7851a28j21J93o6k02R8O66k73k93p8L05l48K11j64J34J56K9j67J01J18j48L05
7872C28k21k64NN59M9k02m53P07Ql39q50j61Q78N49n99L49k30l92J84M66p83L3
7894c79Q95q54M30j92J47j66L23n88N13j05l68K06l62N26j60J8P54r66M88n03
7914c43K83j43O2K76o64J211o39L33k11m53M27n44P29p14Q13k97l17k86J356j053
7934a74K06L85k51m70M09j26O29m64Ml30R42o03K1p16P89k52k59P55p22O1O2K18
7956A14J23M98q54N4l3L00k60L29j27J56j078N31J61q2l24J48L90j55q5M79j10
$$ y = [204, -55, -193, -305, -120, -40, 318, -544, -506, -322, -128, 86, -46, -351, -55, -47, -70, -308, -271, -44, -133, -180, 175, 541, 205, -384, 594, 30, -157, -751, -19, -218, -315, -11, 206, 130, 402, 439, -191, 533, -435, -501, 287, 180, -128, -249, -56, -122, -324, -226, 440, 167, -126, -204, 101, -247, -36, -200, -66, 90, 119, -48, 53, 171, 23, 328, 107, -157, -152, 407, 456, 254, -199, 508, 516, 177, -673, -834, 44, 593, -6, 343, 113, -279, -95, 371, -412, -379, 516, -338, 92, -100, 47, -119, 204, -384, 129, 24, -344, -138, -500, 26, -134, -116, 638, -328, 160, -343, -60, -203, -141, 135, -529, 682, 43, 376, 165, -288, 139, -405, 324, -390, 423, 126, -191, -477, 879, -174, 32, 417, 166, -304, 105, -21, 608, 144, 148, -182, 760, 157, 178, -538, 251, -1, -260, 495, -227, -166, -104, 114, 237, 735, -119, -65, -98, 202, -58, 271, 144, 300, -778, -247, -86, -168, -492, -344, 46, -109, -194, 285, 175]
7977A75p36J157k82q69R91m35N63m80k38L49k73J28k06l48j96M58M94q11L73j79
7997c65M92P3j79P64j032K40k1P8NK32m7l16j66L56P7o02M43k55P9O47m17K17
8019C03J40j060Q4M44K00J44m21N1j22K78q28R76J01j00k41l96Q98n22K68r28
8039g31Q90m41K54N0J0J24l86P47j91n23L60N97r23l13Q33n70K38K33n17Q5J20
8060e4J27p5j94L59L22m65P72l49p87j2M47J59k96L97q43O94r9m53K79o6M76K7
8082C66o13N25m27N78m03P33r62L62J87q87M37N48n21L02k63J3N19m47j36M66
8102C77J95o46j75j25R0J77Q7jon24N50M80j15k51N37r62K06M73k77l06N87m38
8124f7L61k68k4k50R8j73M46J24l73R7r1J70j61N10k18l77O7J46Mk02O85m85j49
$$ y = [175, -561, 596, 314, -555, 436, 1, 564, 84, -154, 195, -78, 50, -156, -504, -700, -242, 252, -559, -186, -365, 127, 200, 21, 785, -247, -7, -28, 50, 55, 287, 240, -76, -242, 114, 191, -411, 32, -223, -144, 503, 86, 303, 443, -617, -533, -89, 111, 255, -166, -115, -237, 41, -787, 189, 290, 190, -51, -447, 451, -71, 197, -731, 159, -282, -28, 22, 32, 156, -230, 517, 326, -197, 163, 760, -163, -476, 357, -213, 25, 258, -259, -174, -54, 73, -2, -196, 163, 485, 20, 792, 443, -344, -356, 91, 250, -46, 351, -492, 202, 103, -350, -71, -137, 339, 366, -247, 278, -149, 429, 26, 759, -203, 159, 346, -541, -104, 444, -77, 225, -38, -25, 494, 47, -89, 377, 572, -74, -249, -374, -284, -107, -20, -21, -27, -551, -1, 479, 364, 113, 650, -312, -106, 367, 90, -216, 371, -67, 294, 26, 2, -248, -150, -323, 123, 247, -126, -29, -120, 50, -111, 399, 181, -196, -129, 17, 21, -181, 504, 19, -130]
8147a30N65l82K06j56K01l42m08J11n5R14m13L90m54j76N80l52K7K2j79L62n24
8168a93L02n42J344r13j68j4J099j279L21m63M99Q8QK62m99j79M02j70k18K04
8188a09P1J56q41
$$ y = [-130, 435, 53, 259, 103, 304, -38, -446, -335, -390, 524, 111, 501, 47, -129, 451, 99, 126, 148, -31, 331, -193, 109, -433, 911, -2, -170, -184, 915, -364, -43, -506, -7, 81, 89, 351, -148, -327, 75, -95, -313, -109, -38, 118, -723]
8191g23
$$ Imaginary data points
##PAGE= N=2
##DATA TABLE= (X++(I..I)), XYDATA
0@%%%%%%%%%%%%%%%%%%%%%%%%%%J7j06J96k15K16k16K16k16K20k69L60m17M31
39B17m50N18o00O46p12P96q72R62j063J171j296J423j568J738j915K116k341K599
57A369k897L244l655M147m760N537o558P958j0006J3272j9335L4105j20732j52248
71b50559L45500o3834k35552K11180J60332k31294K7457K19746j04301j46942
81f8267J23572M111j58035J8150J01961n9302m0348R4110M2917n3828J9071N3551
93G7663m0368n6577J5049r783m6437K436K4943J0437J8075J2766K0746L6069k1076
106D3943l6403L8711k1879j01777L3229O4265r2238p812J39449l1584q4734J24994
118F8164M5252j45392J9641R8047j21143p5766J23480n581j05515Q4016R4340
$$ y = [0, 0, 0, 0, 0, 0, 0, 0, 0, 0, 0, 0, 0, 0, 0, 0, 0, 0, 0, 0, 0, 0, 0, 0, 0, 0, 0, 17, -89, 107, -108, 108, -108, 108, -108, 112, -157, 203, -214, 217, -233, 285, -315, 331, -381, 415, -457, 505, -558, 613, -683, 740, -828, 910, -1005, 1111, -1230, 1369, -1528, 1716, -1939, 2208, -2552, 2985, -3573, 4385, -5621, 7651, -11684, 22421, -98311, -250559, 94941, 31107, -204445, 6735, 167067, -64227, -36770, 182976, 78675, -68267, 55305, 59416, -98619, -80469, 21492, -37810, -78158, 15952, 58869, 5041, 24112, 77663, 37295, -19282, -4233, -14016, -60453, -58017, -33074, -22637, -4562, 8204, 28950, 65019, 43943, 7540, 46251, 24372, -77405, -44176, 20089, -72149, -79961, 59488, 27904, -56830, 68164, 113416, -31976, -12335, 85712, -35431, -111197, 12283, 6702, -98813, -14797, 79543]
129G9543q3548j1230J07497k9722r7842M2983L0466r8472j6011Q4113k2024m9570
141f3817P6169M8004n5828J6231N4454n1697m8061K8497j7649m2954K1428J4964
153b0259j0921K9019K2907j761K5336J85l7961P142P15n8939p36M2829l4740j4407
167e1591P5555Q236m4969N0631L9841p1277j8444N0577m7090o4418N4300K4577
179E928o0931K4646P8950k8451l1755O6682K082q1215J2822M0039o7713k8993
191f7909O7514o272m3738O0504M5264m8231O010M7380m0451m3003K6487r883m3200
204d9528J7927K4171j3473J2994L2585k15j078R260j3879j8090m836j6984j1408
217c2554J1406n98k877K8385K1581r980J0891J8995k7377k4423J5128j5461l9504
$$ y = [79543, -4005, -15235, 92262, 62540, -35302, 7681, 38147, -60325, -76336, 7777, -14247, -63817, 12352, 60356, 4528, 20759, 75213, 23516, -24545, 3952, -13697, -56651, -35223, -20259, -31180, -2161, 20746, 18985, 44321, 44506, 6545, 13687, 14402, -44537, -45273, -2444, -37184, -51591, 23964, 32200, -12769, 37862, 77703, 6426, -12018, 38559, -8531, -72949, -18649, 5928, -55003, -30357, 48593, 20142, -11613, 55069, 57151, -24064, -11242, 28797, -38916, -67909, -395, -6667, -50405, 10099, 55363, 7132, 13142, 60522, 20071, -22932, 3555, -6328, -49528, -31601, -7430, -20903, -7909, 24676, 24461, 23383, 32643, 18764, 674, -4162, -21146, -32554, -21148, -21746, -24623, 3762, 25343, 15363, 26254, 45249, 17872, -6551, 8577, -6884, -46388]
230d6388J5470K4625k3956R467N1212m972k4039L3938O967n1188l269K2520l8037
243b7650k1584M0122L670k2255L5494L1751k3804J086K4489k6704l1085J2850
255c620o714k9740J0497K1594p452J0787K9282l29p375J0399p952k2434l203p715
269a3975j7279O365J1426k288J4961K4383l859k571J7125j3914k8066M606j665
282d751l0013K850K5831j0157r50L8622O919k1086J6329J0528l6256j2940J8888
295C814k2561k3514K8431J3867j7604K0426L2358j6059r874K1804j3184l3713
307a5809M307M187k4048J420K5113m63J133K5683N794j1338M321k238k2283q978
321a3199P97j2298k059J4160N080O180J6941O021m402M352m841j7836n261l575
$$ y = [-46388, -30918, -6293, -30249, -20782, 30430, 25458, 1419, 35357, 42324, -8864, -12133, 10387, -27650, -49234, -9112, -5442, -27697, 7797, 39548, 15744, 16830, 41319, 14615, -16470, -3620, -10334, -40074, -29577, -7983, -15435, -4648, 24634, 24305, 16930, 27329, 19377, -3057, -6260, -13975, -31254, -24889, -13463, -15751, -790, 23593, 19734, 17163, 34288, 20374, -7692, -3086, -4751, -34764, -31914, -6083, -16240, -17190, 21432, 28351, 7265, 23594, 34122, -2134, -15074, 3814, -18747, -42261, -13830, 37, -17567, 2859, 35217, 19158, 9284, 31088, 17904, -15809, -11502, -7315, -31363, -29943, -4830, -5293, -4160, 21523, 27317, 15979, 20300, 18062, -4221, -13199, -12402, -24700, -26759, -12599, -7519, -1339, 15602, 21623, 17221, 21573, 16732, -1104, -6365, -9940]
335i940j5257l41J6465J498J530K1157R236j0698O203M896k4147j3537P156j2345
349a8124j5005J7650J1554o596J5289K2209r537o210J1634j1967k3637L639K40
362h861j9435N970K0231p49L136K0883K370j0524N369l192k1305o274J582j2122
376b2921q6J4774L368J871J8342O381q594L065k0k0481p541M579j0831p883J7019
391h958Q055m100J7189J3639j1874j174P367j6875j8085O515m879j6305J3229
404a6256J7450o344P143K0472l551j1279Q402m347k3710n65M818j2394M09J8086
418a666K285j82J6463O427j1698P04O4j7007r095K855o025m761J2732R734J46
433I76J1105Q332o508k468N80j4534r561J886o893l940J2663Q041k447J3025J1493
$$ y = [-9940, -25197, -25538, -9073, -7575, -6045, 15112, 24348, 13650, 19853, 24749, 602, -12935, -5779, -18124, -33129, -15479, -3925, -10521, 4768, 26977, 17440, 11230, 22864, 10897, -12740, -9101, -8861, -28296, -22326, -2095, -2844, 292, 21175, 23545, 13021, 18390, 15198, -6107, -12381, -10799, -22921, -23007, -8233, -4865, -2994, 15348, 21729, 13135, 16200, 16180, -4301, -11842, -7263, -18094, -25977, -8958, -903, -5003, 12186, 25825, 13951, 12777, 20144, 3269, -14816, -8301, -13180, -29485, -16256, 1194, -5150, 1993, 22465, 18914, 7635, 16037, 11690, -12020, -12585, -7767, -20161, -19752, -1666, 619, 437, 16900, 23327, 11629, 12333, 12397, -4610, -13705, -10850, -16875, -21636, -8904, 830, 976, 12081, 20413, 13905, 11437, 12017, -2517, -12078, -10192, -17085, -21025, -8362, -321, -2768, 10257, 21750]
448B1750q408l815N009j3486j5187M976k358j1001J0200J4237l762O412J7214
461B1781n180r441P466n697k0224j252M885j1020Q10J7548K145j648J5543M790
475B0506j1786J127J448j8132r150P909n808o218J5523Q598n082J1202J2276j1033
489A1380n303N637j1874j5190O047j136r403R713J4529m305M582J5477n566j0408
503D180O268o128j7653J301N750r778K464J7199K10j583J5034K187j3155L49L96
518G041j6308o511Q302m481n396J4717Q414m789J0388Q477j0269o716M971j0422
532b582j2230M223K363p012R031J2363k496L997J0618n538q853L019p732j3928
546a4757L029L311p698O353J4097j012K082J3595l540j1681K214k446j4980j161
$$ y = [21750, 13342, 9527, 14536, 1050, -14137, -9161, -11519, -22520, -12320, 1917, -1845, 4567, 21781, 16601, 7160, 14626, 8929, -11295, -12547, -7662, -18682, -17872, -324, 1821, 173, 15716, 20506, 8720, 9847, 11295, -6837, -15987, -8078, -13886, -20104, -4581, 4017, -1065, 10137, 22413, 11380, 6077, 11714, -160, -15350, -9303, -10439, -19842, -10129, 4400, 95, 4677, 20154, 14588, 4180, 10448, 4320, -13333, -12032, -6282, -16060, -13596, 3603, 3813, 2230, 17264, 19451, 6296, 6645, 7041, -9267, -15778, -7476, -11957, -17353, -2636, 5778, 989, 11377, 19854, 9585, 2869, 7840, -2582, -14812, -10589, -8226, -15238, -6207, 6156, 3660, 7657, 18275, 12737, 3884, 6903, -829, -14757, -11728, -8417, -16115, -9762, 4335, 3323, 5405, 19000, 15460, 3779, 5993, 3547, -11433, -12594]
560a2594O474p521J349J5575J422j555J1405K868j3693K38K985j5836p745J0284
574f344l014o519J3513R393o088O403J1913j0446p475N792q385j4515P690L826
588d256j0330P776J5863m781l09J4338n174j3848N272j830j7086K049Q902q610
602a2024J424J6722L8l895J1926Q49j3402k14K356j3882l904R309k318n481J3115
617F19P995n606N752P798j0437p629M393p076j0576O073L424o841P654J3938m329
632E152k39J0865n871j1433M027k320j4153K667P742n948K604J4164r43k329R487
647A3472j394j1439R59k89j2051j311P792l937l15J1954M070l416N963K773r949
662B882l885K340q658n096O215L64m062R879R451n985K688Q396q289q927N534
$$ y = [-12594, -6120, -13641, -12292, 3283, 4705, 3150, 14555, 17423, 3730, 3968, 6953, -8883, -16628, -6344, -9358, -15877, -2364, 7029, 941, 7344, 19257, 8811, 1336, 7128, -1257, -15772, -8082, -4256, -14586, -6810, 9053, 4272, 3963, 18301, 13127, -721, 4551, 2721, -14365, -12316, -3414, -12024, -10600, 6122, 6160, 2265, 14191, 15040, 1638, 1424, 3780, -10102, -14006, -4697, -7015, -12496, 619, 8614, 3008, 8760, 16558, 6121, -1508, 2885, -4191, -14767, -8694, -5270, -12111, -4457, 9481, 5152, 4913, 15778, 9907, -1526, 2501, 181, -13972, -11305, -3563, -9511, -6907, 7257, 6314, 3985, 13472, 12078, 639, 1598, 1309, -10742, -12053, -4261, -8198, -8513, 3441, 7511, 4095, 10058, 12831, 2882, -1003, 1337, -7321, -12417, -6202, -5838, -9900, -21, 9430, 3445, 6133, 14529, 6240, -2687, 2847]
677B847l843j3392O410P352q348M062J5057m091l174R985l334j3748L809R70j3004
692a2442J484R611o339k2J5261N81o164P168K623j2879j123M472q264o722R020
707c735J493m427Q338Q363n751O72P279q270q587L609j952j0087M405Q429o695
722f916L124J3801k313n640Q549k246j2340K837J892j0823M13Q957l107l93J1509
737G304M21n222N191J951j1321j248K844p652l648P559Q59j918P832N762m949
752C765J655L310o341o243L355l061o421M010M740k855M310Q901l419l177N164
767G693k804r326K830M7q632K807O982m038J560J0455j454n129O580r03j0361
782c693O71L159q131p19P887j125j282Q780L167o563K887K270q711k988M300n544
$$ y = [2847, -996, -14388, -7978, -626, -8974, -4912, 10145, 6054, 2880, 12865, 9531, -4217, -408, 562, -12442, -10958, -1347, -7686, -7708, 7553, 8134, 1970, 9138, 11761, -1118, -2241, 2231, -6033, -12755, -3735, -2242, -6669, 1669, 10032, 4281, 4953, 12232, 3962, -4625, -1016, -2968, -13055, -8650, -221, -6916, -3792, 10009, 7696, 2056, 10605, 8359, -3981, -1144, 748, -10075, -9662, -705, -3812, -4205, 7304, 7725, 2503, 7694, 9645, -1676, -2924, -80, -7732, -11380, -3821, -2962, -4880, 2952, 8714, 3765, 5420, 8730, 2389, -3854, -499, -3560, -9981, -5971, -1231, -4086, 224, 9125, 5706, 2529, 7693, 4889, -4437, -1607, -1560, -10192, -7385, -403, -4441, -2881, 7574, 6120, 991, 7571, 6668, -3693, -3022, 137, -7994, -8713, -826, -1951, -3233, 5547, 8714, 2151, 5038, 7308, -1403, -4391, -91, -5635]
798e635m115O883L782m743N260P538m831k610N804l588q836K803Q71q050L702
813e765P299l511L12R846j648n267N063n63r792N38L851p206j797R130k21k276
829b007O850K990n762Q33L254p762l528K977k481l661N796L062k682M489M831
844G199l460j584L585m130o277K563J99m563K390M823j086RO085o53l843L191
860D448k138o222M71J506m348Q55N365l05o29N855J563m726J881Q7o220p02K685
877e74m288j189O618l32r20L677L580m763L81J467n352k822L276k220k563M140
893a884L100k563L702M017k998j810K701l069m599K748k86m427K275M908k401
908e86j78N892q31m126K624j61o261k27L246l469p43M824P56k209M857J929l790
$$ y = [-5635, -9750, -2867, 915, -3828, 1432, 8970, 4139, 1529, 7333, 3745, -5091, -2288, -1417, -9467, -5765, 1534, -1977, -1665, 8181, 6533, 1266, 6329, 5766, -4026, -3488, 363, -6843, -8640, 490, 269, -2007, 4843, 7833, 2071, 2904, 6158, -1604, -5132, -2155, -4636, -8297, -2501, 561, -2121, 2368, 7199, 3739, 2155, 5740, 1610, -4667, -2104, -1905, -6468, -4078, 745, -341, -332, 5753, 5100, 1257, 4448, 2310, -3912, -3441, -1935, -6283, -5428, -63, -368, -997, 4858, 6421, 1695, 3576, 3663, -2557, -3259, -574, -4862, -6051, 567, 235, -685, 2992, 6572, 1809, 2190, 3657, -1695, -4517, -1241, -3461, -6024, -1884, 1216, -1347, 2355, 6372, 3374, 1564, 4265, 1196, -3403, -655, -941, -5368, -3093, 1815, -586, -764, 5128, 4297, 171, 2795, 2634, -3627, -3854, -608, -4077, -4820, 4, 760, -1449, 3408, 5337, 1547]
925A547k39K103n264k650L413j298k523M200L005l145K950L237l048j735J828
940B381j651m506J232M21j599J237L917r76r6L920p72k917Q95k84l872o17K486
957h01j022j281L614J72p4K833J15l280L42M92l012r10K084j681j414M083R26
974A186j643L564k92j990J8J305l260j282J339n66j418K851J236l77J004K367
990D042k461j096J434j272k733R15J94j881J028L625j099m53K469o66k644J818
1006A220k99l898l8L011k819Q3M116m6k066L153J618l537N5J913l545p22K446
1023F45k143j173K926J725k325J241K599k954j688K670j844k645J277J628k069
1038b130R75K668j159J30K315j394j405J694n34k855K51J717j318l40K446L2j873
$$ y = [1547, 1308, 3411, -1853, -4503, -1090, -2388, -4911, -711, 2294, -851, 2099, 5336, 2288, 553, 2381, 730, -3776, -2544, -2123, -3722, -2485, 1432, 456, 360, 4280, 3508, 591, 1486, 1202, -2670, -3287, -801, -1823, -3104, 510, 682, 608, 3441, 3556, 276, 618, 1110, -1902, -2812, -728, -2409, -3823, 260, 1186, -457, 3107, 2815, 825, 843, 2148, -1112, -2394, -1055, -1621, -3039, -188, 1048, 671, 1675, 4042, 1581, 485, 1919, 647, -2086, -1171, -977, -2858, -1830, 1795, 696, 243, 2712, 2046, -598, 1220, 921, -2977, -3015, -4, -2823, -2740, 1376, 1330, -736, 2417, 4035, 498, 553, 2466, -1079, -1801, 645, -1498, -2671, 255, 1980, -345, 896, 3495, 541, -1147, 1523, -321, -2966, -1689, -61, -2130, -1155, 1513, 354, 484, 2799, 1405, 0, 1694, 1160, -1695, -1444, 273, -1045, -1385, 1061, 1093, -780]
1055g80K522M53k188n65Q00k116l79K429j800o31K522R58j679K508J9k848J811
1072A036K10k623n5J340n12j031J778J041j455Q46J394j781k99R90j561r51Q79
1089g54K86j567K214J134j193k66K619j390k596K428Pl065J072J612j903L57K954
1106A949q78k253K979n07l114J780K139l893m69L505k318j193L080P61l039K786
1122A315J382l136r88K818k260r34K823l12k656J749K462k498K61J928j239k318
1138a603K440K49k892L45K449j694n92K738p30k826L233K69k412Q72J303j974
1154h25m51L196j638k116K830L92k541J914N22j914L00K245k754p96K215j17k160
1171a698K135P88k918J293J733j812p75J836n50j429J762Q88k373M65J612j040
$$ y = [-780, 1742, 2195, 7, -558, 242, -1874, -2253, 176, -1624, -2255, 267, 1225, -454, 2054, 2073, -775, 1036, 1246, -1377, -1432, -92, -604, -1635, 143, 1184, -271, 575, 1969, 188, -111, 879, -682, -1633, -754, -468, -2035, 179, 1313, 120, -146, 2473, 1083, -1513, 915, 922, -2143, -1071, 541, -1362, -1005, 1949, 1071, -1182, 1797, 1290, -1824, -44, 2095, -1798, -2267, 1238, -1080, -2273, 807, 1568, -1471, 1315, 2697, -439, -1427, 1391, -869, -1803, 1020, 708, -1948, -199, 2263, -235, 26, 1954, 715, -1603, 837, 1086, -1806, -1461, 988, -706, -1298, 1440, 710, -2116, 1117, 1386, -1026, -154, 1149, -825, -1276, 1920, 282, -1834, 996, 1388, -1153, 761, 1283, -631, -331, 1914, -840, -1636, 579, 462, -1698, 437, 1225, -1693, -400, 1333, -479, -1254, 582, 32, -1397, 365, 1253, -1120, -655, 957, -83]
1187h3n52K181j099j357K357m9k565J057J467k418QJ964o88j572J928P84l028
1204a665J466K331k473o51K701j168k321K466L78l461K055K254k731K38K324j244
1220D99j661K705r8l053J113K339k629j231K690q73j679K267J415k988J070K037
1236A923k612r83K626m71k543K321J501k377J69K477j426k516L612q39k399J761
1252B24Q7k593J977J311j825o78K929r76j804K158N82k510J44K018k091k89J993
1269F57l70j028J382M01j537J428J52j346o72J471j047j224K029J178k523Q08
1285b41K480j926l06J550j466k093J779N14k661J813J076j388N46K564j646j229
1301f34K270m92k402J302M78k483J297J882j358j072L336m01k302J708N02k993
$$ y = [-83, -635, 1546, 447, -910, 1447, 1398, -1167, -110, 1357, -1061, -1053, 911, 223, -1349, 579, 1363, -1665, -199, 2132, -341, -992, 1709, 541, -1780, 686, 1064, -2397, -342, 1912, -819, -581, 1743, 499, -1162, 1543, 1445, -1608, -495, 1844, -785, -2016, 674, -199, -1878, 389, 1804, -1184, -114, 1923, -689, -1672, 954, 483, -2060, 261, 1762, -615, -446, 2031, 605, -1911, 1701, 862, -1537, 224, 311, -2282, -305, 1006, -819, -1497, 1432, 456, -1348, 810, 1392, -1118, -974, 1044, -1047, -1336, 657, 287, -741, 641, 1042, -495, 933, 1085, -261, -933, 538, -509, -1733, 296, 1474, -1049, -241, 2239, 313, 7, 1557, 91, -2002, -223, 291, -2370, -557, 519, -869, -323, 2241, 595, -634, 1636, 1144, -1258, 44, 522, -1961, -664, 1218, -140, -1212, 2124, 1723, -579, 1129, 1631, -1362]
1317a362l9J387j723o06L067j21j467J689J679k720P5K588k215k030J959P7l079
1334b841K103K657k383J86L013k088r21K198q12l255K278l8k079K50K547p22j737
1351a644L068L95k345J008R20l017n77J593P8j187K020N8j097K290J176k499k53
1368a3J049j296j430J131J2j500J244J659p23j83J973n85j360J482k14k851P54
1385h51J226k667J316K140j247K82J690l98k174J439M55k634M4J262q14j195K083
1402d3l64r6J950O1j822N91R95k146j017J481l72r81K014M88m73L67J288j132
1420G89l27Q58j324k059J254J48r81J588P39j384R24K277p44j532R6P65k668J25
1438a456J809j885R4K073M66j218J646K95k462J103K69j562j365J789l63j026
$$ y = [-1362, -1401, -14, -1737, -2343, 724, 603, -864, 825, 2504, -216, -141, 2447, 232, -1798, 161, 238, -2841, -738, 1919, -464, -278, 2735, 647, -274, 1924, 1112, -2143, 135, 97, -1982, -1732, 815, 93, -1644, 1424, 1819, -526, 482, 1402, -1615, -2192, -599, -521, -1708, 312, 370, -727, 1563, 2739, 240, -13, 1036, -260, -1690, -559, -547, -2047, -803, 856, 133, -50, 1923, 1338, -22, 1460, 1246, -1605, -851, 375, -2292, -976, 1164, -83, 199, 1889, 1491, -683, 756, 1211, -1423, -1379, -117, -931, -2126, -43, -407, -503, 1447, 1508, -314, 277, 1272, -874, -1891, -410, -782, -1763, 251, 739, 266, 633, 1921, 789, 462, 1320, -4, -2063, -809, -661, -1642, -54, 685, -699, 225, 2502, 1758, 226, 322, 1087, -1581, -1456, 353, -1532, -1438, 635, 1101, -117, 1529, 1824, -638, 465, 734, -828, -2193, -404, -767, -1793]
1454a793J695J049j082N15J587j517p18N64l95j587L02O78j514J903J645q80M21
1471H73O91l16j822N81N49j933J04J030j164k79J987N48r76J178O75j359n02K22
1489H7j360o59R47n7j02J489M21n2O26N32j304p58Q85k078L67j37K57k4J085K46
1509D11P35l9O92r77j507J182j051j652R68N42r40J564R02L22n91J090p66l27
1527E58o12K33j493n69Q20P8j46K196n36J32O22R70j911o58P49j595j062J632
1545e92k7o31K034N17j173J192Q48j344n79K03j232p17P72q6L69R16P16m92J33
1564H27J093o47j118O77r48j408L85Pj87N29K218o12J40K93M54k188M52J52j897
1583a778Q4L93M75R2J715N91j028J047j03o79m12j340l46P9J48l4P76O17Q23j94
$$ y = [-1793, -98, 951, -131, 384, 1971, 454, -264, 300, -95, -1682, -1380, -702, -2216, -313, 1332, 452, 873, 1564, 1248, -574, 7, 556, -1377, -1273, -243, -1407, -1686, 301, 849, -127, 1051, 1726, 367, -135, 87, -1273, -1932, -985, -1042, -1144, 345, 766, 714, 1340, 1872, 568, -190, 695, -1383, -1016, -1153, -896, -920, 165, 411, 1146, 1107, 1799, 822, -685, 497, -554, -2206, -1238, -696, -1636, -72, 830, 1152, 561, 1651, 885, 558, -54, 179, -1314, -1883, -1063, -985, -1131, 1065, 529, 661, 1283, 2253, 342, -316, 433, -1162, -2224, -592, -619, -1250, 784, 1301, 128, 1320, 2168, 824, 245, 448, -784, -1501, -729, -815, -446, 470, 1186, 694, 827, 1920, 1273, 155, 832, -116, -1524, -1139, -1132, -1319, -790, 1428, 816, 956, 1249, 1703, -485, -33, 119, -1778, -1694, -1301, -826, -734, 981, 1572, 544, 1591, 1488, 809, 397, -943, -1289, -1210, -1062, -1096, -320, 297, 1120, 926]
1603I26K98l12n24p61j26o20r04O80K53O60M22Q99J27O12Jp39j192J67o64j105
1623a902n21J624O1KJ643m00O41O49J17j887n24j86j636N80J295n22J95J377J02
1642G08o9J092k45j723o4J19n17q78M95O6J96J218J045j331R63M43j291j054N64
1661b63n42r97J92N19N59L11P08J029M6J17q17p64m49j04p10j04O32j05R94K33
1681D85J115o92P33l20j242j003j8M4j035J216J27O05J056m60O32P7k13j449k07
1700e49L35j701K72O76R0L8J358J153k55l38L6j488Q1j15n53m64J51P52J20M34
1720C3J748j008K96O38p54j363k67M13j155L19Q75K5k02J780k68k09J33L50j607
1739b23m78Q45j509j030J718J62q6J324O58q3j64K77j123j645L25k28m59J604
$$ y = [926, 1224, 912, 388, -373, -499, -1119, -2023, -1343, -1090, -430, -8, 891, 1018, 1630, 1631, 892, -300, -133, -797, -1902, -2423, -799, -738, -736, 907, 507, 1148, 1797, 1914, 27, -497, -683, -2319, -1739, -444, -966, -771, 606, 708, 639, 1731, 1486, -237, -301, -182, -699, -1577, -1082, -1016, -820, 398, 1443, 112, 1075, 1518, 227, -827, -263, -805, -1802, -1610, -1091, -532, -221, 487, 1516, 1562, 1679, 862, 98, -351, -455, -1165, -1269, -637, -742, 252, 485, 1600, 908, 1641, 1321, 79, -924, -942, -898, -1933, -717, -590, 15, 1071, 611, 1243, 1320, 1107, -342, -549, -214, -1915, -1643, -967, -877, -839, 519, 1672, 1417, 1079, 1115, -373, -292, -407, -960, -1424, -1273, -521, -401, 33, 1781, 773, 1069, 1707, 953, -410, -677, -264, -1419, -1100, -225, -200, -402, 1378, 1110, 901, 1034, 1384, -223, -701, 144, -1365, -2395, -677, -515, -601, 723, 1381, 1298, 1134, 1411, 288, -1357, -1032, -1260, -1719, -115]
1757a15j01P0O03R62J27j120J657j517j526j55N92q08j05J098J95Q4R16J035j256
1776F36k9j62k72j799P34k24j82M99J425q94J125P09j280R45J40j410n94l39m09
1795a381J40L44J056m87R10P54R4p49L08j239j049K25L74r37M02J730q52O20J206
1814A469j66m78j7L78j988r1O34j347Q55J017q22O01J186j15l55K05p39j526P8
1833a221N81m66j46J53J279L7J456Q30k004N04j41j422l92P43p54o37M56K117
1851I73m13K16P20j015n29M78m25j328L44l9l27n15J794L80J2J370L3j350J85
1870E64J86j564m88P26m17K63N35P94lk65P18q17L30l12r24l55K67m96L55P05
1890a98L14m63Q63Q90m04m13m82j74p91j77P98K3m41Q76M88p5P05K92j280M24
$$ y = [-115, -216, -146, 457, 1419, 1546, 426, 2083, 566, -960, -1115, -523, -1331, -1436, -338, -143, -59, 857, 1892, 636, 607, 445, 173, -1626, -892, -1116, -1298, -799, 626, -268, 857, 1566, 286, 1231, 1371, -39, -633, -972, -1381, -1241, -897, 159, -328, 582, 1336, 1430, 681, 989, -250, -1299, -1074, -700, -1637, -1235, 495, -357, 263, 1469, 1303, 825, 808, 1186, -802, -893, -259, -1606, -751, 266, -556, 45, 1231, 1116, 761, 966, 227, -1299, -1221, -640, -1106, -1252, -1099, 180, 217, 1673, 2503, 499, 1003, 862, -560, -952, -209, -963, -1600, -1144, 973, 560, 776, 1496, 481, -48, 430, 5, -1323, -979, -1018, -1345, -1860, -66, 314, 326, 1696, 1729, 379, 564, 750, -814, -1302, -576, -993, -730, -195, 599, 596, 331, 1049, 232, 562, 250, -674, -1029, -762, -1258, -903, -198, 116, -347, 516, 1406, 1002, 589, 107, -67, -858, -1035, -237, -214, -655, 221, 709, 634, 1339, 1631, 351, 775]
1910G75l61j691L25L70q4k31L90P05P3Q65j4l63n71J51j248k95N88j6l43J239
1930B64p8K65N77M53j023k23O30j466l48M37N42j267Q49P67n4Q5J102k74j162
1949G6j09O5j238K70N56l93j18J448L37p27R55O79j651n6o00K7p15N65J84n12
1969i57J232O21j217J529L69j248j082J109k82j378J050k44K25o97J254K63j4
1986E33J32k16k04k9n73m23j39K92R75p39L30L80J59j30O40j071o84J182r38n18
2006a041O50q2k34Q73O08m7q80J040r21m45O45m59m68K6M05M90k69J33M56j12
2026C68M90p60m70K28j75q28L29N22J68n69J491o54M40K18n2o85M4J48j063L27
2046d83K46K94n98N54J121j262N22O2o34j15O38n92n56J19K70K2N53Q88q46N1
$$ y = [775, 414, -1277, -952, -582, -666, -897, -507, 198, 271, 1136, 1122, 759, 188, 339, -909, -1204, -616, -632, -975, 264, 186, 451, 1028, 1481, 458, 235, 865, -601, -949, -512, 30, -1237, -388, 379, 325, 410, 1512, 1238, 76, -33, 32, -1206, -936, -380, -773, -891, 557, 894, 167, 1122, 1801, 150, 94, -506, -479, -1194, -629, -445, -957, 275, 896, -321, 1208, 1577, 329, -753, 356, 74, -1304, -254, -498, -273, -970, 284, 547, 533, 665, 449, 245, 216, -357, -780, -919, -627, 348, -391, -61, 319, 478, 348, 988, -83, -767, 415, -523, -1041, -391, -473, -707, 166, 774, 727, -153, 887, -34, -479, 166, -293, -761, -735, -330, 160, -109, 24, 480, 368, 858, 98, -372, -144, -319, -1147, -818, -296, -128, -697, 794, 140, 580, 798, 746, 61, 105, 253, -810, -483, -237, 57, -541, 13, 1134, -128, 394, 456, -178, -293, 345, -247, -803, -684, -414, -392, 161, 1049, 203, 254]
2066B54O68m88p74K54P4o94P04o3m27M97N57j34j35L26j19p29n06O37O7j062J055
2087c8j04k25P49K97p13o5R20p81m40L96l19q17J084K65n22L68N74o5n56K73j98
2108H3n12K45%nJ61p89m4M43Q78Nn19J4L28p31K21m29K85j87M00Q06o32N78n53
2131D6N36p7k8q26JK99r3n55J34J156o41K30P7J25P2j68o67J06r4k56J10M78M44
2154D09k63l14Q30j84j8m43K17j72M46l7j202N33N06q03J51P65n48O29n88J066
2174I80j103l69M0L20Q8l82O25jk86O12m11K8J54o41J16K76K82o87l33J020r98
2195f70O88J51k39pJ02L27n81K27J68k66k05L67m47P46K89r44N24k30m6o9L90
2216B75l28o7n23L81J23o7R09q20J03P8m5K49O3n22J00l81J292j422N16K12k66
$$ y = [254, 922, 434, -340, -86, -12, -706, -2, -65, -492, 5, 562, 428, 293, 619, 500, -229, -735, -98, -31, -1093, -38, -142, -367, 382, 679, -34, -99, 821, 40, -400, -4, -323, -1140, -56, 209, -313, 55, 629, 564, 8, 281, 83, -429, -184, -184, -189, -28, -817, -861, -418, 460, 465, -54, -40, 288, -443, -222, -651, -366, -553, -153, 653, 21, 599, 46, 582, 505, 477, -349, -348, -49, -142, -697, -563, 593, -48, 182, 259, 384, 456, 288, -379, -273, -367, -623, -513, -35, 409, 146, -168, 662, 478, 460, 17, 234, 62, 508, 471, -731, -198, 308, -495, -344, 421, -127, 502, -86, 980, -123, -492, -452, -132, -44, -426, 199, 198, -88, 524, 113, 141, 295, -346, -230, 46, 328, -359, -692, 328, -670, 18, 169, -70, -77, 25, 352, -229, -2, 166, -100, -305, 62, -385, 361, 650, -294, 230, 0, -46, -115, 275, -53, -120, -643, -262, -139, -206, 703, -117, -14, 64, 19, 268, 331, -191, -91, -472, 820, -602, -86, 126, -140]
2237a40J90M95m83k7M06o09J48OP16k08p06R44j108N50n09M9M97k60l72N8O57
2258B94m52J6RJ2L47k35J00oq1l68J63P05r42J23j28N42k16Rm09J023k18m59k23
2281c94M96j78L07j18R3j63J56j25m0m25l13N78K27J25l94K92k68J088o74o88
2301d18J145l98o2j05R0j9J9m48K44n08M09j09r6J81L52m27m51M43J46Q0L90m34
2323B4J22n16Q29j05p99M54n92J67L03O23r57J104m74l21L70l90M4K93k34k03
2343b58M0l3O24m53M04L80o17l82K72j57r3m86Q11k92K87L99k16j89L90K07l75
2364B63L35p21n33P35q1p59J79M30J25l12N54k97P60o77pJ01o69r2M54j75K22
2385a65N40m68N61Q2o71K64l78L83l69K73l48K43q33N93O23n80Q17N65p78J95
$$ y = [-140, 50, 545, 62, 35, 441, -168, -20, -14, 702, 494, -212, 732, -376, 174, -335, -286, 211, -49, -421, -363, 294, -158, -142, -133, -121, 226, -9, 91, 85, 4, -364, -201, 504, -438, -315, -443, 99, -117, -108, -517, 506, 288, -171, -394, 102, -76, 231, 113, 206, 43, 199, 74, 34, -391, -704, -126, 101, 226, -168, 124, -144, 944, 270, -418, 727, 329, 267, 162, 252, 233, 252, -196, 48, -460, -51, -160, -256, -75, 277, -150, -601, -158, -12, 68, 458, 24, 146, -370, 459, 354, -445, 9, -583, -416, -113, 510, -447, 657, 183, -138, 232, -158, -114, 179, -55, -258, -218, -251, 373, -80, 324, 704, 87, -295, -23, -180, -273, -759, 52, -240, 47, 446, 230, 41, 431, 638, 263, 598, -123, -656, 79, -2, -761, -582, -152, -27, -339, 215, -82, 678, 1, -6, 95, -574, -666, -212, -387, -165, 375, -93, 468, 550, -121, 143, -235, 148, -221, 52, -296, -53, -886, -293, 330, -250, 567, 1132, 354, 549]
2405E49Q6j233L46k04m43L06J264J66q71O3J008n78j50q71N61l77j5P04l51n96
2425f36O12L68J88j44l88L11P7L4p91J40L0k63K53M27j8O16p6l11R4j92l49l10
2447c28k48M99o76n9J342n20K44N28q50k86qK05o9j185J074k99j49N56O93k39
2467B25j4K09L90m08l10j11l66K62l29Rm03J214J0r5O80o27o37P18p90n80K57
2488f96K77O17n56M57j71N85k7L07n15j03j8m82J71%K11J92j36P32m24K09M52
2509A082n07j144M32k05k76RJ2O8K71O05l22J63J87Q9L0r23K34K98q51M89m38
2530f97K34Q14N7K82J68j12o81K17n30k44K22J14j97J85R72o20J75P60o49l18
2550A52l85L37p81j00N17n0m76L40J816l81o51J019n61j129j67M68j354Q49L51
$$ y = [549, 635, -598, -252, -456, -899, -593, 671, 837, -34, 29, 1037, 459, 309, -562, -1, -378, -393, 311, -40, -636, -24, 344, 532, 388, 0, 311, 388, 422, -369, -229, -199, -462, -209, 218, 200, 816, 740, 429, 523, 331, -18, -328, -576, -77, -753, -812, 530, 10, 254, 782, -68, -354, -362, -157, -226, -1411, -337, -636, -785, -229, 464, 225, 211, 420, 810, 402, 92, -19, -385, -123, -452, -443, -846, 368, 378, 283, 963, 336, -301, 417, -373, -953, -696, -419, 198, -358, 99, -72, 513, 486, 793, 278, 175, 157, -325, -154, -154, 57, 249, 113, 845, 421, 630, 1082, 575, -569, -137, -342, -618, -609, -597, -529, -258, 347, 25, 188, 375, 464, 494, -429, -195, 103, -748, -259, -697, -463, 351, 408, 690, 858, 746, 65, 282, -248, -492, -270, -156, -353, -168, 804, 184, 359, 1119, 470, 152, -233, 104, -677, -777, -260, -310, -786, -446, 1370, 989, 338, 1357, 796, -333, -500, -32, -1386, -537, -186]
2569a86L34j82M59L2k44P95p29m83n61K21m70Q9J51n2Q84N51L3k60j10N07j66
2590F13j104L18j60m79Q30J95l42J00O51O9J03m72p4r44l19k00N63L81k6N28o9
2611A62R32L4L95j239K90o92j057N06L44o09N31K93K54K79K70K4j53K6o42r12
2631i64K17Nj56L12O41j28R96n00M06L3j2j299pM5n04O37j61L96P24k76O28j22
2653I11o80K07n95l51l0j05j051J179m3J57N67P74Mk13n40j25n26m15M3O4q1O89
2675a60K5M76M54J84m29r6J7q78M18q97j19K33R39j10M2J01M85M02m15k92p38
2696c58J33m45J19J01n80R76k9Q16R5L45k99p70k49ro95n6K35J58L82K97p1O08
2718G04P91l52o22m50L00j011j48k89K83k6R91O34j58P7K68O4l82n91p40q23O43
$$ y = [-186, 148, -34, 425, 457, 213, 1008, 279, -204, -765, -544, -1014, -925, -774, -826, 58, 609, 642, 382, 272, 779, 613, -491, -173, -333, -812, 18, 213, -129, -29, 622, 691, 794, 322, 248, -696, -1015, -1215, -652, -271, -297, 231, 162, 1094, 1128, 1523, 284, 574, -118, -1175, -669, -325, -934, -403, -110, 144, 423, 693, 717, 564, 590, -52, -964, -747, -742, -898, -586, 55, -73, 923, 423, 829, 862, 850, -449, -456, -411, -915, -278, -439, -43, 681, 405, 1033, 911, 231, 438, -157, -508, -538, -643, -1694, -515, -558, -401, 166, 940, 944, 731, 191, 66, -460, -875, -832, -768, -849, -160, -135, 341, 795, 979, 550, 454, 471, -407, 11, -886, -1005, -772, 167, 57, 99, 200, 685, 1087, 672, 380, -358, -225, -670, -551, -450, -1030, -54, -83, 733, 828, 1173, 874, 104, -145, -154, -849, -905, -670, -512, -130, 167, 96, 704, 1495, 1143, 521, 71, 371, -640, -788, -1077, -794, -820, 171, 805, 647, 724, 992, 1056, 674, 83, -657, -1480, -837]
2739h37m42Q74J63M76O87J11m1qm42l83j078J92k89j67R54k4P9J045O29p89j46
2760E64p44J48n09J47k82o7J21N80M28K96L69m7m18o11M1m5j113k3J19J57R1O05
2782a93N51R42j00L87j244l73n0l82Rp42M55N57L99P47m77P26o88n46j01k63m8
2803d34j115l3R41k16O13O88P4Q25n73k42j64J3j116J76k11J78J98J82K22P07
2823G13P48q06P7m44q9n98q39O16l43K04k37J001Q83J12m97Q24p27l96p1r77k27
2844a073M49k63l6J092P44M83r65J094q69l29k6j162L05l84J38J56J90N14J311
2863A369r6o96M83j039m12r49L96M37mJ00L88R82l87Q30l17k7j097M16n15j170
2883a308L06K14K44L55O01J25N85J8n08j019l90k55m1J53m81R69L13J61P66kk30
$$ y = [-837, -1279, -405, -242, 234, 921, 1032, 991, 983, 541, 158, -920, -728, -1017, -1184, -230, -254, -175, 870, 1499, 710, 564, -180, -32, -541, -394, -676, -743, -622, -42, 386, 682, 1051, 1004, 586, -25, 16, -29, -1142, -1165, -1046, -889, -798, -193, 358, 1300, 1200, 1587, 343, -30, -80, -462, -453, -1195, -740, -183, 216, 963, 486, 1212, 524, -22, -123, -386, -434, -1549, -1582, -641, -857, -244, 444, 518, 1343, 770, 528, 364, 377, -739, -563, -774, -596, -398, -216, 6, 713, 1461, 655, 732, 288, 199, -399, -1238, -622, -965, -761, -998, 3, 886, 998, 501, 1325, 598, 202, 131, -846, -1073, -624, -887, -923, 169, 913, 1396, 431, 1525, 656, 327, 301, -861, -556, -940, -802, -646, -456, 58, 1369, 1273, 577, 1060, 21, -391, -1340, -944, -507, -511, -411, -23, 959, 572, 1402, 1085, 1058, -39, 377, -138, -1308, -1002, -788, -544, -189, 412, 537, 1122, 1140, 632, -387, -777, -1032, -1073, -920, -1401, -432, -119, 42, 808, 806, 576]
2904E76M57M3p87j11j059n67R4L84M97O62O93l55L49k07o13N6n28m45m38M21R54
2925G6p74J033N49J91K38m62J03m12p55m22o46M06j32K76N73P44j20P21j17o78
2945C92l6n06r34RJ89Q2N96J55O65K62N63m46l37q41j2o10K00K32n35M7Q54K10
2967A99N77l15O07K04r24n15j90p51J43k90O04K46Q9R49L45K37q4q17l9o45m60
2988h30k44k29K46N58J27J040lJ69R91j184j041j53l9q02J40Q66p62J024J023
3007H97J9J75k00l2l93O6j333K66l28k25M61L16P76O55j75k18j09o45j46m76l32
3028i81m85q0J117k01Q17J47N40L89p71Kn40k89l39m34k16N42P33O6P47p7M75
3049A162o89n90K49l39j86r7n21mK21J033Q14o22Q43m24M9o75o15n29K08j2k23
$$ y = [576, 1033, 1076, 289, 178, -881, -1448, -1354, -970, -473, 189, 882, 527, 876, 669, 56, 112, -416, -861, -1299, -878, 76, -698, 335, 884, 1075, 1313, 851, 954, 542, -213, -635, -1281, -875, -1007, -731, -158, 586, 466, 1187, 1070, 392, 356, -150, -1084, -1075, -886, -804, -208, -53, 612, 874, 1437, 991, 654, -187, -199, -809, -609, -377, -912, -865, -11, 199, 776, 461, 1068, 1272, 348, -167, -357, -1108, -965, -1255, -651, -405, -316, 633, 978, 1215, 1131, 314, 275, -370, -830, -1074, -1303, -1057, -499, -372, 668, 665, 834, 1825, 641, -400, -553, -592, -1394, -1254, -388, -1150, -126, 897, 916, 1091, 891, 859, 466, 532, -801, -535, -863, -1088, -627, -311, 465, 1120, 945, 727, 618, -27, -173, -649, -981, -1466, -1546, -429, -630, 187, 334, 874, 1263, 492, 494, -46, -335, -674, -1108, -1324, -782, -49, 17, 764, 687, 1162, 473, -117, 132, -207, -393, -490, -1011, -1015, -794, 239, 1053, 431, 1274, 850, 899, 224, -391, -920, -712, -724, -947]
3070i47O71r8J125k53R97j4o21o93p12m71o15J50J44P49L04P60L01M76o3L24m68
3091A046j561n68O48l82p77N49P71L78J352o84K06l93k11p58j13k93j54J48J28
3110f68P32L1Q93k55Q13o90J0j162n78j23K76m80L37O40N8J147o8J90m6m5r94
3131A8r9q18p2K05m59J277K30J19Q06k88Q9k87o69J6k70j157o7N12J48J176k42
3152A68N66N96Qm82o84j66l13k10m93N44L26k10j94J601J61j11n68J23m70n07
3172c15k73o80M89L28L96N76L79k29Q78l56l76p44n2o06j301R91j2N37O67M13
3192G10K48j56N8j06r33l25k18J23q35j66J789l52J53J193J61m05n04j43m44m66
3212f18l17m59K36J269N60k66N52J36L26j257N7j14j02r05p11Q52J09Q65N27M31
$$ y = [-947, -276, -374, 751, 498, 1495, 1481, 860, 167, -545, -1016, -1631, -1481, -1337, -588, -284, 476, 777, 1253, 1190, 1514, 1046, -515, -1083, -435, -817, -1594, -1045, -274, 104, 1456, 772, 978, 585, 374, -384, -497, -790, -944, -796, -668, 64, 95, 988, 733, 1546, 856, 866, -296, -874, -997, -721, -1201, -864, -224, -166, 981, 913, 1103, 1057, 1012, 18, -81, -899, -971, -766, -1225, 52, 282, 401, 1207, 919, 1008, 721, 52, 68, -202, -1359, -1426, -914, -766, 410, 168, 734, 1330, 1338, 856, 172, 6, -307, -517, -1010, -466, -140, -350, -544, 1057, 1218, 1107, 539, 662, 192, -315, -588, -1268, -779, -451, -55, 521, 900, 671, 1549, 1193, 817, 73, 21, -585, -1886, -895, -907, -370, 297, 710, 958, 802, 860, 754, -179, -504, -722, -599, -1434, -1600, 189, -163, -10, 1183, 1344, 939, 435, 292, -152, -618, -935, -1394, -1158, 111, 671, 405, 957, 1093, 1419, 162, 219, 105, 3, -902, -1613, -761, -652, 213, 740, 1171]
3232A171l72Q39l20q67n63r18J34L69q62R34O47J32J6O34l04l26J14n57m12k49
3252g60l53j99Q99K4L08J47L79J88R7j86l96k51l35n68K23j48N26J193n1K40m37
3273E40K72j2l65K9q09r51Q17j63k60M48J548K61n72P71k43r46p79k46m74j54
3293a288O59N9P08N59l76O70p20Q05m41r95o22M52o04m09J184L37N32L4K34j8
3313G60n60M48n69p84j20n91L03j13J530l63P78J277j315J46J8p67q5j069j59
3332a235M57J01L91l17J384q5L1L10n34m67k36l60K24k65N34m35P31N29J37p5
3352H20o28P00q90m75j0n3p52k73R21J079l72K65M22k26k63M08l56q74l75m60
3372a392M26K82O04K26Q84k18J94P6n73p53M25r74K3L82o60P81M66K58N35k87
$$ y = [1171, 799, 1638, 1318, 451, -112, -1030, -896, -527, -1389, -455, 192, 324, 340, 974, 670, 344, 458, -99, -511, -760, -1113, -1312, -413, -389, -81, 66, 445, 633, 730, 544, 148, -103, -438, -1006, -783, -931, -405, 788, 737, 977, 540, 812, 800, 435, 464, -345, -1296, -479, -642, -902, -454, 1094, 1355, 783, 1554, 1311, 365, -414, -660, -1134, -1288, -629, -570, 138, 697, 321, 991, 271, 1076, 635, -360, -982, -530, -1134, -1543, -359, -22, 510, 544, 778, 760, 200, 648, 79, -705, -825, -1416, -1113, -1226, 304, -59, 719, 1996, 681, 827, 845, 78, -7, -1076, -1235, -778, -677, -286, -603, 781, 696, 727, 1037, 503, 36, -200, -560, -336, -601, -67, -502, 229, 758, 895, 820, 192, 892, 2, -473, -483, -536, -1288, -1561, -640, 439, 67, 332, 754, 528, 265, 673, 317, -557, -932, -1392, -966, -684, -80, 146, 1030, 812, 1006, 1082, 509, -244, 181, -793, -770, -388, -1048, -267, 199, 457, 992, 705]
3392G05R56r01n09k31o25L3l45M16K56K65J042r12P11j5j90J64m98j001o79O12
3412g46N92o4O6R85J19J71k71n2K72r36j98j087J76L99L1L84Q63n63J74O71n4
3433I32mj537K13r66N72J3J008o22J053L73l75M43J1j196Q10o58r11j85J73M78
3453c75k53P29J18N15N46J29j008p60j3q24N62l0K92l51R04M00m8K2k2k47K53
3474E39j212J92m0k81Q27k71j14P09L87L46j94k00p83p19N72o09k60K20j86R17
3494a60O10j34R4P18k41o83k25q00L79j062N65J189r6j22J92J06L02Jl55j28l75
3515b25p40J17Q00n85P22j83M75M00K50k07n68J59n98m63o4l36j85J771j45m4
3535C51J40J87M60m80k90j64p01q5J15k58P09M6j52Q89L58k28j75l81l46m53m29
$$ y = [705, 1661, 760, 251, 20, -605, -572, -917, -501, -245, 20, 1062, 150, 861, 846, 656, 820, 322, -679, -1358, -746, -154, -218, -152, 833, 952, 1123, 852, 800, 1072, 136, -62, -1149, -973, -574, -543, -159, 704, 141, 315, 986, 932, 928, -609, -396, -1362, -790, -777, 231, -391, 662, 1035, 660, 1103, 1114, -82, 728, 70, -841, -1026, -853, -375, -628, 101, 219, 734, 1280, 1409, 401, -359, -372, -1196, -634, -664, -372, -723, 181, 581, 533, 555, 533, 286, 539, -673, -481, -521, -802, 25, -246, -360, 349, 736, 1082, 888, 688, -95, -814, -242, -851, -1111, -891, -1077, -160, 450, 316, 410, 1128, 887, 204, -21, -821, -442, -1504, -939, 250, 154, 32, 224, 330, 632, 633, 278, 150, -225, -965, -848, -48, -633, 89, -94, 381, 781, 1031, 824, 256, 415, -183, -646, -710, -1046, -1231, 540, 395, 351, 491, 678, 1138, 658, 368, 204, -497, -582, -467, -725, -16, 30, -122, 767, 1125, 897, 722, 341, -5, -458, -887]
3556h87L1m1j61Q03Q71J80J90n11R43p98k40j097L39k57l74Q34K57O49J32M50
3576A313m53n99j06k6r11P57m42k9l36R58r4L17P67K8m71m39j88m02j40k41J37
3597f00J72K3O62j21l08Q68K16k24m64n09K9k77k59P35O8K19N46M3Km96O87o34
3619C78m63o67r0J56M72j75P88l66N8R16n34K47m58l50q84J33q0PQ85m95Q19N2
3641C49J12J83J66m45k5m59o19J8j0M10l9N76J75n2M85o0l42j07k13n17n08P07
3663b15p79K72J248k40k31M89Q1l5o00n75J6k6l96O15M95l81J23P36k55M47K89
3684A078j314N4j71l60K51k9K40K45N48j75L61k59k19K14l42n7j56n89j6J079
3704C83n22M9N10P60k94r25P87l26n93j117R22n83Q90o30R93K59j21L50m33o70
$$ y = [-887, -856, -897, -1058, -255, 616, 796, 986, 475, 1418, 620, 380, -717, -378, -635, -1009, -175, 82, 731, 863, 1313, 860, 261, 155, 129, -782, -25, -467, -496, -832, 126, 32, 349, 1116, 1144, 673, 234, 46, -356, -496, -737, -600, -428, -405, 257, 136, -172, 696, 912, 688, 224, -285, -256, -533, -792, -57, 11, 230, 776, 819, 821, 325, 1012, 378, -85, -752, -842, -686, -214, -389, 399, 33, 91, 1007, 473, 720, 262, -88, -972, -839, -919, -912, -27, -522, 297, 349, 461, 644, 810, 365, 340, -119, -738, -720, -730, -320, -359, 217, 392, 340, 825, 765, 423, 316, 103, -414, -922, -215, -994, -722, 526, 286, 55, 544, 625, 590, -10, -585, -569, -595, -991, -376, 119, -262, -139, 597, 342, 789, 1078, -236, -182, -353, -713, -462, -491, -251, -6, 542, 367, 728, 469, 250, 464, 122, 65, -91, -680, -696, 383, -139, -90, 420, 1180, 886, -39, 748, 422, -171, -1288, -366, -949, -59, -689, 304, 563, 442, 792, 359, -311]
3724c11K32j74k18k59J56N10K73l10L08O47j41j42J36q00j44m5o5J39o84K49L61
3745b82O82M2M6l1k09j81l63M5r6J64J08r4l51J256n07P8M95l94l61m05k89m01
3767a048P92j17K91P8K71N5J01L56k42n52L72j162J16O19j018J133l88L98L01
3786C56J69L73l61m0q81M9j01N1M34n48N24j11Q16l18r4j79K07j49ok79j95K2
3808b61k79j52J123J83j39k50J26j67N2n00j96J90r2j86Q02J75k48K41O82p15
3828C89L95m81l27K65k24l27pN01q11RJ068J43j97j86j38m14k92O30r8j40k68
3849e10L61L39j64M13N5k74m46K6j73K56l1n47N9J40J50M54O14n52P0o49L70m48
3871d87L72N1j66j12P67l93l42K96P65m92j68k99n05M22l3j1l89L11l60J172m02
$$ y = [-311, -79, -253, -471, -730, -574, -64, 209, -101, 207, 854, 713, 571, 707, -93, -237, -282, -347, -208, -892, -643, -282, 400, 442, 488, 457, 248, 67, -296, -251, -347, -183, -75, -169, -520, 736, 229, 307, 802, 408, 47, -358, -647, -1048, -256, -373, -82, -4, 267, 322, 423, 779, 537, -15, 357, -805, -689, -70, -1088, 45, -343, 55, 356, 525, 898, 537, 497, -384, -335, -436, -385, 49, -499, 25, -86, 730, 412, 318, 139, 346, 197, 191, -88, -283, -261, -540, -692, 431, 614, 475, 225, 351, 184, 236, -264, -460, -270, -362, -548, 254, 429, 181, 422, 1104, 389, 784, 303, -24, 241, 17, -310, -317, 184, -627, -618, 450, 593, 396, 210, 72, -342, -634, -4, -102, -242, -510, -149, 190, 26, 439, 494, 220, -226, -200, -373, -117, -148, -695, -636, -496, -346, 108, 722, 170, 240, -409, -39, -487, -115, -64, -230, -342, 425, 32, -310, -14, 751, 259, 91, -208, -713, -291, -324, -335, -724, -413, -773, 399, -3]
3892cL90J42j77l52K33l93q51N39J66l35L62M25L03O51n02p51J74k98J62o91K23
3913e83K50j75M15M42M59q02J76K13n07j59J4p03O09nL89M0L7n0Q0L96m87R14
3935I63r10j67k05q3j11M12K9n26R77j32M34j065N42p15M33k81L02l02PJ20R12
3956F34l81j46N27n21j69L27j37n00J75o86M24O4M9K48l03P99m65M00n44L94j91
3977bl77j87n62O79M93J9O32n07M36J61n04o54M54r3o00P3J77L60K94r2l52N73
3999D21k79J55J83o51L45n20pl18Q40n23L79P19n61k08j51J12m95J43K76j1P3
4020g8r9l51J261l23j8p67O17k26j93r87O37M58k79p4N57J10k2l40J01J77j76
4041a5q7r4P7k4L04j26N94m82K63n89J083j143J028p51n79Q7N43p81R35l85o29
$$ y = [-3, 387, 529, 352, 0, 233, -160, -1011, -472, -306, -641, -279, 146, 449, 1100, 598, -153, 21, -277, -115, -806, -583, -333, -508, -93, 349, 808, 6, 182, 395, -112, -271, -257, -960, -351, -356, 33, 73, 110, 60, 140, 536, 49, 963, 53, -114, -319, -402, -513, -101, -72, -598, 379, 247, 681, -384, 158, -557, -124, -405, -103, -405, -398, -278, 634, 253, 107, 634, 113, -56, 271, 134, -366, -191, -877, -453, -389, -340, -92, -395, 404, -61, 339, -205, 189, -2, -379, -566, -1128, -449, 44, 63, 695, 188, 624, 785, 281, -373, 81, -12, -612, -539, -362, -2, 292, 200, -152, 421, 142, 297, 480, -171, 174, -346, -353, -671, 169, -354, 25, 744, 183, -25, -176, -64, -559, -416, -140, -151, -78, -177, -528, 733, 410, 392, -375, 242, 16, -177, -1164, -527, -69, -348, -422, 135, 245, 223, -117, -16, 161, -15, -102, -196, -119, -143, 161, 35, 629, 147, 410, -179, 904, -239, 789, 38, -541, -454, 89, -692, 243, -142, -771]
4062g71P84r2P00o48J23j45K77p70K26k5O8N1J19J96l1J017r66M01p80J17j52
4083c01K86l5j93K70Jk97J97N68l39N84p90K37N0m62m06N41L51k96ML0L83J10
4105D93r99P59n24q3R8N56o16j18R4P4K07M64q08K33k61Q14L0o57J84m77Q55M49
4127G67q27j24N78J26k72j42o01r2P25l59l5L25l99r3O37L84j08m43J44k63M2
4148c0M3K1j27j34k54M79O7Jm46R62p42j94j6L44L93m62M7o46Q74l61N75o98N80
4171B76K39l88L64r25M39J95j07l00p4K83N0K26l09R0n83M11k75P98q70j19O60
4192H1n34n6P21l31R7L00r8j07m82Q05r04J19L75k60R26j067P41o08Q74p57Q10
4213F45k61m11l36q1l75Q96l95R18l63J2n80R6K67j24k44K25M68j60k47j96j5
$$ y = [-771, 13, -79, 621, -27, 96, -49, 228, -542, -316, -341, -273, -222, -103, 93, 62, 1079, 113, 514, -266, -149, -301, -15, -50, -243, 27, 28, -269, -72, 496, 157, 741, -49, 188, 238, -224, -630, -89, 262, -34, -30, 0, 383, 493, -506, 253, -271, -354, -256, 300, -316, -434, -340, -266, -59, 405, -403, -170, -431, 383, 413, -244, -60, -537, 318, 767, -60, -184, 394, 520, 248, 106, -495, -587, 138, -221, -256, 69, -330, -423, 214, 598, 490, 47, 191, -72, -30, 13, 34, -93, -227, -481, -2, 65, 66, -380, 582, -160, -354, -370, -26, 367, -95, -48, -694, 180, -181, 394, -304, 276, 515, 127, 491, -434, 5, 200, 93, -207, -281, 2, 52, 278, -31, 59, -524, -113, -388, 410, -460, -579, 81, -453, -509, 212, -119, -22, 278, 180, 73, -409, 396, -508, -389, -14, -274, 652, -415, 326, -282, 592, -165, 645, 384, -27, -363, -444, -819, 77, -318, 600, 237, 249, -331, -235, 32, -92, -336, -111, 357, 197, -50, -246, -261]
4234b61N75o4J21j72K81p61l06N46n07O75K54j125J002N57o31L71m06J32l20L44
4254C05k07p8m15J14KO21j18L90m19M79n73m06m3J19L89J7m06k07R36j94j2o3
4276B31J94n17l71M08o75O20O16m17j19o2K13L22M23m43n74J23J45k46o37L53
4296d13Q85m3m95J11r9N32j44o27M59o23K66K71j52J94j22j10N92l67l30N29n13
4317a99M89L5j64k26r0L73l62n7o8K0J47L37m97J67j41m12P47k12L17L2o38J32
4339b70J73M71j09k39J54Rn92K26q5J28K2l13R96k12k28l57N06m58O22l52q8j69
4361a65O54m49l24p7N11j07k27Q69p05L02m23K85Ok27K36K08j93o02N14k97P07
4382D96o78J95L71j20k75o14R78o24J24K05q83J267r07o5L59L50j67l12M92l59
$$ y = [-261, 314, 250, 371, 199, 480, -281, -587, -41, -548, 127, 381, -744, 258, 815, 184, 555, 149, 281, -39, 305, 98, 20, -395, -281, -279, 342, 224, 614, 195, 674, 101, -305, -348, -229, 160, 177, -229, -436, 500, 306, 294, 231, 425, -92, -463, -55, -730, -110, 506, 89, -30, -92, 121, 443, 866, 423, -151, -28, 117, -129, -766, -413, 472, 429, -66, 45, -54, 478, 334, -293, 166, -457, -191, 80, -72, 122, 0, -110, 482, 115, -215, 314, -199, 290, 325, 161, -65, -155, 218, -144, -201, -269, -249, -102, 235, -262, -95, -236, -648, 99, -113, 204, 236, -402, -270, -97, 374, 265, 26, 180, 189, -403, -177, -262, -134, -112, -425, 571, 359, 131, -226, 280, -178, 444, 92, 4, -165, 489, 40, -284, -361, 150, 43, -184, 685, -20, 282, -141, 144, 150, -77, 159, 367, 174, -428, 86, -211, 496, -182, 13, 384, 264, -11, -625, 353, -271, -147, 58, -825, 442, -465, -530, -171, 179, 12, -300, 192, -167]
4402a67k53N01j94N91j08p63K47j90M5L75M64r34kM12j78J65O6m61P00p31Q19
4423D04q93R70j69n6l55M4J74k1l78K25L20r90M05J50k67J06P14J28j38m69k7
4444a23L13L37k47r9kj60J80j18k05P3m85R52r38J25M09K60L46m51K72l90K32
4465B81l83N0N78o53L77j59o16L35L57l40M74n1m5n46J036p85L40P7l10O0o4l50
4487c37L21k5J19j10m16P22j17m32K18L29p69L02J87o49Q54m44L38n26K82K34
4507H1Q3J10k88j09K35p14L44j48R19q60l18N17m21N13m4r3O00m25L12l30m2K9
4529d9K54k85K88n18L15J75l66N86j027R44m64J72o53N3J056l86r9n11O41L61
4549D87n17K86k04r9K38K22p68J56JL0L0O8l28L6P27m21P47j418J011k73K60j15
$$ y = [-167, -420, 81, -113, 478, 370, -393, -146, -336, -291, 84, 548, -386, -388, 24, -154, 11, 77, -384, 316, -415, 404, -489, 481, 312, 256, -99, -55, 119, 98, -280, -55, 265, -725, -320, -170, -437, -331, 383, 511, 373, -96, -123, 190, 527, 280, 181, 179, 19, 199, 81, -124, -51, -536, 416, -522, -397, 12, 272, 618, 167, 439, 49, 281, -102, -52, 526, -127, 250, 91, -525, -190, 167, -173, 301, 250, 205, -341, 695, -90, 250, 327, 17, 77, 13, -337, -16, -41, 78, -32, -448, 274, 157, -275, -57, 272, -497, -195, -8, -657, 197, -247, 91, -435, -153, 81, 164, 274, -14, -123, 112, -602, -258, -406, 513, -347, -665, -148, -569, -56, -100, -193, 407, -18, 294, -36, -78, -49, 205, -80, 208, -310, 5, 180, -186, 400, -627, 317, -147, 25, -628, -575, 481, 95, -4, -515, 126, 487, -30, 256, 52, -47, 191, 413, -355, -199, -198, -168, -138, -70, -398, -362, 365, -56, 691, -727, 284, 11, 271, 156]
4571A56K01o80k7J43M95l28M33n37J75k40P5J49J53L95l23q64Q44k85q9m8J94
4592hj44P1J59q83N21q9O06L71n22l87j75P6P46j99L31k17n91k04Q33M18o86l46
4614c19P25l93O1n9m21Q62j128M82K37J49j42l54O12l16J67r3l27J77P8L25j13
4635B10k19N59m18r6j80K96j72R03j277o7j33K99o0k6N54k72M63m94j12L36M46
4656E40o74O1L60o76L07K48p2n18K63l15J18Nn11O49M06j12L78j59j1l33N56p39
4678b29N24K85m23J25L1l03J27m07P11q65Q34K38k86j09l67M34n80M22J7n55q3
4699d59N80l02K30K00m75O09o93R49j276J86M81l20N25m89k70O48J82k83J6k08
4719a69k39L27J43l90L91m52L27m64P09l50N5L45l30L51k81r7L67m4o42M69l26
$$ y = [156, 357, -323, -350, -207, 288, -40, 393, -144, 31, -209, -134, 15, 168, 563, 240, -624, 220, -65, -154, -202, -8, -152, -81, 78, -805, -284, -373, 233, 604, 82, -305, -480, -404, 342, 143, 474, 257, -334, -538, 295, 713, 27, -319, 406, 13, 74, 15, -406, 456, -672, -190, 47, 196, 54, -300, 312, -4, 163, 70, -257, -80, -2, 323, 210, -9, 550, 132, 36, -144, 152, -20, 883, -394, -461, -594, -295, -355, -381, 173, -99, 364, -130, -242, 94, 540, -134, -73, 287, -389, -82, 166, 94, -424, -161, -476, -358, -353, -864, -215, 191, 79, 457, 298, 287, -46, 510, -229, 295, 580, 157, 282, 313, 10, 137, -270, 441, -424, 410, 648, 362, 253, -114, 320, -260, 162, 179, -376, -459, 121, -181, 49, 249, -226, 383, -310, 639, -637, -451, 30, -290, 235, -254, -524, 124, 306, 23, 39, -169, -408, -81, 62, -328, 63, -389, -62, -526, 183, -167, -112, 233, -97, 254, -27, -124, 243, 199, -443, 26, -300]
4740c00k55O39l32K4K38K14n6m81j23l6L32J76m29K76L92k13M18p73J93J08M23
4761D35o09r5M30l89L5k09Q78j24l63K25J5jl01J47m17o9J89k21L6M62J92M2o01
4784c13M59l34P30q71J09K82r20Q02l09M04J68n85K97L83o08J20J63L54l25K72
4804B78j74K53k93l65L13o47K14N33M22p45L31k72l51L57j19M95k47K96k5j37
4824A17p68N44L19J31M66p90Q5k93Rj28L72L81k2m80K53o05O58l13L3l4L33q56
4846e88N04N32K66r69L47o21R28p53k17K04j12j55P75p9L89l22k97L59q2O5j22
4867E2m51M89K99J8r21N69j1j64N20j31l67r6K23Q3l26L58m34M38j42N13k09l32
4889b2k31J015m33J38p77N81p85R93l87k53O70k78n82O82L30p64K8J05p14o2M11
$$ y = [-300, -555, 84, -248, -224, 14, 228, 172, -309, -432, -468, -136, 40, -389, -113, 279, 66, 484, -289, -96, 12, 435, -174, -269, 161, -228, -193, -402, 476, 352, -11, 214, 229, 228, -73, 74, -343, -412, -223, -444, -408, 54, 246, 288, -313, 146, -188, 542, -329, -220, 62, -858, -56, -365, 39, 207, -378, -81, 302, -306, -186, -23, 331, 6, 278, 104, 357, 64, -301, 12, -635, -421, 112, 534, -211, 120, -152, -503, -146, -265, 230, -17, 279, 254, 117, -651, -107, 212, 343, 809, 19, 104, -189, -180, -308, 64, 445, 423, -57, 196, -409, 249, -64, -31, -65, 268, -588, -84, 448, 714, -255, 92, -529, 399, -354, -571, -367, -479, -634, 141, 62, 451, 129, -168, 191, 109, 174, 52, -399, 90, 389, 407, -514, 55, 44, -120, 400, 269, -98, -194, 29, 112, -214, 144, -290, 148, 6, 519, 310, -22, -253, 762, 329, 467, -310, 271, -514, 479, 92, -161, 509, 231, -351, 331, 661, -103, -75, 30, -684, -746, -335]
4910c35M00j14l1j33N6K53L27k54j71k36n2j45M8Q9k4P03o0J7J23l11J59k01k59
4933a51J5k06L92k27J72L23n11K72k15J15M27l25l28L08n29O23M21m60l64j31
4953c79N58r6k85RN72l86K44N2n39K52J99k84m41J55M70N67n12r5k11k45K2N98
4975B25r5j26l65M54J87J47j74m38O10k0l92j54m71J141q74k15Q80k04K54l74
4995dl18J091j031N19k62j55L59l36K34K8k70K51o8K90K37j143R50Lp64M29l16
5016b76k35M96p3L27k59j5r5j24oJ31L17J64m8l96J79J91r71O78nN34L4o28o81
5039g61N52M74l70J21q3k90K27O8k08N14r4k42l66O30L5p64P09k34k24R2J77M15
5061C78p6q8L04n83N43n60K25j17K1j10J77J56O0p7L1p0J33k24L4M3m80k40L46
$$ y = [-335, 65, -49, -80, -213, -157, 96, 423, 169, -2, -238, -290, -435, -387, -298, -322, 381, 321, 338, 461, 150, 309, 108, -151, -136, -342, 50, -177, -5, 318, -193, 79, -136, -21, 406, 81, -247, 61, -468, 155, 576, 116, -248, -379, 179, 83, -202, -193, 379, -7, 237, 289, -250, 2, 201, -83, -524, -369, 101, 668, 156, 61, -150, -395, -373, 225, 130, 4, -361, 93, 280, 427, 253, -185, 425, 405, 13, -141, -612, 529, -345, -560, 320, 116, 370, -4, -322, 769, -262, 257, -5, -160, 199, -137, 97, 125, -145, 106, 38, 328, 565, -578, 372, 375, -389, 40, -276, -511, -15, -88, 239, -20, -35, -130, -254, -260, -129, 188, 352, 304, -92, 87, 278, -693, -15, -20, 514, 548, -80, -761, -209, 265, -105, 16, -67, -357, -130, -62, -270, 244, 150, -92, -458, 172, 207, -557, 152, -82, -306, -214, -37, 378, 302, 214, 518, -65, 478, -82, 143, 26, 47, -63, 114, 270, 330, 253, 284, 214, 347, 123, 157, 200, -280, -520, -174]
5084a74j07N3K93M73j83j026J297r95J86K61K19l26R1m50N72Ll05K90JL3R9p6
5106B29k52Oq4K03K91n28J21k50J143q13j54k34L37j76J48k20J13l75P24J08l2
5127C05j83j25m1m3r8j77N91j50m02M09J76j89O31n68k57J88Q20p58K0m3n51L90
5149e5k93M77K99J17p65P21m99m82M73j08L21l66m23n8L22M53m77K82j6q6j26
5170b89k31K59K39QL30n44L20J6l45k52N64J00n06M34k12L54k45k77R6J67P9m3
5192B2j59N34l89m17N36m53O61n79K14J16nl16J151j139M20r63J073k32O0K31
5212C66k96k6K06O0l73K31L60j08p01J34M55k32K2k40K22k28J39J8L80n09R35
5233H15j148M38J13o49J52n7M04m32P72m85O16j19k44l79K0O46p08L05R3o10J19
$$ y = [-174, -281, -228, 65, 538, 355, -671, 626, -369, -183, 78, 297, -29, 62, -388, 184, 187, -118, 172, 173, 206, 305, 229, -23, -17, -101, 102, 393, -135, -14, -264, 879, 66, -88, -322, 15, -161, -13, -233, -120, -495, 229, 337, 305, 122, -3, -44, -87, -185, -362, 229, 79, -323, 86, 262, 73, 704, 136, -121, 67, 887, 129, 149, 106, -445, -55, -348, 129, 428, 545, -220, 501, 2, -480, -7, -115, 206, -160, -583, -641, -319, 134, -343, -61, -77, -163, -289, -520, -261, -22, -14, 316, -228, 92, 108, -237, -489, 75, 175, -331, 103, -109, 245, 0, -277, -181, -14, 65, 22, -137, 397, 8, -409, 127, -326, 335, -244, -30, 86, 81, -235, 916, -223, 197, -766, 307, 75, 135, 366, 70, 44, 250, 310, -63, 168, 528, 420, -281, -147, 308, 76, 98, -142, 80, -148, -9, 9, 389, -120, 815, -333, 105, 218, -431, -279, -336, 68, -364, 408, -77, 539, 420, 176, -203, -183, 463, -245, 60, 153, -457, -338]
5254c38K10L36m50L97r8l52N07L27o12K8q2m2J30j82J39L10J15J82k48o18m73
5275h14O26L11O5o36j67J075q65J74M33K68L1j112L61J23J35l38Q4J97M3j25L80
5296B49jJ21N7j19l27n3j06M84p51P56pm37M57m57j86M60l60J34j61pN74n68m0
5319b88P15Rk62K91k92J87k42j65k59K35O88l39n62K99l45oO17k19J18j76K9K19
5341B52o62L56P4r0R16q07n00N86m89N73n61K67j96J49n2N02k77n98O70n05K86
5362a06L57J10j22L65k83p72N49M35p31O94j048L83P03l32k97L15M19l87r6K7
5382A83K3l24j79K96K33k91M08l08r2m28O37m2K87m38k10P7K02L16p11N23k37
$$ y = [-338, -128, 208, -242, 155, 57, -295, 212, 539, -73, -45, -127, -169, -39, -221, -82, 228, 343, 525, 277, -341, -814, -188, 123, 188, -448, -615, 460, -405, -231, 202, 470, 501, -611, -250, -127, 8, -330, -246, -49, -6, -131, 249, 248, 369, 426, 307, -20, -73, -179, 305, -446, 310, 303, -134, 323, -134, -320, 140, -220, -86, -247, -254, 320, -248, -288, 427, 436, 174, 465, 173, 360, 118, -47, -306, -71, 617, 278, -284, 15, -330, -336, 281, 62, 180, 4, 33, 252, -410, -54, 20, -70, 846, 39, -461, 125, -364, 209, -352, -85, -281, -132, -184, 318, 41, -557, 113, -392, -106, 251, 361, 239, 604, 321, -451, 98, 533, -198, 496, -552, -169, 534, 202, -95, 220, 639, 252, 156, 183, 206, -118, -297, -1, 232, -59, 349, 41, -51, -479, 158, 116, 403, -35, -245, -168, 34, 350, -361, 162, -75]
$$ [...]
8191A5
##END NTUPLES=NMR FID
##END=
