##TITLE=1H_UK-23_6_2
 CD2Cl2
 108 sc, 
 20.10.2022
##JCAMPDX= 6.0         $$ Bruker NMR JCAMP-DX V2.0
##DATA TYPE= NMR FID
##DATA CLASS= NTUPLES
##ORIGIN= UXNMR, Bruker Analytische Messtechnik GmbH
##OWNER= root
$$ XWIN-NMR		Version 3.5
$$ Thu Oct 20 14:16:01 2022 Russian Standard Time (UT+4h)  she@DPX200
##.OBSERVE FREQUENCY= 200.1313499994
##.OBSERVE NUCLEUS= ^1H
##.DELAY= (6, 6)
##.ACQUISITION MODE= SIMULTANEOUS
##.ACQUISITION SCHEME= undefined
##.AVERAGES= 108
##.DIGITISER RES= 18
##SPECTROMETER/DATA SYSTEM= spect
##.PULSE SEQUENCE= zg30
##.SOLVENT NAME= CD2Cl2
##.SHIFT REFERENCE= (INTERNAL, CD2Cl2, 0, 15.7039)
##AUDIT TRAIL= $$ (NUMBER, WHEN, WHO, WHERE, WHAT)
$$ ##TITLE= Audit trail, XWIN-NMR		Version 3.5
$$ ##JCAMPDX= 5.01
$$ ##ORIGIN= Bruker BioSpin GmbH
$$ ##OWNER= she
$$ F:/spectra/data/she/nmr/H-F/1/audita.txt
$$ ##AUDIT TRAIL=  $$ (NUMBER, WHEN, WHO, WHERE, WHAT)
(   1,<2022-10-20 14:15:01.78 +0400>,<she>,<DPX200>,
      <continue with go, POWCHK disabled, PULCHK disabled
       configuration hash MD5:
       00 E9 B6 7A A2 85 ED C7 34 08 36 98 17 FE 4E 26
       data hash MD5: 16K
       6F 8A 8D 1A 64 F9 62 9B 72 1F 71 B1 3B 3C 00 13>)
$$ ##END=
$$ 
$$ hash MD5
$$ A1 54 19 EC F4 D9 46 AF 66 82 5D 6D 29 71 26 CB
##$RELAX= 
##$RELAX= 
##$RELAX= 
##$RELAX= 
##$RELAX= 
##$RELAX= 
$$ Bruker specific parameters
$$ --------------------------
##$DU= <F:/spectra>
##$EXPNO= 1
##$NAME= <H-F>
##$PROCNO= 1
##$TYPE= <nmr>
##$USER= <she>
##$AMP= (0..31)
100 100 100 100 100 100 100 100 100 100 100 100 100 100 100 100 100 100 
100 100 100 100 100 100 100 100 100 100 100 100 100 100 
##$AQSEQ= 0
##$AQ_mod= 1
##$AUNM= <au_zg>
##$AUTOPOS= <>
##$BF1= 200.13
##$BF2= 200.13
##$BF3= 200.13
##$BF4= 200.13
##$BF5= 200.13
##$BF6= 200.13
##$BF7= 200.13
##$BF8= 200.13
##$BYTORDA= 1
##$CFDGTYP= 0
##$CFRGTYP= 5
##$CHEMSTR= <none>
##$CNST= (0..31)
1 1 145 1 1 1 1 1 1 1 1 1 1 1 1 1 1 1 1 1 1 1 1 1 1 1 1 1 1 1 1 1 
##$CPDPRG= <>
##$CPDPRG1= <>
##$CPDPRG2= <>
##$CPDPRG3= <>
##$CPDPRG4= <mlev>
##$CPDPRG5= <mlev>
##$CPDPRG6= <mlev>
##$CPDPRG7= <mlev>
##$CPDPRG8= <mlev>
##$CPDPRGB= <>
##$CPDPRGT= <>
##$D= (0..31)
0 1.2 0 0 0 0 0 0 0 0.06 0 0.03 0 0 0 0 0.0002 0 0 0 0 0 0 0 0 0 0 0 0 
0 0 0 
##$DATE= 1666260431
##$DBL= (0..7)
120 120 120 120 120 120 120 120 
##$DBP= (0..7)
150 150 150 150 150 150 150 150 
##$DBP07= 0
##$DBPNAM0= <>
##$DBPNAM1= <>
##$DBPNAM2= <>
##$DBPNAM3= <>
##$DBPNAM4= <>
##$DBPNAM5= <>
##$DBPNAM6= <>
##$DBPNAM7= <>
##$DBPOAL= (0..7)
0.5 0.5 0.5 0.5 0.5 0.5 0.5 0.5 
##$DBPOFFS= (0..7)
0 0 0 0 0 0 0 0 
##$DE= 6
##$DECBNUC= <off>
##$DECIM= 32
##$DECNUC= <off>
##$DECSTAT= 4
##$DIGMOD= 1
##$DIGTYP= 9
##$DL= (0..7)
0 120 120 120 120 120 120 120 
##$DP= (0..7)
150 150 150 150 150 150 150 150 
##$DP07= 0
##$DPNAME0= <>
##$DPNAME1= <>
##$DPNAME2= <>
##$DPNAME3= <>
##$DPNAME4= <>
##$DPNAME5= <>
##$DPNAME6= <>
##$DPNAME7= <>
##$DPOAL= (0..7)
0.5 0.5 0.5 0.5 0.5 0.5 0.5 0.5 
##$DPOFFS= (0..7)
0 0 0 0 0 0 0 0 
##$DQDMODE= 0
##$DR= 18
##$DS= 0
$$ [...]
##$SUBNAM2= <"">
##$SUBNAM3= <"">
##$SUBNAM4= <"">
##$SUBNAM5= <"">
##$SUBNAM6= <"">
##$SUBNAM7= <"">
##$SUBNAM8= <"">
##$SUBNAM9= <"">
##$SW= 18.0517283424941
##$SWIBOX= (0..15)
0 0 2 0 0 0 0 0 0 0 0 0 0 0 0 0 
##$SW_h= 3612.71676300578
##$TD= 16384
##$TD0= 1
##$TE= 0
##$TE2= 300
##$TE3= 300
##$TEG= 300
##$TL= (0..7)
0 120 120 120 120 120 120 120 
##$TP= (0..7)
150 150 150 150 150 150 150 150 
##$TP07= 0
##$TPNAME0= <>
##$TPNAME1= <>
##$TPNAME2= <>
##$TPNAME3= <>
##$TPNAME4= <>
##$TPNAME5= <>
##$TPNAME6= <>
##$TPNAME7= <>
##$TPOAL= (0..7)
0.5 0.5 0.5 0.5 0.5 0.5 0.5 0.5 
##$TPOFFS= (0..7)
0 0 0 0 0 0 0 0 
##$TUNHIN= 0
##$TUNHOUT= 0
##$TUNXOUT= 0
##$USERA1= <user>
##$USERA2= <user>
##$USERA3= <user>
##$USERA4= <user>
##$USERA5= <user>
##$V9= 5
##$VALIST= <valist>
##$VCLIST= <CCCCCCCCCCCCCCC>
##$VD= 0
##$VDLIST= <DDDDDDDDDDDDDDD>
##$VPLIST= <PPPPPPPPPPPPPPP>
##$VTLIST= <TTTTTTTTTTTTTTT>
##$WBST= 1024
##$WBSW= 4
##$XGAIN= (0..3)
0 0 0 0 
##$XL= 0
##$YL= 0
##$YMAX_a= 1843722
##$YMIN_a= -1360614
##$ZGOPTNS= <>
##$ZL1= 120
##$ZL2= 120
##$ZL3= 120
##$ZL4= 120
##$ABSF1= 10
##$ABSF2= 0
##$ABSG= 5
##$ABSL= 3
##$ALPHA= 0
##$AQORDER= 0
##$ASSFAC= 0
##$ASSFACI= 0
##$ASSFACX= 0
##$ASSWID= 0
##$AUNMP= <proc_1d>
##$AZFE= 0.1
##$AZFW= 0.1
##$BCFW= 1
##$BC_mod= 2
##$BYTORDP= 1
##$COROFFS= 0
##$CY= 11.3945322036743
##$DATMOD= 1
##$DC= 2
##$DFILT= <>
##$DTYPP= 0
##$F1P= 2.36226072786647
##$F2P= -0.459571619588291
##$FCOR= 0.5
##$FTSIZE= 0
##$FT_mod= 4
##$GAMMA= 1
##$GB= 0.15
##$INTBC= 1
##$INTSCL= 1
##$ISEN= 128
##$LB= 0.24
##$LEV0= 0
##$LPBIN= 0
##$MAXI= 10000
##$MC2= 0
##$MEAN= 0
##$ME_mod= 0
##$MI= 1.114404
##$NCOEF= 0
##$NC_proc= 0
##$NLEV= 6
##$NOISF1= 3.799351
##$NOISF2= 2.8
##$NSP= 1
##$NTH_PI= 0
##$NZP= 0
##$OFFSET= 15.70392
##$PC= 1
##$PHC0= -18038.88
##$PHC1= 17.2007
##$PH_mod= 1
##$PKNL= yes
##$PPARMOD= 0
##$PSCAL= 0
##$PSIGN= 0
##$REVERSE= no
##$SF= 200.130013532006
##$SI= 16384
##$SIGF1= 3
##$SIGF2= 2
##$SINO= 400
##$SIOLD= 16384
##$SREGLST= <1H.CDCl3>
##$SSB= 0
##$STSI= 0
##$STSR= 0
##$SW_p= 3612.71676300578
##$SYMM= 0
##$S_DEV= 0
##$TDeff= 0
##$TDoff= 0
##$TI= <>
##$TILT= no
##$TM1= 0
##$TM2= 0
##$TOPLEV= 0
##$USERP1= <user>
##$USERP2= <user>
##$USERP3= <user>
##$USERP4= <user>
##$USERP5= <user>
##$WDW= 1
##$XDIM= 8192
##$YMAX_p= 0
##$YMIN_p= 0
$$ End of Bruker specific parameters
$$ ---------------------------------
##NTUPLES= NMR FID
##VAR_NAME=  TIME,          FID/REAL,        FID/IMAG
##SYMBOL=    X,             R,               I
##VAR_TYPE=  INDEPENDENT,   DEPENDENT,       DEPENDENT
##VAR_FORM=  AFFN,          ASDF,            ASDF
##VAR_DIM=   8192,          8192,            8192
##UNITS=     SECONDS,       ARBITRARY UNITS, ARBITRARY UNITS
##FACTOR=    0.0002768,     1,               1
##FIRST=     0,             0,               0
##LAST=      2.2672688,     0,               0
##MIN=       0,             -1360614,        0
##MAX=       2.2672688,     1843722,         0
$$ Real data points
##PAGE= N=1
##DATA TABLE= (X++(R..R)), XYDATA
$$ [...]
45 -5548 6137 -6771 7451 -8210 9046 -9962 10964 -12082 13326 -14721 16292 -18075
57 -18075 20120 -22508 25307 -28677 32788 -37962 44684 -53826 66988 -87709 125230 -215169
69 -215169 951703 267070 -272039 1843722 415833 -919703 727503 1078998 -1012510
78 -1012510 -399554 871107 -544871 -1253342 449130 206496 -1237091 -389229 526045
87 526045 -833242 -994537 508829 224962 -807238 276215 918591 -302474 -218107
96 -218107 1062432 427468 -427695 541272 706496 -512601 -201464 700606 -61171 -552011
106 -552011 334696 245050 -642534 -264303 299734 -341791 -620105 36957 13320 -568112
116 -568112 -230724 360415 10588 -223204 425872 527457 -137847 49911 637896 125359
126 125359 -298320 360851 363372 -445631 -144228 492869 -125969 -457463 312935 201247
136 201247 -623814 -206478 361971 -360313 -588171 270345 115830 -632485 -10255 585414
146 585414 -214449 -299344 662602 296379 -533239 217386 604696 -436780 -322355 662316
156 662316 5218 -656345 368192 510221 -560729 -91146 739606 -214269 -621813 451297
166 451297 228498 -739573 -8407 585679 -420096 -452834 606449 165834 -591958 260830
176 260830 565135 -476066 -308711 570146 -91302 -645364 295702 390638 -540065 -98526
186 -98526 644721 -125660 -427906 492578 300893 -542137 6096 475221 -334802 -384096
196 -384096 444604 115363 -484715 146266 427817 -300373 -217665 415960 -11925 -476950
206 -476950 103654 254837 -364262 -178757 391501 5241 -308674 273797 348281 -250605
216 -250605 -60359 398696 -58904 -343940 204907 197538 -354757 -75119 366111 -88405
226 -88405 -291235 255580 173175 -372116 -75773 287859 -217466 -366131 211195 109317
236 109317 -367103 43561 408889 -122640 -190516 402506 176962 -337088 105229 353367
246 353367 -264506 -235268 369194 43028 -389533 170508 333667 -304095 -151654 388209
256 388209 -83775 -443901 158108 184321 -432866 -127553 370003 -141410 -323328 347969
266 347969 255132 -326007 71612 434490 -179199 -269017 353245 102404 -407905 95726
276 95726 360026 -255843 -187595 401404 32521 -386689 161924 263833 -376078 -199063
286 -199063 316339 -127423 -397946 220820 230674 -341093 -23315 424653 -84403 -261070
296 -261070 322058 178513 -366349 15965 352339 -190783 -238540 339905 114739 -330925
306 -330925 122412 337137 -240383 -209337 293208 -36420 -404298 89989 213827 -318037
316 -318037 -141713 347441 -19484 -281692 233157 240543 -285955 -52670 329625 -114152
326 -114152 -287033 238322 163884 -289651 45819 354216 -122087 -199023 291385 90039
336 90039 -335433 24581 220384 -267458 -222995 257290 11699 -302773 131819 259525
346 259525 -208858 -90459 309454 -26089 -289870 142653 174605 -261955 -60537 298691
356 298691 -47143 -203140 239600 188577 -230411 -5633 252858 -141129 -245106 166535
366 166535 56989 -297304 -1962 237053 -130959 -157262 240562 83085 -243385 57109
376 57109 218667 -178207 -168406 211659 22774 -243888 109415 240556 -156570 -82503 283464
387 283464 22731 -235776 124590 169379 -253225 -112076 245085 -62718 -249113 177140
397 177140 172693 -240095 -17937 290697 -103737 -244739 194016 89123 -314388 -1435
407 -1435 258838 -172609 -189371 286013 87396 -274255 112570 265897 -221126 -146661 284711
418 284711 -29171 -307395 155603 214423 -246790 -40629 332695 -58784 -236737 227535
428 227535 142236 -301768 -24284 240846 -186881 -226813 238474 70800 -272943 90738
438 90738 261133 -174157 -119445 267569 -7741 -276489 107275 170793 -224649 -64836
448 -64836 266373 -29762 -182681 196647 156999 -205428 -19246 200227 -127519 -209856
458 -209856 128850 37651 -236569 5288 189165 -96443 -111420 186948 62883 -176103
468 -176103 43857 161684 -121168 -116121 159398 41366 -148739 87965 192887 -78465
478 -78465 -60078 186944 31239 -174681 36931 102407 -176064 -128170 135101 -18823 -191348
489 -191348 70388 140877 -143488 -66173 192646 -18549 -195567 95691 126313 -181934
499 -181934 -44102 226667 -28291 -154064 191241 153103 -188155 5737 222543 -122268
509 -122268 -194190 170465 35693 -274124 29174 204586 -168778 -126151 246526 15264
519 15264 -240865 120405 185607 -220125 -83047 246660 -57483 -210708 200360 167741
529 167741 -208795 24615 272861 -99950 -173115 205888 47645 -282454 20577 178260
539 178260 -197501 -142053 218647 1409 -221901 120360 169962 -192437 -70508 205187
549 205187 -65406 -198514 136244 109777 -180344 15159 225592 -42024 -101477 180466
559 180466 80880 -170635 18265 138989 -127539 -137581 118718 14711 -163563 47143
569 47143 142398 -96154 -75560 142743 13694 -151762 36579 94005 -127132 -75940 137147
580 137147 16434 -113299 88657 137367 -80132 -32894 147809 -7769 -148936 49367
590 49367 81652 -140085 -64513 138084 -21268 -136150 98295 109568 -140706 -42145 147576
601 147576 -65824 -163664 102887 70866 -175072 3676 189514 -58514 -101514 181331
611 181331 73511 -168424 50078 167380 -130251 -111998 166387 3639 -184114 93563
621 93563 155941 -149232 -59325 191677 -40995 -188594 103743 83170 -214360 -43124 174648
632 174648 -89358 -146460 171004 81924 -173148 56251 191641 -117273 -105829 177204
642 177204 9200 -186633 78671 143493 -140106 -47311 194743 -8133 -144782 105945
652 105945 93127 -167905 -45419 134490 -85596 -159040 97538 59214 -147397 17533
662 17533 160762 -60927 -89824 138404 50807 -138920 28647 120642 -95080 -77048 137609
673 137609 34678 -112683 67565 123855 -83883 -53204 117537 -18939 -149312 27129
683 27129 63323 -128544 -65043 111660 -16604 -114523 81034 97087 -105778 -27954 131088
694 131088 -33613 -117294 91501 75339 -119917 6917 159229 -27323 -78873 129388
704 129388 61292 -132777 11522 115173 -99306 -112828 97642 6134 -150597 35433
714 35433 116760 -101685 -71094 130543 -1705 -142115 56293 93373 -127416 -46036 150543
725 150543 -10787 -106615 118697 107907 -107750 8751 150916 -56660 -115604 100116
735 100116 35966 -152077 3795 114480 -89404 -87963 123026 23575 -138786 32075 97688
746 97688 -111965 -76050 116826 -9630 -132627 67683 110239 -87421 -12324 157180 -4274
757 -4274 -101348 96029 79201 -122747 -20693 115453 -63882 -110712 96732 49060 -126240
768 -126240 8249 114150 -74198 -89732 96635 12680 -139542 15562 96438 -86956
778 -86956 -61783 124810 23250 -97153 75292 116207 -79637 -32988 125782 -14248 -113797
789 -113797 69071 69195 -116246 -23303 119810 -38975 -100043 83333 41738 -128986 -10158
800 -10158 94829 -78561 -99404 85327 23673 -111322 35824 115919 -59259 -44982 121592
811 121592 23157 -97784 52096 88875 -87291 -40365 113828 -5205 -94948 66517 73425
822 73425 -93959 -25507 95548 -45659 -109408 51265 33464 -112205 -14855 91038 -43968
833 -43968 -69326 90327 49018 -87016 15896 92727 -52508 -60949 88714 25715 -92956
844 -92956 30333 96104 -50426 -42158 100044 8805 -100348 29666 65134 -93722 -58543
855 -58543 79706 -23183 -102798 52486 69204 -85448 -18791 108347 -19666 -84660 75438
866 75438 54504 -99861 -1326 109187 -38182 -70526 99891 48503 -94901 26087 102526
877 102526 -69921 -72565 88384 1099 -121733 25525 72575 -97668 -52103 104361 -11110
888 -11110 -101695 63309 66827 -98585 -17277 110424 -32263 -85412 84806 56244 -88620
899 -88620 22348 113503 -41978 -60151 95453 26448 -101597 21521 74953 -81657 -61392
910 -61392 83200 -7882 -101548 36602 61523 -84144 -34581 85547 -22207 -87350 53904
921 53904 52760 -77885 -4870 94635 -17725 -52142 80514 52418 -68184 9149 78933
932 78933 -39339 -58226 61539 17625 -84608 5145 64676 -48770 -52745 60973 5401
943 5401 -87136 10528 55844 -61281 -47609 67140 6658 -67888 41960 74356 -44681
954 -44681 -16797 88434 5102 -66018 46640 54079 -70450 -20971 78214 -20981 -73905 50814
966 50814 40709 -80891 -12182 72816 -48026 -80213 55333 22981 -91213 7398 79381
977 79381 -47954 -47148 91956 29046 -74108 40659 81736 -59560 -29872 94349 -2340
988 -2340 -82611 49399 59580 -79310 -19942 83319 -33442 -84625 52614 30018 -96021
999 -96021 -11737 71590 -51736 -66976 69201 23892 -80952 23299 79735 -46211 -34332
1010 -34332 87264 14517 -69870 45196 71413 -54431 -20267 82267 -8703 -68314 47322
1021 47322 43416 -74677 -22192 61620 -34285 -70179 42324 24042 -78114 -7538 62989
1032 62989 -33832 -50463 58371 22566 -65772 16055 69440 -34108 -35041 69924 19892 -58391
1044 -58391 31251 65089 -44657 -29274 65309 -2262 -70646 23023 39679 -64827 -29942
1055 -29942 58672 -16682 -66247 34392 36541 -60314 -11023 66903 -20340 -55460 51359 37404
1067 37404 -56818 7142 74118 -23154 -38954 67502 29274 -62043 12697 58346 -47265
1078 -47265 -45352 56875 384 -76415 15456 44276 -59689 -32376 60802 -12421 -67941 33663
1090 33663 43162 -58295 -12687 70760 -11064 -49481 56438 44919 -53630 6423 72677 -22785
1102 -22785 -43642 58388 22445 -67414 8602 58583 -45000 -45711 51434 -523 -73145 14853
1114 14853 44463 -57750 -36178 58247 -3722 -59745 35279 48252 -49861 -12156 71396 -5023
1126 -5023 -48320 47663 41686 -53954 -764 68934 -22602 -48749 51419 22906 -65564 2444
1138 2444 52748 -46226 -50427 49226 3847 -72364 13729 49236 -48974 -29937 63862 1941
1150 1941 -55333 36378 50339 -45971 -8697 69815 -7974 -48994 46369 38561 -54527 -3674
1162 -3674 59202 -28460 -49844 46734 17038 -66955 -520 45683 -43170 -43548 48476 4994
1174 4994 -60558 17180 46482 -37870 -19415 59708 5808 -42986 34961 45627 -37991 -9577
1186 -9577 55379 -5976 -41726 34124 28976 -49253 -12022 44962 -22914 -49327 27181 14646
1198 14646 -56553 -7564 41879 -27041 -41663 36027 15239 -45951 10990 50537 -22040 -24517
1210 -24517 51819 20049 -37056 23158 50431 -28399 -21592 50808 4303 -50139 18519 34425
1222 34425 -46918 -26312 45508 -12093 -57969 22596 28967 -55248 -16659 49778 -21408 -49516
1234 -49516 41407 30126 -50760 7630 61997 -20187 -30960 58830 22283 -52483 17310 53986
1246 53986 -39106 -29934 54098 -1325 -62255 20957 39025 -53107 -25078 50276 -19970 -57888
1258 -57888 33869 28642 -57061 -5124 57245 -22546 -37010 54337 24833 -48784 16694 57208
1270 57208 -27907 -23288 55826 8725 -48346 22540 39751 -43122 -22918 41748 -14024 -52882
1282 -52882 18678 19956 -51029 -15977 40384 -16760 -39038 30290 21123 -39859 2048 45253
1294 45253 -13393 -24341 38406 22154 -29612 13996 44822 -14121 -19432 36355 12636 -35370
1306 -35370 5681 27464 -30414 -29583 24914 -1988 -44552 2460 25153 -31478 -23949 33294
1318 33294 2205 -38576 16926 32564 -26858 -11811 45693 3562 -31948 30339 37047 -30672
1330 -30672 -5654 47651 -7946 -36463 29740 20838 -48408 -10163 38242 -26749 -43405 30921
1342 30921 9656 -54276 3310 42000 -31164 -31680 43755 7435 -46455 24315 46794 -34117
1354 -34117 -12821 57521 1793 -39328 38580 35096 -45168 -5973 48964 -21203 -42550 35676
1366 35676 13333 -55881 697 40125 -35648 -36967 37251 1491 -51926 13729 35700 -36159
1378 -36159 -16664 50814 2305 -34564 33550 34755 -32711 -1892 48988 -11653 -34026 32126
1390 32126 18415 -39861 2325 36898 -23166 -32144 28126 5230 -43028 795 23518 -31124
1402 -31124 -25749 28967 3766 -31999 15304 32399 -17992 -7224 37486 6583 -24981 18985
1414 18985 27241 -21711 -9071 31911 -1699 -27895 16624 20843 -28060 -12206 23618 -12022
1426 -12022 -34778 11599 10427 -35787 -11727 27138 -10188 -25539 24142 18626 -27430 4661
1438 4661 38959 -8425 -19851 32363 16519 -29868 9437 37578 -17885 -21580 33674 7000
1450 7000 -38582 8470 26702 -35166 -24623 31482 -7066 -41396 16024 23826 -34674 -8487
1462 -8487 41495 -8484 -32866 31025 23667 -33992 2875 43904 -14761 -24677 40590 17616
1474 17616 -36931 9810 35532 -29670 -24654 33992 -4649 -47326 11143 23472 -39202 -14536
1486 -14536 38794 -10590 -36061 26524 22013 -36287 -1647 38810 -15547 -25639 36652 19270
1498 19270 -29956 13465 40876 -16173 -16629 34467 4071 -36218 8660 19511 -32773 -19223
1510 -19223 26263 -8278 -33329 16298 19641 -28925 -9850 26399 -10017 -25942 19383 15381
1522 15381 -25695 2132 32047 -2589 -11944 28923 17272 -19609 5629 25927 -13341 -20521
1534 -20521 15874 3355 -28056 -3 19518 -16949 -19432 17359 2441 -27023 2439 17699
1546 17699 -19764 -17030 22591 6143 -21345 13538 28177 -11353 -4743 30420 5820 -21875
1558 -21875 13472 22304 -23050 -11243 26519 -6626 -29416 15977 16952 -30305 -9420 25039
1570 25039 -15782 -31320 18241 10283 -34802 -57 32564 -14822 -16869 36774 13846 -27987
1582 -27987 15657 34582 -21123 -14278 34419 -1519 -33429 19478 25627 -31699 -7958 35360
1594 35360 -13093 -33920 20530 9624 -41728 -6197 27723 -22777 -27940 29416 8516 -31024
1606 -31024 16626 34747 -20064 -10944 35743 1124 -29077 19768 23433 -27621 -4201 34106
1618 34106 -5892 -22352 23559 12059 -31004 -2764 21113 -21634 -27108 15788 957 -29505
1630 -29505 5632 22854 -14565 -10186 25497 6241 -19070 12026 18796 -15811 -6718 23578
1642 23578 1981 -15659 14286 17909 -13307 -2862 18643 -4330 -21536 3270 5704 -21299
1654 -21299 -12148 12430 -7677 -18451 9964 13149 -14313 -4510 19593 -2546 -15648 14220
1666 14220 14719 -15422 -752 26342 232 -12676 21085 15065 -20513 -1094 21158 -13615
1678 -13615 -23528 14439 3308 -31394 792 21349 -19474 -17092 24271 1762 -29468 9326
1690 9326 20795 -24755 -12000 30511 -242 -24264 23164 25275 -22357 2449 35319 -9372
1702 -9372 -23236 25038 8776 -33506 1458 24222 -23543 -20446 27964 2839 -29257 13280
1714 13280 21637 -26847 -11119 28579 -7447 -28094 19138 16756 -24576 3872 33316 -6767
1726 -6767 -14670 27677 11597 -25890 5785 19668 -21909 -16422 19843 -2366 -26532 8980
1738 8980 14966 -21254 -8592 19018 -8006 -23010 8687 9212 -19499 -2722 19021 -3084 -9518
1751 -9518 18965 15219 -9833 5527 18088 -3835 -10136 12488 6417 -14489 -717 13143 -5668
1764 -5668 -10929 9826 4511 -17332 -3773 10389 -10696 -16579 6558 2907 -14994 1248 16933
1777 16933 -4089 -8922 16819 9377 -14181 3753 17219 -10356 -11139 17646 4963 -18440 7054
1790 7054 18943 -13979 -9760 19740 -2619 -25844 6177 11717 -24263 -8839 21192 -6410
1802 -6410 -20018 20909 17062 -19286 4812 28089 -10472 -15653 25172 7092 -24653 8143
1814 8143 23858 -17204 -10593 26731 -17 -26336 11577 13990 -28224 -12720 19572 -14384
1826 -14384 -27149 14295 9008 -25731 2567 26082 -11358 -12352 24800 6896 -21655 11489
1838 11489 21607 -14483 -6494 25565 808 -15734 16739 16573 -18010 -3755 17611 -9404
1850 -9404 -19920 9791 3214 -23117 -3783 13995 -11254 -12234 14350 3461 -15854 3236 13178
1863 13178 -8776 -7669 15761 4381 -10440 8504 15171 -5224 -2867 14424 3095 -12432
1875 -12432 2323 5535 -12611 -10119 7579 -1787 -13619 2671 7727 -10080 -6389 10715 -1475
1888 -1475 -13533 3366 11057 -9111 -3668 16694 4313 -7228 13323 16234 -7726 -1915 17621
1901 17621 -3168 -15206 8272 7169 -19174 -5442 13693 -8743 -15824 12001 5108 -21727
1913 -21727 -196 14216 -14943 -15361 15895 2377 -18541 9342 20535 -9943 -3220 26739
1925 26739 1848 -15805 15908 14428 -17949 -3061 21038 -9398 -18493 15696 5158 -22250
1937 -22250 1180 16862 -16137 -16318 14830 -2327 -23929 5554 13983 -17407 -5473 22756
1949 22756 352 -14075 16707 15121 -14546 2400 22521 -6148 -12154 16225 5600 -16733
1961 -16733 4513 15108 -12465 -10827 11931 -2428 -19181 1631 7103 -16557 -8244 11212
1973 11212 -2896 -12652 9019 10051 -7724 557 14347 -506 -8039 9785 8701 -6701 1414
1986 1414 12719 -1283 -7126 8689 5888 -8843 -3612 4963 -7600 -12207 1736 915 -11699
1999 -11699 -3919 7853 -3736 -7584 8544 5724 -8317 925 12158 -1639 -5788 10174 7625
2012 7625 -8407 4260 14413 -3069 -6873 12154 3516 -15125 1146 8242 -14120 -11501 10321
2025 10321 -2196 -16866 4035 10958 -14262 -5072 16340 -3065 -14428 11218 10797 -13995 1677
2038 1677 19261 -4500 -9802 18345 9318 -14593 4969 16223 -12903 -10563 15000 -2042 -21284
2051 -21284 4822 8871 -17807 -7198 14612 -7652 -16738 10978 7818 -16915 281 16396
2063 16396 -8193 -8440 18403 7657 -12646 8393 17257 -7783 -4013 16191 -315 -13580 6990
2076 6990 7898 -13501 -5212 10860 -7102 -13153 6446 2274 -14271 -2818 7686 -7755 -8841
2089 -8841 8729 3653 -8685 4285 11302 -2020 -1945 11693 5034 -6441 4831 8872 -4305
2102 -4305 -4218 7193 804 -7323 167 4489 -6922 -6391 4461 -1297 -10236 -1707 3987 -6146 -6324
2117 -6324 6451 3102 -6685 4343 9925 -2559 -2488 12604 4540 -7708 5094 8780 -6750 -3479
2131 -3479 10194 -831 -11375 5262 6056 -13165 -6054 8512 -7680 -14217 6173 3746 -15782
2144 -15782 -544 13189 -7543 -7151 14521 5040 -11015 8333 15266 -6955 -2934 16722 2281
2157 2281 -10340 11183 11062 -13159 -2502 12806 -7485 -14398 8178 1941 -17623 -2112 11201
2170 11201 -10833 -11147 11139 166 -14644 6239 11352 -11472 -3184 15474 329 -8762 11359
2183 11359 9794 -8985 1596 13502 -3551 -8284 9243 2350 -11672 -508 7700 -9148 -8817
2196 -8817 7019 -332 -10493 2460 6134 -7901 -3714 8419 902 -6917 5558 6621 -4059
2209 -4059 879 10417 1828 -2311 5770 6686 -4496 -720 5480 -1884 -7738 1073 1068 -8737 -4889 3242
2225 3242 -4683 -9035 989 3307 -6542 -3419 6893 -1166 -5392 5767 7065 -4781 1126 11015
2239 11015 535 -3353 8995 7011 -6029 508 9283 -3776 -7655 6858 1792 -11125 -865
2252 -865 5956 -9542 -9405 6970 -855 -12983 3129 7389 -9804 -3503 11989 -285 -7867 9710
2266 9710 8952 -9370 1631 13696 -3196 -6322 11134 4050 -10538 3361 8392 -8517 -7002
2279 -7002 9511 -1911 -14468 2742 5236 -12073 -5862 9902 -3982 -9889 8375 7400 -8159
2292 -8159 2310 11258 -3620 -4712 9494 4727 -6419 4101 9687 -5312 -3387 9464 -425
2305 -425 -9714 1869 3070 -10466 -5090 4904 -4569 -9771 2190 3129 -7393 -1342 7378 -2937
2319 -2937 -4512 5761 5793 -3486 2412 9210 974 -2104 6896 4615 -4923 819 5748 -2777 -4662
2334 -4662 3399 431 -7780 -1313 3345 -5066 -6294 1652 -405 -6805 -24 5018 -4164 -4207 5894
2349 5894 3583 -3778 3922 8230 -1839 -428 8244 2195 -6694 2980 5004 -6570 -3128 6592
2363 6592 -2613 -7655 2865 3197 -9338 -4057 6090 -4620 -8058 4148 3363 -8194 680 9935
2377 9935 -2143 -3144 10259 4599 -5861 4725 9170 -5112 -3167 9371 -209 -8820 4449
2390 4449 5321 -8504 -3297 6558 -4919 -9093 5110 1201 -11643 -1678 6230 -5494 -4840 8507
2404 8507 2230 -6314 3867 9088 -3408 -808 9507 449 -6906 5071 5823 -5813 -785 7652
2418 7652 -2116 -5747 3790 695 -8966 -2959 4634 -6304 -6603 2678 940 -6066 2707 5245 -3194
2433 -3194 -2129 6896 2290 -3708 4065 5194 -2471 -860 6787 1528 -3086 3436 4060 -2603 -2772
2448 -2772 3843 -2197 -7599 -1441 -309 -6409 -3232 2658 -744 -5035 2863 4022 -3782 -713 4432
2463 4432 735 -3996 4944 4718 -1608 1524 8330 1219 -2630 4809 2873 -5161 -1515 3973 -4645
2478 -4645 -7289 2501 -665 -7929 -667 5075 -5294 -4778 4858 -394 -6434 3079 5602 -5791 -1699
2493 -1699 8231 958 -3873 7386 6960 -4209 844 8665 -1700 -5594 4958 1245 -8354 -639
2507 -639 4214 -6399 -5756 4929 202 -7601 1461 4173 -7477 -3407 5948 -546 -5427 5199
2521 5199 5399 -3410 2197 9303 -69 -2370 6716 3421 -5844 196 4228 -5737 -3837 4770 16
2536 16 -5909 881 2612 -5902 -5130 3620 -1742 -6274 921 2480 -4578 -217 6168 2589 -818 6252
2552 6252 4769 -2125 1061 4289 -1557 -3837 2732 1805 -3210 417 3239 -956 -2811 1725 -279
2567 -279 -5664 -2953 1169 -4645 -5393 1393 1475 -3367 1427 5356 369 -15 4912 2028 -3049 1649
2583 1649 4733 -1869 -2483 5185 1344 -3757 1983 4550 -4042 -2296 3745 -2930 -8464 -763 -59
2598 -59 -6435 -2054 3946 -307 -3009 5074 3569 -3607 1462 6346 -2702 -2413 5820 1638 -3964 3010
2614 3010 5563 -2249 -869 6868 249 -6253 1317 1213 -7137 -3796 1579 -3702 -5863 2995 2318
2629 2318 -4036 209 4998 -1610 -3145 4631 1476 -4297 2452 6306 -1589 -688 6884 2126 -3047
2644 -3047 3177 3088 -4146 -2911 1965 -2641 -6665 24 589 -4701 -832 4461 -1256 -3128 3277 1363
2660 1363 -4011 -273 3088 -2386 -2204 4280 3319 -2008 3218 7171 445 -1445 3226 408 -4490
2675 -4490 -548 1076 -5040 -3303 2256 -622 -3515 913 2188 -2947 -1158 2784 -2248 -4802 826
2690 826 1889 -2619 575 7017 1808 -122 5216 4516 -1101 438 3562 -2192 -3210 665 157 -4813
2706 -4813 -586 3555 -2273 -2610 2790 -573 -4513 -915 2008 -4239 -2660 3520 -227 -2293 3698
2721 3698 5614 -256 629 6596 330 -3387 2833 2406 -4455 -1740 3675 -1485 -3296 3482 1659
2736 1659 -4339 -1135 2128 -4563 -4743 601 -691 -4747 1787 4120 -1882 -781 6226 2457 -1842
2751 -1842 4240 3607 -2505 -505 2823 -665 -2494 3205 3409 -2026 51 4682 -1761 -3507 1267
2766 1267 -1855 -6128 -1654 766 -4036 -2191 2838 1961 -807 2088 5658 -791 -15 3067 1062
2781 1062 -2894 1485 2197 -1439 -550 4360 974 -2422 2499 1630 -4084 -2996 708 -4421 -4961 -311
2797 -311 -821 -4489 -376 3614 -1121 -981 5530 2048 -2250 246 2092 -2274 -1049 3386 1574 -761
2813 -761 3502 4221 -785 220 3112 -1576 -4079 -906 -518 -5360 -2137 1356 -721 -2548 2746 2416
2829 2416 -2231 619 3475 -2387 -3167 1603 193 -1700 1132 4155 806 470 5301 1631 -2279
2844 -2279 393 1704 -3889 -4214 576 -1570 -3761 -135 1565 -2094 -817 3121 -574 -3161 2137
2859 2137 814 -4034 -814 3141 -356 106 4356 4434 -6 2437 4777 -1491 -2290 1956 -1015 -4459
2875 -4459 -719 1180 -2912 -2212 3525 -770 -2779 1238 1725 -4201 -2878 738 -1333 -3655 1568
2890 1568 1868 -1063 1835 5583 1171 328 3190 1631 -3127 -919 1422 -2372 -2721 2106 -296 -2660
2906 -2660 928 1976 -1735 -1906 1408 -2376 -4564 -1188 82 -2849 -742 2929 614 314 2664
2921 2664 3365 -789 1297 3253 -960 -2090 31 1404 -2551 456 3005 -825 -408 1675 311
2936 311 -3973 -2234 -413 -3670 -3197 441 -594 -1411 1086 2441 536 390 4166 686 -2043 742
2952 742 1236 -1337 -799 2521 599 -1676 2064 3499 -1763 101 1594 -1973 -4070 -336 -1624 -4561
2968 -4561 -1838 1188 -2305 -692 2640 1848 -1430 1958 3439 -898 -1504 1409 587 -2228 1164 4084
2984 4084 -34 1271 4379 -265 -1315 919 838 -3857 -2825 545 -1895 -4048 228 1196 -1498 695
3000 695 1888 -1235 -1646 1526 943 -3392 24 1822 -705 690 4239 2169 453 3604 3455 -2467
3016 -2467 -1101 1477 -1711 -4671 -424 -718 -3345 -277 1914 -626 -851 1522 276 -2659 -684
3031 -684 695 -3539 -2099 2199 718 -730 3182 3817 1434 1525 3326 -960 -2502 12 463 -3053
3047 -3053 -1588 402 -1039 -740 986 328 -996 -264 985 -2578 -3165 -65 -991 -1876 -30 3201
3063 3201 1699 1392 3786 2375 4 949 1077 -883 -1290 -213 -1079 -2314 -740 2055 -746 -93
3079 -93 755 -584 -3552 -1162 -1066 -4063 -2567 -498 -734 -1431 2212 2964 814 1900 4663 1183 -1221
3096 -1221 955 1297 -2358 -461 2318 -959 -852 2293 1774 -577 -180 1887 -2882 -3201 478 -1558
3112 -1558 -3765 -447 1331 -1591 401 3914 1841 -661 2243 1791 -2230 -134 1102 -1564 -1716
3127 -1716 2462 1473 -898 1848 2697 -522 -1474 2100 -1524 -4118 -1901 -220 -2812 -1255 1041 -81
3143 -81 -1150 1839 2534 -466 595 2325 -357 -1721 1034 1063 -1205 1651 2964 371 99 2364
3159 2364 206 -1434 780 315 -2945 -3525 -472 -1733 -2077 -696 1336 -652 -319 589 -54 -1876
3175 -1876 -497 878 -1728 -577 926 578 669 3348 2146 2163 375 906 216 -1929 -911 -1002 -2861
3192 -2861 -2158 376 -834 -2019 749 1473 -887 -574 1282 -953 -3218 413 366 -2077 -148 3657
3208 3657 697 1248 3714 1252 -408 1091 1886 -2385 -1257 345 -721 -1826 692 1014 -2501 -266
3224 -266 2218 -880 -1892 -54 -269 -3802 -1027 876 -1484 -343 3128 1627 -129 2986 3175 -1361
3240 -1361 -999 1749 -1251 -2458 -320 903 -1012 11 3183 -349 -1004 2277 295 -1780 -583
3255 -583 -751 -3004 -2408 167 -21 -935 1853 1814 133 938 3769 945 -1169 389 -226 -1026 -767 1141
3273 1141 -75 -918 1661 866 -1195 -256 665 -1029 -3109 -808 -1065 -2184 -554 42 1659 -388
3289 -388 2538 1588 724 947 1165 594 -959 326 -77 -659 -54 2154 651 699 1593 -44 -962 -770
3307 -770 -486 -2147 -2944 -1572 -1724 -1160 -28 1585 -182 131 2700 842 -982 930 813 -1444 -1380
3324 -1380 2366 693 -907 2353 1624 830 1384 2646 -818 -2025 -989 -887 -2265 -1059 -265 -589
3340 -589 -326 2530 985 -710 1170 1247 -2484 -1251 883 -826 -1427 1872 1580 309 1413 3732
3356 3732 521 69 1837 -174 -2425 -1121 -152 -3371 -1297 358 -103 -1259 873 961 -885 -441
3372 -441 407 -1964 -2170 265 -359 -1561 1012 2249 969 1560 3333 1398 -1013 -327 871 -953
3388 -953 -1621 -190 -896 -1581 -577 787 -901 190 71 -983 -1763 -276 -925 -468 -1030 820 897 -214
3406 -214 1573 1561 900 1140 1285 1317 384 -389 -62 -1462 -1377 -376 478 -238 13 933 465 -972 422
3425 422 -1043 -2338 -985 -901 -2221 -912 646 517 -99 1836 1689 -653 546 553 -1011 -656 1011
3442 1011 -671 -2721 1110 1273 -89 71 855 145 -2195 -588 -1745 -2707 -2413 904 -837 -2142
3458 -2142 1626 1696 -120 1710 2050 161 -655 2696 666 -1354 427 693 -1273 58 3056 479
3474 479 -83 2358 628 -2123 -957 -437 -2512 -2476 -533 -773 -952 204 989 -564 -246 947 747
3491 747 -1479 1080 761 -136 561 1525 -361 889 2232 1528 274 233 256 -588 -1649 -879 -1351 -1330 -289
3510 -289 -558 -1065 483 700 -92 -71 460 -185 -756 -625 -321 302 -672 -54 1963 1206 812 1479 1114 712
3530 712 -761 482 -1352 -2574 -495 -799 -1025 95 1338 456 236 774 934 -647 66 -628 -129
3547 -129 -1361 547 396 -735 2002 1683 109 370 2873 459 -1393 549 127 -2691 -210 961
3563 961 -966 -1150 1730 1341 -708 851 278 -2058 -1860 647 -360 -1902 739 445 -251 1038 2314
3580 2314 1127 -293 2088 1494 -1477 283 199 -1147 -1352 1337 -151 -948 -249 745 -1806 -1019 -1040
3597 -1040 -1095 -2287 -236 -533 -1391 1051 825 330 391 2777 1505 135 887 1212 -1052 -1417 -379 -1293
3615 -1293 -707 -43 1199 -556 -90 94 -467 -162 -185 -981 -721 -1360 -723 -395 -1207 470 1663 327
3633 327 1102 1002 -589 61 27 51 105 -813 968 270 357 476 -203 801 26 112 -575 -2117 -1117 -337
3653 -337 -1119 -1291 -120 278 -807 1088 1534 -546 -358 1017 243 -1396 501 1965 -349 -279 1747
3670 1747 114 61 1681 689 -1274 -628 -181 -1685 -1605 926 -1540 -1879 -350 1185 -1477 59 2161
3687 2161 -414 -1701 834 4 -1498 356 1228 -1228 -498 1695 952 -150 1638 908 -1254 19
3703 19 247 -1419 -983 -936 -976 -2448 197 611 -109 -439 1162 -309 -450 -371 -255 -1440 -659 799 509
3722 509 34 1177 1611 -61 1569 1327 -317 -466 160 -1355 -1294 -452 400 150 570 -151 64 -524 -879
3741 -879 -693 -459 -1240 -235 -1124 -378 454 1341 1054 1518 1316 1675 897 -458 225 -286 -1010 66 624
3760 624 -316 -210 1330 1133 -693 1316 -61 106 -766 12 -1130 -3017 -249 613 -1184 -347 2045
3777 2045 158 483 1095 481 -746 1084 46 -479 -643 1010 27 -1496 1476 552 -618 -44 457
3794 457 -1487 -756 173 -47 -1909 -919 -141 -409 274 2466 231 68 1361 913 -753 -191 133 -168
3812 -168 -525 941 496 -306 1145 24 -206 -1976 -176 -501 -2028 -918 -603 -1462 -531 -44 -131 318
3830 318 413 1125 -497 360 487 -861 -630 1545 307 227 1002 799 556 1420 1897 72 100 517 -365
3849 -365 -1720 -1274 569 -103 -719 48 -57 134 271 254 441 -486 212 -493 -144 -145 -735 1628 -330 1330
3869 1330 510 1449 405 461 -505 -67 -1315 -677 -359 -1280 -451 1146 -928 80 237 -824 -443 846
3887 846 626 -1051 -405 54 -429 -888 1589 -46 123 1275 1369 761 212 969 -1229 -1027 725 -434
3905 -434 -898 195 162 -945 -137 1231 -184 -453 641 -88 -1069 853 -24 -481 67 1145 1312 5
3923 5 1187 1883 -557 410 592 248 -1196 -193 24 -1428 -388 849 -295 -572 191 -1097 -383 -808
3941 -808 -192 -804 -1604 672 -865 -265 1411 1307 -245 -14 482 35 1234 -343 -441 -318 -714 671
3959 671 95 27 1183 296 -764 255 -131 -761 -1635 -1012 -772 -785 -377 431 616 448 1046 710 207 344
3979 344 921 1118 490 -160 -355 619 -622 394 1101 866 317 -331 -237 -1985 -378 -589 -1322 -646 -1578
3998 -1578 -671 12 1373 -175 -16 897 965 -29 -406 1570 -1255 167 407 1178 346 677 1696 43
4016 43 101 304 -882 -592 -192 -566 -1263 -1161 -371 -975 -367 78 -742 -1810 873 889 190 610 1279 -1015
4036 -1015 -665 1415 427 -214 893 1041 -225 -327 1954 806 -559 -49 130 -717 -307 1222 -416
4053 -416 -993 1197 -276 -44 1567 -299 505 -641 -14 -554 -773 -259 964 -161 57 882 1236 -463
4071 -463 485 64 -1068 -666 -603 -638 -1218 -565 -636 -481 -145 -38 -978 -426 -648 -536 -128 -49 317 -40 475
4092 475 874 887 1223 1404 771 1103 -166 -240 163 -253 -476 -39 -345 -612 207 373 -501 -931 -503 -401
4112 -401 -595 -1484 -421 -1520 122 427 -425 -775 339 512 -739 380 72 -334 -7 441 73 373
4130 373 717 1421 -450 -462 1046 -992 -127 326 -358 -321 -589 -805 -614 -1067 14 798 992 623 819
4149 819 351 751 1278 984 358 520 478 -300 -657 1336 -538 -698 903 -423 -1660 -1770 -868 -1865 -880
4168 -880 -98 -331 -854 -548 17 -135 -452 466 273 142 505 392 173 103 329 -399 462 753 1100 -157
4188 -157 -174 457 451 -53 -1260 -1024 -1390 -977 -401 263 -329 244 1220 16 -635 -213 14 -609 -376 266
4208 266 459 758 467 304 543 444 794 -297 463 -478 565 -1180 -169 360 -820 -50 -738 -677 -437
4227 -437 279 -783 -728 28 141 -144 -543 217 917 -300 1345 450 -381 889 1205 -280 -390 105 320
4246 320 299 -586 -64 -480 -131 -254 295 415 -639 -807 -747 -851 414 -625 406 61 484 268 704
4265 704 608 539 96 563 875 -380 499 835 -847 -729 147 595 -158 -518 -310 -299 -261 -111 -510 -211 -98
4286 -98 -602 219 -661 404 450 647 784 330 489 815 1363 4 99 -426 464 -133 -232 291 -567 -811 -283
4307 -283 -495 -18 -124 235 -1632 -718 37 -473 1020 124 216 267 -34 637 -271 796 -440 798 455
4326 455 -173 495 -337 387 -106 -366 -595 -87 -1022 -623 -627 -501 136 -1240 524 -567 -568 -465 -203 136
4346 136 -112 511 591 -372 69 552 777 128 -100 320 261 -102 1094 -555 -720 -720 -32 -1085 -617 -500
4366 -500 -405 -790 93 724 -411 -490 -236 -214 -423 -370 1225 811 260 71 239 622 945 1782 516 1324
4386 1324 943 141 -1109 524 -477 -1246 -257 7 -725 63 -720 -1039 -664 -176 -232 269 445 -272 424
4405 424 -636 653 384 406 -35 341 -374 -300 633 515 -267 384 -847 -501 -901 -531 -419 -1249 159
4424 159 -1206 36 207 -361 -739 -1228 -28 207 608 -431 411 1561 314 768 1197 620 -409 148
4442 148 1029 165 550 -545 -13 -162 493 -843 -630 124 -94 -1202 -1091 149 -504 -544 67 -365 -654
4461 -654 907 764 -11 230 614 30 -135 830 586 332 836 606 -100 -403 -419 -702 -152 -817 164 -1052
4481 -1052 -231 76 -203 -452 981 -712 64 -317 73 317 594 573 175 -96 290 605 709 486 163
4500 163 -228 -468 177 836 363 -872 455 -1189 -257 -122 2 -1059 -450 -353 -118 -303 331 1112 120
4519 120 43 531 527 -120 759 -231 323 125 734 450 148 206 -644 -11 -542 -526 403 366 253 -813 -432 -348
4541 -348 -23 593 -1448 79 -108 -660 178 1117 302 854 445 1205 556 931 576 164 308 -129 480
4560 480 157 -681 -663 230 -710 420 -1463 -396 -257 -89 -358 -962 330 -369 -679 256 875 -225 -148
4579 -148 792 -227 -403 -301 1181 633 768 475 -226 -194 386 129 262 -174 -539 -575 -640 148 773 -513
4599 -513 -404 663 197 -175 469 -349 -625 460 -265 97 463 103 383 734 1548 717 277 148 28
4618 28 -347 83 -574 -532 -877 60 -256 -1445 531 -198 -352 -13 382 -127 -127 -96 935 -797 982 333
4638 333 1151 64 -28 1548 159 127 -321 -783 85 -711 104 -229 -1041 431 43 -492 665 98 -1596
4657 -1596 -684 181 118 1065 378 0 56 -18 661 487 9 367 271 -658 332 1613 -462 1086 -386 -756
4677 -756 576 -1492 -113 -285 409 116 -8 -169 -805 -1318 109 -348 474 -288 -831 341 615 68
4695 68 83 199 -132 63 471 -99 681 539 11 -407 -779 545 576 81 -1250 -448 -392 -1199 472 -517
4715 -517 -46 -747 -61 167 -20 867 744 378 225 1180 -67 150 -21 444 -424 146 226 431 -736 -450
4735 -450 -45 -286 161 -268 -757 -477 73 903 -192 -460 83 785 819 1045 -81 -264 132 -253 196 -156
4755 -156 1323 -593 -356 425 -327 -3 43 -277 55 -847 -478 -680 485 -684 -583 -1381 431 -451 -537
4774 -537 -170 -738 -612 -943 918 -30 -120 -63 295 -1249 329 1157 303 250 -61 -239 -628 -195 -328 -126
4794 -126 -813 -323 -77 -575 250 312 47 -434 652 716 -820 499 36 547 619 560 779 4 -177 1466
4814 1466 -52 256 605 -195 26 -245 -329 -112 -528 -246 670 -201 372 3 -810 445 60 -448 -632
4833 -632 -334 869 -537 506 816 648 463 693 793 376 28 -219 721 -692 -248 -29 -830 -965 -498
4852 -498 -3 -207 -93 -9 -238 -267 -21 37 -1308 564 998 -190 -344 320 426 367 391 -383 603 12 346
4873 346 751 -97 -164 40 -496 342 324 -222 154 -400 -1241 -58 -297 -137 -291 -265 -287 657 160 482 946
4894 946 31 -92 395 -215 72 410 356 -548 119 261 490 71 1170 -43 -221 -730 -120 -360 -941 -908
4914 -908 -533 662 517 650 -195 -218 401 570 148 742 828 446 1013 9 -707 201 244 -714 258 101
4934 101 -911 267 -807 -172 -995 220 -610 -17 -632 354 368 822 -264 367 -178 -367 45 635 -677
4953 -677 96 -17 -124 -95 -61 668 -778 -369 -539 355 -531 197 -98 -576 -312 -29 306 628 -393 -31
4973 -31 231 251 204 277 584 -272 -262 -211 377 224 96 -1167 598 -103 -174 -673 112 -725 -507 531 -780
4994 -780 -177 169 375 -382 -247 13 -307 -332 245 795 331 150 648 716 358 569 737 870 1082 301 -363
5015 -363 153 467 -664 -9 -127 663 -284 -518 28 -200 -189 -831 -43 -875 -50 -1234 136 -524 -228
5034 -228 -301 346 336 351 -148 559 683 204 96 -88 278 -881 -107 -193 -516 398 -758 -625 -48 -681 559
5055 559 -401 -543 90 -751 -427 252 446 241 6 -324 184 -49 492 900 -294 346 -365 -173 33 -1067
5075 -1067 274 500 -266 -511 28 273 -161 -17 -431 -428 76 -540 394 -498 -308 44 -710 47 605 242
5095 242 -395 907 411 335 -174 -334 416 -184 1153 -121 -782 -307 -468 -555 -549 -523 -1492 -443 -706 -280
5115 -280 -353 838 -153 -374 599 524 571 -38 -26 -99 180 -400 -601 -379 771 -55 167 228 -137 -830 -706
5136 -706 -210 -635 -886 -260 -254 -449 -1426 -480 -326 427 201 611 -107 -496 1126 -188 575 32 652 522
5156 522 525 -179 -1224 -937 -189 -92 591 50 339 -767 -695 -683 -246 -326 -172 -607 66 -552 492 -421 -992
5177 -992 147 489 -402 476 615 428 -119 3 377 -485 -159 -867 262 72 -281 76 -734 60 369
5196 369 -18 -820 -332 384 -431 -557 -1073 200 -326 -81 463 715 670 967 756 685 586 154 65 126 1208
5217 1208 284 -848 553 -97 295 -595 395 -424 -1086 -669 -722 160 -520 147 90 341 721 292 -358 157
5237 157 1109 978 -566 322 922 906 495 203 93 149 659 -497 -527 -883 -97 47 -1086 -1015 227 -561
5257 -561 -302 -561 -1133 -181 607 1031 356 -338 160 715 466 800 -147 -489 911 259 549 125 362 651
5277 651 -91 -206 242 -446 -687 357 -326 -519 -324 -191 975 30 -333 159 894 190 121 -1057 49
5296 49 889 -66 -190 -566 285 16 120 -61 -79 -192 -498 -595 -441 -14 -23 -567 -422 -234 1133 -490 526
5317 526 -266 -201 -526 -516 279 -89 492 81 -254 915 752 -649 44 -17 748 -657 691 729 -28 -62
5337 -62 645 -1677 -287 479 -680 -87 704 258 -682 415 -227 -402 -83 -348 425 802 546 -220 -17
5356 -17 101 310 411 -482 12 734 95 -90 640 -472 -826 68 -55 -577 173 129 185 -235 -459 652
5376 652 -493 -7 564 193 -318 335 1163 -677 -863 254 23 -960 592 -137 -125 94 -36 736 285
5395 285 -334 67 873 -569 480 270 250 78 1231 6 -403 -538 1304 -342 542 -456 -101 66
5413 66 -38 823 33 -703 387 101 -352 301 -192 -894 -595 -45 -342 390 -333 579 -989 414 195
5432 195 -390 228 427 6 -274 929 -562 286 -764 140 -627 -59 251 68 455 1237 -624 -420 -515
5451 -515 -784 -955 -293 -42 -784 -770 89 76 -541 12 587 372 -668 593 174 379 640 51 118 224
5471 224 -311 -151 -412 -19 -315 -214 129 136 -544 -606 -583 -80 -911 433 561 628 -336 -435 -650 641 1143
5492 1143 567 443 88 -291 -541 -87 -190 -301 -788 638 78 -878 -49 -467 553 -68 -945 -24 -411
5511 -411 -828 68 595 -239 -415 -10 -366 413 550 148 450 -846 730 1109 227 -340 -410 548 216 121
5531 121 -176 -437 -823 20 -57 -16 -44 -401 377 -891 413 -678 -1238 -508 -146 756 168 727 -124 68
5551 68 72 791 990 1019 733 -355 -282 -598 24 176 156 -393 -86 -324 -523 -274 -651 48 239 -308 112 354
5573 354 -330 -44 420 0 90 623 860 589 344 160 -644 -34 -743 532 49 335 -423 -771 -387 464
5593 464 -414 -244 -147 -687 -467 124 -953 -237 -233 -363 8 185 532 211 669 144 388 198 -26 658 1162
5614 1162 -352 618 -75 -653 654 -818 -221 179 -1040 323 -89 -111 35 396 -133 -170 1108 527
5632 527 -836 204 298 -444 660 568 681 146 151 291 63 321 -92 697 -542 503 811 -594 -633 -167
5652 -167 -469 -775 54 -474 -720 1 -1057 -90 349 -46 -99 794 769 1069 176 472 646 -180 451 562
5672 562 -103 -496 -530 713 4 -556 -12 73 -477 215 -513 -32 33 -555 -1161 -440 -357 158 413 -31 84
5693 84 -350 204 462 160 -899 20 796 -39 711 238 -692 81 -1030 4 -141 -137 306 -763 -785 160
5713 160 299 179 -384 -141 -906 86 171 -421 54 247 342 728 387 -563 155 -334 -108 -147 -147 216 317 -371
5735 -371 338 305 -596 -824 -658 -946 -914 -280 -64 487 191 704 344 230 294 -26 -506 -519 673 342 277
5756 277 695 -130 -130 684 411 120 -68 -494 32 -500 -122 -588 190 -468 -723 349 221 -203 -344 -577
5776 -577 303 -149 1005 1138 -259 191 644 132 198 928 -188 65 -534 348 -56 542 -503 -190 -549
5795 -549 -14 233 985 -56 594 -649 -60 -1174 -1019 -754 215 16 -372 153 575 590 -369 768 341
5814 341 -395 -521 -193 795 -388 -789 -383 -1024 -387 -105 -444 -100 -271 -1170 -1509 286 822 470 131
5833 131 332 456 782 742 133 152 805 298 89 -58 214 -814 -704 646 -45 -687 484 45 -121 -300
5853 -300 -749 -355 -290 -383 79 -865 -218 268 406 666 146 534 -387 450 -76 -3 453 363 370 405 -307 437
5875 437 -136 221 -1080 225 -784 -1189 -553 658 -648 -1189 89 -194 -380 -826 -60 142 808 276
5893 276 111 1 194 297 24 314 -125 482 132 -453 377 -213 -91 91 -376 -460 -717 -1197 -947 999
5913 999 -20 -232 -340 -429 -641 -593 292 -66 239 -195 926 345 -565 -390 422 397 578 -1007 112 -496
5933 -496 91 -111 -615 -1346 -105 144 -498 -276 288 -84 774 -144 412 168 -616 621 -407 -284 51
5952 51 738 -735 365 517 334 704 113 -52 -185 -1289 832 -324 -629 160 -1018 196 330 -275
5970 -275 -273 -446 307 -10 -468 238 214 1211 752 458 627 815 1174 -71 -656 659 -119 -621 -654 -164 200
5991 200 -1064 382 84 -1104 420 349 217 211 43 -12 226 104 268 19 288 63 494 29 1196 219
6011 219 -214 357 -482 -158 -1323 -282 -244 -165 304 -28 159 662 130 -1029 -351 -153 127 -228 399 -364
6031 -364 1151 161 433 -21 -213 1107 553 619 109 -308 1052 -884 253 160 1129 278 143 829 -628
6050 -628 -550 -394 -125 347 -166 -1167 -218 -900 536 74 447 89 -356 -373 1052 -458 -153 -856 647
6069 647 164 -72 -681 812 769 288 551 747 95 -581 -624 365 -42 -149 -207 -682 -28 -172 -33 -548 -363
6090 -363 -50 337 -620 -58 -284 -121 455 613 603 1017 544 289 67 -121 -752 -984 -199 -549 -882 560
6110 560 -146 -429 -197 455 -427 -753 327 -258 -615 -111 743 374 226 7 336 222 99 -10 551 -553
6130 -553 451 -122 -575 726 -962 -874 294 -802 -657 -139 697 -519 629 492 -659 -186 633 409
6148 409 -904 761 761 745 -309 524 -417 537 -157 -963 816 298 191 -178 369 349 369 -781 955 -149
6168 -149 -630 -232 450 -502 -362 -119 -1173 551 1071 1546 -91 1318 357 235 259 115 520 -417 -310
6187 -310 -993 116 541 -891 151 -304 -847 -112 -382 -627 154 -587 267 -23 497 755 213 554 -351
6206 -351 291 407 -183 255 660 6 72 1068 562 536 -147 -317 -109 12 447 218 -183 -934 -735 -445 315
6227 315 -66 -414 77 -611 -53 -406 -159 25 135 330 85 229 438 -147 234 -504 -51 510 211 -329
6247 -329 280 -857 278 428 -603 -676 -529 -756 32 -473 -229 137 -100 -17 247 -9 284 -230 -316 416
6267 416 105 547 -281 444 -640 -824 -1243 -313 410 -986 133 -1382 3 -74 26 -234 770 -41
6285 -41 -43 -677 135 341 -14 -126 -21 173 -113 361 117 -243 -683 1003 61 138 484 -152 -247 -997 -906 196
6307 196 -132 -751 389 -18 392 318 -118 28 -205 -1256 363 154 -1030 821 -700 7 -4 293 374
6326 374 -246 -1006 326 418 256 -500 348 887 -710 -688 571 145 -411 -262 -877 10 -286 -520 311 -321
6346 -321 -564 279 743 1074 -1 300 262 216 991 -17 393 301 230 -227 215 503 -102 -130 -233 121 -179
6367 -179 -135 -717 -558 -697 -925 -376 100 614 729 437 577 316 598 218 -588 237 -235 -932 124 -429
6387 -429 1214 316 -304 1079 -12 -177 -573 -1277 -428 -94 149 273 774 105 -418 599 35 346 -309
6406 -309 -846 -100 -622 959 554 -250 489 224 195 915 227 -250 -448 -215 -955 -1314 -119 -291 -515 101
6426 101 559 -100 -193 498 588 277 170 -212 298 -312 -722 58 16 417 309 -265 -170 -45 -315 -199 94
6447 94 0 -887 197 -699 321 570 -323 -434 -51 314 -188 -87 -349 223 -738 -350 136 1198 -257
6466 -257 614 189 706 197 11 144 555 -573 576 132 -568 -457 117 456 261 -88 107 378 723
6485 723 -327 450 -374 -345 201 -587 -59 264 1612 -773 -473 340 368 203 -327 649 -764 -537 375
6504 375 -351 -73 -855 114 729 -280 -440 -413 298 -253 -103 416 737 -834 317 -67 -121 875 -208
6523 -208 257 533 315 314 548 58 247 -593 769 -45 254 -1175 -889 -67 276 -359 -1398 -142 -358
6542 -358 -49 495 528 -362 364 38 -157 780 169 -514 -706 156 -405 623 466 -20 665 221 351 -156
6562 -156 -162 700 -125 -526 -42 -193 -41 352 -481 -883 415 -141 -82 638 -867 458 -752 -422 -696 -189
6582 -189 20 533 440 25 583 915 144 -357 -1145 -392 -228 -1082 43 -275 482 -28 18 -20 251 100 341
6603 341 -389 -283 -98 296 -604 440 531 762 655 194 1015 406 -368 496 -315 -745 -795 -534 -306 -328 -225
6624 -225 -347 85 -571 -951 296 -30 -305 -409 216 -11 -571 1653 263 459 38 -982 578 366
6642 366 867 -1040 -28 -50 -1087 599 881 107 288 -310 443 -244 -165 435 -26 -913 -794 -418 -368 776
6662 776 220 580 -217 404 659 471 772 -194 254 -138 -441 263 335 -415 -160 769 1226 123 112 82 -532
6683 -532 143 283 -500 -435 752 246 1393 993 763 163 -1095 773 327 374 1258 76 -291 -516 -636
6702 -636 -871 -29 169 -315 -407 -600 -236 -804 -426 -147 -306 446 141 -713 188 -358 186 228 260 -700 765
6723 765 -14 -768 -158 -209 727 -390 -471 232 -48 364 314 206 -233 -550 181 -418 -276 -59 -217 120 -211
6744 -211 598 -192 789 -267 62 -256 -982 131 -252 394 100 -98 -798 -85 -338 697 808 450 -449
6763 -449 571 -628 -664 -676 351 -325 852 -340 -111 74 -278 535 -270 206 -1196 -335 109 1086 430
6782 430 61 769 -39 -321 -340 553 412 -1462 151 -187 227 306 434 -193 170 -735 77 -319 -34 -78
6802 -78 -123 208 79 705 542 -63 142 541 584 145 -130 537 264 -372 255 640 -598 -343 395 266 663
6823 663 80 -251 345 -137 764 378 -110 384 -290 -627 -215 352 78 454 -627 824 411 258 -652
6842 -652 -126 210 -316 -432 192 -147 -381 289 -90 77 -455 -811 -811 -548 -375 161 806 51 196 439 -32
6863 -32 769 1409 -739 -664 247 156 993 201 -420 -597 288 14 164 351 232 -25 -368 395 -499 -434 -841
6884 -841 -90 830 -668 -739 -49 -406 -1061 -201 -121 532 119 -931 104 -48 228 454 71 175 106 -982
6904 -982 702 80 -889 -450 -592 43 557 -34 -42 -716 461 -9 -678 541 433 -629 -264 201 306
6923 306 693 -258 -270 -653 -225 14 463 642 329 438 -840 -358 -464 -826 179 69 -480 -129 20 343
6943 343 394 102 110 -28 -211 367 81 -488 -246 718 -863 -372 -164 695 396 53 -350 -132 401 -194 -236
6964 -236 454 857 -524 -388 667 -372 413 -50 -205 -76 -294 -152 592 -164 -123 -77 -97 577 -427 460
6984 460 347 201 796 606 -108 412 -432 -938 -269 195 74 493 671 -711 -111 -575 -791 -443 209 544
7004 544 -743 922 526 -535 -80 486 505 -1144 -11 -237 66 -98 -870 -84 801 507 -129 238 1086
7023 1086 -474 -667 -872 -456 -1069 -575 744 -139 -1182 -1100 389 -357 362 -366 -155 418 -2 -462 -11
7042 -11 18 -553 304 -14 641 240 488 322 -201 -144 -7 -280 -510 -517 -1428 -132 700 141 -157 666 1234
7063 1234 -277 595 161 389 63 11 285 -42 558 -60 320 -823 -47 131 -419 -451 -786 -151 -516 -138
7083 -138 -260 88 68 143 85 88 496 -102 115 -481 397 -23 -74 -324 297 444 700 -703 808 165 -581
7104 -581 -756 400 -501 -457 -848 469 -326 -356 -514 -795 -35 36 334 -93 483 95 -1154 -33 -10 49
7124 49 -53 276 574 604 242 1054 -138 233 -323 -248 -364 -118 -117 61 646 -225 404 -227 379 250 84
7145 84 -998 -212 213 -32 -330 198 -408 53 -987 -805 1293 264 463 -644 -213 -848 979 -529
7163 -529 -57 -221 -333 -257 131 -282 -435 395 -638 391 255 126 247 -637 399 -58 540 669 -158
7182 -158 354 662 686 514 -172 -40 203 -34 -927 -489 -514 493 -806 400 -2 182 273 -359 -50 521
7202 521 -88 -1357 -306 -42 25 436 1086 -327 131 544 -39 -291 -414 242 78 -1043 -105 -117 380
7221 380 -950 -347 -93 -418 -146 -328 -167 584 152 33 -136 441 429 -236 806 -140 54 250 -285 -781
7241 -781 -381 -68 284 365 707 679 -122 -350 38 -1202 -100 -269 -516 -16 -305 -935 -288 -271 369 320 87
7262 87 -106 -822 437 23 -394 66 -73 45 583 208 557 1032 -505 -140 11 385 -212 -247 -143 -170
7282 -170 300 -114 -11 235 440 -196 -93 13 -35 -714 680 -362 260 701 391 510 46 472 1392 -89
7302 -89 -25 536 367 -886 -1016 -191 -1293 -456 -13 -335 -338 194 538 136 -13 -667 49 -244 494 -256 762
7323 762 -19 311 25 746 -243 -309 508 -478 9 -78 344 107 380 225 228 138 -53 -347 -471 -808 146 -474
7345 -474 290 1 862 891 338 -513 770 -128 235 325 -298 -243 46 -478 49 -244 -190 244 -153 799 -47
7366 -47 -743 -260 -434 -604 -319 -616 -500 820 171 -5 37 562 268 -287 294 491 -344 -375 199 59 -116
7387 -116 -475 -236 226 103 -324 -311 -272 -246 146 90 -973 -580 67 799 338 -352 561 240 200 -184 461
7408 461 81 570 15 -603 -286 213 26 378 179 -445 -531 273 351 -713 391 225 -728 -535 2 -509
7428 -509 749 -617 174 1087 -560 571 -190 68 36 104 -309 422 -298 467 26 234 -111 532 -49
7447 -49 -1028 -444 -310 -42 -871 -283 -624 588 203 -748 -597 -509 -404 -433 -152 68 -214 -693 452 492 260
7468 260 923 -186 364 768 274 -340 -110 425 -75 326 469 -146 209 -703 583 276 -286 153 -768
7487 -768 533 -216 -320 -87 -19 -909 -120 447 -619 10 575 352 -239 26 263 409 742 541 -625
7506 -625 926 -149 336 -184 -307 474 475 -910 -37 -4 103 -360 11 534 136 596 448 946 -286 218
7526 218 -103 -376 -639 537 135 582 -430 -348 -191 -526 446 -38 -416 -215 -80 -394 -306 -112 -244 -1431
7546 -1431 368 242 -663 188 195 192 271 -135 678 446 -172 1012 -809 -135 273 305 -141 -903 -201 0 -592
7567 -592 916 51 195 -21 431 -383 -606 1152 590 -471 576 -124 118 792 -418 -1100 440 159
7585 159 977 273 -304 -503 357 -481 -377 -338 -95 265 -218 -50 553 -481 -546 -493 -535 -112 -825 -600 -206
7606 -206 218 400 165 529 1111 -372 824 7 544 206 761 684 -766 -196 -407 -528 51 451 -170
7625 -170 118 -288 83 25 -1066 -97 -10 747 -285 232 -425 -165 361 -1454 401 -109 362 674 76
7644 76 331 -160 918 -1051 -587 -527 -329 -311 -572 258 -1046 395 981 -424 -107 66 -135 -189 338 -438
7664 -438 -859 1002 199 248 -748 70 701 -219 544 94 526 -101 6 447 -876 480 568 644 559 449
7684 449 -147 -927 -654 -190 -342 637 -320 -264 665 600 -944 -227 434 797 510 51 922 117 -266 349
7704 349 -465 -60 612 -144 51 -263 -310 -191 614 -18 -369 -102 -684 234 311 -407 -357 -452 458 726 395
7725 395 -60 419 965 -651 -118 17 -828 -293 -454 393 178 121 286 478 -31 759 665 -226 691 -466
7745 -466 -722 -57 -166 545 -187 1109 -102 -593 -47 453 400 266 421 945 480 -496 -21 -235 -317 202
7765 202 -526 -157 -84 -43 -499 449 -626 -201 96 -112 275 122 -160 -694 601 -1023 259 50 -157
7784 -157 180 824 -878 549 392 -307 184 -671 -321 17 -590 -142 -286 -582 -186 -1230 -312 -436 -219
7803 -219 820 253 -157 364 375 -620 -23 158 -384 70 354 385 -131 -334 517 178 -574 -968 385 377 -141
7824 -141 -224 -86 -10 -426 -362 1 348 -190 1212 -613 -634 -179 279 28 4 686 177 -123 -1150 322
7844 322 559 -300 -73 -900 -199 367 -265 -254 378 291 -264 359 -48 -290 -287 -314 477 783 215 -56 272 -51
7866 -51 -163 -271 -214 -151 511 -100 185 448 184 -85 51 427 432 -13 -418 -426 -645 -15 -853 168 -366 -358 -200
7889 -200 -446 -175 -90 -628 -379 -457 697 -143 -54 1061 -94 195 -655 -10 -301 -679 730 610 -678
7908 -678 60 -237 718 204 -157 -885 -518 -232 -58 -327 -149 101 -141 91 -163 634 -579 716 -118
7927 -118 -316 -209 -379 63 266 -329 29 764 -476 -459 -512 855 555 547 290 93 -156 -707 584 -858
7947 -858 -392 -658 -326 821 -688 300 872 861 49 -110 -386 296 -57 -26 -276 519 -407 -204 464 -1089
7967 -1089 -954 -1136 -87 -20 -331 151 -156 577 -186 -14 262 -353 -9 -125 152 3 87 895 972 -995
7987 -995 -200 -106 107 313 328 -961 -504 589 -387 -1015 -1251 -207 -663 -637 600 -175 -245 215 292 336 361
8008 361 -57 -817 636 -429 323 393 -247 314 -129 -313 350 -404 131 -370 -664 610 666 -512 996
8027 996 468 -166 165 209 -179 34 699 320 386 -251 -274 -679 383 545 1193 559 381 -491 28 -384 -300
8048 -300 394 -59 -841 -1159 -309 -965 66 -451 376 442 -442 396 -243 47 -354 -112 75 -196 304 -487
8068 -487 32 -270 226 -695 -267 665 -520 -236 443 954 192 -322 -242 -60 -29 -119 -878 -522 -104 883 -192
8089 -192 615 481 -345 73 649 -398 314 -291 874 -525 -112 720 373 -285 216 426 648 466 -489
8108 -489 -294 -294 -92 56 -20 766 676 -162 -576 181 -277 683 856 281 593 -265 -662 -249 223 -169 742
8129 742 -288 -607 115 251 285 -834 565 -157 -848 -345 -490 -157 265 80 -613 -529 53 253 257 42
8149 42 265 351 -176 243 502 40 216 -77 575 -244 -95 506 570 -170 -123 -660 -1006 -92 -769 -200 -893
8170 -893 -212 262 -571 430 -465 -388 -634 -666 -443 -16 -554 591 -240 178 869 411 5 277 1427 86
8190 86 567
8191E67
$$ Imaginary data points
##PAGE= N=2
##DATA TABLE= (X++(I..I)), XYDATA
0 0 0 0 0 0 0 0 0 0 0 0 0 0 0 0 0 -8 108 -108 108 -108 108 -138 216 -216 219 -324 324 -431 433 -540 623 -661
32 -661 760 -867 979 -1104 1252 -1396 1557 -1737 1934 -2149 2374 -2632 2912 -3213 3542 -3905
48 -3905 4301 -4735 5221 -5751 6341 -6998 7747 -8583 9543 -10651 11954 -13494 15371
61 15371 -17685 20662 -24614 30130 -38389 52106 -78704 148778 -699130 -1360614 1143287
72 1143287 656460 -961880 593375 1566213 -307442 4825 1742985 596562 -651742
81 -651742 754149 793990 -878676 -327974 864806 -382340 -1058052 282134 170356
90 170356 -1097237 -286508 647139 -522690 -844189 425039 73807 -918405 69861 734021
100 734021 -323317 -217847 870455 320084 -346033 569944 781322 -188063 -52602 547551
110 547551 -94329 -568391 87301 200794 -462804 -335188 198133 -172160 -559553 12206
120 12206 250220 -386696 -345170 299850 -27853 -482500 214051 526177 -179059 -17501
130 -17501 712160 218817 -290855 421476 514853 -357883 -162470 474603 -170961 -602823
140 -602823 221026 280121 -544458 -165422 503780 -239827 -588621 346110 235087 -675580
150 -675580 -101987 533688 -375992 -484627 617244 266482 -569730 294992 688629 -426619
160 -426619 -273763 707715 -35220 -686857 348113 425123 -638664 -131025 698383 -180909
170 -180909 -498088 556541 318482 -646066 13099 560275 -409358 -471233 521941 92414
180 92414 -645503 196930 548916 -407539 -228625 620566 -32575 -592969 276380 338570
190 338570 -560715 -157872 532478 -164037 -416072 445296 308779 -420152 78005 510967
200 510967 -217382 -339530 344345 68405 -492696 32317 346992 -270480 -250040 365108
210 365108 77227 -370362 128810 320901 -298525 -244270 303307 -16057 -376362 164626
220 164626 324126 -230131 -74542 443059 66874 -269700 232485 271466 -317236 -146826
230 -146826 303144 -119184 -384559 175846 203348 -337605 -73846 361950 -120624 -341919
240 -341919 239633 157643 -415052 -68194 338111 -189204 -276188 379053 213565 -314423
250 -314423 143201 446051 -182916 -203915 385337 40835 -443461 96495 289855 -338543
260 -338543 -189187 390709 -29771 -383955 219847 259153 -393167 -142739 345095 -170824
270 -170824 -392930 262355 200170 -363518 49696 464368 -107832 -211990 397605 154112
280 154112 -382986 75684 332952 -289978 -255250 342972 25287 -376184 175939 317212
290 317212 -303630 -157311 355700 -82627 -409915 155493 178811 -388518 -95712 380186
300 380186 -79110 -260108 328339 240650 -291783 49719 376034 -171129 -276157 275743
310 275743 85915 -363168 66542 321761 -206678 -181058 340613 52168 -345596 97727
320 97727 226343 -317349 -201411 275006 -64616 -336030 183124 249836 -243648 -23489
330 -23489 373354 -48361 -251209 240446 166521 -314299 -27909 290117 -147710 -222460
340 -222460 279372 128624 -284707 61559 283121 -191552 -205221 233760 -7807 -350613
350 -350613 50208 212168 -223282 -121091 302367 28288 -230823 179556 230281 -220563
360 -220563 -84356 257880 -65999 -254189 162493 163173 -226246 -13866 291738 -53494
370 -53494 -197822 187532 106874 -275930 -48002 198920 -158291 -230804 180803 93104 -229556
381 -229556 60350 268662 -118649 -152630 234442 54688 -274849 43652 200249 -198304
391 -198304 -138960 274870 51541 -225190 152954 244659 -197180 -93422 267984 -60360
401 -60360 -299641 128790 152469 -275572 -50118 302411 -75692 -217516 247938 147965
411 147965 -295130 -2641 255277 -201858 -241166 238833 45122 -311335 102067 286597
421 286597 -187612 -108563 322155 6426 -285259 151806 194107 -278359 -90412 279831
431 279831 -80854 -232419 233681 167444 -253172 17371 274019 -147066 -213777 204851
441 204851 30138 -306511 40149 218664 -175826 -114539 267503 34470 -210500 139540
451 139540 194844 -192450 -77268 217989 -51522 -205098 139103 132126 -183082 -11295
461 -11295 220796 -58047 -166546 125877 61373 -220109 -44119 138203 -117485 -167004
471 -167004 129759 76493 -150314 41251 197408 -59397 -104232 161935 70162 -166058
481 -166058 19989 161452 -90983 -99666 180584 75937 -152612 54705 170874 -119643
491 -119643 -128204 141414 -14488 -243010 16717 130815 -167626 -102996 209302 17706
501 17706 -179969 132821 179815 -178602 -62517 223473 -57755 -209212 159305 132040
511 132040 -214364 13290 265306 -88285 -164538 211758 61161 -276837 20817 183513
521 183513 -214334 -173751 215310 32 -238549 141598 212300 -190552 -51299 271899
531 271899 -43942 -214229 173302 125918 -239358 1033 253314 -95584 -150351 227040
541 227040 80297 -228583 52170 184852 -188211 -154098 173368 -30547 -235093 84181
551 84181 144879 -170502 -48834 213832 -23410 -159593 124729 102455 -170410 -18036
561 -18036 173744 -61171 -123889 145553 95491 -129838 29370 162791 -75321 -119147 111561
572 111561 29133 -170719 -7266 107854 -99533 -98108 130765 45325 -129897 38077 129669
583 129669 -84864 -85504 121006 17383 -146969 37351 130504 -81754 -58561 160664 39727
594 39727 -127361 70274 130611 -126537 -88970 132519 -30260 -181769 67370 105414 -156006
605 -156006 -43527 184719 -32461 -152260 121476 85568 -186505 -18289 167806 -96416
615 -96416 -143214 161166 74324 -159986 69939 201933 -100493 -91714 189902 16472 -196954
626 -196954 67845 130950 -175437 -76145 192859 -31606 -172200 130273 112588 -187857
636 -187857 -24925 174593 -106405 -170265 138154 50440 -190988 40692 181018 -97319
646 -97319 -79066 194020 38970 -160379 71203 131271 -136178 -67090 156769 -21023 -151309
657 -151309 93363 110361 -129963 -30503 145532 -57080 -149287 83312 53383 -160413 -22564
668 -22564 128926 -63606 -94739 131759 70849 -113089 33915 136706 -63999 -78046 115181
679 115181 28099 -125389 35394 120252 -70567 -60149 124369 20445 -126899 33372
689 33372 88256 -120690 -91478 96547 -25796 -146176 53450 94867 -110607 -31724 152137
700 152137 -6467 -110211 93431 85133 -122513 -11942 141683 -43476 -102701 115693
710 115693 76612 -115090 25078 142296 -71435 -103914 104833 16788 -163279 6071
720 6071 97830 -117795 -90238 131572 10886 -134387 68680 115359 -110302 -43087 142653
731 142653 -24734 -128156 93588 91366 -115574 1071 156087 -33088 -91281 119353
741 119353 61346 -137307 -3811 107001 -92676 -108662 98087 16174 -145690 27413
751 27413 114901 -86841 -66765 123505 2972 -134257 53922 98860 -104312 -39454 140267
762 140267 -3740 -95600 103004 100639 -100822 -13371 126356 -45606 -113511 77124 39785
773 39785 -135265 -10264 110102 -62719 -91237 100007 33981 -126001 13341 99288 -88320
784 -88320 -81669 107831 17497 -109570 61801 116264 -72751 -25871 142426 7282 -104881
795 -104881 66352 71927 -113728 -32668 108950 -42667 -106948 76769 54601 -111578 -5002
806 -5002 102858 -65163 -98690 77442 22665 -121949 11331 97969 -64272 -53504 119593
817 119593 35776 -87859 55823 103348 -69522 -41132 103816 -6138 -103422 50970 71597
828 71597 -87974 -29481 98733 -22607 -91906 57605 45867 -106326 -30351 79773 -45979
839 -45979 -86689 68078 45005 -89193 11058 107920 -29756 -58614 90482 37471 -92928
850 -92928 19587 92982 -58516 -60305 90597 18713 -95066 36373 83559 -78946 -56110
861 -56110 86898 -16187 -113782 35816 60588 -97972 -32734 107753 -15240 -85593 79092
872 79092 71496 -91008 -2120 110624 -41969 -82837 91680 49032 -99386 23371 109265
883 109265 -59209 -62635 102726 12775 -119016 21501 67716 -102111 -61481 93682 -18777
894 -18777 -106073 58255 74161 -87778 -14300 108661 -29460 -85498 76934 51528 -92395
905 -92395 8298 105973 -37124 -53842 99441 39611 -88377 24261 81541 -70859 -62928
916 -62928 72151 -11352 -105819 26319 60064 -77912 -38337 83015 -11005 -77794 47997
927 47997 53469 -75902 -19933 80816 -15189 -57760 67085 54253 -60236 8934 90337
938 90337 -19051 -54390 59537 27478 -81866 -5114 63583 -48389 -66480 54142 15464
949 15464 -81462 7438 64597 -52526 -52441 65107 9503 -77889 25870 69706 -49821 -26770
961 -26770 89623 15709 -64627 48606 69366 -60433 -23449 80183 -20602 -83061 46733
972 46733 44407 -84848 -18761 76941 -39863 -76907 61793 29523 -95331 -1909 76036
983 76036 -53766 -55500 85553 23670 -79151 41211 91028 -49968 -24982 96649 1700
994 1700 -81626 47121 59148 -79573 -25146 81971 -26985 -77821 55378 36995 -89517
1005 -89517 -13552 68614 -52087 -73174 56568 15464 -85959 16377 78422 -41948 -35200
1016 -35200 85431 22665 -61820 41817 69915 -53526 -27823 76250 -2120 -64474 42549
1027 42549 48992 -63753 -18720 68822 -21930 -69304 34347 23764 -78371 -15984 58652
1038 58652 -34295 -58722 51566 30424 -61350 13295 71551 -28948 -39495 65532 22569
1049 22569 -60356 21548 63518 -40289 -31886 65041 7253 -66975 22012 46443 -56668 -34009
1061 -34009 54607 -14927 -73343 27550 41045 -61854 -19702 66605 -15376 -55880 51686
1072 51686 42644 -58739 744 72436 -20185 -41926 63455 31769 -61007 13175 66391 -37937
1084 -37937 -42262 57187 3247 -76036 13164 45720 -60076 -41021 56537 -7885 -68746 29719
1096 29719 44679 -58060 -18490 69219 -10884 -55012 47975 42464 -54385 3956 76560 -16362
1108 -16362 -43201 59736 30768 -60777 7931 57082 -44533 -50994 48707 4281 -71697 9394
1120 9394 46880 -51850 -36618 57761 1283 -62968 26094 46301 -52398 -17989 67944 -3702
1132 -3702 -52102 47452 48731 -49079 289 71293 -18121 -48981 50895 25217 -66803 -1235
1144 -1235 54317 -42235 -48575 49739 7237 -70069 9771 49329 -46220 -33192 57418 -19
1156 -19 -58675 32786 51869 -43895 -12528 67201 -4072 -47071 47297 41962 -52472 -5388 60150
1169 60150 -22461 -48091 43152 17565 -65579 -3158 45112 -38797 -44102 41492 4880 -59012
1181 -59012 12154 45123 -35349 -25879 52991 8457 -43421 29062 46592 -34051 -11691 57171
1193 57171 2568 -42111 30505 35152 -43700 -13551 45634 -17155 -50847 23606 19093 -52505
1205 -52505 -12675 39578 -26600 -47839 31579 18758 -48111 2365 49080 -21592 -29708 50478
1217 50478 25346 -40448 18204 54274 -25324 -24452 53608 11171 -52045 16316 42814 -42952
1229 -42952 -27203 49196 -9723 -59619 22711 30397 -57482 -20842 49262 -21509 -53156 39623
1241 39623 29282 -51812 3637 64138 -19153 -32670 55897 23029 -53240 17596 55478 -35862
1253 -35862 -31519 53088 268 -59090 23318 38987 -54348 -25270 50259 -18510 -57896 30844
1265 30844 24023 -60217 -7953 52986 -22737 -37960 48975 24302 -44028 18994 56657 -22520
1277 -22520 -22469 52734 11028 -43611 19815 38260 -37135 -20943 42716 -6458 -47508 17058
1289 17058 21964 -45109 -20033 33367 -17940 -45167 20346 19146 -36450 -2231 41996 -8153
1301 -8153 -24723 36331 26373 -26592 7309 41548 -10548 -22636 34222 18755 -32941 3398
1313 3398 33561 -20923 -30770 25663 4162 -46549 -3553 26542 -30808 -30324 31929 5322 -40873
1326 -40873 14371 39233 -27033 -17571 44892 5450 -35638 26839 37985 -31283 -6541 53141
1338 53141 -975 -36635 32224 26180 -48223 -10477 41161 -27990 -48000 29126 10649 -54288
1350 -54288 2891 43823 -32770 -33024 45433 6953 -48635 20681 41661 -37870 -14210 57205
1362 57205 123 -37525 39828 38593 -38130 -1018 52419 -18294 -42491 33259 12487 -54066
1374 -54066 -2481 36810 -34844 -35274 38683 4014 -48683 12281 34196 -35899 -17682 44128
1386 44128 -3039 -37438 27475 33514 -28561 484 48569 -4609 -27729 31921 21024 -35708
1398 -35708 -3910 31374 -21385 -32909 23178 7572 -38935 -1422 26189 -22836 -25585 24431
1410 24431 3909 -33825 5628 27447 -17798 -13549 35010 11961 -22338 19218 33656 -15109
1422 -15109 -10900 32207 3155 -28382 10666 20947 -27666 -14652 28149 -4200 -33351 10347
1434 10347 15995 -35024 -15517 26414 -12254 -34728 18785 20192 -28084 684 43215 -6327
1446 -6327 -22556 33466 21835 -31901 4970 36309 -20487 -25237 34988 9421 -38065 11192
1458 11192 32013 -29949 -22202 33196 -6909 -47343 11858 21728 -40308 -12913 39809 -8530
1470 -8530 -31400 33446 29011 -33429 2915 44112 -15047 -25806 37444 13498 -39733 9262
1482 9262 38214 -26010 -19513 38670 -935 -44194 12664 23337 -40830 -20061 31292 -14493
1494 -14493 -37442 22986 21038 -33047 420 40543 -9462 -22948 32869 16273 -29743 8605
1506 8605 35939 -15938 -16154 34502 8916 -29387 11805 25170 -27608 -19152 23164 -7539 -34989
1519 -34989 8578 14886 -28865 -11171 26727 -4513 -23809 17049 16398 -22198 -1546 27611
1531 27611 -3742 -17244 20717 18740 -16138 5101 28986 -5228 -18107 18263 9427 -27602
1543 -27602 -6559 15842 -19143 -24930 15102 6300 -26106 548 23724 -14475 -17816 22074
1555 22074 5340 -26188 6861 25236 -14554 -10675 31686 9123 -21492 18757 29215 -19985
1567 -19985 -11822 28221 -6425 -34179 12514 14275 -35018 -11698 29117 -11183 -29502 21708
1579 21708 12116 -34881 -1123 31225 -19426 -23926 30241 9377 -29858 16322 37697 -18436
1591 -18436 -10718 39895 3444 -31785 18707 22463 -33318 -10537 32498 -13300 -32821 22436
1603 22436 12741 -38069 -1940 27964 -23526 -27460 26017 3952 -34659 10339 29861 -20640
1615 -20640 -9936 37939 4409 -23889 21513 22962 -23117 -3554 30169 -7905 -23599 18601
1627 18601 13461 -25932 -1278 23322 -15473 -23204 15155 2207 -28245 -348 15722 -15624
1639 -15624 -13387 21308 6767 -16874 11091 22318 -8488 -6460 20651 3469 -16742 7588
1651 7588 16412 -10349 -7513 17622 2442 -17749 5496 12506 -17657 -15381 10449 -4659 -24791
1664 -24791 3407 12427 -17895 -9066 22697 4150 -15610 15487 19738 -16258 -4037 27298
1676 27298 -1916 -19390 19623 17433 -20783 2195 29688 -8528 -20987 19944 7131 -32065
1688 -32065 -2305 20551 -23674 -22521 23534 1443 -30718 11392 25567 -22583 -10168 31074
1700 31074 -4109 -27383 20409 20579 -26446 -110 33461 -9784 -19898 28926 12145 -29881
1712 -29881 3868 23553 -24220 -20860 24807 -2866 -32967 11153 20573 -24587 -7961 29262
1724 29262 -6695 -24763 19361 15148 -24563 1852 27789 -8978 -14548 26743 12168 -20320
1736 -20320 7874 22021 -15344 -13623 16987 -3668 -26830 4255 12916 -19622 -10168 15947
1748 15947 -3925 -18254 8910 8409 -16958 -6746 13259 -3769 -12992 12555 13223 -9106 2811
1761 2811 20658 4100 -7721 12178 10256 -12473 -4240 12709 -5211 -15766 6444 7431 -14951
1774 -14951 -4562 13939 -5218 -16101 7962 6447 -19213 -5199 14218 -7362 -13790 16752
1786 16752 12418 -14503 4825 23873 -6177 -11521 20114 5001 -23054 4718 18225 -19164
1798 -19164 -12972 19682 -1335 -24040 11215 16319 -23695 -9815 21485 -9526 -23783 17953
1810 17953 12302 -22881 2717 29535 -7239 -12437 28137 10147 -23373 9600 24218 -18986
1822 -18986 -12490 25742 -1038 -25182 13716 16135 -24900 -8256 20912 -13294 -26649 12170
1834 12170 3713 -28839 -262 21010 -13576 -11310 23691 6623 -17745 11587 20814 -14587
1846 -14587 -7369 22399 -294 -15659 14523 16307 -13614 -1680 20055 -4321 -15790 9433
1858 9433 2150 -21538 -4855 10496 -11897 -13762 10007 4783 -11699 4082 14781 -4934 -7100
1871 -7100 13179 5145 -9836 3536 13152 -4217 -4628 13373 5446 -8357 2060 11226 -6400
1884 -6400 -10652 6567 -1958 -17117 -3140 7709 -10711 -10550 10931 1883 -13260 4715 14401
1897 14401 -8895 -7120 14893 2598 -12696 10323 16779 -9490 -1290 21129 2130 -12745
1909 -12745 12015 10913 -19032 -5141 15008 -11409 -21112 11205 4785 -23304 -645 16761
1921 16761 -14445 -15075 18981 2236 -22414 7580 17925 -14536 -4995 25813 2804 -13809
1933 -13809 19523 16455 -16688 78 21306 -10123 -18588 14545 4934 -23839 888 16904
1945 16904 -16626 -13896 16952 -708 -23285 5412 10579 -19593 -8404 18990 -3320 -13835
1957 -13835 15196 15505 -11300 3779 21859 -3414 -9492 15483 5488 -15939 1799 11899 -10279
1970 -10279 -8890 12068 137 -15304 2027 7759 -13326 -8794 7600 -4516 -14629 4737
1982 4737 8486 -7512 -877 12550 2613 -4369 10469 10705 -5057 -693 11042 1115 -7323 5526
1996 5526 7289 -7947 -3949 8127 -2708 -10846 1991 2377 -13653 -7371 7662 -4661 -12023
2009 -12023 4712 7175 -8424 -1553 14202 179 -7957 11835 9680 -9999 1820 16175 -4807
2022 -4807 -8145 14083 7258 -13506 2448 12059 -12701 -11913 10516 -3629 -20580 1989 8432
2035 8432 -15009 -7646 16406 -1790 -14096 13702 11547 -13588 864 18512 -7045 -10544 17603
2048 17603 8531 -14143 7756 19238 -9935 -7045 16927 -1806 -19272 4738 7488 -20035
2060 -20035 -8892 12608 -7505 -15704 10884 6764 -16644 2080 15605 -7641 -9214 14032
2072 14032 4486 -13145 6715 15562 -6412 -2188 16502 2345 -9564 8487 8388 -12053 -4674
2085 -4674 9430 -6233 -12754 4121 2276 -11846 -2112 8251 -4942 -7745 5449 3066 -8148
2098 -8148 1738 8979 -2150 -4045 9089 6728 -3431 3294 10063 -1205 -4416 6371 3080 -8244
2112 -8244 -2227 4203 -5690 -8789 4310 1566 -11343 -2362 6755 -5159 -7574 6761 3466 -9755
2126 -9755 1963 12828 -3029 -3717 12025 5166 -8629 6850 12572 -7289 -4717 12264 -597
2139 -597 -13188 6063 7374 -13672 -5700 11018 -6612 -15581 7039 2884 -17403 -1538 11351
2152 11351 -8891 -9351 14702 4949 -11438 8185 15691 -7549 -2466 17011 2279 -10058 9897
2165 9897 9656 -13094 -1402 13524 -5572 -12610 10534 3078 -15037 -358 9011 -12864 -11472
2178 -11472 9140 -1697 -14839 4650 9984 -9630 -2280 13845 317 -7533 10776 8029 -8480
2191 -8480 739 12943 -2662 -7364 9450 4428 -9883 208 7035 -6706 -9000 4868 -1251
2204 -1251 -11289 -706 3966 -6655 -5058 5851 335 -6515 2805 7343 -2793 1002 9559 2975
2218 2975 -3240 4525 8672 -2266 -2538 6529 -49 -6649 1233 4444 -6675 -6505 3365 -2845 -9655
2233 -9655 -388 2892 -8890 -4242 6395 -925 -7786 4159 7894 -6121 1165 11676 849
2246 849 -6062 9257 8224 -5989 1740 10987 -3782 -7638 7337 2395 -11893 -290 6598 -9091
2260 -9091 -8813 8216 -1143 -12893 2640 7062 -10030 -4424 12360 -1499 -9189 9563 7578
2273 7578 -7908 1893 13910 -3005 -6199 12190 6086 -10561 2478 9836 -8161 -6566 8422
2286 8422 -3045 -13787 3225 4681 -11694 -4912 8558 -3515 -8697 6515 6254 -8897 22
2299 22 10393 -2230 -4601 10080 5883 -6482 4012 10479 -3739 -2553 8455 -344 -8355 1752
2313 1752 3781 -8245 -5369 3726 -4523 -9458 292 2389 -6915 -3074 5667 -1096 -4499 4983 3729
2328 3729 -3627 885 8062 899 -2670 6551 5769 -2657 616 6191 -1044 -4738 3723 1808 -7074
2343 -7074 -2725 2786 -4083 -8323 2148 1240 -6964 -1168 5577 -2647 -5374 6459 2917 -6365 2290
2358 2290 8050 -1976 -1693 8754 3044 -4745 5322 7668 -5150 -3697 7438 -2415 -8634 3057
2372 3057 2796 -8794 -4104 6472 -3825 -9244 4378 1284 -9859 -153 8459 -3073 -4646 9793
2386 9793 3315 -6276 6279 10861 -4811 -3118 9730 21 -8565 5053 5663 -8610 -3469 7970
2400 7970 -3981 -8174 4857 822 -10501 -2239 6083 -6680 -7127 6806 1581 -7601 3261 8525
2414 8525 -3137 -583 9539 2654 -5335 5102 5519 -5531 -1439 6189 -1744 -6457 3177 2488
2428 2488 -6815 -1862 4040 -4828 -6827 2496 -628 -7805 -430 3774 -3092 -2309 5240 2806 -1821
2443 -1821 2940 6330 -1494 -838 6246 1993 -3630 2497 4797 -3004 -2140 4129 368 -5448 -137
2458 -137 1800 -5448 -4280 1416 -2256 -6315 907 4055 -4270 -1102 5304 1594 -3395 3853 5443
2473 5443 -3580 -1194 8220 174 -3265 5786 4197 -5099 -15 6474 -3277 -6475 2481 -221 -9122
2488 -9122 -1408 3303 -5943 -5092 5932 1298 -5558 3750 6218 -5634 -2249 7388 434 -4768 5693
2503 5693 4884 -3309 1787 9741 -1191 -3561 5755 2872 -7133 -1021 4130 -7666 -7175 3038
2517 3038 -2098 -7793 863 5046 -5533 -2359 6671 -1496 -6092 4272 3609 -4851 305 6865 -52
2532 -52 -1747 7347 5109 -3039 1439 5142 -2691 -3917 2816 -502 -7877 -333 3229 -3780 -2982 3571
2548 3571 -625 -5847 1049 1710 -3723 -1516 3813 950 -1712 4438 4772 -513 1356 5974 1449
2563 1449 -1750 3237 2759 -3785 -1781 2458 -2366 -4332 740 773 -4607 -1799 2821 -3665 -5989 1895
2579 1895 238 -3793 11 4077 -1256 -2730 5736 3730 -1494 3177 5764 -2384 -2067 4365 1356
2594 1356 -5973 355 3515 -3952 -1880 4687 -997 -6714 990 1562 -6596 -3674 2801 -3421 -5595
2609 -5595 3777 3331 -3531 2295 8057 218 -1393 6161 2799 -4616 1672 5205 -3822 -1661 5844
2624 5844 227 -4988 2519 4553 -5467 -2190 2793 -3288 -7264 519 1095 -6166 -679 5056 -939
2639 -939 -1702 5921 2649 -3557 1873 5318 -1500 -2692 5053 11 -3698 2781 4532 -2821 -339
2654 -339 4030 -755 -5325 -486 491 -5556 -3299 2478 -2643 -4368 2606 2751 -1208 316 5040 -359
2670 -359 -3318 2542 1917 -2880 1566 4944 -66 -271 5115 3926 -2321 1479 3148 -2978 -3620 -181
2686 -181 -2100 -5541 -798 2178 -3451 -1216 3686 286 -3285 2482 2607 -2717 -834 2826 -474
2701 -474 -2707 3818 4583 -721 1764 6435 743 -2451 3966 -731 -4637 -2034 1000 -4519 -3718 2677
2717 2677 275 -4129 452 2473 -3521 -2790 3125 -803 -3809 1210 2462 -2806 601 6657 2348
2732 2348 -763 4323 4101 -2698 -1323 3282 -2281 -4896 1128 -202 -4905 -468 2456 -2621 -2751
2747 -2751 2433 -304 -5087 1115 2606 -3678 -2173 4436 1883 -2011 4740 5580 -58 1094 5565
2762 5565 788 -3183 1668 1153 -3907 -534 2833 -1362 -3414 2333 1234 -4018 -1683 1359 -4739
2777 -4739 -4187 233 -532 -3467 1007 4428 -960 413 5293 1430 -1180 2595 3066 -2106 -1339 2905
2793 2905 -34 -2389 2962 2468 -2085 -787 2571 -1804 -3947 240 -1441 -4909 -2127 601 -2101
2808 -2101 -2333 2032 1501 -1053 2604 4641 -670 -799 3006 389 -3158 1421 2233 -994 17 5071
2824 5071 1294 -2209 1084 1263 -3684 -2770 110 -3500 -4596 -427 844 -2366 163 4465 553
2839 553 -1464 4095 2293 -2871 -30 2482 -1772 -1697 3649 1177 -1494 2131 3860 -173 -1483 2319
2855 2319 -1049 -5627 -79 85 -4075 -2881 2567 -261 -1953 2794 1433 -1877 -225 2539 -1109
2870 -1109 -2991 2915 2085 -1377 2117 4551 1082 351 5020 1889 -3652 203 852 -3112 -3946 1112
2886 1112 -673 -3962 1644 1881 -2677 -947 1997 -593 -3761 654 -155 -3064 302 3284 344
2901 344 881 5112 4725 -376 2281 4580 -1165 -2600 802 -1830 -3305 234 2086 -2242 -380 2926
2917 2926 535 -1874 -862 652 -4685 -2705 384 -1647 -2997 1814 3059 457 2109 4467 1487
2932 1487 -533 2267 1128 -3020 -1318 1067 -2028 -2155 1492 544 -1810 328 1341 -1336 -2210 702
2948 702 -1292 -4457 -600 860 -1864 -896 2539 2332 145 2970 3679 -261 -987 1238 -679 -1968
2964 -1968 125 595 -689 -32 2902 395 -1987 890 438 -3406 -2644 576 -3298 -3294 -47 1145 -2353
2981 -2353 1774 3170 -188 500 3223 1598 -2453 719 1304 -2929 -1001 3542 720 -363 1875
2996 1875 2885 -1539 -1232 1691 -2832 -3122 -333 -1167 -4520 -962 2906 44 -410 3917 1925 -679
3012 -679 941 3110 -2445 -1972 1145 -1070 -547 2557 3781 739 820 3465 -25 -1713 81 -326
3028 -326 -4297 -2888 -724 -2219 -2654 1326 1126 -1837 822 2928 -325 -962 2101 -918 -2120 579
3044 579 1751 -476 1147 3908 2393 688 1667 1734 -2194 -1881 -99 -2458 -3365 -531 340 -1366 -229
3061 -229 1261 497 -714 969 52 -1832 -462 332 -1586 -1509 1487 2390 1342 2626 2815 1511 -69
3078 -69 747 -399 -2388 -1015 -501 -2376 -1945 1402 380 -1917 95 878 -850 -937 427 -918 -4066
3095 -4066 385 1709 -925 795 4154 2469 147 2740 3669 -574 781 1235 -1789 -2197 -225 285
3111 285 -2673 -530 2131 -1020 -950 1607 -931 -3031 -1303 747 -3888 -2664 917 -648 -1350 3032
3127 3032 3361 -64 1302 3689 402 -1301 1028 -60 -2785 -43 2071 -1696 -865 3070 1059
3142 1059 -1673 1355 462 -2567 -2701 28 -1276 -3039 1592 657 -505 1059 2660 1674 180 2217
3158 2217 80 -1800 -709 368 -1626 -828 2093 1832 109 1091 1307 -414 -945 -533 -1801 -3405
3174 -3405 -2777 604 -1711 -600 979 1406 229 1647 1399 -829 -54 917 -1328 -1674 355 440 726
3191 726 932 3036 1594 -164 566 1934 -1600 -1915 -1263 -3115 -3140 -159 -399 -1306 840 3206 1141
3208 1141 -459 680 908 -1489 -1835 1338 -1417 -854 1943 1028 157 2445 3627 43 -268 2289
3224 2289 -948 -2576 -5 -491 -3187 -1140 1779 -1632 -1327 1845 2416 -1065 621 1583 -2167 -2327
3240 -2327 1719 -142 -1716 1640 2963 759 1792 3083 1062 -1982 1080 1091 -2015 -635 461
3255 461 -1865 -1873 1394 299 -1532 384 482 -2095 -1339 -327 -645 -2206 -560 468 -847 919 2477
3272 2477 1498 401 1578 1618 -590 -501 346 -928 -1731 441 335 -826 -153 575 -571 -1064 267 -1180
3290 -1180 -2698 -1755 -887 -1655 -2069 -278 1349 1123 2848 2626 1471 1168 810 498 -1488 -572 107 -292
3308 -292 -1508 -41 1775 -326 165 2075 -822 -1801 320 -1064 -1968 -2297 -276 -1731 -1085 1353
3324 1353 1067 416 1942 2539 -445 219 1153 -605 -2198 815 1069 -611 154 2590 767 -540 1837
3341 1837 430 -1278 -290 579 -3333 -2327 185 -1241 -1395 719 2067 -556 1027 2352 35 -637
3357 -637 1086 402 -1368 525 3130 -705 1086 2177 1668 -1323 613 496 -2122 -1182 86 -1676
3373 -1676 -2338 122 338 -124 456 1420 -70 -836 1103 162 -1725 -219 57 -1207 243 1671 1964
3390 1964 687 1821 2043 -453 -535 39 -1655 -1325 -888 -1180 -1774 -600 -108 -278 -488 70 599 -222
3408 -222 -1099 503 547 -1246 -1626 636 344 338 2654 2235 881 1183 2078 292 -847 -438 -973 -2675
3426 -2675 -1316 480 -1892 -1808 802 917 -603 760 -21 -1463 -973 713 -943 -1932 1398 1568 1129
3443 1129 2372 3337 381 -421 1954 360 -2346 311 984 -983 -2290 1219 37 -1909 1869 1972
3459 1972 -1516 -1190 247 -2154 -3280 66 -1090 -911 969 1767 929 332 3073 1667 194 1142
3475 1142 433 -1232 -861 1742 -1378 -1266 1686 1222 -604 915 1564 -1046 -1755 1130 -1138 -3418
3491 -3418 -539 -654 -1259 149 2270 951 552 2057 939 -413 305 636 -817 -1078 1207 942 -24
3508 -24 448 970 1079 -437 -447 -1062 -1858 -1792 -1249 -1770 -1058 -710 -199 -116 500 1109 827 -123 604 933 -542
3529 -542 54 128 -294 -720 744 2006 211 1090 786 -186 88 74 -23 -2559 -1911 -440 -905 -1565 194
3548 194 860 -563 965 1857 -262 -1470 1429 -79 -1431 178 6 -437 356 3209 979 -153
3564 -153 1869 1461 -2125 -1233 396 -930 -1998 56 -631 -1688 265 692 -601 -749 1552 771 -1483
3581 -1483 -934 662 -1859 -292 1574 -260 -498 2726 1187 325 1102 1568 -911 -1634 525 -1596
3597 -1596 -1645 -377 -629 -519 517 1455 -18 -777 194 499 -1323 -868 -498 -828 -657 1228 1388 1393 2281
3616 2281 1653 343 952 662 -1205 -623 -162 -373 -654 217 -270 324 772 145 195 -203 -452 -680 -1428
3635 -1428 -1123 -1032 -786 -369 465 366 1080 611 1770 2551 933 -630 52 -620 -862 -1020 486 -199 -740
3654 -740 1562 595 271 -172 -193 -1457 -922 -355 -853 -2153 -248 226 -284 466 1673 1249 600 2193
3672 2193 1007 -830 -524 330 -56 -1168 1056 14 -655 -155 990 -876 -1771 238 -959 -1752 -965
3689 -965 -392 -2268 236 558 -40 -781 1963 991 -453 635 916 -1520 -91 954 1317 -599 1388
3706 1388 1329 159 428 1004 -655 -1296 127 -1160 -1867 -1212 -635 -1208 -1637 964 -851 -88 1076 887
3724 887 -171 -1189 -98 -875 -447 388 999 802 909 2231 -9 152 1387 -383 -254 -1332 -266
3741 -266 -1156 -1111 -1142 -72 -79 -183 337 -833 29 -46 -1241 -449 -110 151 675 300 425 565 1210 937 947
3762 947 328 658 515 -541 -812 -667 411 -872 -1284 173 277 199 -625 860 -787 -1021 -528 298
3780 298 -1373 -1307 793 -204 -149 2222 713 228 1611 1888 -72 -315 1031 13 -1118 -302 780
3797 780 -1568 292 926 -820 -323 600 -235 -1465 199 31 -2739 -410 183 -704 -590 2031 1052
3814 1052 323 1028 1223 -1032 -1426 548 -149 -858 -134 1354 -248 -25 689 -148 -900 176 -590 -1761
3832 -1761 -1361 -106 -798 -369 227 -248 -511 267 237 536 446 542 530 -875 251 -134 -318 562 -309 302
3852 302 -90 15 168 -856 -1063 -150 -1007 -1461 -1213 -395 -184 -815 -28 1165 416 157 458 17 372
3871 372 1318 -264 -292 -45 -564 776 926 897 2125 -905 344 515 -1224 -1567 417 -201 -2084 -918
3889 -918 -145 -803 69 1045 -659 -702 1041 1432 -282 -246 511 -873 -1021 941 1822 -245 454 1414 1
3908 1 230 797 -418 -1400 -415 -74 -453 -253 792 -888 -72 840 147 -542 76 736 -1020 -1288 443
3927 443 31 -870 1406 2137 -73 892 1340 283 -674 350 125 -1464 -294 -58 -494 -1261 -99 -590
3945 -590 -260 419 1 -750 -572 -144 -966 -599 -763 857 -495 753 1741 430 394 1452 799 -762
3963 -762 318 677 -500 -885 825 -185 -238 -1 -798 -122 -426 -321 -1303 -471 -665 -268 -473 -626 -294
3982 -294 596 520 641 1374 1279 336 -57 1121 228 -627 -126 -35 -856 -836 -35 -481 21 1810 90 -882
4002 -882 191 -862 -374 -917 825 -337 -251 630 174 273 223 2039 839 -429 1063 151 -216 896
4020 896 794 -675 708 328 -276 -1084 1366 263 -963 -1166 79 -1967 -428 235 -995 -1800 883
4037 883 414 -593 -284 1487 -759 -443 791 291 -517 174 503 -181 317 968 603 -823 984 1418
4055 1418 -535 -522 -454 -965 -455 1019 172 43 -8 244 -308 -469 -134 -167 -412 211 610 156 -661 595
4075 595 667 -395 913 529 735 215 -789 -325 203 -942 219 -89 -340 1027 -232 -31 -154 -498
4093 -498 232 -70 -212 -382 -1262 482 633 778 30 90 1126 -122 1410 720 852 640 -35 -540 -38
4112 -38 -7 647 -843 363 365 -305 -846 879 -177 -704 -802 357 117 -1144 108 608 -46 1141 1472
4131 1472 431 498 995 282 -399 501 437 -943 -141 984 -739 -320 560 449 -293 177 -180 -342 -880
4150 -880 -261 -91 -871 -449 1080 564 182 1005 374 -605 680 338 -1015 145 -84 -74 -658 972 107
4169 107 0 -258 -480 -805 -597 507 -397 -237 440 448 -1011 146 1324 441 159 497 1047 -164 -46
4188 -46 -298 -167 134 656 164 -271 219 -411 567 -99 -347 -467 -1600 -651 -917 -710 -479 -706 -398 -199
4208 -199 -345 920 -62 97 -42 289 948 65 429 1087 595 971 931 -204 430 -379 -114 -557 307 -456
4228 -456 -973 -471 -638 -312 -819 -121 336 -710 -75 675 214 -299 341 668 -508 642 1017 -137 550
4247 550 1435 378 106 220 -561 -182 725 11 -580 -627 6 104 -155 56 -402 681 -292 1051 -240
4266 -240 -1070 657 687 -609 -187 1021 -377 1017 1254 1057 441 84 -491 -557 480 -106 -55 -575 39
4285 39 925 -461 -490 -94 -920 -821 11 575 439 732 469 -479 385 317 758 1232 991 850 836 132 -93
4306 -93 751 -83 -701 -190 122 54 341 225 371 -501 -151 -1026 -1172 -1173 24 -247 -322 455 -283 160 867
4327 867 1006 672 -191 1469 -21 636 1153 20 -480 237 237 -885 -250 397 -812 -537 -791 -321 -852
4346 -852 214 -252 -610 -549 632 309 -28 1231 -34 868 -307 891 575 134 449 659 -548 278
4364 278 152 -669 -204 858 753 -1071 -283 631 -438 -573 -71 265 -855 -245 673 -295 -1207 347
4382 347 842 259 -183 386 -233 -648 416 36 914 -39 364 493 -170 513 -344 -696 -320 -87 -725 -129
4402 -129 -293 -722 -346 150 -770 -246 334 75 -111 -485 553 919 264 -121 1159 727 499 909 -404
4421 -404 -536 -398 -16 -1645 569 -207 -196 -1247 209 -160 315 -384 -208 -268 -930 64 694 508 -1299
4440 -1299 1140 302 -594 -52 246 1205 -837 -16 470 -53 498 690 -466 -948 -674 -83 -647 -887 -880
4459 -880 192 -554 -202 -484 -59 -281 -904 -873 25 133 169 27 691 961 -239 948 65 -155 -12 1178
4479 1178 623 -272 -128 903 -194 -622 90 -668 -309 -273 -582 277 -1063 160 -1003 -492 -233 958
4497 958 429 195 741 -236 -1353 428 -235 185 1057 375 -381 -846 -143 -624 380 -321 -277 -912 -37
4516 -37 63 -123 -1142 -411 -733 -785 -551 -41 -1 420 -760 20 -287 31 369 -161 181 -171 -662 158
4536 158 -91 80 -322 -367 794 314 -783 256 174 -596 -684 -785 -133 -868 319 425 -458 -449 -33 444
4556 444 -314 1379 432 -259 1091 -113 -93 -389 -93 -112 -142 928 -845 783 683 208 1240 52
4574 52 -677 579 -184 530 -644 -638 -637 593 188 274 618 485 110 596 1107 497 -705 439 -67 -953
4594 -953 -731 167 -145 -167 373 -747 -514 -50 1006 -953 103 -252 777 159 -406 214 -167 1168
4612 1168 -278 1469 108 132 244 840 458 306 816 -242 460 395 -642 1272 -177 -457 -170 374
4630 374 -535 -607 286 -307 317 244 -59 1174 47 625 1159 -282 -109 565 -82 706 351 696 -609
4649 -609 362 326 248 4 1283 767 359 -689 -1101 21 -143 250 308 167 240 -185 -923 -122 1060 279
4669 279 284 920 164 706 72 -457 360 544 53 -614 355 469 500 -170 -1071 -819 242 16 260 -186 -547
4690 -547 -1010 -979 -484 272 -326 817 884 6 -42 132 -529 -298 557 32 592 659 1118 112 -836 -515 -1025
4711 -1025 -208 -17 -305 -1086 83 -1253 283 -149 368 -85 516 -269 583 -3 -256 513 -692 512
4729 512 218 50 705 254 57 76 365 156 -584 1247 -112 735 -304 -232 -425 -488 488 -204 110 -676
4749 -676 -590 -246 602 -1026 -96 525 220 -87 1124 1179 -290 224 317 -208 231 298 -1154 57 -179 -145
4769 -145 -365 -66 -278 -812 -359 -784 201 -1076 -308 484 -316 231 414 636 313 -125 343 14 555 16
4789 16 -268 530 645 866 -564 429 465 310 -38 426 -329 21 10 -430 -651 -310 -17 -221 304 -994
4809 -994 787 125 -186 17 365 556 441 531 617 -83 418 -234 53 -253 -244 -137 -109 103 -20 -86 -887 -1150
4831 -1150 -517 114 771 151 122 268 -372 -555 9 -392 42 -779 -761 561 813 169 1150 531 669 -398
4851 -398 674 -318 212 153 -749 -132 -746 1015 -1048 -880 664 -157 143 65 22 -525 891 -655 -502
4870 -502 -352 411 303 474 389 -177 201 269 1064 173 -696 -381 308 44 285 -10 -1231 -640 174 -209
4890 -209 -333 -555 -434 -95 23 147 355 -325 -6 434 138 151 819 -350 452 747 415 800 -190 -549
4910 -549 461 -697 -38 -96 -339 152 367 -660 -335 -569 -557 -937 97 -796 59 655 927 -461 1225
4929 1225 466 220 288 -1125 267 262 -411 -293 -51 -655 28 881 -682 -450 -902 -504 488 18 120 33
4949 33 -488 10 84 77 355 -821 391 28 234 869 132 443 -140 206 -291 613 164 -199 -173 558 -784
4970 -784 -41 468 -606 -990 769 -868 -641 519 -611 -1042 85 -55 -798 29 356 7 333 -107
4988 -107 -316 68 573 507 238 -19 -34 1498 649 -826 -49 -257 172 -696 -212 -56 -495 407 -287 -9
5008 -9 542 912 765 387 -604 -385 -186 -43 877 104 381 165 -907 87 651 362 -623 -318 106 -818
5028 -818 -1225 -596 -1286 -848 433 -852 -657 -811 110 452 28 -257 -756 -313 -8 307 -58 153 -4
5047 -4 172 1004 350 -175 -101 -502 -599 -263 223 -844 177 -482 -1195 -199 -196 -347 -353 -145 937 -633 66
5068 66 -111 359 -58 266 280 787 -611 329 -47 154 110 -320 267 464 867 155 -715 532 476 -282 -164
5089 -164 5 -1428 -581 575 -480 -868 -154 17 1278 314 1573 122 38 720 599 78 367 445 -15
5108 -15 -237 442 136 -810 -132 -52 175 -185 -257 -427 560 881 -35 -271 -321 -389 692 569 618 -336 -240 516
5130 516 -193 -159 -226 395 -376 689 37 122 -355 309 -725 -634 773 72 -30 -367 -745 -875 477 110
5150 110 -486 126 -387 -632 -61 -97 -741 327 1352 -59 -591 -109 -93 92 -788 66 885 -188 827
5169 827 -669 -509 -1262 -492 296 -665 101 -1086 -743 -95 -763 -1107 584 110 -279 408 287 -78 -514
5188 -514 387 843 260 327 892 407 401 -149 200 -638 -590 540 -822 -465 -465 -166 -312 -423 -452 -23 -95 138
5210 138 36 -659 599 375 -239 529 312 902 882 -36 824 114 20 611 -348 -376 -13 -587 500 687
5230 687 -6 -77 -128 1030 1 -553 -149 139 -305 -314 355 -19 -434 626 606 479 51 -6 747 237 1063
5251 1063 127 -1022 271 -268 574 -213 189 -483 -469 -330 -356 -288 -469 -488 -393 -145 218 -542 837 1177
5271 1177 454 560 -383 563 306 217 180 -425 27 427 621 -71 -1104 -570 -371 506 -518 -627 -239 159
5291 159 166 -429 -290 6 436 91 -241 -176 431 318 536 671 565 582 -498 65 528 89 634 -377 -360
5312 -360 588 -237 211 -1202 -1002 -830 -229 -241 -283 733 415 -77 7 948 991 -68 -906 285 907 430
5332 430 371 -57 -763 506 158 265 -552 124 1153 502 -333 -53 -106 -1267 -46 -386 -12 98 1016
5351 1016 -515 97 -84 -153 -725 506 307 226 1123 634 233 194 423 -706 -934 -584 221 55 145 -542
5371 -542 -171 1 23 -89 -507 175 -86 443 -112 -274 -235 -44 -169 608 -146 729 549 -501 176 755
5391 755 367 -39 732 -224 542 911 -348 -207 79 -831 266 158 -250 -777 -6 112 19 -463 144 -590
5411 -590 -373 161 652 -42 73 210 554 -774 369 344 -525 -563 -816 -157 -613 613 156 -378 442 92
5431 92 -510 -359 -327 -1105 -648 119 296 -537 438 -20 -459 284 189 276 266 -81 837 -122 837 -110 246 -79
5453 -79 233 323 -938 -228 -93 -769 -128 -395 -671 -214 -57 71 -571 -321 567 -485 -276 1131 -462
5472 -462 66 406 -489 -94 753 646 310 487 -193 -572 -278 -572 -710 -719 -632 -206 473 -445 -795 461 -450
5493 -450 243 -226 96 77 1110 -143 541 597 -313 -308 719 129 -549 1255 -350 356 -22 88 -385 -191
5513 -191 -713 -271 13 -172 -286 -610 -60 -934 823 -248 267 779 41 -463 -79 342 -500 920 -171
5532 -171 143 -299 193 -187 559 585 -389 587 -446 -185 -1170 -1096 315 -317 -88 -820 255 -48 967
5551 967 -206 551 149 -30 -577 41 516 -172 832 33 73 -291 -154 277 -185 185 139 -256 -210 307
5571 307 -512 -977 -817 -40 -714 -603 182 484 -257 -312 -495 -64 -67 293 293 184 667 682 333 -176 -866 449
5593 449 -222 -691 -195 -33 753 784 -1058 -204 328 -448 -214 -903 -511 164 -121 582 488 -547 8 -767
5613 -767 -45 918 -99 -854 721 -12 1160 668 117 -1259 -69 457 -136 -454 -666 54 -941 48
5631 48 -325 265 -508 -39 152 -451 -248 1004 -583 180 178 -388 -368 -669 640 -215 796 -465 64 125
5651 125 556 -395 -29 -427 -214 198 -56 -401 -636 -1034 -161 -52 -341 -453 -465 -402 -1138 17 -565 -599 15
5672 15 577 102 665 427 389 -144 -110 39 -378 -125 -764 -139 454 76 -486 403 -1051 -758 830 480
5692 480 -404 -282 261 -1010 -113 45 408 797 554 104 1187 990 -47 -208 111 3 901 -256 -27
5711 -27 -125 -237 -61 -825 220 -78 -1410 -230 -57 -316 -544 1064 -893 82 222 657 -217 267 510
5730 510 1019 827 181 464 -287 -225 214 -131 -118 83 -514 -98 -921 195 213 -1171 -1238 -56 -960 -319
5750 -319 -746 -258 -45 102 495 399 -340 879 -396 -183 1194 825 -51 74 457 -305 -496 -370 -396 -326
5770 -326 -514 -461 -78 -896 485 879 -896 -852 -955 -322 520 1274 577 196 -88 117 813 510 1302 -720
5790 -720 -46 -397 1163 -181 -644 37 -342 -363 -444 -536 -165 -239 -724 346 -103 -386 -952 701 388 152
5810 152 -254 -152 -364 313 252 -306 396 -31 1742 541 252 1352 -15 -416 21 -562 -22 -1256 -375
5829 -375 -717 -65 339 -130 -963 25 -146 -799 -624 358 -127 87 284 634 893 261 636 349 860 168
5849 168 -212 -40 668 -124 101 224 -30 -226 196 -238 -629 -930 -399 -853 -1279 -544 302 -74 -6 153
5869 153 -173 -13 90 -579 526 738 28 218 30 723 297 502 191 451 -645 -231 -157 -555 -859 -209
5889 -209 -419 0 -591 -909 271 -551 -471 -152 -11 1630 252 252 443 -76 -193 204 329 68 -41 840
5909 840 438 -92 185 -638 -386 446 -473 -330 107 14 -806 -565 -105 595 -476 -981 648 646 -576 -499
5929 -499 504 699 -461 292 637 -1196 287 511 701 688 55 -590 -345 -296 -872 -142 -333 44 448
5948 448 91 32 -1116 -273 -83 -43 -120 -76 750 151 -23 -204 -384 497 486 750 841 -446 -541 76 238 271
5970 271 -273 -338 -756 567 137 694 180 -687 -579 338 -743 -209 -548 608 -205 -98 -579 911 151
5989 151 -225 449 358 1005 -59 132 727 -438 -687 -733 158 344 -173 709 49 726 -43 567 -806 -833
6009 -833 -513 51 899 -325 331 178 1594 -361 -196 309 265 -913 -50 -29 -101 -56 179 -646 -455 -299
6029 -299 259 177 249 673 -64 -764 -458 -1044 -338 -294 481 1232 -243 477 307 879 -49 1494 497 -87
6049 -87 389 -256 344 -444 -90 393 -416 -225 142 -1535 427 -1307 -395 -971 467 144 -764 -368 668
6068 668 597 895 909 290 150 1472 -363 -181 862 1063 186 -98 807 80 -129 -397 463 861 -1013
6087 -1013 -434 401 -842 432 -1000 -34 167 -448 -78 205 371 -162 548 -112 247 -579 360 -355 959
6106 959 -207 -55 42 -697 -369 -58 641 -692 120 -562 -286 -205 -205 -339 -449 120 434 -365 124 896 291
6127 291 -733 41 -415 617 89 649 391 520 459 911 -19 42 -52 -206 -1084 -531 -984 -161 -997 -698
6147 -698 692 387 716 216 441 441 -214 340 198 351 189 357 628 -382 1137 769 -280 576 28
6166 28 -360 -191 -395 78 -163 -1028 -269 -239 -346 608 -89 449 209 135 -306 316 60 -446 408 -548 922
6187 922 485 1087 -236 704 439 94 193 -222 -353 -44 905 165 -21 -4 293 -27 390 -866 -673 -842
6207 -842 -177 -359 -334 -149 577 -37 -348 1048 316 937 -181 942 195 234 74 29 -421 -294 445 -238
6227 -238 -340 -70 666 -147 90 -649 -498 131 -467 -170 -821 413 864 -565 -40 -158 226 15 -298
6246 -298 -514 5 -429 734 1064 550 -79 41 328 164 -1086 -136 -782 -684 -100 -427 -635 154 574 225
6266 225 -41 8 486 264 439 235 -6 -182 -96 346 116 712 -272 -271 117 -64 -122 234 -1411 -106 -519
6287 -519 -733 112 724 -695 646 -434 -760 582 -173 -103 -296 -319 -435 -487 145 710 -791 575 765
6306 765 629 477 524 334 -248 -54 -187 60 -107 368 -874 -227 -97 -584 -460 -313 -1060 -291 213 -530
6326 -530 -248 362 359 481 298 59 216 614 -236 89 570 -819 -105 278 320 -59 -735 143 329 -159 744
6347 744 408 742 -9 124 -884 -883 231 -1065 297 40 -390 748 775 858 -178 -370 282 38 75 20
6367 20 -667 -109 20 225 -81 1002 -3 -175 451 179 -182 -789 407 -87 -712 545 -152 1258 518
6386 518 511 908 462 530 220 213 -112 0 -466 -285 -123 145 -16 364 -240 539 -442 -861 79 -55 -1067
6407 -1067 -1041 -198 -465 409 183 202 644 -132 -725 527 28 90 864 -244 56 274 516 -47 -378 -680
6427 -680 -74 943 -396 -379 321 -358 -112 -829 -177 -686 401 -18 -387 1092 272 179 496 -345 -497
6446 -497 -3 553 475 -510 367 655 -225 612 544 -654 -718 -664 -862 -945 78 -152 -477 114 79 -433 381
6467 381 850 -411 52 -278 -206 137 -307 642 -272 -14 483 370 -389 -595 -228 170 -598 560 168 -744
6487 -744 387 53 224 -102 -259 318 399 -345 -628 172 -818 496 293 -1628 424 562 594 717 571
6506 571 271 823 -387 -280 -17 -1128 -142 -79 615 -335 -544 -169 -550 794 942 -656 604 -106 712
6525 712 -179 -20 -214 34 249 438 817 694 124 -274 -197 -357 -659 -382 -340 -152 136 132 70 292 178 -200
6547 -200 -835 -625 -528 618 183 654 -160 -531 604 -39 -698 -488 315 534 -100 -900 -135 -426 -92 980
6567 980 -660 -371 693 560 -390 398 -690 -1046 -109 -1708 -111 -525 538 -134 -227 -282 -114 670 -553
6586 -553 400 782 81 -899 -183 138 357 4 -96 753 -139 -351 -1089 801 466 -677 -390 -214 -639
6605 -639 -246 416 -321 814 -100 147 537 507 687 -435 -534 499 457 -191 -63 -323 490 225 747 304
6625 304 25 -229 -300 507 -660 -669 -568 -655 -1429 242 -279 -363 720 -445 -611 -287 188 -572 319 429
6645 429 948 94 470 -321 -432 454 1186 6 -537 -169 -261 -536 152 -169 47 -7 -47 452 -208 478 -765
6666 -765 -617 -684 -1085 -379 205 249 19 863 454 1263 266 553 442 346 -194 189 49 -40 -143 -476 -300
6687 -300 526 -2 -666 692 -304 -852 529 -156 -1133 -725 -219 -230 183 511 784 1115 1054 314 512 360
6707 360 -110 8 -461 -1061 -80 579 -674 -420 -504 -28 -887 -566 -733 31 -409 -567 402 -353 698 -525
6727 -525 245 499 86 623 143 -413 489 572 -98 -23 -706 -779 -379 -90 35 -477 414 -407 -410 -808 -449 -437
6749 -437 -1428 -847 742 263 -636 1157 279 885 91 852 -185 458 122 -232 1079 147 54 286 1017
6768 1017 58 264 -182 -444 251 -160 -180 318 -8 -298 -364 -561 356 -442 -154 -282 449 436 -1334 -15
6788 -15 -154 -46 -342 -311 1111 727 222 92 -435 485 -268 251 219 -188 -449 292 -204 -348 303 -131 239
6809 239 521 -695 551 448 -1155 321 -196 -277 79 -118 1253 389 -172 -341 141 -242 459 510 187
6828 187 675 257 -380 -529 42 418 -771 -564 74 -157 -193 118 805 -201 -563 417 28 679 -292 489
6848 489 295 283 -25 -171 -158 -124 -37 -746 280 -322 -146 69 -473 -640 -189 -304 -4 -136 -186 -220 450 398
6870 398 587 836 -87 -100 343 157 -322 107 -11 -794 140 -449 57 -19 -916 -792 -116 89 225 -483 -3
6891 -3 -251 -934 194 -691 -234 -875 -493 -45 527 480 -280 167 26 92 136 643 174 696 80 807 444
6912 444 638 281 39 444 272 -1002 -401 -467 -364 532 -333 198 60 673 261 -455 -524 -110 155 1213
6932 1213 213 -256 -555 286 532 287 8 -114 458 -466 -282 -527 96 538 -35 -97 -245 -462 -1221 201
6952 201 -4 397 -247 567 349 -770 609 723 783 70 106 997 148 102 324 247 -455 458 -221 -268 -1296
6973 -1296 -450 -602 -217 -199 119 -373 875 1915 -11 -767 55 -415 -481 1339 -88 298 800 534 -254
6992 -254 794 771 1015 -267 126 -16 314 -403 -823 -78 -50 187 -316 47 -322 522 -688 -236 142 -33
7012 -33 111 108 -197 -398 -289 838 -913 -29 542 342 364 -243 -348 -662 225 -632 235 49 276 434 -440
7033 -440 333 419 -716 793 -194 436 261 234 -1204 -494 1206 674 943 926 761 -444 752 -649 -3
7052 -3 -911 -939 -124 -383 -323 621 400 479 -209 -472 -605 -881 -722 -481 -307 -494 403 781 663 50 1192
7073 1192 1233 -256 -36 428 344 -478 -415 294 534 43 1145 260 622 -536 411 -303 -176 161 -156 -121
7093 -121 -192 -936 -85 -149 -147 25 250 -130 522 928 -19 145 -176 424 -502 604 448 554 343 -176 -746
7114 -746 497 -563 -262 -143 -143 469 -1409 131 12 111 370 -120 -342 -352 -4 -56 614 -661 36 593
7134 593 288 -271 -453 430 67 -36 -85 845 60 -46 -124 215 -125 -519 -484 945 -562 512 -481 -255
7154 -255 559 -484 207 327 149 440 532 548 -57 366 181 -305 636 -20 473 -576 154 -754 402 131
7174 131 -215 260 -122 293 288 233 -603 -632 -272 -328 -223 539 -25 -395 11 418 -560 849 -330 -138 862
7195 862 464 -144 173 -1344 205 -584 389 148 -918 -112 -599 122 420 92 -440 280 -390 498 -19
7214 -19 298 852 -671 215 811 469 423 -259 -145 269 -642 -32 -668 365 3 -752 811 -184 -236 -624
7234 -624 -720 -506 1012 -384 -436 -707 70 346 720 315 685 326 -273 734 1066 -464 -108 -247 71
7253 71 -457 83 -240 -584 70 -855 -319 188 -97 -44 -626 110 -138 -444 710 -64 -41 177 438 444 47
7274 47 287 -657 135 180 280 401 -40 318 -503 568 -475 400 -572 -27 -479 -464 -1102 -210 -34 111
7294 111 197 143 308 36 -6 -1011 -290 -569 270 -64 985 167 580 79 34 82 -539 314 -363 -1049 -771
7315 -771 -462 -332 -373 374 33 -360 143 -301 -995 283 -2 -932 98 -41 -405 131 -159 743 1076 508
7335 508 453 136 -805 72 795 -1147 10 -44 -582 126 41 106 587 469 499 -254 182 -842 158 -391
7355 -391 800 -243 207 -177 -539 237 79 206 -11 1198 -12 -560 -422 -4 -34 602 -38 -166 438
7374 438 -458 591 -188 -1179 -434 -291 -239 525 -39 610 240 53 -308 318 986 476 -77 40 734 241
7394 241 177 366 202 119 -270 -518 -565 355 18 -648 -377 -228 -83 -619 -550 -47 453 -374 -419 -71 26 0
7416 0 -365 286 -106 362 271 -1001 326 -30 -31 -193 299 217 -598 195 -318 -578 -247 -977 -476 140 -841
7437 -841 -272 49 -839 137 502 1431 428 188 -84 146 503 459 818 217 579 -28 96 -631 -152 254
7457 254 45 -398 -235 -57 332 -1359 -927 402 -154 527 1003 252 -237 324 397 271 -498 75 -266 1077
7477 1077 1172 -477 -257 455 -54 203 -1065 -353 1 -89 -198 -35 1027 -542 -169 321 498 374 574
7496 574 299 -596 345 252 271 126 -64 545 301 86 -442 -670 694 -1231 -155 22 -3 11 -62 -187 -196
7517 -196 -507 -86 -529 -31 937 -186 364 369 -588 -53 -16 -173 64 403 -203 430 444 -8 0 -418 -486 -481 -161
7540 -161 -99 121 268 435 583 652 -620 -410 -644 -509 -319 -513 283 -1023 -1054 396 371 35 -344 118
7560 118 235 -621 -271 613 532 -495 319 -518 -598 73 -601 -145 -425 394 -78 231 73 -476 -767 226
7580 226 -703 -32 176 -177 -732 57 -344 -1 223 124 -33 146 -806 1213 421 137 -93 18 -525 441
7600 441 -1060 -514 -347 282 -314 884 -374 -775 -157 -17 412 -466 135 -356 -512 -302 456 -161 97
7619 97 930 147 351 229 -75 36 121 145 764 817 -486 233 241 558 -688 608 -616 754 -48 -520
7639 -520 233 -246 414 535 -109 -467 650 62 576 77 256 134 564 -328 -306 38 91 -462 -838 53
7659 53 -335 -237 188 -372 392 -497 -221 690 18 -230 113 -682 318 187 130 -516 -926 326 760 433
7679 433 669 -836 -489 -410 359 552 16 260 -131 -48 683 -147 532 74 -203 422 -242 890 81 -264
7699 -264 250 134 341 -326 -556 585 579 -47 -674 -188 252 -385 -565 795 -390 -29 -748 -530 -227 -339
7719 -339 857 328 89 -736 -57 -267 183 387 293 -42 284 567 201 384 -196 -337 -61 900 608 818
7739 818 -698 269 -536 551 174 139 481 -654 42 49 -117 521 -45 -27 308 186 299 595 -73 233
7759 233 -412 382 75 572 211 -921 221 266 267 -153 108 -23 366 -373 -340 -67 20 -154 167 454 498
7780 498 1050 177 211 -381 79 -62 -962 -119 130 778 -168 595 -376 170 549 168 -41 -64 -146 -308 -69
7801 -69 423 -791 -154 415 -278 -335 -562 -12 -773 -780 367 67 253 -606 -276 509 156 653 34 902 79
7822 79 820 341 200 388 855 -1126 509 1106 184 380 -359 -996 -449 34 102 812 -244 -353 258 591
7842 591 297 -68 -217 323 182 518 484 585 -5 7 -448 54 -99 472 567 -123 674 -572 851 -793
7862 -793 343 -202 -654 407 194 -38 -162 345 -196 -655 380 -298 8 90 461 -65 233 678 633 -9
7882 -9 865 -547 -171 -982 -188 -271 -38 -698 1004 359 -455 -851 -871 427 52 73 -269 301 165 107 958
7903 958 587 -99 140 -522 348 -192 -334 -825 210 809 79 657 -81 141 -651 -837 171 108 208 -13
7923 -13 513 -480 -416 775 -794 858 804 287 414 -99 -52 526 603 -763 629 619 -76 87 117 718 -184
7944 -184 -238 -153 -387 -934 60 -673 645 390 -318 -1043 186 454 -492 75 91 715 -266 426 -613 -169
7964 -169 -688 -657 173 -94 -297 -967 82 441 527 -121 286 148 -21 264 180 -77 -863 -845 -374 325 -290
7985 -290 -365 869 -736 793 512 241 312 -134 552 -383 -168 -934 -8 1460 375 -16 406 34 -672
8004 -672 -25 -404 -211 -248 53 120 46 -440 57 656 -117 -57 252 23 547 763 732 -488 -89 -55 -663 -417
8026 -417 -65 299 565 49 1148 5 55 -287 -563 -767 103 354 -844 -339 -13 -87 607 -1080 628
8045 628 -29 -361 -34 -147 -890 -189 -150 -190 -135 213 1101 -45 172 339 53 218 328 -687 345 -410
8065 -410 467 548 232 -132 410 214 -68 -802 346 638 -174 452 672 -196 561 471 24 -123 -327 -473
8085 -473 18 329 76 9 -232 -32 -772 -566 -634 1001 727 28 460 -779 845 357 128 -522 339 296
8105 296 819 213 268 -843 -360 -296 378 294 310 -747 -545 -522 -163 -545 910 90 -899 240 -61 326
8125 326 61 219 -739 62 610 -584 352 726 -494 -311 558 -826 485 -321 -376 529 -87 261 232
8144 232 428 380 630 -724 -481 38 -319 619 417 675 -330 564 123 -80 805 34 729 603 1049 -180
8164 -180 -139 -61 545 -435 -39 -488 -337 220 787 353 -259 -796 -644 -101 -416 -612 -206 -48 -993 -174 150
8185 150 -300 75 377 787 500 280
8191B80
##END NTUPLES=NMR FID
##END=
