##TITLE=1H_UK-23_4
 CD2Cl2
 108 sc, 
 14.12.2021
##JCAMPDX= 6.0         $$ Bruker NMR JCAMP-DX V2.0
##DATA TYPE= NMR FID
##DATA CLASS= NTUPLES
##ORIGIN= UXNMR, Bruker Analytische Messtechnik GmbH
##OWNER= root
$$ XWIN-NMR		Version 3.5
$$ Tue Dec 14 13:20:34 2021 Russian Standard Time (UT+4h)  she@DPX200
##.OBSERVE FREQUENCY= 200.131346
##.OBSERVE NUCLEUS= ^1H
##.DELAY= (6, 6)
##.ACQUISITION MODE= SIMULTANEOUS
##.ACQUISITION SCHEME= undefined
##.AVERAGES= 108
##.DIGITISER RES= 18
##SPECTROMETER/DATA SYSTEM= spect
##.PULSE SEQUENCE= zg30
##.SOLVENT NAME= CD2Cl2
##.SHIFT REFERENCE= (INTERNAL, CD2Cl2, 0, 15.7039)
##AUDIT TRAIL= $$ (NUMBER, WHEN, WHO, WHERE, WHAT)
$$ ##TITLE= Audit trail, XWIN-NMR		Version 3.5
$$ ##JCAMPDX= 5.01
$$ ##ORIGIN= Bruker BioSpin GmbH
$$ ##OWNER= she
$$ F:/spectra/data/she/nmr/H-F/1/audita.txt
$$ ##AUDIT TRAIL=  $$ (NUMBER, WHEN, WHO, WHERE, WHAT)
(   1,<2021-12-14 13:19:22.34 +0400>,<she>,<DPX200>,
      <continue with go, POWCHK disabled, PULCHK disabled
       configuration hash MD5:
       00 E9 B6 7A A2 85 ED C7 34 08 36 98 17 FE 4E 26
       data hash MD5: 16K
       60 4C EE 1E AB 1B 0D 18 22 64 AA 87 C9 67 73 A2>)
$$ ##END=
$$ 
$$ hash MD5
$$ B8 7A DA D0 7B 9B 53 6C 98 3F 49 1B 27 8D F3 76
##$RELAX= 
##$RELAX= 
##$RELAX= 
##$RELAX= 
##$RELAX= 
##$RELAX= 
$$ Bruker specific parameters
$$ --------------------------
##$DU= <F:/spectra>
##$EXPNO= 1
##$NAME= <H-F>
##$PROCNO= 1
##$TYPE= <nmr>
##$USER= <she>
##$AMP= (0..31)
100 100 100 100 100 100 100 100 100 100 100 100 100 100 100 100 100 100 
100 100 100 100 100 100 100 100 100 100 100 100 100 100 
##$AQSEQ= 0
##$AQ_mod= 1
##$AUNM= <au_zg>
##$AUTOPOS= <>
##$BF1= 200.13
##$BF2= 200.13
##$BF3= 200.13
##$BF4= 200.13
##$BF5= 200.13
##$BF6= 200.13
##$BF7= 200.13
##$BF8= 200.13
##$BYTORDA= 1
##$CFDGTYP= 0
##$CFRGTYP= 5
##$CHEMSTR= <none>
##$CNST= (0..31)
1 1 145 1 1 1 1 1 1 1 1 1 1 1 1 1 1 1 1 1 1 1 1 1 1 1 1 1 1 1 1 1 
##$CPDPRG= <>
##$CPDPRG1= <>
##$CPDPRG2= <>
##$CPDPRG3= <>
##$CPDPRG4= <mlev>
##$CPDPRG5= <mlev>
##$CPDPRG6= <mlev>
##$CPDPRG7= <mlev>
##$CPDPRG8= <mlev>
##$CPDPRGB= <>
##$CPDPRGT= <>
##$D= (0..31)
0 1.2 0 0 0 0 0 0 0 0.06 0 0.03 0 0 0 0 0.0002 0 0 0 0 0 0 0 0 0 0 0 0 
0 0 0 
##$DATE= 1639473167
##$DBL= (0..7)
120 120 120 120 120 120 120 120 
##$DBP= (0..7)
150 150 150 150 150 150 150 150 
##$DBP07= 0
##$DBPNAM0= <>
##$DBPNAM1= <>
##$DBPNAM2= <>
##$DBPNAM3= <>
##$DBPNAM4= <>
##$DBPNAM5= <>
##$DBPNAM6= <>
##$DBPNAM7= <>
##$DBPOAL= (0..7)
0.5 0.5 0.5 0.5 0.5 0.5 0.5 0.5 
##$DBPOFFS= (0..7)
0 0 0 0 0 0 0 0 
##$DE= 6
##$DECBNUC= <off>
##$DECIM= 32
##$DECNUC= <off>
##$DECSTAT= 4
##$DIGMOD= 1
##$DIGTYP= 9
##$DL= (0..7)
0 120 120 120 120 120 120 120 
##$DP= (0..7)
150 150 150 150 150 150 150 150 
##$DP07= 0
##$DPNAME0= <>
##$DPNAME1= <>
##$DPNAME2= <>
##$DPNAME3= <>
##$DPNAME4= <>
##$DPNAME5= <>
##$DPNAME6= <>
##$DPNAME7= <>
##$DPOAL= (0..7)
0.5 0.5 0.5 0.5 0.5 0.5 0.5 0.5 
##$DPOFFS= (0..7)
0 0 0 0 0 0 0 0 
##$DQDMODE= 0
##$DR= 18
##$DS= 0
$$ [...]
##$SUBNAM2= <"">
##$SUBNAM3= <"">
##$SUBNAM4= <"">
##$SUBNAM5= <"">
##$SUBNAM6= <"">
##$SUBNAM7= <"">
##$SUBNAM8= <"">
##$SUBNAM9= <"">
##$SW= 18.0517287032376
##$SWIBOX= (0..15)
0 0 2 0 0 0 0 0 0 0 0 0 0 0 0 0 
##$SW_h= 3612.71676300578
##$TD= 16384
##$TD0= 1
##$TE= 0
##$TE2= 300
##$TE3= 300
##$TEG= 300
##$TL= (0..7)
0 120 120 120 120 120 120 120 
##$TP= (0..7)
150 150 150 150 150 150 150 150 
##$TP07= 0
##$TPNAME0= <>
##$TPNAME1= <>
##$TPNAME2= <>
##$TPNAME3= <>
##$TPNAME4= <>
##$TPNAME5= <>
##$TPNAME6= <>
##$TPNAME7= <>
##$TPOAL= (0..7)
0.5 0.5 0.5 0.5 0.5 0.5 0.5 0.5 
##$TPOFFS= (0..7)
0 0 0 0 0 0 0 0 
##$TUNHIN= 0
##$TUNHOUT= 0
##$TUNXOUT= 0
##$USERA1= <user>
##$USERA2= <user>
##$USERA3= <user>
##$USERA4= <user>
##$USERA5= <user>
##$V9= 5
##$VALIST= <valist>
##$VCLIST= <CCCCCCCCCCCCCCC>
##$VD= 0
##$VDLIST= <DDDDDDDDDDDDDDD>
##$VPLIST= <PPPPPPPPPPPPPPP>
##$VTLIST= <TTTTTTTTTTTTTTT>
##$WBST= 1024
##$WBSW= 4
##$XGAIN= (0..3)
0 0 0 0 
##$XL= 0
##$YL= 0
##$YMAX_a= 1255977
##$YMIN_a= -911768
##$ZGOPTNS= <>
##$ZL1= 120
##$ZL2= 120
##$ZL3= 120
##$ZL4= 120
##$ABSF1= 10
##$ABSF2= 0
##$ABSG= 5
##$ABSL= 3
##$ALPHA= 0
##$AQORDER= 0
##$ASSFAC= 0
##$ASSFACI= 0
##$ASSFACX= 0
##$ASSWID= 0
##$AUNMP= <proc_1d>
##$AZFE= 0.1
##$AZFW= 0.1
##$BCFW= 1
##$BC_mod= 2
##$BYTORDP= 1
##$COROFFS= 0
##$CY= 11.3945322036743
##$DATMOD= 1
##$DC= 2
##$DFILT= <>
##$DTYPP= 0
##$F1P= 2.36226072786647
##$F2P= -0.459571619588291
##$FCOR= 0.5
##$FTSIZE= 0
##$FT_mod= 4
##$GAMMA= 1
##$GB= 0.15
##$INTBC= 1
##$INTSCL= 1
##$ISEN= 128
##$LB= 0.24
##$LEV0= 0
##$LPBIN= 0
##$MAXI= 10000
##$MC2= 0
##$MEAN= 0
##$ME_mod= 0
##$MI= 1.114404
##$NCOEF= 0
##$NC_proc= 0
##$NLEV= 6
##$NOISF1= 3.799351
##$NOISF2= 2.8
##$NSP= 1
##$NTH_PI= 0
##$NZP= 0
##$OFFSET= 15.70392
##$PC= 1
##$PHC0= -15872.43
##$PHC1= 15.2008
##$PH_mod= 1
##$PKNL= yes
##$PPARMOD= 0
##$PSCAL= 0
##$PSIGN= 0
##$REVERSE= no
##$SF= 200.130013532006
##$SI= 16384
##$SIGF1= 3
##$SIGF2= 2
##$SINO= 400
##$SIOLD= 16384
##$SREGLST= <1H.CDCl3>
##$SSB= 0
##$STSI= 0
##$STSR= 0
##$SW_p= 3612.71676300578
##$SYMM= 0
##$S_DEV= 0
##$TDeff= 0
##$TDoff= 0
##$TI= <>
##$TILT= no
##$TM1= 0
##$TM2= 0
##$TOPLEV= 0
##$USERP1= <user>
##$USERP2= <user>
##$USERP3= <user>
##$USERP4= <user>
##$USERP5= <user>
##$WDW= 1
##$XDIM= 8192
##$YMAX_p= 0
##$YMIN_p= 0
$$ End of Bruker specific parameters
$$ ---------------------------------
##NTUPLES= NMR FID
##VAR_NAME=  TIME,          FID/REAL,        FID/IMAG
##SYMBOL=    X,             R,               I
##VAR_TYPE=  INDEPENDENT,   DEPENDENT,       DEPENDENT
##VAR_FORM=  AFFN,          ASDF,            ASDF
##VAR_DIM=   8192,          8192,            8192
##UNITS=     SECONDS,       ARBITRARY UNITS, ARBITRARY UNITS
##FACTOR=    0.0002768,     1,               1
##FIRST=     0,             0,               0
##LAST=      2.2672688,     0,               0
##MIN=       0,             -911768,         0
##MAX=       2.2672688,     1255977,         0
$$ Real data points
##PAGE= N=1
##DATA TABLE= (X++(R..R)), XYDATA
0@%%%%%%%%%%%%%%q7J95k16K16k16K17l25M32m85N93o78P86r72J116j225J405
30G56j622J863k172K473k784L136l509L940m423M950n513O135o804P537q345R228
46D846j0189J1237j2383J3637j5023J6555j8244K0115k2212K4572k7242L0289
58A5958l3813L7940m2847M8807n6233O5760p8502R6542j24235J72664k82067J037118
70H57092p6920j064470M71194p32416n4623J363461L33415j383128k22415L40726
80a68084k82516L67350J075137m96973j168891N3027M29479j17932M62483M85871
90F38951p25444p51505N26277N34164j7853K71400O8328q46571l53183O81500
100B6064L16931k08898J00165k06175o25185J92305P52772O4511k29440l3330
$$ plain form
0 0 0 0 0 0 0 0 0 0 0 0 0 0 0 0 -87 108 -108 108 -108 109 -216 216 -269 324 -354 432 -540 576 -649 756
30 756 -866 997 -1175 1298 -1486 1650 -1859 2081 -2342 2608 -2905 3230 -3574 3963 -4382 4846
46 4846 -5343 5894 -6489 7148 -7875 8680 -9564 10551 -11661 12911 -14331 15958
58 15958 -17855 20085 -22762 26045 -30188 35572 -42930 53612 -70623 102041 -180026 857092
70 857092 780172 -284298 186896 -545520 -600143 763318 1096733 -286395 -508810 -168084
80 -168084 -450600 -83250 991887 494914 -673977 -620950 -191471 -309403 153080 638951
90 638951 -86493 -837998 -311721 222443 204590 475990 544318 -302253 -655436 26064
100 26064 342995 134097 234262 28087 -597098 -404793 347979 412490 183050 149720
110A49720l46438k80682M51271L96759k00921k09431j32880k15881J84875M90461
120B86853J07130k12773j81587j96315k900L33138J72939j87948j95596j60360
130b37419r8072K63065L61570o6609k32670n5482r7412k9632L25240J68772l43552
141d2201k20627J06683l5257N8930M06118K1856m40439n640K62310j08898M1709
152D4544L18626k57339m71452K24689K66739j94668J32444K75411l88403k76723
162c26132M40404J37042l07839J31674J00063m76924o6615N07161k1230k92597
172a74993K27435N9328l83825J60235M63439k19693l00431K30647n1734l26209
182c15801K84116L41182l41689j67321L18666o8339k01043L46099J31878m43121
$$ plain form
110 149720 -196718 -477400 -26129 370630 169709 -39722 -172602 -388483 -203608 286853
120 286853 393983 181210 -377 -196692 -199592 133546 306485 118537 -77059 -237419
130 -237419 -335491 -72426 289144 222535 -10135 -65617 -163029 -192661 132579 301351 -42201
141 -42201 -262828 -156145 -191402 -132472 273646 295502 -144937 -150577 111733 2835 44544
152 44544 363170 105831 -365621 -140932 125807 -68861 63583 338994 -49409 -326132
162 -326132 114272 251314 -56525 75149 175212 -301712 -368327 138834 117604 -174993
172 -174993 52442 111770 -272055 -111820 351619 131926 -168505 62142 10408 -315801
182 -315801 -31685 309497 -32192 -199513 119153 50814 -150229 195870 327748 -115373
192a15373o2488K73874j62072j15322L21914k2932l57383J25676K68949j43006
202A1837j8806K26667j58746k75583J71576J51553j70781O193J41513j52462j06797
213a73836K35038J05921j43218J1732N2852j58322m5760J68566O4j40106J6816
224g0253M0643n6289O4169J39683k6294r1801L211N1k3323L0084K0715n1258n2642
237g3304j480N0394P1457K3920j7207l573l3229m2089M9489M2077q4877n8335
249g6757M0291k4342k6468J19197O2780j09138j0877R2443n6104n3530J10840
260F8335j6339j74756L1447J24462p5545j6467J63090l4999j52365J09461J08598
271A34922j47591k1706J29159j22529j43397J66990P9220j58608N2374J51552
$$ plain form
192 -115373 -177861 96013 -66059 -181381 140533 117601 -239782 -114106 154843 11837
202 11837 -6969 219698 60952 -214631 -43055 108498 -62283 -56090 85423 -67039 -173836
213 -173836 61202 167123 23905 35637 88489 -69833 -115593 52973 53037 -87069 -70253
224 -70253 -29610 -85899 -21730 117953 91659 -142 3069 3120 -20203 9881 30596 -20662 -73304
237 -73304 -74784 -24390 47067 70987 53780 50207 16978 -25111 24378 66455 -18422 -76757
249 -76757 -36466 -60808 -87276 31921 94701 -14437 -25314 67129 11025 -42505 68335
260 68335 51996 -122760 -91313 33149 -42396 -58863 104227 69228 -83137 26324 134922
271 134922 -12669 -34375 94784 -27745 -171142 -4152 75068 -83540 -31166 120386
281A20386j32954p2691K04114m320k02412O7479R7769j81987k4874K12591n3090
292C0011j56979J49065Q8942j67595M4004J79085j37878j49405J49825J6196j73177
303a27906Q3471J44557j49446n5759J93423n674j37851J08603P0787j84390l0343
314i0528J50666o6457j11047J23177M3840j34261N3464J48943p8903p6145J04655
325F7404j6164j34068N0847Q3896j00390l9366J07027j0683o5369R0518O3128
336I6780r0640j9068O8496m4274o4419N2013J4152p5014Q828P0265j0822j6196
348i899N5924R517n2579k043K7432k6281l5755J2022K345k6236J1111M6903J3715
361B6176j6121J2074K0982k2153k6078J8825m417n0357p402L8720j0501j5682
$$ plain form
281 120386 -12568 -85259 118855 114535 -87877 -20398 77371 -104616 -129490 83101 30011
292 30011 -126968 22097 111039 -56556 -12552 166533 28655 -120750 29075 45271 -127906
303 -127906 -44435 100122 -49324 -105083 88340 82666 -55185 53418 124205 -60185 -90528
314 -90528 60138 -6319 -117366 5811 49651 -84610 -31146 117797 38894 -37251 67404
325 67404 51240 -82828 -31981 51915 -48475 -87841 19186 8503 -56866 33652 96780
336 96780 6140 -12928 55568 11294 -53125 -1112 13040 -61974 -53146 17119 6297 -9899
348 -9899 46025 55542 2963 920 28352 2071 -33684 -21662 -19317 -45553 -34442 12461 26176
361 26176 10055 22129 43111 20958 -5120 13705 9288 -41069 -48471 -9751 -20252 -35934
373c5934N5212K5735m8067R140N5758l9804n2308M3535l411q0243K1757P3498
385B4868m3681k4650R0172M343p6143N0350O0581r2386l8463P9563m0701q5744
397i1891Q1202N6417r3094J4253J10506m9517o8325R6126J2741j29460K0362Q4796
409D4116r0753m7918J23179k362j01788Q1119Q8627j01867j7292J10766n8901
420B6926j07488Q5482L9820j20471K2193J14461o6573n4960J21495J7394j12314
431c4035M4923O9663j05998m2905J01124k8946r6108P7977O1580q6059J3527J04656
443G9399m7907o9549P5135R466j01505K1145O4156o6510l2507Q8495M294n8162
455c4050N5588M6014o6100j2215N3292l7171n4668L9381J2117n0273J9817N0189
$$ plain form
373 -35934 19278 45013 -3054 6086 61844 22040 -30268 13267 9856 -70387 -48630 24868
385 24868 -18813 -43463 46709 51052 -25091 25259 85840 -6546 -45009 34554 -6147 -91891
397 -91891 -10689 45728 -47366 -33113 77393 27876 -40449 55677 68418 -61042 -40680 44116
409 44116 -46637 -94555 28624 26262 -75526 5593 94220 -7647 -24939 85827 26926
420 26926 -80562 4920 44740 -75731 -53538 60923 -5650 -60610 60885 78279 -34035
431 -34035 10888 80551 -25447 -68352 32772 3826 -92282 -14305 47275 -38784 -25257 79399
443 79399 31492 -38057 37078 46544 -54961 -33816 30340 -36170 -68677 19818 24112 -34050
455 -34050 21538 67552 1452 -10763 42529 5358 -49310 -9929 2188 -48085 -28268 21921
467B1921j6608r859M1080o73l3084Q083Q027k9588j1943Q482l027l216J4670J2833
481G098R245L082j209L729k431k0855j0246P848j8752k0150K8239J5791k4249
494b2860K0168L8693k6730j6905M2377j1611n6354K2737K6931n7139j981O8028
506B5354k1106l9450O6818K6365p0045J7857N9330o6356m8347P0465r087q0939
518f9141N2552O1931p3794n255R8547l4027p3929P3431K3225j05305J2594P9514
530D0343o8588m7730J00918M206q3075O2457O9880q7512j8306R0135m6874q4082
542f8228P1547K8340r2742K4778Q7518n5658l6170R2409r95q3289M0403M6399
554E4312q2795j9410P3762l1962n5914O7018L2441o1874K2163O3084m8223l4862
$$ plain form
467 21921 5313 -4546 36534 35861 2777 10860 18887 -10701 -22644 -14162 -17189 -20405 -5735 7098
481 7098 16343 19425 18216 21945 19514 -1341 -11587 -3739 -22491 -42641 -14402 1389 -22860
494 -22860 -2692 36001 9271 -7634 34743 23132 -33222 -10485 16446 -40693 -42674 25354
506 25354 4248 -35202 31616 57981 -12064 5793 65123 -1233 -49580 20885 11798 -69141
518 -69141 -16589 45342 -28452 -33707 64840 30813 -43116 30315 53540 -51765 -39171 40343
530 40343 -28245 -75975 24943 29149 -53926 8531 78411 -9101 -27407 62728 15854 -68228
542 -68228 3319 31659 -61083 -36305 51213 -4445 -40615 51794 50799 -32490 7913 54312
554 54312 -28483 -47893 25869 -6093 -62007 5011 37452 -24422 -2259 60825 12602 -22260
566b2260N3539j0736o4525K7961L1000m8397k82N4824j3667k5288M2688Q545m1102
579g700Q410J8091l4272j2174K2797j0495j1164K6713R018p573J5994P556j4690
592A0511L317N43k2044j953Q408k0351J450K6689p457q798L1799M046l0991J6419
606A1588J6443m4142r770L3684k2365k8701M3053J6340m0574K3051M6564l8468
618F703k2550M9731j3465n9905L3508K8367n8927J975O7823k8261l9713O7018
630C2304J5171p0886K3456N0612o7100l0781O9776j8577o4980N9362M0938o7423
642b8128J1893P4090m3651m6907O3886L64p7095K6973M9993o0052j6697P4915
654B9584j2816n1621N3051L1389o3645M68N3221m3213m2066N2419M979n6017K9909
$$ plain form
566 -22260 31279 20543 -43982 -16021 14979 -33418 -33700 21124 7457 -17831 24857 33402 -7700
579 -7700 710 18801 -15471 -27645 -4848 -15343 -26507 206 9224 1651 17645 25201 10511
592 10511 13828 14371 -7673 -9626 -1218 -21569 -20119 6570 -887 -9685 22114 26160 -4831 11588
606 11588 28031 -16111 -25881 7803 -14562 -43263 -210 16130 -24444 -1393 45171 6703
618 6703 -15847 33884 20419 -39486 -5978 22389 -36538 -34563 33260 4999 -34714 32304
630 32304 47475 -23411 45 50657 -16443 -47224 22552 3975 -61005 -1643 39295 -28128
642 -28128 -16235 57855 14204 -32703 31183 31547 -45548 -18575 31418 -28634 -45331 29584
654 29584 16768 -34853 18198 49587 -14058 -13590 39631 -3582 -45648 6771 11750 -44267 -14358
667a4358M8417m1671q928N5101j4561m4486L2672J2446n2208M310L6606k7499
679a4159j5952M2609K113k6164K4009J6919k7364m047J6594j8187j8014J6179
691e464l26j3344J3366J2705o096N024J0702p595m857L338j0566q109N227m751
705a0746n350J4553N226q021J3663J2640j6699m439J6364j7919k0113J8712K840
718G11k8182J6026K8302k3929k796L8769j1969l1299K8523Q756m5940N263L3803
731A6038l1120j7943M7592J03l7616L2111K7488m3292l428L9750k6038l7323L5350
744A672J1826m6425J6160M3578k8972j8218M8841j769m6701K3603K5458m8163
756a9110j0370M5628j8601l4366M2655J9256m2195J3865M0358l2589k3394L9687
$$ plain form
667 -14358 34059 -7612 -16540 38561 24000 -20486 12186 24632 -27576 -23266 13340 -14159
679 -14159 -30111 12498 14611 -11553 12456 29375 2011 -2036 14558 -3629 -21643 -5464
691 -5464 -5790 -19134 -5768 6937 841 5865 16567 8972 4115 7453 -3113 -11222 -5995 -10746
705 -10746 -16096 -1543 3683 -4338 9325 21965 5266 827 17191 -728 -20841 -2129 711
718 711 -27471 -11445 16857 -7072 -9868 28901 16932 -14367 14156 22912 -23028 -17765 16038
731 16038 -15082 -33025 14567 14670 -22946 9165 36653 -6639 -10067 29683 3645 -33678 1672
744 1672 13498 -32927 -16767 26811 -2161 -20379 28462 26693 -20008 3595 29053 -19110
756 -19110 -29480 16148 -2453 -36819 5836 25092 -17103 -3238 37120 4531 -18863 20824
768B0824q166m3799K3509K3192l7209n07M2054j2401k2319L1096R950l5119N147
781c748K3107k6079j6923K5515j90k1747J6454J8844j6299j517K1367p799j7332
794f347R752K396j9312P37J2954p172l218J5027L507o650N884M048q146j515K10
809B155o995k898K73k16K638N800j435M650P278n490m697P974o511j2828O254
824d048N050j5179L952J7435p377o648J8923K061j8183P358J0699k0497p859J9321
838E008o826j6654J8463J3502k0468L831K3484j3558j8096K2236o9k8709Q147
851i709K0174k1042p118K9329l111k1668K0347J5310k9030j450K4714j7349k1819
864b2422K4923N679k7262J1080K5594j8610r851K8821l983k6555J3207J5194k7533
$$ plain form
768 20824 12658 -31141 -7632 15560 -21649 -22156 19898 7497 -14822 16274 26224 -8895 -3748
781 -3748 19359 -6720 -23643 1872 1682 -20065 -3611 15233 -1066 -2583 18784 10985 -6347
794 -6347 3405 5801 -13511 -12774 180 -6992 -10210 4817 8324 1674 7558 11606 3460 1945 2155
809 2155 -4840 -7738 -7465 -7681 -5043 757 -678 3972 11250 5760 1063 9037 2526 -10302 -4048
824 -4048 1002 -14177 -10225 7210 -167 -6815 12108 14169 -4014 3344 14043 -6454 -14313 5008
838 5008 -1818 -18472 -9 13493 -6975 -3144 20340 6782 -11314 10922 10853 -17856 -9709
851 -9709 10465 -10577 -17695 11634 8523 -13145 7202 22512 -6518 -7968 16746 -603 -22422
864 -22422 2501 8180 -19082 -8002 17592 -1018 -10869 17952 13969 -12586 621 15815 -11718
877a1718m669K6182r386j8707K3014J1347k2750M652K1588j6142j4609J8209p79
890F232k1659Q117J5489j5463m750K2017k025j5436J3230Q176j8132k511J3482
903F767j0203j1358J3409N052j2628N000J3386o640m034Q780K62j2104J913N500
917C102q069l920Q487R95m478O701M114k625j807L857l566n271k13J116l151j544
933f272M148K505r2j183M975K072m925r22L139l961o742M453L280q026L516R722
949E687m838m102R430J949j1717K614P985j1445n508J2694j849j1829J0893R761
963I725j2627Q8J4077n749j3840J0822N672j8998L167J5383j1101q616J9938O84
977H625j7911J0812J2483j6683o611J8513o771j7735J4375R573j9146K425K0441
$$ plain form
877 -11718 -16387 9795 409 -18298 4716 16063 -6687 -2035 19553 3411 -11198 7011 6232
890 6232 -15427 -7310 8179 -7284 -12034 9983 7958 -7478 5752 13928 -4204 -6715 6767
903 6767 -3436 -14794 -1385 3667 -8961 -3961 9425 2785 -1249 7531 7793 -4311 -2398 3102
917 3102 -4967 -8887 -400 595 -3883 2818 6932 4307 2500 6357 2791 -2480 -2693 -1577 -4728 -6272
933 -6272 -2124 381 289 -894 4081 6153 1228 306 3445 -516 -7258 -2805 475 -7551 -4035 5687
949 5687 849 -3253 6177 8126 -3591 -977 7008 -4437 -9945 2749 900 -10929 -36 9725
963 9725 -2902 -2814 11263 5514 -8326 2496 8168 -10830 -7663 7720 -3381 -11997 7941 8625
977 8625 -9286 1526 14009 -2674 -9285 9228 2457 -15278 -903 8670 -10476 -8051 12390
990A2390j0734j1267J7960K976k0825O673J4624j7603p029J9326k944j6074J3504
1003I77J2644j7446j363J8448r853j4579J4849L879j8575M955J5258j2751p433
1016a0990J9386j223j5612J0072R668j6056k619J3286o823j0507J1898L787j1845
1029g578O170R710q220m158J0183l171p638M988L176p642P07O595k791l119O325
1044C537j011l560K760J090l990K99J180k487j07K031j721J041L085k201j406
1059a460N447j791m846L900J616p099J04Q253o154l365R589O63j0000P101N157
1074G115j1337m81J1387o488j0001J2471K577j3951N771J2372j1191n196J5578
1087H626m180j4313J0968P939j7033K60J7265r732j0542J6832K830j8792Q516
$$ plain form
990 12390 1656 -9611 8349 11325 -9500 -2827 11797 -5806 -12835 6491 3547 -12527 977
1003 977 13621 -3825 -5188 13260 3407 -11172 3677 7556 -11019 -6064 9194 -3557 -10990
1016 -10990 8396 7173 -8439 1633 11301 -4755 -7374 5912 -911 -11418 480 4267 -7578
1029 -7578 -1408 8302 82 -4076 6107 2936 -4702 286 3462 -4180 -3473 3122 331 -2788 3537
1044 3537 2526 -1034 1726 2816 -1174 -875 305 -2182 -2289 -258 -1979 -938 2147 -54 -1460
1059 -1460 3987 2196 -2650 1250 2866 -4233 -4129 4124 -2030 -5395 4194 4857 -5143 1958 7115
1074 7115 -4222 -4703 6684 196 -9805 2666 5243 -8708 -2937 9435 -1756 -6952 8626
1087 8626 4446 -9867 1101 9040 -7993 -7733 9532 -200 -10742 6090 8920 -9872 -1356
1100a356J3753j6013n982J8532n722j6432J4586Q397j9094L066J8258j1656j0394
1113a0057J7864L9j8500Q998J2075j5923l448J7230n835j3234J3971N496j5160
1126f484L513J3189j0054q829J4685j144j2984O817P792j1251n64J2563m797r249
1140f797J1073k80r182L283Q040j0105q79Q359l068m871O613J704o101J791L633
1155C213m124j516N338l546k390M241r53l031M195j01l713K829K497n604M81P422
1171E238o204k893O925k393n260N142M745q627J154P498n191o092R449Q2j0263
1186f690O940P366j1170k073J1644m150j0807J2267L117j3451L221J2962j0361
1199a185n877J4055k173j3057R131Q168j5231M1J4045o968j0278J4054L080j5663
$$ plain form
1100 -1356 12397 -3616 -9598 8934 3212 -13220 1366 9763 -9331 -6265 11993 337 -10057
1113 -10057 7807 7846 -10654 -1656 10419 -5504 -8952 8278 2443 -10791 3180 8676 -6484
1126 -6484 -2971 10218 164 -8665 6020 4876 -8108 -1291 6501 -4750 -5314 7249 2452 -6797
1140 -6797 4276 3996 -5186 -1903 6137 -3968 -4847 3512 444 -4427 2186 3890 -2211 -420 3213
1155 3213 -911 -2427 2911 -635 -3025 1216 263 -2768 1427 1326 -2387 442 2939 -2665 -2184 5238
1171 5238 -966 -3859 3066 673 -4587 555 5300 -3327 -2173 5325 134 -5958 3491 3573 -6690
1186 -6690 250 7616 -3554 -5627 6017 1867 -8940 3327 6444 -7007 -3786 9176 -1185
1199 -1185 -7062 6993 4820 -8237 894 9062 -6169 -6128 7917 949 -9329 4725 7805 -7858
1213g858N588J2027j2364n973J5205m485j0867R002P513j2817m57J3491o364r768
1227h127J2403J663j3325N768R405j0350m200J2662l890r369R356N338j2138J697
1241c107Q723o193m714Q640r01p867N361M309o180q15P541m027m037M460R53m982
1257b836K295K495l915o63M399j531j284J996J51k117R92J797k255q22J759k051
1273a590JL094j806r50K664k9l047K997K007m603N52L077m297k190P202k004n467
1290d389O355K291o724M64Q358o818m743Q527p72r161M949O485p568j325J0206
1305F135m148p032P755J975q916J463P580p220l657J0257r90q892N594O797r617
1320b916o34J0029m066q445P886K319j0080L056Q648o867l605R815m97r485O023
$$ plain form
1213 -7858 -2270 9757 -2607 -8580 6625 2140 -8727 275 7788 -5029 -5486 8005 1641 -8127
1227 -8127 4276 5939 -7386 -1618 7787 -2563 -6763 5899 2009 -7360 1996 7334 -4804 -3107
1241 -3107 5616 -577 -5291 3349 2448 -5419 -58 4251 -1929 -2744 4797 770 -3267 1193 2146 -2836
1257 -2836 -541 1954 -1961 -2624 1775 244 -1040 956 1107 -1010 -18 1779 -476 -1298 461 -1590
1273 -1590 -1589 1505 -301 -1251 1413 1384 -1663 1334 3341 -1262 -710 2367 -1930 -4120 3082 1078 -4389
1290 -4389 1966 4257 -2467 -2003 6355 -463 -5206 3321 2549 -6612 -1663 4822 -2746 -4071 6135
1305 6135 1987 -5045 2710 4685 -4231 -2768 4812 -2408 -6065 4192 3202 -5690 -96 6701 -2916
1320 -2916 -3550 6479 2413 -6032 1854 4173 -5907 -2851 5797 -1070 -4675 5140 4643 -4842 1181
1335A181M692q563j037P784l960o361P825J268p366L353P812p888j337N063J5
1350B481o477K771L451n537M26N364j353l043M849P66m491J669K380l195l113
1365c052L191J01k799J254K492k026N70J867r92q77Q61L35j362r60j36N69P01
1382b63l80P70J333m14q11J099Q81l124m02K701k509k432M217n01l318M180K574
1399C601m522P20K788j339l689K712O01l828P27L881l035r95N429O3m354J761
1415E21L768n697r99M048k574n435N291L112m385MP090l423l974M967N93n783
1431b876J194M151o338j336O895k83m044N160K609n263r34N499l915m066M210
1446F63O72n473K208N162l508j539N298j87m041J264K148n366q9L778j716k741
$$ plain form
1335 1181 5873 -2690 -3727 4057 97 -6264 1561 2829 -4537 -1184 6628 -1260 -2597 2466 2481
1350 2481 -3996 -1225 2226 -3311 -2885 2479 1126 -1917 2932 3698 -793 876 3256 61 -3052
1365 -3052 139 240 -2559 -1305 1187 -839 -269 1598 606 -271 590 925 -437 -1397 -1533 -964 -263
1382 -263 -643 127 1460 1046 235 1334 2215 -909 -1311 1390 -1119 -3551 666 165 -3153 1027 3601
1399 3601 -921 -201 2587 1248 -2441 271 872 -2956 -2229 1652 -1383 -2378 3051 3114 -1240 521
1415 521 4289 -1408 -2407 1641 -933 -6368 -1077 2035 -2350 -2346 4744 1321 -2653 2314 2907 -2876
1431 -2876 -1682 2469 -3869 -5205 1690 1407 -2637 2523 5132 -131 -1065 4434 519 -3547 663
1446 663 1335 -4138 -1930 3232 -276 -1815 3483 3296 -745 519 2667 -2699 -2788 990 -726 -3467
1462c467K944K657l043J012L997j818l361L038k9m307O79J783k582O68K461J253
1478A885k309J104K133j312j703J957j769k197k89J860j636K6L029j55Q9R69k52
1495A430n65j953O29J48k411O95J356q5nJ314K209j795j25M60j95k724J220P34
1513C37l422J291K354o98q60K821Q23j447M7J689l301k064J830l25k356J549K213
1530D81J67j779M262k96k962O76K068m054j167L616j902k864L549K156k581j0
1546f40M641k791j905L224L48n826K80K657k269k190N407L78j838K180K747l883
1562E20j044L531k689m215L616N98l011J722K663j269r64L925j5l377n85K334
1578A740l319j876L307p63k718L716K276j967K24L522j908l384K449m31m828K453
$$ plain form
1462 -3467 -523 2134 -909 103 4100 2282 -1079 1959 1930 -2377 -1698 85 -2497 -1829 632 1885
1478 1885 -424 680 2813 1501 -202 1755 -14 -2211 -2500 -640 -2276 -2250 779 624 713 1682 1430
1495 1430 865 -1088 -459 -311 -2722 -2027 -671 -756 -761 553 2762 967 842 1302 1107 -1617 -397 337
1513 337 -3085 -1794 560 -138 -998 1823 2646 1199 1246 2935 -366 -2430 -600 -925 -3281 -1732 481
1530 481 648 -1131 3131 2835 -127 549 2617 -1437 -2604 1012 -890 -3754 -205 1951 -630 -640
1546 -640 4001 1210 -695 2529 2877 -2949 -2669 -12 -2281 -4471 936 1314 -524 1656 4403 520
1562 520 -524 3007 318 -3897 -281 317 -2694 -972 1691 422 -542 3383 3368 -9 -594 1740
1578 1740 -1579 -3455 -148 -911 -3629 87 2363 396 620 4142 2234 -1150 1299 868 -3960 -1507
1594a507J892j577L15J611j48m84J808R87k312j276R90j808j278K157m58J32N28
1611d28R19J847q01N16j75k120k50r79r98J026L06j43J985k06j90J606J30j132
1629I13K30K39k538r52J525j158j831L189J791k481J569K875j933j861J745k43
1645A079l517R45K916l571K24L467r06k045M140J404m891O36K342m346j321K674
1661g70K21l630M193J930k761j36M856k144l150L053n22m964Q99M231l295j023
1677c012N474l26l554M520J413n088L3L782m597l048M187N21l624K399L181k448
1693a87o87M255k047l177K137J427l552m18K554j995K57L836P64k502N43J806
1709C014k821r55R77q86k749K556P4j289J648K462r89n06J731k281k96j41k96
$$ plain form
1594 -1507 385 -1192 -877 734 586 102 1910 2897 585 -691 299 -1509 -2787 -630 -1088 -956 -428
1611 -428 491 2338 1537 2053 1878 -242 -492 -1471 -2469 -1443 -1137 -1280 705 499 309 1915 2045 913
1629 913 1143 1382 -1156 -2108 -583 -1741 -3572 -383 1408 -1073 496 3371 1438 -423 1322 1079
1645 1079 -2438 -1493 1423 -2148 -1924 1543 637 -1408 2732 4136 -755 -119 2223 -2123 -3444 -770
1661 -770 -549 -4179 14 1944 -817 -953 3903 1759 -1391 1662 1140 -3824 -2925 1306 -1989 -3012
1677 -3012 2462 2136 -1418 3102 4515 -573 -540 3242 -1355 -4403 -216 305 -3319 -920 2261 -187
1693 -187 -874 3381 1334 -1843 294 1721 -1831 -2249 305 -1690 -1433 2403 3167 665 1208 3014
1709 3014 193 -762 215 -671 -3420 -864 -790 -2079 -431 2031 1042 536 2267 -14 -310 -451 -747
1726g47k233J342J200r31J584L88o7P21J553j828j221J273l78j694p6J229l067
1743b952K179K678j518J22J980P9m295L077p44l567K23L107j922j575M024L25
1759A221k713L160K371m789q96K892j806l201K835J504l456J815L181j644p87
1774c13M063j236l431R54J652m103r42M457j788k019L560J468l360J960M221m450
1790F93j422J876q68l651J789K374k821P81L560k298j108L932q66l908K554O26
1806A243l398n97J720j22j059K565J368j192j09J689j624j251J060o48j516J625
1822b46j14j205J916J723j332q9J265j349q14M98k74j814J34O95q68K018L05K8
1840D77L75N85o53j167P21j55j774L38R75k72r32K730l04j346K233J158l021o81
$$ plain form
1726 -747 -2980 -1638 -438 -1369 215 603 536 1257 2810 982 -239 1034 656 -1038 -1114 115 -2952
1743 -2952 -773 1905 387 509 2489 2568 -1727 1350 606 -2961 -2738 369 -1553 -3128 896 1221
1759 1221 -1492 1668 4039 -750 -1646 1246 -560 -3761 -926 578 -2878 -1063 2118 474 -313
1774 -313 3750 2514 -917 37 1689 -2414 -3356 1101 -687 -2706 854 2322 -1038 922 5143 693
1790 693 -729 1147 279 -3372 -1583 791 -2030 -1249 2311 13 -1095 2837 1971 -1937 617 1243
1806 1243 -2155 -2752 -1032 -1154 -2213 352 1720 528 419 2108 484 -767 293 -355 -1871 -246
1822 -246 -360 -1565 351 2074 742 653 1918 569 -245 253 -21 -1835 -1701 -1006 -1874 144 449 477
1840 477 852 1437 784 -383 338 183 -1591 -1253 -278 -550 -1482 1248 944 -402 1831 2989 -32 -713
1858g13J970k451p58K061j350j113K943J419j848Q28J891k345j450K345j114k428
1874b113O65J806k293K01K876j23j469K698J032l569l23J695j849k570L376J307
1890A347m488K837K345j637j647L718j468k773L090r36k462m84L649k258N8K714
1906A605m21j140N02J709k751K32R65r50k406J744P16j146Q99K611j985M3J809
1923B036q13k497M33K74o90M25l92N16m41J011R40j88R82j67k489m52J477q75
1941i10m35P73j39J98R01J14Q66N98q97M9n93p87m38j068J483l30O39N11R55j145
1961C45M26P49j619j92J464j501j436J493k01j183J727N06r54P1J276P85k056
1978c00P21m61p13k96J460j299m6J383M89j331J590J354k484j263J350l41j243
$$ plain form
1858 -713 1257 -1194 -1952 109 -1241 -2354 589 2008 160 988 2879 534 -916 1429 315 -2113
1874 -2113 -1448 358 -1935 -1734 1142 1019 -450 2248 3280 -289 -612 1083 -766 -3336 40 1347
1890 1347 -3141 -304 2041 404 -1243 2475 1007 -1766 1324 388 -2074 -2558 1091 -1167 -1109 1605
1906 1605 1184 44 546 2255 -496 -264 701 -249 -2655 -911 -195 -1341 -442 2169 184 227 2036
1923 2036 1223 -1274 -841 -567 -1257 -832 -1224 -708 -1149 -138 802 614 1596 1429 -1060 -1512 -35 -910
1941 -910 -1345 -572 -711 -513 388 502 1368 1966 1069 1118 525 -262 -700 -1768 -285 -615 24 535 1490 345
1961 345 771 1520 -99 -291 1173 -328 -1764 -271 -472 -1655 72 578 -376 -305 971 1756 -300
1978 -300 421 -40 -753 -1049 411 -888 -934 449 938 -393 1197 2551 67 -1196 154 -187 -1430
1995a430P74P23r45O04J888j042K46R50r46j653L34J158j836o21K970r65j144
2012i35M98K498k001M1J522j236j631R04j79q22N25K389k568R74K137j047q15
2029B54O39K84k402O63M75K1j113J120m87q2Q82N73j9o92J47j75o69J107p74L89
2049A41j592J001J004n56P77j79N63j050O64o05r57M55N67p23J15L76J52Q75l47
2068F81K42o33K6k03q8q6j238L51Q10j107N30O09O77m06J522o84r22l60J090j300
2088d89n1J031n15p77J044J28L19ML58J93j615O77p01p13j86J835p71J20J021
2107I12Kj190Q22J052q38j739Q97N0j511J312J457j553r46K907j282m08J179q22
2125C01K16J81l50j013k20M70R29r00K69J323m28Q5N38q29r11k68R60o22k65N18
$$ plain form
1995 -1430 -656 67 -878 -274 1614 572 818 1768 822 -831 -497 661 -1175 -1796 1174 209 -935
2012 -935 -437 2061 60 101 1623 387 -1244 -340 -519 -1341 -816 1573 -995 -21 2116 1069 254
2029 254 893 1177 -1225 -562 -87 -66 -1179 -59 -546 -628 254 827 808 116 263 88 -581 526 -248 141
2049 141 -1451 -450 554 -2 775 596 1159 109 773 168 -789 -334 233 -490 -375 1 153 1028 681
2068 681 923 290 316 113 25 -61 -1299 -948 -138 -1245 -715 -106 571 165 1687 1003 81 -279 811 -489
2088 -489 -540 491 -24 -801 243 371 690 694 1052 1245 -370 307 -394 -1107 -1293 542 -229 -109 912
2107 912 914 -276 546 1598 760 -979 -82 -32 -1543 -231 1226 -327 -1273 1634 352 -56 1123 301
2125 301 517 698 348 -665 -885 -415 514 -386 -117 1206 778 863 1401 572 -339 -607 353 -269 -534 -16
2145a6L63m96L99Q30j455k07N76J144j616K53K14k23p80J298R6n89J111j054j90
2164c42N73o77N57p88J144j10j121P84n79l2n4J364m93o38J184j31n30n51j220
2183a660J201r57J938o21k0Q01j53q6M89q67k57L46l56j43M0N13m22j47K39K22
2203A00J79K45q15K04j91M41q29P81J166j499j15N83r2p40J200Q4r88J52J175
2222A041j715L05J908j249p41j95J436j261L95J068j275J000o07q1r53K60J808
2239A144j690j59K418j391j189P32J001j803O91J765j694p17R23N53j801J362
2255A45J044j855O65N12k26p52J47J869j668q40J982j425J43P48k33j54M16L14
2273H32p07q36R58J078j159L32m75R3K14l84o94R76O48q48m09O39k51O02q81L12
$$ plain form
2145 -16 347 -149 250 1080 -375 -582 -6 1138 -478 -225 -11 -234 -1014 284 380 -209 902 -152 -342
2164 -342 231 -446 111 -677 467 357 -764 20 -559 -591 -645 719 226 -412 772 641 111 -440 -1660
2183 -1660 -459 -1416 522 -99 -119 682 529 443 932 65 -192 154 -202 -345 -305 208 -214 -361 -122 100
2203 100 279 524 -291 -87 -278 163 -666 115 1281 -218 -333 250 158 -582 618 702 -286 -134 1041
2222 1041 -674 -369 1539 290 -451 -646 790 -471 -76 992 -283 717 110 29 -924 -664 1144
2239 1144 -546 -705 1713 322 -867 -135 866 -937 -246 1519 -175 -892 31 584 -1217 145
2255 145 1189 -666 -1 511 285 -467 -320 1549 -119 -959 1023 -402 -259 489 256 102 518 832
2273 832 125 -711 247 1325 166 498 23 116 330 -54 -748 228 876 28 -381 258 7 609 -272 40
2293D0j98R26k47m78Q01J25j529P85k03r71K15J492J15j443N96L11j69j163J029
2312C4k54K24J351k06j221L11J047r25j401J818j009n58J075L86l63q22J617o82
2330D22j513J419l13j158Q56L42n07k42J373l52j576J559R01j228m21R87j062
2347e13n72M98Q78j305L33O26q81M19K348j511j278L36R91j049p5N79n55L59Q58
2366D86J19j229J770Q20j739j16N84j491K68M23o12J33Q38K90k05l83P04j94k39
2385B27L98L18j282M15r49K89L15Q8L61l01O48j63Q91p68m21j069J27Q32j857
2404a901J117P70k86n27J018m57R17K6o70Q72j284M99m33k01Q01O53m12K94q55
2423e9R0k1Q65j793p2Q75M38j261r0J859j250j14J481n12j65L90L88q2j682J274
$$ plain form
2293 40 -158 768 521 43 844 969 -560 225 22 -949 -734 758 873 -570 26 337 168 -995 34
2312 34 -220 4 1355 1149 -72 239 1286 361 -1040 778 -231 -789 286 672 309 -513 1104 422
2330 422 -1091 328 15 -1143 -287 55 -452 -694 679 327 -1249 310 1211 -17 -438 549 -513
2347 -513 -1085 -587 291 -1014 -681 -55 -936 -517 1831 320 -958 -622 369 -680 -755 -176 -731 -372 486
2366 486 605 -624 1146 1966 227 111 695 -796 -528 -105 -717 -584 254 544 339 -44 660 466 227
2385 227 625 943 -339 76 -873 -584 -269 -181 180 -121 527 364 1255 487 66 -1003 -876 -44 -1901
2404 -1901 -784 -14 -300 -827 191 -266 651 677 7 879 -405 94 -339 -540 261 914 502 796 -59
2423 -59 31 10 875 -918 -990 -115 323 -938 -1028 831 -419 -533 948 436 271 661 1049 967 -715 559
2443E59j209j53Q41j25m71O64J077n50q74J255j494m07M64l82l55M00R38k90k29
2462c41J188L0j192J209j027K22r18J159j304m7P53Q99q8k3R3Q53j813O85Qq60
2482e14J64j126J609J29p35R08M48r3mo10J41n03k93n66R5N99n03L1O84k61J675
2503A275l30l66m01m07j45r38J192r22J286l08j81J41J578j59j218P17L13n45
2521E82j263J32k83j20L69M10J64Q52P08m80j154P52r14j086R27P3o78J5L93Q37
2541B36o94Q26K22j117Q37J0J13j604L60J737k284L93J320l23n13J155n96R73
2559A051N36q18j402N22p4r64k89J292M4n1P90o42Q85l90m63k54j058L30O3K89
2579f03n97J909q33N89J774j304o06k81l66n10R51j61p32k3J125J62l2j56R95
$$ plain form
2443 559 -650 -803 38 -87 -558 106 1183 633 -241 1014 -480 -887 -423 -805 -1160 -760 178 -112 -341
2462 -341 847 877 -315 894 -133 89 -829 330 -974 -1021 -268 631 543 520 613 1466 -347 338 346 -514
2482 -514 -350 -1476 133 262 -473 435 883 790 786 176 317 -186 -479 -1045 -950 -351 -854 -823 -139 -400 1275
2503 1275 945 579 178 -229 -374 -1312 -120 -1042 244 -64 -245 -104 1474 1315 97 814 1127 582
2521 582 -681 -549 -832 -952 -583 -173 -9 843 1551 1071 -83 669 -245 -1331 -404 -331 -1009 -994 -601 236
2541 236 -458 368 590 -527 310 320 433 -1171 -811 926 -1358 -965 355 32 -481 674 78 1051
2559 1051 1587 769 -633 -111 -185 -1149 -1438 -146 -102 -153 637 -5 880 490 27 -227 -1285 -955 -892 -603
2579 -603 -1200 709 -124 465 2239 935 329 48 -318 -828 123 -38 -770 -793 332 494 462 306 1301
2598A301o25q4l98q35N4q91K50J174n11K59M36R31J82n55n16l72L32j233P66m51
2618g86k05O86O76K26O75q76Q63j233M84r18k30k85Q74q80l23J152K72J53J627
2637A952r49J46n84j170J03O31q55l28j0l24K009K77o50Q81O93j730M19l05j218
2656a012L3q53O13N38P55L47l09N97P53p03k21o33n31j263P76O52o09N42J448
2675I20j54l92O89k25j62o61k86o25O85l23n36R9J582j44J99L51L51k39j699L41
2695b29q59j059K36O83J251n39P23R43o35Q36l55j151M93j004J43k83q21J102
2713e25l41J070K10L11O10o82J56j354L52l03M0m91N93r5j4J274M15K69l57l26
2733H12k36o34k84n43o75L60p06K563k87K04O34Mp96P31r11q94m16M6KL84j26
$$ plain form
2598 1301 676 592 194 -641 -587 -1478 -1228 -54 -565 -306 130 1061 1243 688 172 -200 132 -1101 -335 -786
2618 -786 -991 -305 371 597 1272 396 1259 26 510 -408 -638 -923 -49 -929 -1252 -100 172 325 1952
2637 1952 1003 1149 565 -605 -502 129 -726 -1054 -1064 -1388 621 898 248 1129 1822 92 511 206 -1012
2656 -1012 -979 -1832 -1219 -681 74 421 112 709 1462 759 538 -95 -626 -1889 -1113 -461 -1070 -528 920
2675 920 766 374 1063 838 676 15 -271 -896 -211 -534 -1070 -971 611 467 666 1017 1368 1129 -570 -229
2695 -229 -1088 -2147 -1911 -1228 23 -516 207 1150 515 1351 996 -155 338 -666 -523 -806 -1627 -525
2713 -525 -866 204 414 725 1335 653 809 -545 -193 -496 -456 -947 -354 -449 -463 811 1226 1495 1138 812
2733 812 576 -58 -342 -885 -1560 -1200 -1906 657 370 574 1208 1212 416 1147 236 -658 -1074 -1028 -1026 -642 -768
2754g68J126J21M66P35j307m71K02N9j80m57l47j23K62P55J047n21Q19L06q87
2773H37l56k29p70o92R7L13R4m49J707Q59r07J152q34j47j368P47q60j212J103
2792i15k89M98K76J537%j90K46N45k062R63j329Q57j589J044l94J032K04K17O46
2811A297m86L14o84n9l5r51o82K3L40L92k86J381K48O25l72l05p83n89l02k76
2831a190P5J20N15P36L50Q79j269J408o99k60j60o07k155L03M60M71J093l96J321
2850I95j85J014o16K78j567j25j185L17n69J6M66J443n22Q77Q60j90P77j631r96
2869e43l72k39j698J506O85m13K283n65Q8J82R8j041Q23m19k001M64k44M36j21
2888a091J912r9L99r0Pj51j630m7J09r09m23O96P1N33Q27J391q38P55r69o16K60
$$ plain form
2754 -768 358 479 945 1680 373 -98 104 163 -17 -474 -821 -944 -682 73 1120 599 1418 1724 837
2773 837 481 252 -518 -1210 -1113 -800 -706 -1155 552 1411 504 1656 822 675 -693 54 -806 -2018 -915
2792 -915 -1204 -706 -430 1107 1107 917 1163 1708 -354 609 -720 137 -1452 -408 -802 230 434 651 1297
2811 1297 811 1125 441 382 347 -604 -1286 -1263 -923 -531 -817 564 812 1437 1065 760 -23 -612 -914 -1190
2831 -1190 -1115 -995 -480 256 606 1485 216 1624 925 665 505 -102 -2257 -1954 -1494 -1023 70 -326 995
2850 995 810 1824 1208 1486 -81 -206 -1391 -1074 -1643 -1627 -1161 282 -240 637 1497 1307 2084 453 -543
2869 -543 -915 -1154 -2852 -1346 -661 -1074 1209 644 732 914 1012 -29 794 375 -1626 -1162 -1406 -970 -1091
2888 -1091 821 722 1121 1031 1038 887 -743 -790 -681 -1590 -2013 -1317 -1246 -713 114 1505 667 1422 453 -163 97
2909I7q44r28P72J51J04L90J205M62k47O02j85o95p65p02q03K26j7n71R51K68
2929e29P00J10O73K60q47Q56q96j469L60j548J121J53J91J359K30M29J90n19k9
2948G95q38m59K40j328N97K55l50J701P62j02j004J212M9j674J9r81m22R40n78
2967a166J50J157L12J413M3m06j99r62m48j296M91l34j62L07Q75j82N25Q29k06
2986G41R66n0k103L17p9j268l32P15N88Q44N13j25j78Q41Q76k455K27l43n83p17
3006a605J258l76J15K204m50K19O22q73j415m8l70J06p03L10j02L81Q62J241l93
3025I83O86J5m03q80l49j457L50o55J42J307m2l5J365L12R59j412o55o48k64k43
3045i24j187N98J224J3N84R79n04R88o63p72m15l6j098j92q87J360N26L66N82
$$ plain form
2909 97 -747 -1675 -903 -752 -648 -258 947 1409 1162 1764 1579 884 119 -583 -1386 -1160 -1177 -1748 -797 -529
2929 -529 171 281 954 1214 367 1223 327 -1142 -782 -2330 -1209 -1056 -865 494 724 1153 1343 824 795
2948 795 -43 -502 -262 -1590 -993 -738 -1088 613 1375 1273 269 1481 1530 -144 -125 -1106 -1528 -588 -1166
2967 -1166 -1016 141 453 1866 1909 1503 1304 342 -106 -1402 -911 -1245 -1407 -1100 -225 -407 118 947 741
2986 741 1707 1657 -446 -129 -208 -1476 -1808 -1093 -505 339 852 727 549 1390 2266 -189 38 -305 -888 -1605
3006 -1605 -347 -723 -608 1596 1146 1365 1987 1114 -301 -349 -719 -613 -1316 -1006 -1108 -727 135 1376 983
3025 983 1669 1684 1281 401 52 -1405 -1055 -1710 -1568 -261 -303 -338 1027 1339 2298 886 231 -417 -681 -924
3045 -924 -2111 -1513 -289 -276 308 1287 783 1771 1108 336 -79 -115 -1213 -1405 -2292 -932 -406 -40 542
3064E42l62O77J346r28j328J33p48j65r95Q31K71J082J60Q52m2R96n49l03j486
3083a6J04n99p72L5L26J61J065O84O77O3j334M33r84k09m47l98j006R73M01R21
3103G8J230l27j61P18p05l81j268n55K21m73J240l78n27K023o57J466p94J291
3121B041j426r08P53j159o15J32Q41r52J536M89J30P92O4j206n43k1l81p38l15
3140a486k77J543J22J696m28J19j02N63j394p80p09l55j17k48J556j94P14N19
3158G42Q52j447J386k45j890l70l90j007J129k0P63J160RJ155l66M29j045p58
3176H7q75O79j383J36N35J46P70J042K72K16j091N53j25j348l03j123Q28k65q9
3195a338J036O92M69M49L39l26J04j275l50l17j030j1K81K59J32J294J537n6j36
$$ plain form
3064 542 180 857 2203 1275 -53 80 -668 -833 -1828 -997 -726 356 516 1368 1326 2322 1773 1470 -16
3083 -16 88 -511 -1283 -1248 -922 -761 304 988 1665 1728 394 827 -157 -366 -813 -1211 -2217 -1244 -843 78
3103 78 1308 981 820 1538 833 452 -816 -1371 -1150 -1623 -383 -761 -1288 735 78 1544 750 2041
3121 2041 615 -293 460 -699 -1314 -1182 -341 -1293 243 732 862 1654 1718 512 -31 -52 -433 -1171 -1486
3140 -1486 -1763 -220 -98 1598 1170 1289 1187 1750 356 -424 -1133 -1488 -1605 -1853 -297 -491 223 742
3158 742 1594 147 1533 1288 -602 -972 -1362 -2369 -1240 -1260 -497 663 672 1827 1461 1890 845 87
3176 87 -788 -109 -1492 -1356 -821 -675 95 1137 1409 1625 534 1087 962 -386 -689 -1812 -984 -1249 -1338
3195 -1338 -302 390 859 1308 1647 1321 1425 150 -200 -517 -1547 -1558 -1277 -1018 -886 408 1945 1889 1753
3214A753j02q68j518J8r25m68Q32O70J114q88J475N51n86N38j479N77j416l5k91
3233a048j240J511m96R60J021k29J55P13n04l90r57p29n10N84l4q8J622m0L8J232
3253A571M82r33k0p98j284J73n19n74J319L25R82m4M07J37n07P61q95j492M60
3272d49p21k79j81N90R80J811j504J571l38p43r68Nm02p96l83N88O69L44K174
3291A968o01k41J25L64j106J73j051n48j570M91P63L84J502jO20L3N2N2j026j030
3311f47l86K97q83j89J354N92M64J769p42m48m63L87j198p56K66j498R75k97M05
3330i98J615l92M65P28k67j9j286q76m0o63L15O90j3P92R26K05L42N47j152p77
3350A42j048K25j952J399l23O96R26L03R03l02r6J95r42N95j041k13m56j90K77
$$ plain form
3214 1753 1651 783 -735 -717 -1642 -2110 -1278 -608 506 -382 1093 1644 1058 1596 117 694 -722 -757 -1048
3233 -1048 -2288 -777 -1273 -313 708 479 634 1347 843 453 -504 -1233 -1743 -1159 -1193 -1281 341 301 339 1571
3253 1571 2053 1120 1100 302 -982 -809 -1328 -1902 -583 -258 724 680 1087 1224 717 1478 583 -909 -449
3272 -449 -1170 -1449 -1630 -1040 -60 1751 247 1818 1480 737 -231 -226 -628 -1424 -1807 -1219 -550 -206 1968
3291 1968 1367 1126 1251 1615 509 682 -369 -917 -2487 -1996 -1233 -849 653 652 1272 1305 1357 1409 383 -647
3311 -647 -1033 -736 -1619 -1808 -454 138 602 2371 1629 1181 718 1105 -93 -849 -583 -2081 -1106 -1403 -998
3330 -998 617 225 690 1418 1151 1132 -154 -1030 -1070 -1733 -1418 -728 -741 51 977 1182 1524 2071 919 142
3350 142 -906 -681 -2633 -1234 -1557 -861 65 368 1271 969 873 1068 126 721 -320 -533 -989 -1179 -902
3369i02O56M21m07J146j74L40K51j573O23j958M48o26O26P82k13J847k5J30K0
3388A412Ro63p71n28p02M92j91J38O05M49j47O45k57N47R7q80p52j104J68J93
3408a240L9L11J401m40J416M86m22j057L73j584l43K7L11N32j99K11P0J107q28
3427A71N80M77r53j31p15L0j288J082O0O24J83qP05k79M64j32q66n83q23J271
3447a31j351J137L08L69n07J120O45P54j684K72l04q56m64r24J39O80P24M53O45
3466A025j01R14j77j428n31m13q15L03p2j052K351L42N00N94q75Q57m51q38j005
3485h72P10p90l87Q69N26o53O76J620j17n25L58p89o30o95p8J137j387L11J38
3504e78P35N03J206M82o30K0j388r91N65r82q05J324p33O09J641j92L42j53j11
$$ plain form
3369 -902 -246 175 -232 914 740 1080 1331 -242 381 -1577 -1129 -1755 -1129 -347 -560 1287 1262 1392 1412
3388 1412 1421 758 -13 -541 -1243 -751 -942 -804 -199 250 103 748 491 1038 1135 255 -497 -1601 -1433 -1240
3408 -1240 -1201 -890 511 71 1487 1973 1551 494 867 -717 -1060 -1033 -722 -190 -389 -178 -108 999 171
3427 171 751 1228 275 144 -571 -541 -1829 -747 -687 -63 120 112 817 538 1002 870 4 -579 -1402 -131
3447 -131 -1482 -345 -37 332 -175 945 1590 2344 660 932 628 -228 -692 -1616 -1477 -797 -73 380 1025
3466 1025 924 1838 1661 233 -298 -711 -1526 -1223 -1295 -2347 4 346 846 1440 565 1422 971 133 -872
3485 -872 -162 -952 -1339 -470 56 -597 79 1699 1582 1057 1415 626 -4 -699 -777 360 -1027 -716 -578
3504 -578 157 660 1866 2348 1718 1738 350 -641 -76 -1058 -1863 -539 -1272 -663 978 786 1128 975 864
3523H64k57j053p62K63r37Q16j21J266O00n29R20N80o85k44j39m67j512M07K02
3542g88p62J996l01J70P72J20l98L3j28j279K00n81p50J283K85O1N0L84J718m01
3562A684j004m07j90p76m8J50l85N08j97R28l3P16L36j44q67m82n47O98n55l76
3582i91j003K206K29q1O49O61k41n79m22j256M0m02O69o00Q66N51R22n0j101P54
3602H21q61N41q10l78n54o08J16J355r8K07J154L57r84R39M15j417j555O84o18
3621a294K45l4J417q52K93O74J076l09j752N17m27o00P98p29l46O18J478k8l81
3640C64Q23q54l61K60n80N33j247J38Q5J59R86K14J59j269J967p16r4l3o81j362
3660a509J085o10p69J104M76J221m50J516j396p99K76l2j407J309j531J087p54
$$ plain form
3523 864 607 -446 -1208 -945 -1882 -1066 -1187 79 679 150 1070 1650 965 721 582 115 -1397 -990 -788
3542 -788 -1550 446 145 315 1087 1207 809 842 714 -565 -365 -946 -1696 -413 -128 -67 -17 367 2085 1684
3562 1684 680 273 83 -693 -741 -591 -976 -468 -665 263 230 946 1282 1138 271 -211 -758 -60 -615 -991
3582 -991 -1994 212 441 360 1009 1670 1429 850 428 -828 -788 -1190 -521 -1121 -255 296 1218 1168 67 821
3602 821 -40 501 -309 -687 -1241 -1849 -1733 -378 -476 -269 885 1242 258 1197 1612 195 -1360 -676 -1294
3621 -1294 -1049 -1083 334 -518 -225 449 1525 1216 -536 -19 -446 -1046 -248 -977 -1323 -705 773 745 364
3640 364 1187 333 -28 232 -348 185 -1062 -924 -839 -680 306 520 679 -590 1377 661 567 534 -147 -1509
3660 -1509 -424 -1034 -1803 -699 -223 998 548 2064 668 -131 145 113 -1294 15 -1516 -429 -1183
3677a183J180j10O77k74P31q45m36J81m74m12M78j631Q95P37O91j64J239J060
3695B340k294M18j18m03k66J40j380R32l58Q49R53j114J063J066j315P66r21q57
3713d99j466J127m40j067J462O81O6J213l37o59J75k52r96K36j20o08L50M14J404
3732F84k68Q85P0j083k16m8J27j461R14l08n00M78Q19M26l45O93R11o93p24n74
3752b13l44k00K00k173L77L063j1L60k029K305k48j04n80j279K2n90K92K45O34
3771b73J113r05N59R49k2j516L03K08k060J589n48m87L21Q55Q78j94p7n74J617
3790A736q79m48m10l05l8r1l9Q0Q18k52n69M37J481j249K81q76Q23j168J336j692
3810a024Q72oR69q33J220jq19O93j290L92j061M48j20o25J775J92m07O56k18k13
$$ plain form
3677 -1183 -3 -113 564 290 1021 176 -260 -79 -553 -965 -487 -2118 -1223 -486 205 41 1280 2340
3695 2340 46 464 346 -57 -323 -183 -1563 -631 -989 -140 813 -301 762 1828 513 1279 358 -499
3713 -499 -1965 -838 -1278 -2345 -883 -202 -136 1077 740 81 256 4 -992 -756 -876 -1484 -1134 -720 684
3732 684 416 1301 1371 288 72 24 151 -1310 -396 -704 -1204 -726 93 519 174 867 1778 1085 361 -213
3752 -213 -557 -757 -557 -2730 -2353 710 699 1059 -970 1335 1087 983 403 -876 -854 -1444 -1152 -907 -273
3771 -273 840 -65 494 1443 1421 -95 208 416 -1644 -55 -603 -1090 -769 86 964 770 693 119 1736
3790 1736 857 409 -1 -306 -344 -435 -474 -394 424 172 -397 40 1521 272 553 -323 500 -668 668 -1024
3810 -1024 -152 -158 811 -22 1198 1197 378 1071 -219 173 -888 -440 -560 -1185 590 782 375 1031 813 600
3830F00p33Q2k05q29k49N56j83N54J065k51j99J181q21M20p17M55j225r50N12
3849i37J58K10J36O75J10J673j339n31j71K87j160R41q19Q90q0j832J956J28N67
3868H62n44M13o78L7J02j205j50N74k83m89J475k70M13J010l02q23O60m17l68
3887A7o7l28j269J531l35Q16jo92Q32j121O73q26j96l35m31J465O10q83J246n08
3907A98L95k93N74K03j102o22M1L39l57NP42k30J111k07j75m4o71K57ol44p87
3928i73Q32j41n32J08J600p06P91J08l26o8n14L9m35j11j242J493n99J533l05
3947E52N13n79k91K96j313J030r60q3R26m77K44N0L35O30j06l05J89q62N42k73
3967E8J34m46J01k8l59N39O63M78m71J61n97j36j45r87M60P13k17r5o8N46l79
$$ plain form
3830 600 -133 -51 -256 -1085 -1334 -778 -961 -407 658 407 208 1389 568 988 271 726 -499 -1449 -937
3849 -937 -779 -569 -433 242 352 2025 686 155 -16 271 -889 52 -767 123 43 -1789 167 295 862
3868 862 318 731 53 90 192 -1013 -1163 -589 -872 -1361 114 -156 257 1267 965 142 802 385 17
3887 17 -50 -378 -1647 -116 -451 365 364 -328 504 -617 56 -770 -966 -1301 -1732 -267 343 -540 706 198
3907 198 593 300 874 1077 -25 -647 -606 -267 -624 -619 123 -107 1004 797 622 578 -93 164 158 -186 -973
3928 -973 -141 -282 -814 -706 894 188 979 1087 761 693 179 218 -217 -328 -1570 -77 -676 857 552
3947 552 1065 486 195 491 -822 208 -752 -835 91 -386 -142 -92 243 873 767 462 651 -211 331 58
3967 58 192 -254 -153 -181 -540 -1 662 1140 669 830 233 97 -48 -1035 -575 138 -79 -174 -242 304 -75
3988g5O90M27q23j44J34j013M70j17l94l86J187o13J483o74n17J585j379m34J15
4007d78L65o07N92m33O17K27q7M48m15O89o94k6k03j7l03J55l50M71o93J709J51
4028A118p60m64J16O75j350J670k054L62N99L88j405J102Q40L15q82L41l66q40
4046e95R76q79j035J134M84j82M34k69R0j38Q13j132O75q01Q91o1m07p55P90p22
4066f89Q57k91J311n30N35r09K22n87m95l54M82R04q38L70J32J004q96P26j429
4085d75L95m62J27N20j057O21O0j3N83j21n30O42R58n23l91n66j27r0L89J88k79
4106a51o79J905p56M41j101O65j54J28m16l38m8Q61j330J655j067J383j252J522
4124A268l72o60K28m90q7j117M72J163o66q8Q80O06j605K35J250j019k62J16r2
$$ plain form
3988 -75 615 1042 219 75 209 -804 -334 -451 -845 -1231 -44 -657 826 152 -365 1220 -159 -593 -478
4007 -478 -113 -720 -128 -561 56 283 196 644 229 918 224 198 -5 -22 -325 -170 -520 -49 -742 967 1118
4028 1118 358 -106 10 685 -665 1005 -1049 -687 -88 300 -1105 -3 837 1152 270 611 245 -595
4046 -595 381 -498 -1533 -399 85 -97 337 68 158 20 833 -299 376 -425 466 405 -2 -757 33 -689
4066 -689 168 -123 1188 658 1193 284 506 -81 -576 -930 -448 456 -382 -12 120 1124 228 954 -475
4085 -475 -80 -542 -415 105 -952 -331 -271 -284 299 178 -352 290 1248 725 334 -232 -359 -449 -60 128 -151
4106 -151 -830 1075 319 760 -341 324 170 298 -118 -456 -504 357 -973 682 -385 998 -254 1268
4124 1268 896 236 464 -26 -113 -1230 -758 405 -261 -349 531 1137 -468 -233 1017 -2 -264 -148 -240
4143b40l30L03k2M70l27L41N27n75M4k87J06l17n4o18N11M45m04l99P62j8m94
4164e76J196l06o55P58n61l27Q10P71o97k02R53j45m91m88q28N30r31P84p94J137
4184f2p32N52j41N25J177j732R65j42j085L68k64O05K44n27o35L17O52O04m82
4203B07l2N6k43r30L90O69o70Q17n22N13r48K035q88N8n3j078M54R9P73r39m38
4224f70P51p69J68Q36j91K39L19N19j526J013r16N24j135M98m43J113Q9m43j459
4243a483J227R9P37j344j42M37j2k78O93J78o21J067m82J49K06J60N36k069J78
4262g64J119j282p1J350o99L22n10K87P94j452J111n47N09Q9M16j049R98l6p80
4281a95N91O58r51j06M2j89k38k4Q61j140P27q8o4J73O18m57m65J076m88J67j015
$$ plain form
4143 -240 -570 -267 -289 181 -146 195 722 147 191 -96 10 -307 -361 -979 -468 -23 -427 -826 -64 -82 -576
4164 -576 620 314 -341 417 -144 -471 339 1110 413 211 1164 1019 528 40 -788 -258 -1189 -405 -1199 -62
4184 -62 -794 -242 -383 142 1319 -413 552 410 -675 -307 -571 34 278 -249 -884 -567 85 689 207
4203 207 175 231 -12 -942 -552 117 -553 264 -258 255 -693 1342 454 512 459 -619 -165 -66 707 -232 -670
4224 -670 81 -688 -520 316 125 364 683 1202 -324 689 -227 297 -838 -340 -783 330 419 -24 -1483
4243 -1483 -256 -157 580 -764 -906 -469 -481 -759 -66 112 -509 558 76 225 431 591 1127 -942 -764
4262 -764 355 -927 -998 352 -347 -25 -535 -248 546 -906 205 -342 167 256 672 -377 621 585 -195
4281 -195 396 1054 103 -3 39 -150 -388 -412 449 -691 36 -52 -116 57 675 218 -247 829 341 508 -507
4302e07O48Q09j439Q69j193k20K000q48M26l58j87l25k34O43Q28j651R89p59J247
4321G38p26J7M43q07M8N03k42l94N04j002O94o02J464n92K04j90n66O04j34M39
4341D03j277J060r04j50J159n4n92p64K121r76k42O26p9j2n86l01L19K04J95N1
4361B01k7M56p92j156J222j20r2k07K57m0K03p04O20M01J156p62n47N4m60J28
4381b09J2j092O10J002P5m29J9m73J113k84j291P15L82l35Q7N42j64j058J217
4400D39n35l40O71M53r80P19M8r44R52j019R88r00J124q82jl86J063l4L29j42
4420F23n88M2l14N40K02m27m5K43N01j015j29N38m89M90r44K83J40O77p23j07
4440e02J21K13R00k26m71m74Q68n84J015K91n14o87o09J223j054k16P45N66m9
$$ plain form
4302 -507 141 950 -489 380 -813 -1033 967 119 545 187 0 -325 -559 84 912 -739 250 -509 738
4321 738 12 29 472 -335 -287 216 -26 -420 84 -918 -224 -826 638 46 250 60 -506 98 -36 403
4341 403 -874 186 -718 -868 291 237 -355 -1119 1002 26 -216 410 331 319 -267 -568 -249 -45 150 201
4361 201 174 630 -162 -1318 -96 -216 -308 -515 -258 -298 -95 -799 -179 222 1378 616 69 123 -337 -209
4381 -209 -197 -1289 -679 323 398 -31 -12 -485 628 344 -947 -232 150 -185 -98 444 280 -778 439
4400 439 -96 -436 235 688 -292 427 475 -469 483 -536 452 -448 676 -206 -207 -593 470 436 765 623
4420 623 35 77 -237 303 505 78 33 276 777 -238 -367 171 -318 172 -772 -489 -349 328 -395 -502
4440 -502 -381 -168 732 506 35 -439 429 -155 860 1151 637 -50 -659 564 -490 -706 39 605 556
4459E56j178J010r58M86K54k37j62R90j431j7j49O42M62jj85l14K95J86K52m33
4479F8O67J02p29J72o27r24P07O82l43O27kp26p2l06P23q81N23J19Q64j307Q42
4500A79K70K8j138P02r74P39p87J627p9k93J058j724J078j152n30R96L6j05m44
4519e13j75R00r9m30Q55J7j287K50J259j700M35P44K14M14j375k06Q27O31q66
4538a05M38l17O36q10j61P81j32j51m56N18m42N0J53pP0M01j088K59q78J335P11
4559H05r63N24K19N59L98j181j676J271O13N5j037P29r11P47K28j150J16K50l75
4578g79n51J328j72q2L31J92n63P09m10N57N53r88N37l09o27J115K00q24J45p
4598C55o89j62P48r37p8J88R2Q08m85Q70j453L36O52n44Q41k38J5N35q85N22k97
$$ plain form
4459 556 -622 388 -570 -84 170 -67 -229 761 -670 -687 -836 -194 268 267 82 -232 63 249 501 68
4479 68 735 837 108 280 -347 -1271 -564 118 -225 402 400 -326 -398 -704 19 -862 -339 -220 644 -663 179
4500 179 449 477 -661 41 -933 -194 -981 646 567 274 1332 -392 686 -466 -996 0 36 -69 -513
4519 -513 -688 212 113 -317 538 555 -732 -482 777 -923 -488 256 470 884 -491 -697 130 761 -105
4538 -105 333 16 652 -158 -319 462 330 179 -277 241 -201 -151 2 -5 65 466 -622 -363 -1241 94 805
4559 805 -158 366 585 1144 1542 361 -1315 -44 569 624 -413 316 -595 152 380 -770 -654 -404 -779
4578 -779 -1330 -2 -174 -256 75 267 -296 413 3 560 1113 125 662 353 -274 841 1041 217 362 355
4598 355 -334 -496 252 -685 -763 -575 -483 325 -160 710 -743 -407 245 -299 542 304 319 854 -31 491 194
4619A94q96J082J70q65M46R8m14j84l4N79p76Q05M50p99J20J01L29l95Q22o35
4639A98P29k74l7o51JK1m30L63j51l4k99O51J46J94j288l55L57Q41k18N30j172
4660h78M36J184m92q19O62J3p7M35n00l2j74p34Q16M66n55O44o6l99N45j89J35
4681D21r4j81P46p31k74n51J96n09L98J268j57m54m99J431j220Q12j019R39k77
4700B45O3m91K50m34J56M9R17j129K45J55q05J243n17o15M31N18N92j103J365
4719A135j64r05p8N33p1j578N35j97Q13l37K41L28j137J243p48k23J370k95n55
4738i0P0K31j145J546j620O27K00L66k14Ql36Q44n70M75n10R8N19J47p84n21M88
4759a71M16M51j049R2N91l06K0l54L28K55n09M79m88P44l11K60n45J99N18p79
$$ plain form
4619 194 -702 380 550 -315 131 229 -185 -369 -403 176 -600 205 655 -144 -24 77 406 11 833 198
4639 198 927 653 616 -35 -34 -13 -443 -80 -231 -265 -564 87 233 427 -861 -1216 -859 -18 -236 294 -878
4660 -878 -442 742 250 -569 93 106 29 464 -36 -68 -242 -976 -160 306 -249 395 329 -70 475 286 421
4681 421 327 146 892 161 -113 -664 -468 -977 -579 689 532 78 -421 1010 -210 602 -417 522 245
4700 245 308 -183 67 -367 -211 -162 755 -374 -129 26 -779 464 -53 -668 -237 281 873 -230 1135
4719 1135 971 66 -12 521 450 -1128 -593 -790 23 -314 -73 255 -882 361 -387 -610 760 465 -90
4738 -90 -20 211 -934 612 -1008 -381 -181 185 -29 -21 -357 487 -83 392 -118 -20 499 646 -138 -659 -171
4759 -171 245 696 -353 -261 330 24 44 -310 18 273 -236 243 -245 499 188 448 -97 102 620 -159
4779a59L93p41R01n74L05o97R51j79M69m63k45N81j146N6R7N59j35k60P32k09
4799B36P1o01N2J08R7l96K27J133j603K96J40J087j561R53k7Q53q07m78K86j81
4819a15P04J99j317N32l32M52N88L82l52o57K59l4q80k78J301K72l84O4n32P14
4839E86J64l46l55N82m97j040l99K512j365j538J861p46L92R74n93l22L42M98
4857G10p62j425O44R59J72l27J177r18J30m88N18K36o54n0j462J372K70o43J42
4876c99j08L19K5K56p09qK22M3P1r57J215R29r11M62j19p7m77Q90j081J18N54
4897B58n3n99k43P54p95Q08J32k35J61m94k99J298L33j190O18j124M8Q63j23L05
4917D23P6j60j66q86J382p2o95J74L71m94j51k04J367q50n25M65j0N9q40J181
$$ plain form
4779 -159 234 -507 394 -180 125 -572 379 200 669 206 -39 542 -604 -548 -451 108 -27 -287 445 236
4799 236 307 -294 -242 -134 -37 -433 -206 927 -676 -380 -240 847 -714 239 212 1065 258 -220 66 -115
4819 -115 589 788 -529 3 -329 123 711 1093 741 84 343 309 -571 -849 452 724 340 404 -128 586
4839 586 750 404 49 631 134 -906 -1305 1207 -158 -1696 165 -581 -189 785 192 -130 212 710
4857 710 -52 -1477 -833 126 298 -29 1148 230 360 -128 390 626 -28 -78 -1540 -168 102 -541 -399
4876 -399 -507 -188 -163 93 -616 -624 -402 -359 -288 -1245 -30 899 -12 450 331 254 -223 667 -414 -296 258
4897 258 205 -394 -637 117 -678 130 262 27 188 -306 -605 693 1026 -164 454 -670 -622 241 118 423
4917 423 499 339 173 -713 669 597 -98 76 447 -47 -198 -402 965 115 -410 55 45 104 -736 445
4937D45q61L91k26K05J43J49p1l56n70K425j277m81J220r32Nl80K35n25K28R44
4957G11P4o28L04q3m7M1o05N02j147P75L13j028J258k40m39Q04n01L35o91k4P58
4978D42o28j73J22r7P50n3j409R48m37J029K75j214P62n08l01N25r30J276n09
4997a30Q82q01J55l03P27J2p40N62K81k88j83M18n84K52n48J251o66J46J8k22
5017B39l42M41k22k00j37N07n39k39L54L7m83P90L58m66n47M03K81K34o49J046
5037H66n91k09K64l37k49K20l88O92j006Q76j76L92k46P2l49q5l08Q83o30M7K10
5058e2j95L53j51n69J074l11K37n36P5J29R71m94n04J303j284n19P49l61R45j176
5078c16L86J50K16k36o04j73P75L0p40Q29k3K99j953J850p16J097M9r89J41L34
$$ plain form
4937 445 -416 -25 -251 -46 97 246 175 -181 -751 1674 397 -84 1136 204 209 -171 64 -461 -233 711
4957 711 785 157 461 378 331 372 -233 269 -878 -103 210 -818 440 200 -239 565 64 399 -292 -316 442
4978 442 -186 -359 -237 -334 416 363 -1046 -98 -535 494 769 -445 317 -191 -492 33 -897 379 -130
4997 -130 752 -49 106 -197 530 542 -198 364 645 357 174 592 8 260 -288 963 297 443 461 239
5017 239 -103 338 116 -84 -221 286 -253 -492 -138 -101 -584 206 564 98 -449 -46 235 469 -180 866
5037 866 275 66 330 -7 -256 -36 -424 268 -738 138 -38 354 108 180 -169 -254 -562 321 -309 -262 -52
5058 -52 -247 106 -45 -614 460 149 386 -150 -75 54 1025 531 27 1330 46 -473 276 -85 860 -316
5078 -316 70 220 436 200 -404 -577 198 228 -512 317 294 593 -1360 490 -226 871 920 -69 72 406
5098D06m02n52M8N2Q7L46K08k83K65l83M38M13k13q90j75J19J088j503M78O22
5118A69j69o00J373n16M86J83j590J86Q07j073O50Q6Q16o66l7K54l99Q60r75K72
5138A17q76j48N52m91O96J175j667P88J188q93l48m80L96J69J33n25P95l97j068
5157h84J742j99m6J64j038j56K25K59n56j19N50j87O84j021J50Q26k71k64J1Q71
5177G41n23l69k6K32o28Q91r55J129m20K17p2p47Q77n81L76M41n66o27L09J123
5197H22j679Q76m37k81N88m24O21k84L10n80l83M71M86L82j169J308M44j418L71
5216B4j09l3J98K15o56L96l93J109j468P84K80L62j026kQ62m4p25n48N04k35M48
5237e7m26Q06J34o22J101l64n37j64M91K78L4p69j95K32M08r26J642q41j28L93
$$ plain form
5098 406 4 -548 -500 -448 -361 -15 193 -90 175 -208 230 643 430 -460 -635 -516 572 -931 -453 169
5118 169 0 -600 773 257 743 926 -664 -478 329 -744 -94 -8 808 142 105 359 -40 820 -155 117
5138 117 -759 -907 -355 -846 -150 1025 -642 146 1334 441 93 -387 9 178 311 -214 581 184 -884
5157 -884 858 659 613 777 -261 -417 -192 67 -489 -608 -58 -245 439 -582 -432 394 123 -141 -130 741
5177 741 218 -151 -177 55 -573 318 -637 492 72 289 217 -530 347 -234 142 583 17 -610 -301 822
5197 822 -857 19 -418 -699 -111 -535 86 -198 112 -468 -851 -380 106 488 -681 627 1071 -347 24
5216 24 -85 -118 80 295 -361 35 -358 751 -717 67 347 709 -317 -319 543 499 -226 -774 -270 -505 -57
5237 -57 -483 323 457 -165 936 572 35 -129 362 640 674 -95 -290 -58 350 -576 1066 225 97 490
5257D90r47R4M65M46j77p63Q5O49n76p1R1M20N61L21q70L86P1k54q49N57N16l88
5279B57m19N98r5m5K35j178N08J30q39R13j9M93p85PK54o2o3j98O83q78M75n84
5301f12J491j048J38k82O93k99q2k2m53Q54q06N63k89j05r05Q31j96M98K18K29
5321D16l73q6N1l07J22K92J219j800N75P27l65p7p02J653j162o21N51N79n78M2
5341A56n79M8Q84o63O61p26K88j120J500j41p87N82m62J069p47j46k02N38m03
5360b50N62m32P17n65L54j050M62R5K71l40p3O9R63l25n32L09j207O34K53q01
5380h86J186J05j42j60K61j36K55k5m28m48J004k48Q5j20o42J13N15k69o34O80
5400F6M43j96L91m93j333J312N61j271O96Q00r21l64R65m31k40l55J30J30M68
$$ plain form
5257 490 -457 -363 102 548 371 -392 -307 342 -234 -305 -214 206 767 1088 218 604 675 421 -428 129 645 257
5279 257 -162 436 341 296 531 -647 -139 -9 -848 65 46 539 -246 -239 15 -47 -110 -308 375 -503 -28 -612
5301 -612 879 -169 -31 -313 380 81 -1 -23 -476 378 -428 135 -154 -259 -1164 -333 -529 -31 187 416
5321 416 43 -43 8 -299 -177 115 1334 -466 109 836 471 394 -308 1345 183 -438 113 692 114 156
5341 156 -423 -375 509 -154 507 -219 69 -1051 449 308 -479 103 -359 710 -37 -183 -385 153 -250
5360 -250 312 -120 597 32 386 -664 -202 -107 164 -176 -249 -180 783 458 -74 235 -972 -338 -85 -886
5380 -886 300 405 263 103 364 228 483 458 30 -418 586 338 423 303 -339 -226 289 20 -614 66
5400 66 509 313 704 211 -1122 190 751 -520 176 976 55 -309 656 225 -15 -370 -240 -110 358
5419C58p35j10Q69m77J65J9J92P53k59n38Q38p61j56n24J02p3K91k64P42o22N15
5440C25M75j119O0k27O48p72M78k20N05j06r2L66n06O18l66m45L73M27L26q98
5460a50j44M96m09l36L05P61j229J243r05K37M91p74l36L8N28K13l70J36P85r22
5480c42J41k21L71k09k05k53N34O85K52p02j29J11l48L44l35K95j30j59L04j193
5500a189J293Q29j327P76K43J30q70Q95j172J70Q3N06p00M13K14o56O92l83P24
5519F71o71O52k31j006O74k16N5o10L64J284j863J066k08l3J65M5l70L75J96l89
5539e0N91j185n69O62J719j574L20N69j005O52q61L68p5K64r7J70M49r1j713K462
5559A006j485K98J08L53M3m46P99p17r0K84K02R60j092J77o6l27Q8q8J314q78
$$ plain form
5419 358 -377 -487 382 -95 70 89 281 1034 775 237 1075 314 158 -366 -264 -337 -46 -310 432 -190 325
5440 325 800 -319 -259 -486 162 -610 -132 -352 153 47 -45 321 -185 433 67 -378 -5 422 748 -150
5460 -150 -294 202 -207 -543 -238 523 -706 537 -368 -131 360 -414 -750 -712 -184 29 -341 -205 580 -342
5480 -342 -201 -422 -51 -260 -465 -718 -184 501 753 51 -78 33 -315 29 -306 -11 -141 -300 4 -1189
5500 -1189 104 933 -394 382 625 755 -115 780 -392 -222 -139 367 -333 80 294 -362 330 -53 671
5519 671 0 652 421 -585 89 -127 -72 -682 -318 966 -897 169 -39 -72 93 138 -232 143 339 -50
5539 -50 541 -644 -1213 -551 1168 -406 -86 483 -522 130 -731 -363 -438 -174 -271 -101 348 257 -1456 1006
5559 1006 -479 -181 -73 280 323 -123 676 -41 -131 153 355 1315 223 400 334 7 95 7 1321 443
5579D43l71n4p12R44o13J327q76K53J24l62j082O77Q15Jj66l66Pl72J183m75k18
5600A07n11k76O31l67Q54l39j35m82Q40M4Lk00L00j19K98q30K76p56J240j371
5620g93L25J166K04J8o36o20j29J42j98Q4O39M97k68L14j192M43M6jR1k19k56
5641c43p1R51m70K02l27R9n13K50k77j3K275j290l38n08J222j005p0N26q8j56
5661E6K59j9j37P06p81m45J5L17K52l7N36rj251J075J53J89r92L33k50J34j0M08
5683E02p59l27N36K82j91j51o2L8J5M55j45K87M3j178j16J348k44p3N27k92o29
5704a34N96p96j17o0m4N1O95o98J194p30o75M95M30q08N10p00O59l1P92j111N31
5725D9n18O5L64J43L50j420J547j390J14N51m9P45m17m44N31j06o67O56J2n87
$$ plain form
5579 443 72 18 -694 250 -363 964 88 341 465 103 -979 -302 513 514 348 -18 -11 -383 800 325 107
5600 107 -404 -680 -49 -416 438 99 -36 -518 322 366 369 169 469 350 648 -182 94 -662 578 -793
5620 -793 -468 698 902 920 284 -336 -465 -323 -521 -437 202 699 431 745 -447 -4 42 41 132 -87 -343
5641 -343 -414 537 67 269 -58 41 -472 -222 -499 -512 1763 473 135 -373 849 -156 -226 300 212 56
5661 56 315 296 159 865 84 -361 -346 -29 223 186 722 713 -538 537 690 879 -113 220 -30 104 94 502
5683 502 -257 -584 -48 234 43 -108 -170 -132 -117 338 193 480 523 -655 -771 577 333 260 787 495 -134
5704 -134 462 -334 -451 -511 -555 -504 191 -507 687 -43 -718 -223 207 -601 -91 -791 -132 -163 629 -482 49
5725 49 -469 -404 -40 103 453 -967 580 -810 -696 -145 -194 551 134 -310 221 115 -552 104 116 -471
5745d71m3Q80l02k47k25L05N55N24k44j304J40J075j206L53n04L41N26N10j317
5764f54L74M43R2r1j29K64J92j02j241J61R11r66P50R2r30J813o73p43O76p73
5784e34R94k0n24o04P20m83j37J401j78m90M79n39l1Q15r30n0k39k00M71m68Q88
5805C41m59k01J252p77m42K46N17n89J43L30q15N48O14o37M91k02K00j003q1Q05
5825B81k44P69j591N79L33m4k86l32N93R20j081k15L14L93m09K44J90j727Q90
5844d23O06J13K54k94P4o50M44j54m32J64n89J310o76M71l53K14J05k5k5l0q79
5865g75J580j080J84m76M12M27J46j92l32K96q37J084l25k73O99p88k10K06K12
5884d2j54M57n56j00N97P20j075L27L48o22L7q92Q62J93n99J037r61L79j19O84
$$ plain form
5745 -471 -514 366 64 -183 -408 -103 452 976 732 -572 -432 643 -563 -210 -714 -373 153 663 -654
5764 -654 -280 163 255 164 35 299 491 389 -852 -691 220 -746 4 96 -834 979 306 -437 239 -534
5784 -534 460 440 -84 -688 32 -451 -588 813 635 145 624 85 54 869 -61 -111 -350 -550 -79 -547 341
5805 341 -118 -319 933 156 -286 -40 477 -112 31 361 -454 94 708 71 562 360 560 -443 -524 281
5825 281 37 806 -785 -206 127 83 -203 -535 58 978 -103 -318 -4 389 -20 224 414 -1313 -423
5844 -423 183 296 550 256 330 -320 124 -30 -462 -298 -887 423 -253 218 -135 79 184 159 134 104 -775
5865 -775 805 -275 -91 -567 -155 272 418 226 -106 190 -647 437 112 -161 538 -250 -460 -254 -42
5884 -42 -196 261 -295 -395 202 922 -153 174 522 -100 -63 -955 -93 100 -499 538 -423 -44 -163 521
5904E21j35q24M74k77N51j529J077n50L25M71P29q30n5L3Q85j352M91Q44j14j153
5924d18J267r53m31J153k05m67L23M18j350J327k01o26N76j188R38m63K90k13
5942b23P32k09p85o00R51l03k90J11J0N35q81J849l65M37K21j418J04Q69m56K31
5962E20l13m45k83J55L51L32M06K0m02l05K61K84p14J09m47K83o03N70P19l0o22
5983a54L97k54R6J78j066J70R18M5J32p23Q00m77K63p78O64L62n1j38m81P60j132
6004d69L79O40k29N00K66o04m82k66l18k93L50J221M28j202k3K19J72j083J120
6023C26j574J311l45q6p8M9N56N04l65n99L0R38k1r17R76j720J218k43OM26q89
6044d97J230j138J545k337J410O48j083o52N61R19l83k08k88N9J46m85J557m36
$$ plain form
5904 521 386 -438 36 -241 310 -1219 -142 -692 -367 104 833 3 -52 -19 866 -486 5 849 735 -418
5924 -418 849 -104 -535 618 413 -54 269 687 -663 664 463 -163 413 -775 163 -300 -10 -223
5942 -223 509 300 -485 -1085 -134 -437 -727 -616 -606 -71 -952 897 532 969 1190 -228 -124 745 289 520
5962 520 207 -238 -521 -366 -15 317 723 743 341 36 297 581 -133 -24 -471 -188 -791 -221 498 468 -154
5983 -154 243 -11 85 263 -803 -633 285 330 462 -261 539 62 325 -453 211 573 522 384 -97 663 -469
6004 -469 -90 550 321 821 1087 483 1 -265 -583 -876 -526 695 1123 -79 -102 117 289 -794 326
6023 326 -1248 63 -282 -368 -446 -397 159 663 298 -301 -271 667 646 -271 705 -1015 203 -40 -34 392 -497
6044 -497 733 -405 1140 -1197 213 861 -222 -874 -313 606 223 15 -273 -214 -68 -553 1004 568
6062E68J57r86P43l51q57J214o80k63j03r1J247j31O3o70J68J96j33o56R29m11
6082d7k1J84m7J52l09L32l08L15j069O57J86R99k410M48J22L21K96k47O86P19
6102I59j615K417k224J608k101n00J077O22K60q53l6J071Rp33r2P07j069L13M59
6121B79k17k35k39k75Q09o59o0J154j58rjJ02j294J029K79j259J100j00k07M14
6141D53o45J32M70O14k353J526K8p70M00J21l32N46j0l75O39K09o17K3M90K59
6161H08j249M68K20M37j240Q71M53q41Q03r29j5l34P66j16r43L19j69J88m35L12
6181f26J381r19J13J050j519Q39l52r6m4k36n95J261K56N2m67J57J52l95K56k89
6201b1n40N77l32q9j237J667m52N29k0r13J945o83O42r43L32n68o18K96R46o96
$$ plain form
6062 568 725 -261 482 131 -726 488 -192 -455 -558 -649 598 467 530 -140 28 224 91 -565 364 -47
6082 -47 -68 116 69 221 -88 244 -64 251 -818 -161 25 1024 -1386 -938 -816 -495 -199 -446 240 959
6102 959 -656 1761 -463 1145 -956 -1456 -379 243 503 -350 -386 685 694 -39 -131 576 -493 -180 279
6121 279 62 -173 -412 -687 122 -537 -597 557 399 390 389 491 -803 226 505 -754 346 246 39 453
6141 453 -192 -60 410 1024 -1329 197 225 -545 -145 -24 -356 190 180 -195 444 653 36 59 549 808
6161 808 -441 27 247 684 -556 315 768 -73 730 -199 -214 -548 218 102 -841 -522 -691 -503 -938 -626
6181 -626 755 -164 -51 999 -520 319 -33 -129 -173 -409 -1004 257 513 565 98 255 407 12 268 -21
6201 -21 -561 16 -316 -405 -1642 25 -427 102 82 -831 1114 431 1073 130 462 -106 -724 -428 518 -178
6221a78R51M65o29j205J005p59k12P58m02m00k00P60M24Q34r19j56n03L39j59
6240a86j57k71O97n37j27J61M71J44k38J34j14K82j59j42k24M5j42K66j254J517
6260A66K38J23J42o96r4J43L47m14N09j160J07j33M31K14j4L96k18o74K92j07
6280d02j23O15m83l9R84j273R79K80o55N83q92p1N22O23m92k67m31o15J105K90
6300B38L88p66N96k91o22N64N15k70j233P78k43J08P71k7n20Q07p55q70R36K43
6320C47n50m0N55p39k31L78J188q74k31k50m6P55O7o92L11k95m01N20l2J119j169
6341c10J339L21j334p14l21J248k39L54r25j59N70j0M02j85N27k74p8n59Q8p2
6361c31p9j9N00m50L34L8j70M20n58M08L66p36J7p48O99j46k34K85J1J069m39
$$ plain form
6221 -178 773 1238 609 -596 409 -350 -562 196 -206 -606 -806 -46 378 1212 293 137 -366 -27 -186
6240 -186 -343 -614 83 -454 -581 -420 51 195 -43 91 -23 259 100 -42 -266 -221 -363 -97 -1351 166
6260 166 404 527 669 -27 -121 22 369 -45 464 -696 -589 -722 -291 -77 -91 305 87 -587 -295 -402
6280 -402 -525 90 -393 -432 552 -721 258 538 -117 466 -426 -497 25 648 156 -111 -542 -1157 -52 238
6300 238 626 -140 456 165 -457 107 622 352 -881 -103 -346 -238 533 506 -14 793 38 -832 104 347
6320 347 -203 -243 312 -427 -658 -280 908 34 -197 -447 -493 262 329 -363 -52 -347 -748 -228 -260 859 -310
6341 -310 1029 1350 16 -698 -1019 229 -10 344 -581 -740 -170 -180 222 37 564 290 212 -347 -259 -331
6361 -331 -410 -429 71 -379 -45 -7 -177 243 -315 93 459 -277 -260 -1008 -309 -455 -689 -404 -393 676 237
6382B37M58k75n8m74L23M58j125n1l26P00l48P4J46l92J258l33m53R69l74r34
6402e20l33L13K31p84J488K89n16q4j59K90o12Q74o62q74J497q5n56k82N08J304
6422A327o46q20M78k46p6J95k80J66K93j098L84o2J050p60j81J3k8N5M1K13j18
6443a00J01j202l39J406M10j36r5j93j00K34R59o60p54j36J6O1P15j32K3N88o17
6464D9O10q44Q69o73j102J029J88L39n16J411j483M4O28l04q70Q84k31o58O10
6483b0j70P66k24r32m54R81K53l55K82M62jn07l61J04k06J72J13M19N8p12O19
6504B87m17P08o56Q9P98j804R02K49l32k06J22j94P92K63m97l8O99j003L55j90
6524g3k85k87J098p14O0J84P81n88L06j027J76K13N8o5m35N62j57r9J234r06j21
$$ plain form
6382 237 695 420 362 -112 211 669 -456 -507 -833 -133 -481 -407 -261 -653 605 272 -181 788 414 -520
6402 -520 -853 -540 -309 -1093 395 684 168 84 -75 215 -397 477 -185 -1059 438 353 -203 -485 23 1327
6422 1327 681 -139 339 93 17 212 -68 98 391 -707 -323 -385 665 -95 -276 -263 -291 -236 -195 18 -100
6443 -100 1 -1201 -1540 -134 276 140 45 -148 -248 -14 945 285 -469 -605 -589 -528 187 55 78 666 49
6464 49 659 -185 684 11 -1091 -62 126 465 -51 1360 -123 -79 549 245 -625 259 28 -630 -20
6483 -20 -190 576 352 -580 -1034 -53 200 -155 127 589 588 81 -280 -176 -382 -210 -97 322 380 -332 287
6504 287 -130 578 -78 11 809 -995 -93 156 -176 -382 -260 -454 338 601 104 66 765 -238 117 -73
6524 -73 -358 -645 453 -261 -201 -17 764 176 482 -545 -369 -156 -98 -163 -598 -36 -193 -292 942 36 -85
6545h5M35n45l49N2K33o09R78K79n8O02k53j79Q98j251m77M06j27n75k53L6J70
6566f72K6K43k85N85K25k87Q24q64P87o58m51L11J231j370n01J849o18K46p0k34
6586C17j023Q85L85r11j38J571m81m60l61P01n28R27j002j58N11o75L54l33J60
6605b59m98n22Q64J381j515J741q99O03j427J592j348K27R2p15O96m31m12J441
6623F11o11N17n51J96RM14q77P08o4o30P65J0j75q2L91n15l7q90P77%k95J41l00
6646d88M81L76q84J123m74K81j160qM35J346j126N59p00L70k31N48j140N91N55
6665D54p23p32R07K20q22L09N0n20P90N38m49k4K60J088p70j16J17n10m27P46
6685C86o99r68J532m5K40p84K49Q64p24j60O31p26N5p35M04J006l67P58l75m7
$$ plain form
6545 -85 350 -195 -544 -492 -259 -868 110 389 331 933 680 501 1399 148 -329 77 -50 -625 -878 -842 -672
6566 -672 -646 -403 -688 -103 122 -165 659 -205 582 -76 -527 -216 1015 -355 -856 993 375 621 551 317
6586 317 -706 179 564 -347 -485 1086 605 145 -216 485 -43 884 -118 -276 235 -440 -86 -419 -259
6605 -259 -757 -1279 -415 966 -549 1192 293 896 -531 1061 -287 -60 32 -683 13 -418 -830 611
6623 611 0 517 -34 162 171 585 -292 416 352 -278 487 497 322 240 631 116 79 -811 -34 -34 -329 -188 -488
6646 -488 -7 369 -515 608 134 415 -745 -753 -318 1028 -98 461 -239 131 -100 448 -692 -101 454
6665 454 -269 -1001 -94 126 -696 -387 -337 -857 -67 471 22 -2 258 1346 576 460 577 67 -360 386
6685 386 -313 -1281 251 206 446 -338 -89 775 51 -109 522 -204 -149 -884 -480 526 159 917 542 495
6705D95L82j45j28m2j068N84K29Ln89O93n72j58J11N28j4n56N84j21Lj572Q49
6726e04j31k29R13Q85j35N1o88J55N8m28m60M7Q14p97L81r3P67p85R9P51p36K94
6748B29j09r70L53l99R27M81r9J80q57j04P66n29O47j93n04j1j179Q70m63L85
6768e79P43j92l76K9R25k48J67p31M62p33J00Q19l78N05k37o30Q9p26L48K12J50
6789b81O89o53M9M14r81N13N12Q8j32L14o77n22Q55N21r48j84N43N27j690P83
6809b60k40O53k40N78N24j005N37j022N14j51M05n02N74n74J96j099J359J0m86
6828b29M43Q27j065k74J56J54K69j00M91m85k91L43l0q9q07J267M4r18k42P7K20
6849b39p7L21P29q47M08rr43K84Q5J137r82K71r5k84L19k80l26L79M86j93k42
$$ plain form
6705 495 877 732 604 562 -506 78 307 310 -279 414 -158 -316 -205 323 309 -247 337 216 219 -1353 -504
6726 -504 -635 -864 49 934 799 850 162 317 375 -53 -513 -466 348 -449 -68 -161 606 -179 -80 671 -65 229
6748 229 120 -850 -497 -896 31 512 413 593 -264 -368 398 -131 516 323 -181 -192 -1371 -501 -964 -579
6768 -579 164 -28 -404 -375 550 302 469 -262 200 -533 -433 386 8 513 276 -354 -265 -991 -643 -431 -281
6789 -281 408 -245 -196 218 -763 -250 262 350 218 532 -145 -667 188 709 -239 -423 120 647 -1043 -260
6809 -260 -500 153 -87 491 1015 10 547 -475 39 -112 293 -209 365 -209 -13 -1112 247 257 -229
6828 -229 214 1041 -24 -298 -142 12 281 181 672 187 -104 239 209 120 -687 580 624 -294 -536 -459 -239
6849 -239 -316 5 734 -113 295 286 -657 -373 -288 849 -133 138 43 -241 78 -202 -528 -149 337 144 -98
6870i8MJ68n58P58k64N7O67p26J36m09P4J52N0j074P59l14N37q4l6l6k71Q35p82
6893d55n11O98l05J79J87k99N60o68P46N80r39j51L55L0j16L00L03n68j431J168
6913c37K1q7O70r18J152r31O19l1j05m16j85O42o9O32j263k32R76j54N27n0n68
6934a07L81o13Q46p67K13r31M85N32l72J72j52oQ69L56j768N43P45j117L52m93
6954h32J126L34L26j479J063Q3o1j50j157N05J75l81k34P0M61P3J12L30N11k75
6974F00p31K31p43P36p47O36J67M38j232k67J225l39Q8M76j35j37m52o9j40P92
6994C97j87m21P09j090O20N86l12l68K47r7n66L58q0l17Q60P64j166O40M29m65
7014E41L41j605j39n0O48L28p88P91P2o55R51n43o04K48J146p82K00l3j17L45
$$ plain form
6870 -98 -94 74 -484 274 10 67 734 8 144 -265 -191 -39 11 -1063 -304 -618 -81 -165 -201 -237 -508 327 -455
6893 -455 -966 -268 -573 -394 -207 -506 54 -614 132 712 -227 -378 -23 7 -109 191 494 -74 -1505 -337
6913 -337 -316 -403 267 -651 501 -430 189 158 53 -363 -548 94 25 657 -606 -838 138 -16 511 461 -107
6934 -107 274 -339 507 -260 -47 -978 -493 39 -333 -161 -313 -319 550 906 -862 -319 426 -691 -339 -832
6954 -832 294 628 954 -525 538 621 560 410 -747 -242 -67 -448 -682 -612 -151 -78 34 364 875 600
6974 600 -131 100 -643 93 -654 -18 149 587 -645 -912 313 -26 62 538 403 266 -186 -255 -395 397
6994 397 210 -211 498 -592 28 614 302 -66 181 84 -482 -124 -204 -521 339 1103 -63 577 1006 541
7014 541 882 -723 -862 -912 -264 64 -724 67 139 -516 435 -108 -712 -464 682 -100 100 67 -50 295
7034B95o47M44l54N9N65q5l27M43m74m56o12J607j43k71l31N28J44j51O82j156
7054b40M85j64p56N73L14l34Q0Q4L34o67K11L13j0K07k40p81J034n27l25L5J28
7075b46M51J088j298m13Q21q18L16K19j019R78m35O2J356r71L70p4o38M68K87
7094E04l07K07q01N94r54j83R38M18m98K77N53o07P05q68P99j199J194pl74k07
7114A84n39J028r20M73p26Q33o35N34L74j167j18L46m19J457j582L09O68n00j18
7133e18J105l0q36J236j220M44l50R59j211M39j16O9J56K87O0k59J91K95Q9q47
7153e7K94p9j018K84P39m45R6P6R95j053L68r38O04P60j149J68L42K77r6J63p1
7174B60Q23r26p17J102n77j99J87L16P99j317l5N85K4m86j60J66Q92n85m75O03
$$ plain form
7034 295 -352 92 -262 -203 362 277 -50 393 -81 -537 -1149 458 315 44 -287 241 385 234 916 -240
7054 -240 245 81 -675 -102 212 -122 -42 42 376 -291 -80 233 223 430 190 -591 443 -84 -409 -374 -246
7075 -246 205 1293 -5 -418 403 -415 -99 120 -899 79 -356 -294 1062 91 461 387 -251 217 504
7094 504 197 404 -397 197 -757 -940 -2 416 -82 195 748 141 846 -22 777 -422 772 765 391 184
7114 184 -355 673 -247 226 -500 333 -302 232 606 -561 -679 -333 -752 705 -877 -568 100 -400 -518
7133 -518 587 557 -279 957 -263 181 -169 790 -421 18 -98 -29 127 414 474 215 406 701 790 -57
7153 -57 237 158 -860 -576 163 -282 -186 -110 885 -168 200 -738 -134 626 -523 -355 -13 264 168 331 260
7174 260 1083 157 -560 542 -35 -234 -47 269 1068 -249 -284 301 325 -161 -321 -155 737 152 -323 280
7194B80p01l7N72J07R0J35L41j390p5J070j100O64j49oj81K78M03K37q76j40J028
7215E50N2L81j044o09R85n34p57J208K78j001J62M99l10O90n17p0K38n94M90n04
7235d07M93m45M76P6l94M79O89j801Q99m7R97j487N79l84K10K11L51L74m37p72
7255c40O54l4N6j1o2O7K57j106J089l0q8m50R4J48l34L84p98P62M61q82K14l91
7277c40Q81o55J4q12J160O56j098l88j84P6j22J097o38Q59m32K64K42m25L01q45
7297c89J199r20L20P01j351J301n98j97QL1O76j086n57J147j047R33L6l69M72
7316C10n1O5k26j103P48P58q6n28N93m79L73J071j456q29J633r64Q82j576J51
7335g14P61R9o57Q80j479J093J78m67Q87j137R15j180O99K48Q5p24P70K94j462
$$ plain form
7194 280 -421 -458 114 221 311 446 787 -603 -678 392 -708 -44 -193 -199 -380 -102 301 538 -338 -478 550
7215 550 602 983 -61 -670 315 -219 -976 232 510 -491 -329 170 -140 550 33 -37 201 -393 97 -407
7235 -407 86 -359 117 193 -201 278 967 -834 65 18 1015 -472 107 -277 -67 144 495 869 432 -340
7255 -340 314 280 336 325 263 330 587 -519 570 540 452 2 96 244 -90 294 -504 258 719 -163 51 -340
7277 -340 541 -114 -100 -912 248 904 -194 -582 -766 -690 -812 285 -353 506 74 338 580 155 456 -389
7297 -389 810 -110 210 911 -440 861 263 66 74 105 781 -305 -862 285 -762 171 207 -162 310
7316 310 259 324 98 -1005 -257 501 415 -113 480 1 374 1445 -11 -840 793 -171 711 -865 -714
7335 -714 47 146 -511 369 -1110 -17 161 -306 581 -556 359 -821 -122 126 211 -513 257 551 -911
7354i11O97jP13m86M99j13K1n91j41K40k81Q86p24K15j49P29l28k87N79j75j024
7375f32R96n80P64j366M26R13J73m61n9l35L14L99j41r26J98L14j45L25o77J272
7395G72l01q05J77M46o97M59o17P98pN19j603O80Lk20J96N63p68n2N76J2k98l70
7417e37m3P23k56R4p05J166M92o43q22N47L77j345J427m77R04m67Q2n22l6N19
7437D78j431O70Q30p90o3M03M19n09k35N05n46M84n01R37j845J255p37L02J404
7456A030p58n4m91k81O70l5k03M32j21R76j126O84q79j69K2m40J193j091Q43J69
7476C71j145O25k21j83N87j06K73j12o93R44n44p8J78J13j4L29q12k52K027r55
7496C32n44Q12p34L9L05j321N45K26J004J13l05p12K07J54M03m11L31m18K94n71
$$ plain form
7354 -911 -214 -215 498 12 511 398 419 -172 -313 -73 -354 532 -192 23 -126 603 275 -12 567 392 -632
7375 -632 364 -216 548 -818 -392 521 694 233 174 -161 153 552 411 -515 -317 -3 -148 177 -500 772
7395 772 471 -334 -157 289 -408 51 -566 232 225 744 -859 -179 -176 -396 -200 363 -405 -457 119 131 -167 -537
7417 -537 -580 143 -113 -19 -724 442 934 291 -531 16 393 -952 475 -2 902 435 517 -5 -41 478
7437 478 -953 -283 547 -243 -306 97 516 7 -228 277 -269 215 -286 651 -1194 61 -676 -374 1030
7456 1030 272 218 -273 -554 116 81 -122 310 189 1165 39 723 -156 -325 -303 -743 450 -641 202 371
7476 371 -774 -149 -370 -553 34 -72 201 89 -604 340 -204 -282 -104 9 -5 324 -488 -740 1287 332
7496 332 -212 600 -134 -95 210 -1111 -566 -340 664 777 472 -240 -33 121 524 113 444 26 320 -251
7516b51J361p91K25k44r85J088m66k50p2N59l46j92P58n78J37O73p70q56N32L91
7536g7J07k74O97J6n35j0p31R07L98k68P15j047n65L56l2L06J03K08n81m34J079
7557C38q40O13j28k94P85k47p0M27n86RJ022j280r4P15n24l60M20l36L57j25O87
7578D89j407J357j056K77J271j301M90m13K18j64L53o49Q65o92j67M90J3N40J68
7597F82j263R38o28N90k23n09R72l08k9K59o86l98M76L32n20m70J162l53o19L77
7617b18Q3j69P07m36l63M38j01K95o08J10m78Q62o97J62Q75q00k25L68J97O28
7637F30p6r88K57l47O47r21R90k41j61O37K16l49n38l1k80N56N84m3J41j629P77
7658a69m33K46J129o82O9P45j4o98l96K21P24r09O33l69j71N26K03L90j432M6
$$ plain form
7516 -251 1110 319 544 300 -685 403 -63 -313 -385 174 -172 -364 394 -184 -47 626 -144 -1000 -468 -77
7536 -77 30 -244 453 469 -66 -76 -807 100 498 230 945 -102 -667 -311 -343 -37 66 274 -307 -741 338
7557 338 -502 111 -17 -311 474 227 157 584 -2 7 1029 -251 -345 370 -154 -514 -94 -430 -73 -198 489
7578 489 -918 439 -617 -340 931 -370 120 -293 -75 -239 114 -535 330 -362 -529 -39 -26 514 682
7597 682 -581 357 -271 319 96 -413 559 251 222 481 -205 -603 -127 205 -315 -785 377 24 -595 -218
7617 -218 -135 -304 403 -33 -396 42 -59 236 -372 -262 -740 122 -575 -413 462 -338 -563 -195 2 630
7637 630 554 -434 -177 -524 123 -798 192 -49 -210 427 643 294 -244 -275 -555 1 585 542 683 -946 -169
7658 -169 -602 -356 773 91 160 905 891 193 -203 18 742 -167 466 97 -74 452 655 1045 -387 -341
7678c41j20J330k55j031l42L89j64K71L48K44n6n63L40J35k61j18O53o90k78J018
7698E09J32p74L87O47n6j188J58L88n56M27L35K75j74N0l91m32Q34r57M14p83
7718g55O09K31j95L67r69O56K3q2J76m09M45o48L05L32j502J707j025j22N94K36
7738b6J35o55j73R14n44k55M87R01p71k77j99J085j083K29L43l7N19j386J049
7757B56r49l99J343L17J66p41N72p18O99j148P85k33K33J87j105Q20l10n56N51
7776b30J016r14n92J329j017O40j313J206N35j235M15N14Lk28j20p94J343j172
7794f14J092o20M28p9m58Q89l85j27o29R9M76Q41k30j260M29J193j287J441j376
7813a77R21P92j554k50M13j77r15L74K63N31k34O47J74n00K47p83N40m78n66L32
$$ plain form
7678 -341 -461 869 614 -417 -759 -370 -534 -263 85 329 273 -290 50 185 -76 -194 459 -231 -509 509
7698 509 641 -133 254 901 845 -343 -185 203 -353 74 409 684 510 560 169 -263 571 -386 28 -755
7718 -755 -146 85 -110 257 -712 -56 -33 -115 61 -348 97 -551 -246 86 -1416 291 -734 -856 -262 -26
7738 -26 109 -546 -719 195 -349 -604 -117 784 13 -264 -463 622 -461 -232 111 74 593 -793 256
7757 256 -693 -1092 251 568 734 -7 565 -153 546 -602 183 -50 183 370 -735 85 -225 -781 -230
7776 -230 786 -128 -720 609 -408 232 -1081 125 660 -575 -160 354 357 129 9 -785 558 -614
7794 -614 478 -142 286 207 -251 638 253 126 -503 -404 72 913 683 -577 -148 1045 -242 1199 -177
7813 -177 744 1536 -18 -268 145 -32 -947 -573 -310 221 -13 634 808 308 555 -228 312 -166 -732 -400
7833d00Q1N02n01J613j465l07j23P00K68m5j083j79Q65k56l19R83j94j87J128
7852A081r70k47N05k41n87J005p32L87l79q83J235M22j005J57N0M93j96l44L73
7871A24r15p6J677p65m66N30m71O43Q9l99J18j92N23J18p69O3M16N2p67J302j201
7892c66L28o72P70L69L27j008J43k69l49P51J177j521m26P4R24m23m1j81l19k70
7912i82O77M09l16K98n56J646j201n5K67N11l77K35k27j014L84L49l10P79L27
7931H44m67Q4j88p2j91J56K67m48l03R05m82q7Q05j300P73r8o47N39m01K26j67
7952b52J58l9j49M05K00j265J101j90N55n25O57o99K16O00J6K88q11J55m9j035
7972f63O50j50n55Q77m13j34K09J57P21r81r2M09l79L36J65m24K28J89K44q57
$$ plain form
7833 -400 -319 183 -318 1295 -170 -477 -600 100 368 323 -760 -939 -74 -330 -649 334 140 -47 1081
7852 1081 111 -136 369 128 -459 546 -186 201 -178 -1061 174 596 -409 -252 -202 291 95 -249 124
7871 124 -791 -867 810 45 -421 109 -362 281 370 -29 89 -103 420 538 -231 -168 248 300 -467 835 -366
7892 -366 -38 -710 60 429 756 -252 -109 -378 -727 24 1201 -320 -746 -672 252 -171 -212 -393 -712 -982
7912 -982 -305 104 -212 86 -470 1176 -25 -80 187 698 321 556 329 -685 -301 48 -262 517 844
7931 844 377 461 273 201 10 166 433 -15 -318 587 105 18 823 -477 296 198 -449 90 -311 -85 -252
7952 -252 -94 -133 -282 123 323 -942 159 -31 524 -1 656 -43 173 773 789 1077 266 421 372 -663
7972 -663 -13 -163 -718 159 -254 -388 -179 -22 699 -282 -374 35 -344 -8 157 -267 -39 150 394 -463
7992d63m77N11R09m93m6N29o29P35n18j95m32P24j14K36N7l39q37J165o38l57
8012f72R04r58N72k91M30M84q71j36N92K34l29L91q59P18n45Q99Jp82J90j03M32
8033C01j032M23J35P20k71l51p47N87R6Q57K50j083J97M07k18N46k14K02m58m8
8053B99O49m47p65m58J301l39m23N92j260J530p33k29K16J66J34m18k28L44n90
8072f59J448j255J145o37o91Q48l41L12p68M47l66J73k5L62n24M90j67P23r0r27
8092e02K05P22o57r2m2N35N20j002R30j225J001k02J78q55Q88p29L42K2o5P6o98
8113f50J313q48J035n32n29J35k93N70r95K42J268l75K45o04j43o0k1J094j246
8132c94Q16m94l49J175o32J1K91r55Q35R3j367R39l50J079k2o19O6k72K17n9k68
$$ plain form
7992 -463 -940 -429 480 -13 -59 470 -159 576 58 -137 -569 155 41 277 334 -5 -842 323 -315 -672
8012 -672 232 -726 -154 -445 -15 469 -402 -538 54 288 -41 350 -509 209 -336 563 564 -218 -28 -131 301
8033 301 -731 -308 -173 547 276 -75 -822 -235 -139 718 968 -115 82 489 271 817 603 805 347 299
8053 299 948 501 -264 -722 579 240 -183 409 -851 679 -54 -283 -67 99 233 -185 -413 -69 -659
8072 -659 789 -466 679 42 -649 199 -142 170 -598 -151 -517 -344 -369 -7 -531 -41 -208 515 425 -502
8092 -502 -297 425 -232 -324 -366 169 689 -313 617 -608 393 191 369 -486 402 -327 15 37 -28 48 -650
8113 -650 663 -185 850 318 -211 -76 -369 201 -794 -552 716 341 586 -18 -161 -221 -242 852 -394
8132 -394 422 -72 -421 754 122 133 424 -531 304 397 -970 -31 -381 698 676 57 123 -149 68 9 -259
8153b59J6K99n00k59P6k68Q44N62l80k45J60p77N53N03n16J31N11j82k3J70n79
8174a63J55N62o66L79l38N08k00j09K00l61L2p88o07Q34J568j408K33
$$ plain form
8153 -259 -243 56 -444 -703 -627 -895 -51 511 131 -114 46 -731 -178 325 -191 -60 451 269 246 416 -163
8174 -163 -8 554 -112 267 -71 437 237 128 328 -33 -1 -789 -1396 -562 1006 -402 -169
8191a69
$$ Imaginary data points
##PAGE= N=2
##DATA TABLE= (X++(I..I)), XYDATA
0@%%%%%%%%%%%%%%%%%%J01k09K16k16K16k16K63l71M32m34N42o48P19q27R30j040
34e42J186j355J495j668J875k096K336k603K890l200L539l907M312m758N250n788
50c034O378p029P745q544R448j0459J1606j2924J4442j6226J8369k0994K4277
63A3055k8522L4276m2558N5472p8615J32143m57956N7897J516718n82750j445516
74h26356L06832P00789k36738O53175O58275j125034r89359P11278M34947j96771
84I1038L94473M662j122253k79688R39945L64433k20701J68810k69538p99236
94g28055J98493R12666J3050m06965Q150k93902l85386O15089P10179k97527l74582
105b8790K5192k52528l3814O24733J80541n38625k58617M95o7811L26172M58942
$$ plain form
0 0 0 0 0 0 0 0 0 0 0 0 0 0 0 0 0 0 0 0 101 -108 108 -108 108 -108 155 -216 216 -218 324 -324 395 -432 498 -542
34 -542 644 -711 784 -884 991 -1105 1231 -1372 1518 -1682 1857 -2050 2262 -2496 2754 -3034
50 -3034 3344 -3685 4060 -4484 4964 -5495 6111 -6813 7629 -8597 9772 -11222 13055
63 13055 -15467 18809 -23749 31723 -46892 85251 -372705 -314808 1201910 619160 -826356
74 -826356 -519524 181265 -55473 597702 1255977 130943 -858416 -147138 287809 91038
84 91038 485511 490173 -632080 -911768 28177 392610 171909 340719 71181 -728055
94 -728055 -529562 383104 396154 -10811 -2661 -296563 -681949 -66860 643319 345792 -28790
105 -28790 -3598 -256126 -289940 334793 515334 -23291 -281908 -281413 -349224 -23052 435890
116D35890j64708l95307p0383K9148J40442L28450J4524l64559k18627o387J03205
127a68312L17285K08535k25400k45497J7779M3736J31233K68399q9210m28987
137a70439j15390J60360K1222J31346K38529k19364l65701J80718K62359r2893
147C0747Q2288J33015m06883k78609L88927J80704k10284J49865J01110m14123
157b43243R121N36277k9377l05808J76377m3894m31487J96176M56869k51182k55385
168a85556K69365p0306k78265L70337L08731m19380j84254K72808j56344k04351
178b77215L92519J06883m66727J0307L50580j51221p0657L94163p5906m52158
188b39432J43929K67316k45082j9259K92577k16687k98795L12138K08080k29109
$$ plain form
116 435890 271182 -124125 -194508 -165360 -24918 303532 318056 -46503 -265130 -271517 -168312
127 -168312 148973 357508 132108 -113389 -95610 -51874 79359 347758 258548 -170439
137 -170439 -285829 -125469 -104247 27099 265628 46264 -319437 -138719 123640 30747
147 30747 113035 246050 -160833 -439442 -50515 130189 -80095 69770 170880 -243243
157 -243243 -234122 302155 272778 -33030 143347 99453 -332034 -135858 321011 69829 -185556
168 -185556 83809 13503 -264762 105575 414306 -5074 -189328 83480 -72864 -277215
178 -277215 115304 222187 -244540 -234233 116347 -34874 -105531 288632 212726 -239432
188 -239432 -95503 171813 -73269 -92528 200049 -16638 -315433 -3295 204785 -24324
198b4324O1789J84596k72251j59607L01322M2646k43790O4732R0055k15317J7474
209a52675L04037j3695j78749Q3440L5025j60820O0284J74470j20547j59225P8209
220e0246K3696o3594J12585J13904j08489p6685P1827Q208l2559M5349j3925j12256
232h2185l5433N6322M5302L3208J8095j5660j6401m33K1968M8782r453q6464l6015
245e8367K1324j9082K0204R7853r647r5189M4310P8134n7221m173P6939r3093
257A992j34658Q5386P0256r7339L3570J18159r5998p3684J67192M5480j48206
268b7850L8495P4158j66291n2342J89241k0544j52322J13808R3558j53390L3830
279b9649K00951r8711j60268J27594J9022j89644P0102J65695j51032r3050J96253
$$ plain form
198 -24324 37465 222061 -50190 -209797 91525 134171 -109619 -44887 45168 -170149 -152675
209 -152675 151362 137667 -41082 42358 77383 -83437 -23153 151317 30770 -128455 -50246
220 -50246 -26550 -90144 22441 136345 27856 -48829 22998 31206 -1353 43996 30071 -82185
232 -82185 -117618 -61296 -15994 17214 35309 19649 3248 2815 24783 73565 64112 -22352 -58367
245 -58367 -37043 -56125 -35921 61932 52285 -42904 1406 79540 22319 18146 95085 1992
257 1992 -132666 -47280 22976 -74363 -40793 77366 -18632 -92316 74876 120356 -27850
268 -27850 10645 84803 -81488 -133830 55411 34867 -117455 -3647 89911 -63479 -29649
279 -29649 171302 72591 -87677 39917 58939 -130705 -60603 105092 -45940 -138990 57263
290E7263J3411j49189J28709J12923k01924n5307J77991p2058j49502J45882O0603
301F8802j89595M0543J98625q5468r0594J59730n043j90674O7507J27483j45044
312d3728o7156J49242l4044j23172J30756J06215j30215j1916J25841p4560j04115
323g6852J06953K7517j44028J1488J07675o3683l6047J26077J1636j03658M2750
334I828O8915q1634l6423P1869l5865q6991N1799N7603m4509R201P1741k0036
346C5498m5092M2835K3129n7406k1555J8602k6606k9054L6213L4760j3808M87
358a997L3009N058k0932O810J4038l4545m2780J1921J7058k3266N915M8736m939
371A4086k7499M0097L5067m9709j6935L7428l9292o0110M4627L5516o0553J0461
$$ plain form
290 57263 70674 -78515 50194 163117 -38807 -94114 83877 11819 -137683 8199 68802
301 68802 -120793 -80250 118375 32907 -57687 102043 97000 -93674 -26167 101316 -43728
312 -43728 -110884 38358 4314 -118858 11898 118113 -12102 -24018 101823 27263 -76852
323 -76852 30101 57618 -86410 -74922 32753 -30930 -66977 59100 70736 -32922 9828
334 9828 78743 -2891 -39314 32555 -3310 -90301 -38502 19101 -25408 -16207 55534 35498
346 35498 -9594 33241 56370 -1036 -22591 -3989 -30595 -59649 -23436 11324 -2484 -1997
358 -1997 31012 36070 15138 21948 35986 1441 -41339 -29418 -12360 -35626 -29711 19025 14086
371 14086 -13413 26684 61751 12042 -4893 32535 -6757 -66867 -22240 13276 -47277 -36816
383c6816P9060l0929l9581Q0567J7705r6095J0176O1455p6951m8204R3405N79
395A4371q6627O3418Q1364p6695j2704J06473m0989j03492O6898L9712j16670
406f4941L909J06078o1654o5548J18111L4375j09366M2408R0530j02925n9941
417f8964J08413k1546j17445P1572P5521j02792K161J33103l8704q7508R2991
428D6802L2247j24827J2557R1666q4052o3209J06715J1578r1311O4136Q5800q6521
440A581k8332R5674l5723r2093N8453L3889r6839N304R0852l6612m3737Q4787
452C7204J8651p6266K6612N2874o5799l5100N5628j8437n7815M5317L9148l9887
464a7870O514N4028j8520k8038K9463j34m4307l376J4962k0768n615K5326J0195
$$ plain form
383 -36816 42244 11315 -28266 52301 70006 -26089 -15913 45542 -31409 -79613 13792 14371
395 14371 -72256 -8838 72526 -4169 -16873 89600 48611 -54881 12017 51729 -64941
406 -64941 -61032 45046 -16608 -82156 35955 70330 -39036 3372 93902 -9023 -68964
417 -68964 39449 17903 -99542 -27970 47551 -55241 -53080 80023 41319 -46189 46802
428 46802 79049 -45778 -33221 58445 -25607 -88816 17899 29477 -61834 2302 88102 1581
440 1581 -26751 68923 33200 -58893 -440 33449 -63390 -58086 32766 -3846 -47583 37204
452 37204 55855 -20411 6201 59075 -6724 -41824 13804 -4633 -62448 -17131 22017 -17870
464 -17870 -11356 42672 24152 -3886 25577 25443 -18864 -22240 -7278 -28046 -33661 -8335 1860
477A860k120J4249J1881O42l585q580p149p949j8033p762J7450j863j0645K8122
491F518K1931k2456M409L2796k7399l6911K7094l067n3880J7765M5040l8533j1575
504c8268P1339k744n2263M5761L2431p6001j0415O3697m7082n4821P2836K3345
516B7815p5401L8794P9569o0023l3034Q4865k1562r2908N0326M4906r4888p739
528e9280R7952l9529o1115R3237L2021r5561K8705P6629q2723m8627Q9418j7823
540A3304r2597O3111O1426q0667L481R8028m0085o4113P4829J4433r4538J8055
552b5333O4015o7244l4229Q2989j940o2305N4895M8392o6068n461O3565m0084
564A1192n5192N0234Q450o2802K3378N2534l6594j1487N8460o695m1902K8443
$$ plain form
477 1860 -260 13989 25870 26512 22927 14347 7198 -751 -18784 -26546 -9096 -10959 -21604 6518
491 6518 28449 5993 10402 43198 15799 -21112 5982 2915 -50965 -33200 11840 -26693 -38268
504 -38268 33071 30327 -21936 23825 56256 -19745 -30160 33537 -13545 -68366 4470 27815
516 27815 -47586 -8792 70777 10754 -22280 62585 41023 -51885 -1559 43347 -51541 -59280
528 -59280 38672 -857 -61972 31265 63286 -32275 -3570 73059 -9664 -58291 31127 13304
540 13304 -79293 -16182 45244 -35423 -31942 66086 26001 -38112 36717 51150 -43388 -25333
552 -25333 38682 -28562 -62791 20198 18258 -44047 10848 59240 -6828 -12289 51276 11192
564 11192 -44000 6234 14684 -48118 -24740 27794 -8800 -20287 38173 31478 -10424 18019
576A8019J3828m9047l545K6338k5411j4099L2610K455j4919K2889J3458j7160
588E416M369N744j9679o239N798j5914o06J9256p544J222K8782l29j6905K0422
602B3793M412l7584K200K0370l2662j4366L9795l707l0243L6145K7611m1562M078
615a720M2592l5351l9860M4155L0n7768K5927M8099m5490j0459O9557j1939n4319
628b6546M8126K6309p5587J735O0483m8280m3019P1989Q621o6390M3269N7055
640E7765o4464j5456P1267l1296o7071N2853K3206p5250J5238O8240m3042k9573
652c7583P3231M273o5712L2623M1235o3476j9196N9096k6526m9943N2623K6471
664B7116n3277J6697N5746l6570l0903M9437n474n6040K2246K6981m3750l770
$$ plain form
576 18019 31847 -17200 -20745 5593 -19818 -33917 -1307 1148 -13771 9118 22576 5416
588 5416 9785 15529 -4150 -10389 -4591 -20505 -21111 -1855 -9399 -8177 20605 20276 3371 23793
602 23793 28205 -9379 -7179 13191 -19471 -33837 5958 2251 -27992 8153 35764 -5798 -1720
615 -1720 40872 5521 -34339 9816 9846 -47922 -21995 26104 -19386 -29845 39712 27773 -26546
628 -26546 21580 47889 -27698 -25963 34520 -13760 -56779 15210 23831 -42559 710 57765
640 57765 -6699 -22155 49112 17816 -49255 3598 26804 -48446 -33208 35032 -8010 -37583
652 -37583 35648 39921 -25791 6832 48067 -15409 -34605 24491 -2035 -51978 645 27116
664 27116 -26161 -9464 46282 9712 -21191 28246 22772 -33268 -11022 15959 -27791 -31561
676c1561M8290j4070k3220L8489J0447l3609R375K1000l0996j3758K2364r257
688f506j8037J9849J1810j2064R036J4743r281m744O924j0496r346L578n277o156
702a5967Q821L323k946J3421P012q801L554J0469j8351j1716J4976q938j9600
715b4743J9354J2170k1273J0103L1412k0396j4882L2056p795l7352J7242J9301
727A5197l9012k572M2656j7659k4984M3531J2031m3238J5906L2266m0850j9061
739b5789M0773j1189m2236L3025K7038m0912M973M8696k2192l1145L9591N749
751B6382n2398J2604L5236l7716j9238M9741j622m0758L4194L0304m4598l526
763a1395M3163k7025l5617L6424P109m4096J7120L6934k9479j0785M3048o516
$$ plain form
676 -31561 16729 2659 -20561 17928 28375 -5234 4141 25141 -5855 -19613 2751 -6506
688 -6506 -24543 -4694 7116 -4948 4088 18831 9550 4806 11730 1234 -8112 -4534 -9811 -15967
702 -15967 -7146 -3823 -6769 6652 13664 4863 8417 18886 535 -11181 3795 -5143 -24743
715 -24743 -5389 6781 -14492 -4389 27023 6627 -8255 23801 16006 -21346 -4104 15197
727 15197 -23815 -26387 16269 -1390 -26374 17157 29188 -14050 1856 34122 -6728 -25789
739 -25789 14984 3795 -38441 -5416 21622 -19290 -14317 34379 12187 -18958 20633 26382
751 26382 -26016 -13412 21824 -15892 -35130 14611 12989 -27769 6425 36729 -7869 -11395
763 -11395 31768 4743 -30874 5550 12659 -31437 -14317 22617 -6862 -17647 25401 18885
775A8885l3628K2807J4437l6967k748K8469j6971j9044K6467J0374k2242J1305
787A144K0721j7750r449J7777n731k2040Q164R157j5399Q03J6934j517o820J3598
801I592L377j1938J527L822r969m898L702k806q2N615K661J696N797k219m68L278
817H687o643q432N514j180j2724P340R639q247K169J6819m280j2251J2352L024
831A1787k0328L75J4227j4835q904K0260K782j7194J3639J8436j9788n273K1962
844A7146j0577k4210J7897Q027k5801L292K7243j4372j2794K8892L502k7696J1231
857A780J8342k6807j0705K6101q426k4343K2927J6150k5618L620K9379j5430j8694
870a1724K3922Q27l0305Q112J9637k0713r540K7621m07k0501J7864J7698k5088
$$ plain form
775 18885 -14743 8064 22501 -14466 -17214 11255 -5716 -24760 1707 12081 -10161 1144
787 1144 21865 4115 -5334 12443 6712 -15328 -7164 1993 -13406 -12603 4331 2814 -4006 9592
801 9592 12969 1031 2558 6380 -3589 -8487 -4785 -7591 -7673 -2058 603 2299 8096 5877 5409 8687
817 8687 2044 -6388 -874 -2054 -14778 -7438 2201 -6046 -3877 12942 8662 -3589 8763 11787
831 11787 -8541 -8166 6061 -8774 -17678 2582 5364 -11830 1809 20245 457 -4816 17146
844 17146 6569 -17641 256 8283 -17518 -14226 13017 -1355 -14149 14743 18245 -9451 1780
857 1780 20122 -6685 -17390 8711 285 -24058 -1131 15019 -10599 -6979 22400 6970 -11724
870 -11724 12198 13025 -17280 -9168 10469 -10244 -19784 7837 7430 -13071 4793 22491 -2597
883b597m068K1607j3303j9006J7121O741k1822N951K1627j1816q512K0621J355
896A3899j8840O823J0643j8009o769J6481n284j2152J2337R767j1646J653J2688
909A1591o441j0327Q312R75j3273J920P142n229k022R262K234m793L693M684m740
924B988m335K970k139n222J268J919Q40j397M369K966o4j946J809J208n448l782
940c996M092k538n427M705N017m859J536R920l068p742P184J403j2101J24Q446
955B696o229o928J3089L059j1639P529J0286j1439m832J2516m870j5140Q535R785
969F418j4934j481J9259o406j1882J5831N953j8130K569J5767j4738j2029J8651
982D848n11j8567J2672J4308j6865l685K1548o464j9142J6018O712k2433K488
$$ plain form
883 -2597 -6665 14942 1639 -17367 -246 6495 -15327 -9376 12251 435 -8077 12544 13899
896 13899 -4941 1882 12525 -5484 -12253 4228 -1056 -13208 -871 8896 -2750 -1097 11591
909 11591 5150 -5177 3135 4110 -9163 -7243 -101 -5330 -7352 1910 4144 -649 3044 7728 2988
924 2988 -1347 1623 -516 -5738 -4470 -2551 -1711 -3108 1261 4227 4163 2217 4026 5234 -214 -3996
940 -3996 96 -2442 -7869 -3164 1853 -3006 -1470 8450 5382 -2360 4824 6227 -5874 -5750 2696
955 2696 -3533 -10461 2628 5687 -5952 1577 11863 424 -4408 8108 3238 -11902 -3367 6418
969 6418 -8516 -9997 9262 2856 -9026 6805 12758 -5372 -2803 12964 -1774 -13803 4848
982 4848 4337 -14230 -1558 12750 -4115 -7800 13748 7284 -11858 4160 10872 -11561 -9073
995i073J8933j3072j0375J9328L323j7526Q376J4869j6608o638J8049n111j8046
1008a3571J2408R531j6611J132J8554q819j0461J5402K568j7531M227J2122j3230
1021d279o295J4865k829j1109R903Q201j2222J894R993o649p953R303m77r461
1035g115M015N490o635R25O573r32l352M584J026n396J549J48k948k43J717j571
1051b165K163K066j811J33L881k175l214L204o39n599K234L653n814r53R306k797
1067A473n890R894R20j0385K700Q549j0906m075J2038k791j1244J0165P129j3699
1081f122K425J4788j0980q361J4995j049j5435P954J0269j4785k535J8446n666
1094C944j4162J4957O583j9297K866J6503j2683j0827J8659m95j8890J1590J3464
$$ plain form
995 -9073 9860 -3212 -13587 5741 9064 -8462 -86 14783 -1825 -8463 9586 4475 -13571
1008 -13571 -1163 8368 -8243 -7111 11443 2624 -7837 7565 10133 -7398 -3171 8951 -4279
1021 -4279 -10574 4291 1462 -9647 256 8457 -3765 -1871 8122 1473 -6480 2823 2346 -7115
1035 -7115 -3100 2390 -4245 -3320 3253 2321 -1031 3553 4579 -817 732 880 -2068 -2311 -594 -2165
1051 -2165 -2 2064 253 386 4267 2092 -1122 2082 1443 -4156 -1922 1731 -4083 -5036 4270 1473
1067 1473 -4417 5477 6397 -3988 -1288 7261 -3645 -7720 4318 1527 -9717 448 7577 -6122
1081 -6122 -3697 11091 111 -8250 6745 5696 -9739 -1785 8484 -6301 -8836 9610 3944
1094 3944 -10218 4739 11322 -7975 -5109 11394 -1289 -12116 6543 6048 -12842 -1252 12212
1107A2212j7817k196J9643q665j4677J4871N775j8627L834J5102j1723p795J7642
1120G579j174j6056R878J0161j4896j365J4911q957r363J2500K893j4270O262
1133a897J0963j0612m604J2165j958j0246N769P049j0925O70R424n719n142Q658
1147C595l35p689M557L441n255K71N210m996k310N581j379l076M550m19m556M304
1163A494N9l830J402L823m326j374N659k004m612O769M63p246L665N556p965j841
1179d308R412l869p748P832L917j0747M220Q269q614m279J1018j713j1053P509
1193a54O974j2045j044J3267n883j0046J3596J646j4350N658J0950j2020m240
1206g691J4869k776j3326J0799O868j3865K33J4343r492r372J4250J158j4723
$$ plain form
1107 12212 -5605 -7801 11842 3177 -11500 3371 9146 -9481 -5647 9455 -2268 -10063 7579
1120 7579 6405 -9651 227 10388 -4508 -5873 9038 81 -9282 3218 6111 -8159 -1897
1133 -1897 9066 -1546 -6150 6015 4057 -6189 -420 6629 -4296 -3626 5798 79 -5063 3595
1147 3595 3260 -4429 128 3569 -1686 -1415 3795 -1201 -3511 2070 691 -2385 2165 1746 -2810 1494
1163 1494 1553 -2277 -875 2948 -1378 -2752 2907 903 -3709 3060 3523 -3723 -58 5498 -2467 -4308
1179 -4308 5104 1235 -6513 1319 5236 -5511 -1291 6978 -1636 -5915 5103 3390 -7663 -154
1193 -154 6820 -5225 -6269 6998 1115 -8931 4665 6311 -8039 -2381 8569 -3451 -7691
1206 -7691 7178 4402 -8924 1875 8743 -5122 -4889 9454 -38 -9410 4840 5998 -8725
1219h725O820J0451j1686l589J4513n045j1692J0572M947j3723K026J2862q792
1232a061o950J2663n38j1268P376O816j0730r91J0564n324p816R556J816q817
1246d704L439O540p216j038P028j957o475M988J521m442J506L797k834l133M368
1261A388M65l215J867J373l119K81K932k779K0J532j257j816M224j445j844L558
1277B165O8l505j77K399k672r01M144j991l790O969m83n984L952N252p175l85
1293b114O538m366o757P999L460r387K563Q372p004k888R078k249q020M201N747
1308E173r714Q2Q657n310m908R103K215r052L044P452q135m455J0242l070r280
1323g956O422O618r467R36J0092m611p314P889L177j0321K742Q062q983l366J0228
$$ plain form
1219 -8725 -1905 8546 -3140 -6729 7784 2739 -8953 1619 6566 -7157 -5131 7731 -1061
1232 -1061 -8011 4652 4114 -7154 222 7038 -3692 -4683 5881 557 -7259 2297 4113 -4704
1246 -4704 -1265 5275 -1941 -2979 4049 2092 -4383 605 2126 -2316 -810 2987 153 -2980 1388
1261 1388 1853 -1362 505 1878 -1241 -960 1972 -807 -787 745 -512 -2328 1896 451 -1393 2165
1277 2165 2233 -1272 -1449 950 -1722 -2623 1521 -470 -4260 2709 2226 -3758 194 5446 -1729 -2114
1293 -2114 4424 58 -6699 1300 4760 -4627 -2064 6308 -696 -3584 5494 3245 -4775 -574 5173
1308 5173 -4541 -4459 4198 -1112 -6020 3083 5298 -3754 -710 6742 -1393 -5848 4394 1324 -7956
1323 -7956 -1534 5084 -4383 -3447 6645 2034 -5280 2609 5786 -4535 -1793 6269 -2714 -6080 4148
1338D148j261q232O499N382r343J755N989m078o489O438R85o684J795N675m236
1353a657k124O591j146l775L662J230l486j078M215l124l705M984K44k232K339
1368I38K538k266j04R51j011k163R37m66r46l04J383l03J496J104j262N60Q73
1385A955k343J326J76l349m94K808m60j562K423K452l287J023L128l213k452L381
1401A512q71m724K439L335l967R63M145r77l291M078J202n711J159L419m488k989
1417d766O121K51m670M807L095n627k65O470m003n072M358R79o033R06O011l067
1433e05k938N920J181n673L389K586n467j770O119k619o004M713L741m618O36
1448a309O790l263l854M106R58o787K046L267m434j277M882m61k846K811K376
$$ plain form
1338 4148 2887 -5345 1154 6536 -2807 -1052 4937 859 -5630 808 1793 -4891 -3096 2579 -1657
1353 -1657 -3781 2810 1664 -2111 1551 2781 -705 -1783 2432 -692 -4397 587 831 -1401 938
1368 938 3476 1210 1106 2057 1046 -1117 -180 -646 -1592 -1896 -513 -816 680 1784 522 1082 1955
1385 1955 -388 938 1114 -2235 -2729 79 -381 -1943 480 2932 -355 668 3796 583 -1869 1512
1401 1512 641 -4083 -1644 1691 -2276 -1313 2832 1855 -1436 2642 3844 -1867 -708 2711 -1777 -4766
1417 -4766 1355 1606 -3064 1743 4838 -789 -1054 5416 1413 -3659 699 1678 -4355 -3449 2562 -505
1433 -505 -3443 2477 3658 -2015 1374 3960 -1507 -3277 2842 223 -5781 -1068 2673 -1945 -1309
1448 -1309 5481 2218 -1636 2470 3428 -3359 -1313 1954 -2480 -3757 1125 664 -2182 629 3005
1463C005k157j580L974l156l789K851J192l698M48M046j048j051K587J656k631
1478F49P96M04j691k395J940m42j703J724J717j15j406K197Q61k166K46N75k068
1495h77j643J389l52l98J553J084P08q94J193J391k760j369P31K2k046J080M39
1512g49p36O21K826n88j750J585J929k267j781J450j839k524K218K187k462R32
1528i48K655j46j824K194M28l561m25K906k499k457L926N5k088L012K561k663
1544A126j607L819p33n838L507R60m853P66M602j167l199M813J735m369J102L423
1560D087m960j951L310n05l472L051J852l056J074L739j37l005J919J65m293j94
1576b376L041k273j494L158O33k243K556L109l455j604K872j447l691K657k94
$$ plain form
1463 3005 848 -732 3242 86 -3703 -852 340 -3358 -2910 1136 88 -963 1624 3280 649
1478 649 1445 1849 158 -2237 -297 -739 -2442 -718 999 884 -522 1675 2536 370 616 1191 -877
1495 -877 -2520 -1131 -1483 -1881 -328 756 1464 570 1763 3154 394 -975 -244 -222 -2268 -1188 -749
1512 -749 -1485 -864 1962 1374 -376 1209 3138 871 -910 540 -1299 -3823 -1605 582 -1880 -948
1528 -948 1707 1561 -263 1931 2359 -1202 -1627 1279 -1220 -3677 249 304 -1784 1228 3789 1126
1544 1126 -481 3338 2605 -3233 274 1234 -3619 -2853 1749 582 -2617 2196 3931 -438 664 4087
1560 4087 -873 -2824 486 -19 -3491 -440 1412 -1644 -570 3169 3032 27 1946 2111 -2182 -2376
1576 -2376 665 -1608 -3102 56 689 -1554 1002 4111 656 -948 1924 477 -3214 -557 -851
1591h51k639J388M076j937q18L742j54k824R80P51k696r46M29L01m24J469O49
1608D96p80Q39K146j825j168N08n35o73l88k4R31k29M42P06J701r20P06q46J016
1627B103j435j762P66o97o90J291j05mJ701K006l207J673P66j520l553J098Q59
$$ plain form
1591 -851 -3490 -2102 1974 37 -781 2961 2807 -17 963 1714 -982 -1928 -1499 -1198 -1622 -153 496
1608 496 -284 555 2701 876 -292 216 -319 -992 -1380 -1404 -473 -702 -260 446 2147 1227 1933 1087 2103
1627 2103 668 -1094 -328 -1025 -1715 -424 -529 -533 1168 3174 -33 1640 2406 886 -2667 -1569 -710
$$ [...]
8191D34
##END NTUPLES=NMR FID
##END=
