##TITLE=1H_UK-23_3
 CD2Cl2
 108 sc, 
 14.12.2021
##JCAMPDX= 6.0         $$ Bruker NMR JCAMP-DX V2.0
##DATA TYPE= NMR FID
##DATA CLASS= NTUPLES
##ORIGIN= UXNMR, Bruker Analytische Messtechnik GmbH
##OWNER= root
$$ XWIN-NMR		Version 3.5
$$ Tue Dec 14 11:26:41 2021 Russian Standard Time (UT+4h)  she@DPX200
##.OBSERVE FREQUENCY= 200.131346
##.OBSERVE NUCLEUS= ^1H
##.DELAY= (6, 6)
##.ACQUISITION MODE= SIMULTANEOUS
##.ACQUISITION SCHEME= undefined
##.AVERAGES= 108
##.DIGITISER RES= 18
##SPECTROMETER/DATA SYSTEM= spect
##.PULSE SEQUENCE= zg30
##.SOLVENT NAME= CD2Cl2
##.SHIFT REFERENCE= (INTERNAL, CD2Cl2, 0, 15.7039)
##AUDIT TRAIL= $$ (NUMBER, WHEN, WHO, WHERE, WHAT)
$$ ##TITLE= Audit trail, XWIN-NMR		Version 3.5
$$ ##JCAMPDX= 5.01
$$ ##ORIGIN= Bruker BioSpin GmbH
$$ ##OWNER= she
$$ F:/spectra/data/she/nmr/H-F/1/audita.txt
$$ ##AUDIT TRAIL=  $$ (NUMBER, WHEN, WHO, WHERE, WHAT)
(   1,<2021-12-14 11:25:35.96 +0400>,<she>,<DPX200>,
      <continue with go, POWCHK disabled, PULCHK disabled
       configuration hash MD5:
       00 E9 B6 7A A2 85 ED C7 34 08 36 98 17 FE 4E 26
       data hash MD5: 16K
       F3 E6 C3 A1 A1 F4 7F 7F 7E C9 05 D5 4C A1 2F 63>)
$$ ##END=
$$ 
$$ hash MD5
$$ 58 8B 13 E7 DB 35 77 A7 EB 04 F6 80 C5 31 18 94
##$RELAX= 
##$RELAX= 
##$RELAX= 
##$RELAX= 
##$RELAX= 
##$RELAX= 
$$ Bruker specific parameters
$$ --------------------------
##$DU= <F:/spectra>
##$EXPNO= 1
##$NAME= <H-F>
##$PROCNO= 1
##$TYPE= <nmr>
##$USER= <she>
##$AMP= (0..31)
100 100 100 100 100 100 100 100 100 100 100 100 100 100 100 100 100 100 
100 100 100 100 100 100 100 100 100 100 100 100 100 100 
##$AQSEQ= 0
##$AQ_mod= 1
##$AUNM= <au_zg>
##$AUTOPOS= <>
##$BF1= 200.13
##$BF2= 200.13
##$BF3= 200.13
##$BF4= 200.13
##$BF5= 200.13
##$BF6= 200.13
##$BF7= 200.13
##$BF8= 200.13
##$BYTORDA= 1
##$CFDGTYP= 0
##$CFRGTYP= 5
##$CHEMSTR= <none>
##$CNST= (0..31)
1 1 145 1 1 1 1 1 1 1 1 1 1 1 1 1 1 1 1 1 1 1 1 1 1 1 1 1 1 1 1 1 
##$CPDPRG= <>
##$CPDPRG1= <>
##$CPDPRG2= <>
##$CPDPRG3= <>
##$CPDPRG4= <mlev>
##$CPDPRG5= <mlev>
##$CPDPRG6= <mlev>
##$CPDPRG7= <mlev>
##$CPDPRG8= <mlev>
##$CPDPRGB= <>
##$CPDPRGT= <>
##$D= (0..31)
0 1.2 0 0 0 0 0 0 0 0.06 0 0.03 0 0 0 0 0.0002 0 0 0 0 0 0 0 0 0 0 0 0 
0 0 0 
##$DATE= 1639466348
##$DBL= (0..7)
120 120 120 120 120 120 120 120 
##$DBP= (0..7)
150 150 150 150 150 150 150 150 
##$DBP07= 0
##$DBPNAM0= <>
##$DBPNAM1= <>
##$DBPNAM2= <>
##$DBPNAM3= <>
##$DBPNAM4= <>
##$DBPNAM5= <>
##$DBPNAM6= <>
##$DBPNAM7= <>
##$DBPOAL= (0..7)
0.5 0.5 0.5 0.5 0.5 0.5 0.5 0.5 
##$DBPOFFS= (0..7)
0 0 0 0 0 0 0 0 
##$DE= 6
##$DECBNUC= <off>
##$DECIM= 32
##$DECNUC= <off>
##$DECSTAT= 4
##$DIGMOD= 1
##$DIGTYP= 9
##$DL= (0..7)
0 120 120 120 120 120 120 120 
##$DP= (0..7)
150 150 150 150 150 150 150 150 
##$DP07= 0
##$DPNAME0= <>
##$DPNAME1= <>
##$DPNAME2= <>
##$DPNAME3= <>
##$DPNAME4= <>
##$DPNAME5= <>
##$DPNAME6= <>
##$DPNAME7= <>
##$DPOAL= (0..7)
0.5 0.5 0.5 0.5 0.5 0.5 0.5 0.5 
##$DPOFFS= (0..7)
0 0 0 0 0 0 0 0 
##$DQDMODE= 0
##$DR= 18
##$DS= 0
$$ [...]
##$SUBNAM2= <"">
##$SUBNAM3= <"">
##$SUBNAM4= <"">
##$SUBNAM5= <"">
##$SUBNAM6= <"">
##$SUBNAM7= <"">
##$SUBNAM8= <"">
##$SUBNAM9= <"">
##$SW= 18.0517287032376
##$SWIBOX= (0..15)
0 0 2 0 0 0 0 0 0 0 0 0 0 0 0 0 
##$SW_h= 3612.71676300578
##$TD= 16384
##$TD0= 1
##$TE= 0
##$TE2= 300
##$TE3= 300
##$TEG= 300
##$TL= (0..7)
0 120 120 120 120 120 120 120 
##$TP= (0..7)
150 150 150 150 150 150 150 150 
##$TP07= 0
##$TPNAME0= <>
##$TPNAME1= <>
##$TPNAME2= <>
##$TPNAME3= <>
##$TPNAME4= <>
##$TPNAME5= <>
##$TPNAME6= <>
##$TPNAME7= <>
##$TPOAL= (0..7)
0.5 0.5 0.5 0.5 0.5 0.5 0.5 0.5 
##$TPOFFS= (0..7)
0 0 0 0 0 0 0 0 
##$TUNHIN= 0
##$TUNHOUT= 0
##$TUNXOUT= 0
##$USERA1= <user>
##$USERA2= <user>
##$USERA3= <user>
##$USERA4= <user>
##$USERA5= <user>
##$V9= 5
##$VALIST= <valist>
##$VCLIST= <CCCCCCCCCCCCCCC>
##$VD= 0
##$VDLIST= <DDDDDDDDDDDDDDD>
##$VPLIST= <PPPPPPPPPPPPPPP>
##$VTLIST= <TTTTTTTTTTTTTTT>
##$WBST= 1024
##$WBSW= 4
##$XGAIN= (0..3)
0 0 0 0 
##$XL= 0
##$YL= 0
##$YMAX_a= 567226
##$YMIN_a= -571588
##$ZGOPTNS= <>
##$ZL1= 120
##$ZL2= 120
##$ZL3= 120
##$ZL4= 120
##$ABSF1= 10
##$ABSF2= 0
##$ABSG= 5
##$ABSL= 3
##$ALPHA= 0
##$AQORDER= 0
##$ASSFAC= 0
##$ASSFACI= 0
##$ASSFACX= 0
##$ASSWID= 0
##$AUNMP= <proc_1d>
##$AZFE= 0.1
##$AZFW= 0.1
##$BCFW= 1
##$BC_mod= 2
##$BYTORDP= 1
##$COROFFS= 0
##$CY= 11.3945322036743
##$DATMOD= 1
##$DC= 2
##$DFILT= <>
##$DTYPP= 0
##$F1P= 2.36226072786647
##$F2P= -0.459571619588291
##$FCOR= 0.5
##$FTSIZE= 0
##$FT_mod= 4
##$GAMMA= 1
##$GB= 0.15
##$INTBC= 1
##$INTSCL= 1
##$ISEN= 128
##$LB= 0.24
##$LEV0= 0
##$LPBIN= 0
##$MAXI= 10000
##$MC2= 0
##$MEAN= 0
##$ME_mod= 0
##$MI= 1.114404
##$NCOEF= 0
##$NC_proc= 0
##$NLEV= 6
##$NOISF1= 3.799351
##$NOISF2= 2.8
##$NSP= 1
##$NTH_PI= 0
##$NZP= 0
##$OFFSET= 15.70392
##$PC= 1
##$PHC0= -15877.22
##$PHC1= 19.2008
##$PH_mod= 1
##$PKNL= yes
##$PPARMOD= 0
##$PSCAL= 0
##$PSIGN= 0
##$REVERSE= no
##$SF= 200.130013532006
##$SI= 16384
##$SIGF1= 3
##$SIGF2= 2
##$SINO= 400
##$SIOLD= 16384
##$SREGLST= <1H.CDCl3>
##$SSB= 0
##$STSI= 0
##$STSR= 0
##$SW_p= 3612.71676300578
##$SYMM= 0
##$S_DEV= 0
##$TDeff= 0
##$TDoff= 0
##$TI= <>
##$TILT= no
##$TM1= 0
##$TM2= 0
##$TOPLEV= 0
##$USERP1= <user>
##$USERP2= <user>
##$USERP3= <user>
##$USERP4= <user>
##$USERP5= <user>
##$WDW= 1
##$XDIM= 8192
##$YMAX_p= 0
##$YMIN_p= 0
$$ End of Bruker specific parameters
$$ ---------------------------------
##NTUPLES= NMR FID
##VAR_NAME=  TIME,          FID/REAL,        FID/IMAG
##SYMBOL=    X,             R,               I
##VAR_TYPE=  INDEPENDENT,   DEPENDENT,       DEPENDENT
##VAR_FORM=  AFFN,          ASDF,            ASDF
##VAR_DIM=   8192,          8192,            8192
##UNITS=     SECONDS,       ARBITRARY UNITS, ARBITRARY UNITS
##FACTOR=    0.0002768,     1,               1
##FIRST=     0,             0,               0
##LAST=      2.2672688,     0,               0
##MIN=       0,             -571588,         0
##MAX=       2.2672688,     567226,          0
$$ Real data points
##PAGE= N=1
##DATA TABLE= (X++(R..R)), XYDATA
0@%%%%%%%%%%%%%%%%%J08k16K16k16K16k16L24m32M32n26O34o65P73r17J025j187
33f47J377j530J696j911K165k435K706l015L359l727M131m574N061n585O161o797
49c565P484q241R086j0014J1041j2182J3467j4929J6584j8501K0750k3403K6610
62A4187l0595L5691m2446N1920o6229R0729j44398N35950m18866k32835P74118
73E67226n66089l59047N68497j3035n62550M20344K61029m38196N0176M06314
83C34669l31514k15697L18348o0139l57010J97990J75780k47885J7860L18709
93A51111j02874j57781K40959O4418k87223N7962J83672k33185j16533K69598
103G0124m7346k02368K33110J34426k45908P9964K18997k31236j22578K31119
$$ plain form
0 0 0 0 0 0 0 0 0 0 0 0 0 0 0 0 0 0 0 108 -108 108 -108 108 -108 216 -216 216 -310 324 -341 432 -485 540 -647
33 -647 730 -800 896 -1015 1150 -1285 1421 -1594 1765 -1962 2169 -2405 2656 -2929 3232 -3565
49 -3565 3919 -4322 4764 -5250 5791 -6391 7076 -7853 8731 -9770 10980 -12423 14187
62 14187 -16408 19283 -23163 28757 -37472 53257 -91141 444809 25943 -206892 567226
73 567226 1137 -357910 210587 197552 -364998 55346 316375 -121821 -71645 334669
83 334669 3155 -212542 105806 45667 -311343 -113353 62427 -185458 -167598 151111
93 151111 48237 -109544 131415 195833 -91390 -33428 150244 -82941 -199474 70124
103 70124 22778 -179590 53520 187946 -57962 22002 240999 9763 -112815 118304
113A18304j10736k31165J96887Q4306k20748J07330K12313j56687m1121K12122
123A70805q2536j76674J27171K3209j96912M0821J36720j05591l0872J73298l277
134G6162j02302J02708N4979j53440j6766R7517j10179r7243J29484J5073j15212
145a19219J02718J19960j07227K560J35984q7183j08799J04079j9864j50735P5442
156e2284Q8748j13055K4160J53187n5258n9673J24425j3709j33217M8302L7568
167D9194j29771j1086J01932n2826m4823J15676L1507p7685N4290O2244r4635
178D017l7668O7951n5873q2695P2119L1305p2493M8573R8251n2479k0290R3434
190I4152l1085r4515M8088J1924j06191J3891P7563n7049j5239J07520k557n6486
$$ plain form
113 118304 7568 -223597 -26710 57596 -163152 -55822 156491 -196 -41317 170805
123 170805 88269 -88405 38766 61975 -134937 -94116 42604 -62987 -93859 79439 76162
134 76162 -26140 76568 131547 -21893 -38659 58858 -51321 -148564 -19080 -4007 -119219
145 -119219 -16501 103459 -3768 -1208 134776 47593 -61206 42873 23009 -127726 -52284
156 -52284 36464 -76591 -52431 100756 45498 -14175 110250 96541 -36676 11626 49194
167 49194 -80577 -91663 10269 -42557 -87380 28296 59803 -17882 36408 98652 4017
178 4017 -33651 34300 -21573 -104268 -32149 -844 -73337 -24764 73487 21008 718 94152
190 94152 63067 -31448 16640 28564 -77627 -63736 13827 -43222 -58461 49059 46502 -9984
202i984O6336K4556q9845n19M0143p2086l6050O6657o191m1849O5825M6153m6799
215F347J7256N1286m7785m5963L2742k0383o2462K6590L4559l7079J6764O8184
227D0056j2233k1377M9580l201o1574O926J5253n9712j2245M8835j5934j5212
239d0838O1948K0212l2063K6778K6729n0666k1838K4027l5111l9297L2861J1566
251a5692k4927L3036M3461j9195J891L5778k4295l7247J4109j0863m3927P945
263c9926K5498j6821Q484M7088J356j1374K8535Q82m0223m071N283l5810j6161
276d7260K7644l578o897L5724K2287j3016J3785J8204k8369k1394J1056k2131
288a3945k8925J5658J2086j4579J9682L5014o451j467K4980j0537l1765M638o121
$$ plain form
202 -9984 56352 80908 -8937 -9456 30687 -41399 -77449 -10792 -16983 -58832 6993 53146 6347
215 6347 23603 74889 27104 -18859 13883 -6500 -68962 -42372 -7813 -44892 -28128 40056
227 40056 27823 6446 56026 52825 -8749 -1823 13430 -46282 -58527 -9692 -25626 -40838
239 -40838 21110 41322 9259 36037 62766 12100 -9738 14289 -20822 -60119 -27258 -15692
251 -15692 -40619 -7583 35878 16683 18574 54352 30057 -7190 6919 -3944 -47871 -39926
263 -39926 -14428 -31249 -22765 24323 25679 14305 42840 43722 3499 -572 4711 -31099 -47260
276 -47260 -19616 -23194 -30091 5633 27920 14904 28689 46893 18524 -2870 8186 -13945
288 -13945 -42870 -27212 -15126 -29705 -10023 24991 18540 17073 42053 31516 -249 4389 -1732
301a732l3590j117K1092q709J363L5028R968r183J9638N400k9248r152L575k4867
315b1534j5845J6357J845m868K5675J9929n872O950J5244j7186j8254J093j4142
328a0608k1652O266Q515n406J2261K4290K585p60J5451m996k1069m771l305k2508
342b5707p023J4103r61J289K3230J4732l547R181P969j7855j2756m19j5895j6462
356c0121P888N852k481J5538J7777J240L407P956n650j7534k845j0449j5052j280
370b5754O012P62P515J7928Q641J241Q625m92j3546p801n188j3926q637N598J705
385a7317K812J4452J2026L085N835L295r175j0061n669j0880j0778J340L743J650
399a5642J0896J2577O332N197M781o039q708p258q514r737l324L60L313O995J0659
$$ plain form
301 -1732 -35322 -36439 -15347 -24056 -22693 12335 22303 13120 32758 38158 8910 -242 3333 -21534
315 -21534 -37379 -21022 -19177 -24045 1630 21559 15687 22637 37881 20695 2441 3534 -10608
328 -10608 -32260 -25994 -17479 -22885 -10624 13666 16251 15491 30942 25946 4877 106 -3199 -25707
342 -25707 -32730 -18627 -19588 -18299 4931 19663 16116 25297 33266 15411 2655 2236 -13659 -30121
356 -30121 -22233 -16381 -18862 -3324 14453 15693 19100 27056 21406 3872 1027 -9422 -24474 -25754
370 -25754 -19742 -18980 -11465 6463 15104 16345 24970 24478 10932 3131 -2057 -15983 -24620 -19022 -17317
385 -17317 -14505 -53 11973 15058 20893 24188 15013 4952 -717 -11597 -22375 -21035 -17292 -15642
399 -15642 -4746 7831 14163 19360 24141 18102 9394 2136 -6378 -16115 -19439 -19079 -15766 -8771 1888
414A888Q712M426L980l52o879p195r645q125n349r91L346N477Q537R128O177N834
430A8969L21m018o710q851p975o830k641J001O519N831R640O162N976J045l584
445A4855m405p282r967p121k677j655M301P217N914P145R109O18j510k049o139
460F354j2005n146k426m601J553Q931N703M531J0140L025k415p67k485j1927p428
475h963j864n262k361P827Q845J529Q695R454k122n254K398p544j3474j797o5
490i958q003L124J1660K314L198J1137K974o410M67r22j4013o614J986o448l523
505a9031J2429M957L14R885Q723o215j237J224j0485r337Q58l166o073O781R224
520a149Q42N677R752j074m269O30l747j2308l041M71o386L23J1394K220J431J0404
$$ plain form
414 1888 10600 15026 19006 18654 11775 4580 -5065 -13190 -18539 -19530 -16184 -10707 -2170 6958 13135 18969
430 18969 19290 15272 8562 -289 -8264 -15094 -17735 -16734 -10215 -4384 5256 11418 17394 18439 14855
445 14855 10450 3168 -6799 -13920 -16597 -18252 -13951 -6734 -820 6325 15434 16052 14542 12493 6354
460 6354 -5651 -10797 -13223 -17824 -16271 -7340 -1637 2894 13034 16059 13644 12877 10392 -1535 -8963
475 -8963 -10827 -16089 -18450 -10623 -1778 -249 8446 17900 15778 10524 12922 5378 -8096 -9893 -9958
490 -9958 -17961 -14837 -3177 -863 2335 13472 16446 10036 10503 9581 -4432 -11046 -9060 -15508 -19031
505 -19031 -6602 -1645 -1331 8554 17277 11062 9825 11049 564 -8773 -7915 -11081 -17154 -10373 -1149
520 -1149 -307 5370 15122 14048 9779 10409 6662 -5646 -8687 -8216 -14602 -14279 -2885 -665 766 11170
536A1170L199n882O15J702j3748o921M223o163l942R740O244l463J0380R202o985
551I371k591M004r953j0763M080k620p910O836R610k847M282J3787l264o483N038
566A0577k826j4024j287L170q467j56J1585J787k069J1655L697p593K152J924
580A0125j2545o682M474m411p599R818P349l669O544J1125o280m295O492n512
594D934j4489M616N68r424L624J1147p93o72J3519j234q822N793J202j5049k355
609g435M944q470l082J2403J310l991J1154O203q296K1N342r471q306N426l381
624e629r041Q315Q475m701L307J2257m204o207O625k686j3890J384M484j0134
638a1645p39J3513j830l324J2941L329j0073L785K763j1770m731P108o378o496
$$ plain form
536 11170 14369 8487 9102 10804 -2944 -9865 -5642 -11805 -15747 -6007 237 -3226 7154 16356 9371
551 9371 6780 10784 831 -9932 -5852 -8472 -16382 -9546 64 -2783 1499 15286 12022 5539 10577
566 10577 7751 -6273 -7560 -4390 -12857 -13013 -1428 359 -1710 9945 13642 6049 8201 10125
580 10125 -2420 -9102 -4628 -9039 -16638 -6820 529 -3140 3404 14529 8249 3954 10446 4934
594 4934 -9555 -4939 -4371 -13795 -10171 976 183 -489 13030 11796 2974 8767 9969 -5080 -7435
609 -7435 -2491 -10961 -14043 -1640 -330 -4321 6833 13036 4740 4761 10103 632 -7674 -2248 -5629
624 -5629 -14670 -6355 2120 -2581 726 12983 8779 2572 9197 6511 -7379 -5995 -1511 -11645
638 -11645 -12384 1129 -701 -4025 8916 12245 2172 5957 8720 -3050 -7781 -673 -7051 -13547
652a3547J1199M937p174Q494Q788p590j863O405o697j1185N331L67r379L823J1075
667B984n742J285J1330j629q117O348M35j2645j452P941q829m165J3662m62m965
682d021J0258O832j0842J000P302j1419p678P849m313p855R965O386p708N275
696A031J1074p783k973P151m319j1493L745K293q728K754R379k502k815J0896
710G710J228p785L349L248j1517k694O562m838o431J0211M026o993O748P365p420
725B769j772P606o467j0241P427j242q919N364R489o693P59J1252k865p669O863
740E661J38j1224J363M825p921j130J0184j462m219Q927L200p326M36N304q037
755a281m926O036k544n545N664N138n139K652R115m411n517O745j454r579K076
$$ plain form
652 -13547 -2348 2589 -4585 3909 12697 5107 3244 9649 2952 -8233 -2902 -2535 -11914 -8091 2984
667 2984 -2758 -1473 9857 8228 111 6459 6894 -5751 -7203 738 -8091 -12256 1406 944 -4021
682 -4021 6237 13069 2227 3227 10529 -890 -8568 -719 -5032 -12887 -2922 3464 -4244 1031
696 1031 12105 4322 1349 8500 4181 -7312 -3567 -1274 -10002 -7248 2131 -371 -3186 7710
710 7710 8938 1153 4502 7750 -3767 -6461 101 -4737 -11168 -957 3069 -3924 2824 10189 2769
725 2769 997 8603 2136 -8105 -678 -1920 -10839 -5475 4014 -2679 -1920 9332 6467 -1202 5661
740 5661 5799 -5425 -4062 763 -7158 -8288 1896 434 -3785 5142 8342 1016 1452 6756 -1281
755 -1281 -6207 -171 -2715 -8260 -2596 2542 -2597 55 9170 4759 -758 5987 4533 -5046 -2970
770b970L396p744J173Q685k800k605R281p7o492K917K708r294n07M430m589l500
786g988P214K572m170M859N601o508k06M860n526m977M200j392n358K615O131
801A927l325P44O967k139l699L173j202o106J180K769n232m49O149j60k376O891
817E112J170n324J034K725m870l893M228l822k597N093K159k901K771M621l510
832A996j319L661k338o128J846J341l935J960L891j986n3N685K64m520J828K65
848B458m300o13K140l468o76M503Q37k428L656K461l164l01K720m069l513L053
864g04j279l008L212K407j382J547L618k583j447K230o21m458J196K17k875J143
880b787L901j341m71L485O11l178J482J819m942l40Q54r10j909L031O0q6J639
$$ plain form
770 -2970 426 -7318 -6145 2540 -260 -2865 6416 6339 -153 2764 5472 -3822 -4329 101 -4488 -7988
786 -7988 -774 1798 -2372 2487 8088 1580 1374 6234 708 -4269 -69 -1461 -6819 -4204 1927
801 1927 -1398 -654 6313 4174 475 3648 2446 -3660 -2480 289 -4943 -5392 757 597 -1779 5112
817 5112 6282 958 1992 4717 -153 -4046 182 -3640 -6237 -1144 1015 -1886 885 5506 1996
832 1996 677 4338 2000 -4128 -2282 -941 -4876 -2916 975 -1011 -1064 4621 4885 365 2193 2458
848 2458 -1842 -2455 -315 -3783 -4459 44 881 -1547 2109 4570 1406 1105 3825 -244 -3757 -704
864 -704 -1983 -4991 -1779 628 -754 793 4411 1828 381 2611 1990 -2468 -1272 -1055 -3930 -2787
880 -2787 1114 -227 -698 2787 3398 220 1702 3521 -1421 -1761 -907 -1817 -3726 -695 -635 -721 918
897I18J676j000m68J612k583k547N41K57j886K331J895j079L60K242o49j144J190
914A666p17k790Q21K71k387J560K036j243N46L636j249j848J413L11k523o08Q76
931b29k050l53K685L51r52J796R75j354l29J382k645j184J947r90j938K238Q06
948A56r47J123J375l05o49J155l74j664j203Q45k394J78L132l14k98K537n49j562
966B42N72R0j42k357J264r61j380K806p65R82P75J055p17j260J190k76k310J598
984D06l94j712K42K017o12L93J578j89q17R97j207k482J528M48j325L0J253L1
1002A85q57K344K11j123L20J56k604P04J555k463M43O36J066j250O38P05n45J7
1020A38J400n30k000J056o1n57m77P38n40R94O60L80j039L31k0j075n44R17q3
$$ plain form
897 918 2594 1594 1126 2738 155 -2392 -1851 -1594 -3480 -1149 746 -333 27 2269 1620 476 1666
914 1666 949 -1841 -1020 -749 -3136 -1576 460 -783 -237 3399 2150 302 1715 2026 -497 -1105 -229
931 -229 -2279 -2632 53 404 -548 1248 2223 869 540 1922 -723 -1907 40 -950 -2888 -650 156
948 156 -791 332 1707 1402 753 1908 1534 -130 -1333 -488 -2882 -2704 428 114 -184 2353 1804 242
966 242 814 904 762 -1595 -331 -1292 -2672 134 -631 351 1126 2181 1464 204 1394 1118 -1192 406
984 406 12 -1700 -1458 559 -53 340 1918 1729 912 1909 702 -1780 -252 196 -1129 -1099 154 185
1002 185 -672 1672 1883 760 1080 1236 -1368 -664 891 -1572 -1129 -493 573 -677 -39 666 121 138
1020 138 1538 1008 -992 64 3 -554 -1031 -293 -833 161 821 1201 162 493 473 -602 -1146 -229 -312
1039c12k17L52k09k3L96J396p23K7L39r94j285J082k10j196J224K72o65J682K18
1058A154q40M53j182J136j106L50p69o02R61K91j004J147R54j123N48M37j46j517
1076h58M18k29N64m35L45J030p81R99o05K01r79K30k96n27J016l73J31K42R59
1095A052p3m62q6Q93j626J352j438k23K77J44o63J5J666j113J004m30k44j48R86
1114H83n59j99J80l17m21Q77m12n04L40J107o00P4L47j886M49M27Q52m30R8n7
1134B49j57n87J122j370P19N5j7l44j96L68q80m15J940J96j028Q09j128P82P46
1153H64m64j184O63l91M10n63N10j64p67J033P97l78j073J003j25l86P5L29j126
1172i37M89J206j613Q44k39Q08j330P76O29j190J121j65n39l11J625m46m85N9
$$ plain form
1039 -312 -529 -177 -386 -409 -13 1383 660 687 1026 32 -1253 -171 -381 -1577 -353 -81 -746 936 1154
1058 1154 314 767 -415 721 -385 -35 -804 -1406 -445 -154 -1158 -11 943 -180 368 805 659 -858
1076 -858 -440 -669 -105 -540 -195 835 54 1053 448 649 -330 -100 -396 -923 93 -280 -149 93 1052
1095 1052 979 517 431 1324 -302 1050 -388 -611 -334 -190 -853 -838 828 -285 719 289 45 -103 883
1114 883 324 125 305 -12 -433 444 32 -472 -132 975 375 449 796 -1090 -641 -214 638 208 306 249
1134 249 92 -495 627 -743 -24 31 14 -330 -526 -158 -1038 -1453 487 683 -345 464 -664 118 864
1153 864 400 -784 -121 -512 -102 -665 -155 -319 -1086 -53 744 366 -707 296 171 -215 -140 189 -937
1172 -937 -448 758 -855 -11 -250 558 -772 4 633 -557 564 399 -140 -451 1174 728 243 302
1190C02O8p30L68M88r42j068J713N84j254R32J68r92N67L06k004J482M8L44j740
1209a360J587J042j886Q37Q71j994k34J920j919m8J241J580l174K183P21j228
1225A39p83J642j099p75J727j2j921Q62J364j693Q41L71O06j985J725j068q23
1242h82%J886p41j143J402m78k99M75K40J61r60N92m26k37J337n83o00l38J166
1261E72j467Q88L3m29o9J532L9j380L07m47J064l37k32n45L42Q51o94j209J692
1280E11K41j323R4J244p89l11O8l84j51O82O12p67m3P25P97j263N59N57j646l60
1300i47J092o50M9J018Q1j004M72P95j540M04Q55n19p65J518q94q10J796J07o62
1319C96k61J091j484P2J008l86r88O76Q1n99m3R21j013L03J487r13l28k83J495
$$ plain form
1190 302 370 -360 8 496 -446 -1514 199 783 -471 461 629 -363 204 510 -1494 -12 36 380 -1360
1209 -1360 227 1269 -617 220 1091 -903 -1137 783 -1136 -1184 57 1637 -1537 646 1367 139
1225 139 -644 998 -101 -876 851 839 -1082 -220 1144 -549 292 663 1269 -716 1009 -59 -882
1242 -882 -882 1004 263 -880 522 44 -255 220 460 621 -339 253 -173 -410 927 344 -256 -594 572
1261 572 -895 -7 26 -403 -472 1060 1099 -281 26 -421 643 306 74 -471 -129 722 28 -1181 511
1280 511 752 -571 -477 767 -22 -333 -265 -649 -800 -118 494 -273 -316 409 1206 -57 502 1059 -587 -947
1300 -947 145 -505 -456 562 643 -361 111 906 -634 -230 625 106 -659 859 -35 -845 951 1058 396
1319 396 135 1226 -258 -186 822 436 -552 124 205 -394 -437 484 -529 -226 1261 348 20 -263 1232
1338A232k087p15J767P10j707J174J56j216J257L40j569j84J206q21L32J125j427
1355d27l40K06J018q9q80J097P08j344J12O95j408J63k08P10o38J544j211J209
1373I17L1p2j235R76p88r9N5K27J66j413R99K75j023Q35L36R2o01J552j531k06
1393e07J189o42j131J535L37n28o70R77k99q39O37o05j79m48P36Q55j548J207
1411G7k62j20J72L57M78j050J081n95p80J83J337l1p33J357j368j06O50o90q60
1430i03P94M51p42K24R76m36l75M97M6l73N85L51j486P56o46K63N54l66J58O66
1450I94j547Q24n26N59L40j584L26N66o08K26J012p14k26L50Q24k13r18R71r63
1469c07p02J307m84O8p13J738q22l05O43q95J172K48j03j954J182M90p55l97l36
$$ plain form
1338 1232 -855 -1570 197 907 -800 374 530 -686 571 911 -658 -842 364 -457 -125 1000 -427
1355 -427 -767 -561 457 368 -512 585 1293 -51 61 756 -652 -489 -697 13 -625 919 -292 917
1373 917 948 876 -359 617 -171 -270 -215 12 178 -1235 -236 39 -984 -149 187 279 -322 1230 -301 -507
1393 -507 682 40 -1091 444 781 253 -417 560 261 -578 59 -546 -725 -1173 -437 418 -1130 77
1411 77 -185 -305 -133 224 702 -348 733 138 -642 -459 878 847 114 1471 103 -3 647 -43 -903
1430 -903 -109 342 -400 -176 800 364 -11 486 532 159 744 1095 -391 365 -281 -18 536 170 328 994
1450 994 -553 271 -255 304 644 -940 -614 -48 -656 -430 582 -132 -358 -8 816 603 -315 656 -307
1469 -307 -1009 298 -186 -118 -831 907 85 -220 423 -472 700 948 845 -1109 73 563 -192 -589 -925
1488i25R34K27N06J88m77K53m5r17L55L7q19M26m09K47r0l41J333K49j197J044
1508E79m9o94N04j108R56o03L63N15r67O42J76j76O9M87n46L39j58r61L60l92
1528f64J19Q50j048J569j196O61N06n46J3O2p87J77m79O45l98J220j1o08J1O09
1548G05k12j249K44J501j311K38O62j391P85J97K17K06l74l66L58l51L58m01k56
1567d40Q48p74q8J62N82j56L54q69P59j197J35M08o01j64J79J250K7L26Q8j02
1587G27M82j427P79k62q84o83R51M1N07N4K69p59J006L82j497Q89n87R7q31J28
1607f18P05o11n37O63N91L81j168O84j84j76M99o93J04N34k1O6l00n89J482l71
1627D41L6j72K55M43j143o4K96Q2J15p2M37j06q75O34j02L94j86n65m09l1O10
$$ plain form
1488 -925 9 236 742 930 453 706 661 -256 99 136 -683 -257 -666 -419 -509 -850 483 732 -465 579
1508 579 530 -164 340 -768 188 -415 -52 463 -504 138 314 138 207 694 148 487 329 -632 -272 -664
1528 -664 -545 305 -743 826 -370 291 797 251 264 326 -461 -284 -763 -118 -516 704 693 85 96 705
1548 705 493 -756 -512 989 -322 -84 578 -813 -28 169 386 592 218 -148 210 -141 217 -184 -440
1567 -440 408 -366 -454 -292 290 134 488 -381 378 -819 -684 -276 -877 -1041 -862 388 415 741 829 727
1587 727 1209 -218 561 299 -585 -1268 -317 -276 231 285 554 -205 801 1183 -314 575 -12 85 -746 -618
1607 -618 87 -524 -1061 -398 193 574 -594 90 -94 -270 229 -464 -360 174 153 219 -81 -670 812 441
1627 441 477 305 560 1003 -140 -204 92 174 289 217 654 548 -327 307 205 599 413 -152 -561 -592 18
1648A8p4J86n2L05mn58N74j2N53r17M35j292m2O11J93j07M68N95q84P87n45m82
1670b44J48k56l01R38L44l61M8l88J83O06l05l28K43J69l86j96j018Q60Km83M01
1691c24k88N72JL72k53j74p28Q55l76k4o15N15O88J46Q87j264M9M55J10j124P57
1712B37j75j109J858j406o2L78J748j346NJ205r90N37o60j009J107o00j71Q01
1730C48n00K88L13l62Ok7P5N62j164j79r9N75o5k92m39J253K39j48n09r6R67j305
1752e59J066o20M7M50q29N10m00l6M89j51J83k71P71j013J6L82p4N72r49j80Q32
1773B36N38p09l3K14k89m59j78P6L14J02PJ81R0J83N29o39l55J053j589M19M71
1794A62j009Q94R8j83j41M48q99Q17J84l51k41L66K88p46q33J487j23l79J17J00
$$ plain form
1648 18 -56 130 78 383 379 -179 395 383 936 19 454 -838 -880 -269 -76 -183 285 880 -4 783 238 -244
1670 -244 -96 -352 -653 285 629 268 316 -72 111 717 412 84 327 496 110 -86 -1104 -244 -242 -725 -324
1691 -324 -612 -40 -39 333 80 -94 -822 33 -343 -367 -982 -467 221 367 1254 -10 39 494 604 -520 237
1712 237 62 -1047 811 -595 -657 -279 1469 123 128 1333 343 880 220 -789 318 -282 -453 348
1730 348 -152 136 449 87 93 66 141 703 -461 -640 -739 -164 -229 -521 -960 293 532 384 -125 -221 746 -559
1752 -559 507 -113 -66 384 -445 65 -335 -371 118 -33 150 -121 650 -363 -347 35 -39 533 -416 -596 236
1773 236 774 65 32 246 -43 -502 -680 -604 -290 -188 -181 0 90 273 802 163 -192 861 -728 -309 162
1794 162 -847 47 145 -38 -179 269 -630 187 371 20 -221 145 433 -313 -1146 341 218 -161 -44 56
1814E6M15m54J029o19m30k94J108j216j75N87o41J711p65J85l49p44J207o74J26
1833F3k09N23j661L84P63j31N66m00L76l21Q0L70q6M25j360j65k59J321m64M3
1853a42Q57K3q86P68o61L85n0l80j251J177p7L49K17k08J91K4k78q2p49R85j74
1874C8k31l67K45J11K68j21L60m14q4j228K030l87O28n63k81j143J581K85p82
1893e5K07M13l10n08O72m78j35j98M4mJ049J97n63j130R96J61m44N28r29j75j08
1914g70P79q27J7J434n70l7k31J038m88j16J15j333j73P74L30m53qM50N43l74
1934A00j0J22J48O82q92L62J28j209J153q23j11L95O7M67p98j1k02m08P70J22
1954E2pm83m89J391j092J540M3r90Q91m74r73R41j31l56M01M7k30L40N9m48Q98
$$ plain form
1814 56 471 17 1046 427 -3 -297 811 -405 -580 7 -634 1077 312 497 148 -596 611 -63 63
1833 63 -146 377 -1284 -900 -137 -268 298 -102 274 -47 33 403 317 742 -618 -783 -1042 279 -185 -142
1853 -142 715 738 -148 620 -41 344 294 -86 -1337 -160 -237 112 329 121 312 336 58 -24 -773 212 38
1874 38 -193 -560 -315 -204 64 -57 303 -111 -195 -1423 607 220 848 285 4 -1139 442 727 -55
1893 -55 152 565 255 -253 419 -59 -194 -392 -348 -352 697 894 331 -799 197 358 -86 442 -487 -662 -770
1914 -770 9 -818 -801 633 63 26 -205 833 345 229 344 -989 -1162 -388 -58 -511 -519 -69 474 100
1934 100 90 212 360 1042 150 512 640 -569 584 -239 -350 45 112 579 -219 -230 -432 -840 -70 52
1954 52 45 -438 -927 464 -628 912 955 -35 856 382 -591 350 219 -137 264 311 81 421 480 32 930
1975I30j184K55J075r12m75L21L25q1L42nl5j674J398k96J44n17M07m11J152n16
1995B43o33N94p08R47l27Q01r11l68J72J80r7Q84j809J028m73N81L58o47k47J02
2015c30k52j1p3Q67K61o19l26L04j002J709m7n76O00M98j140j87Q13o47m4P03
2035E01q6m98K62m29l29O92J04o01N38k92L40l20k12P33J08l32J31j39j35J12
2055A48q42Q00n11O62J9p98K13K6J044j124N74l73l55J162o11J7M06k87o22O56
2075B04j012j90O46K0j93R89m98o40J24Q93l47O23m78M20k73J9l4L24l22j5n51
2096b91k5J39R75j619J191o88L59P10j195M62M10j291Q86K85k44J025k237J313
2114A65J30q44K50P65j22L39n17K10n32J06l66M54l39K30m6J47k03n97J043K29
$$ plain form
1975 930 -254 1 1076 164 -311 10 335 254 596 591 556 -1118 280 -16 128 -389 18 -393 759 243
1995 243 -390 204 -504 443 116 917 6 -362 -190 -10 -107 777 -1032 -4 -477 104 462 -185 -432 -330
2015 -330 -582 -593 -666 201 462 -157 -483 -179 -1181 528 481 -95 505 1003 -137 -324 489 -158 -202 501
2035 501 415 -83 179 -250 -579 113 217 -384 154 -138 202 -118 -330 403 511 179 310 171 36 148
2055 148 -694 106 -405 257 276 -522 -309 -283 761 -363 211 -162 -517 645 34 51 457 170 -452 204
2075 204 -808 -998 -352 -332 -525 464 -34 -674 -550 343 -4 619 141 561 288 307 273 597 275 260 -291
2096 -291 -316 -177 798 -821 370 -318 41 751 -444 18 428 -863 23 308 64 1089 -1148 165
2114 165 295 -549 -299 466 344 683 166 376 -156 -50 -416 38 -301 -71 -117 30 -173 -770 273 502
2134E02k01j201Q33K99O90m03n80M10R3j134Q92j8M99j427J536o75j9l88J129
2153H37q20l72N74m8m03K39l47K20k13N0O9J15N97j228M54Q54J31j169m19J324
2173D45k75j46J53M89l51j047J278N72j279P94r34O97j017P11k55LO08q85p8l
2193e20K53K68m02l2Q1K15O97m85J12n63L98K07j12M84n63j09P99q99J8O18r77
2214e12J321j481J250n29q04J154k00r13J77j60K64P85n15k40P50l31L7P6L57
2233D86l46O46j005O28ml09k59K68N54o67N26j552P22K16Q87j022M61n02P4k77
2253d75L24L52l42M57m64l75J163j311J300q82N62l91m5r3l04O29m37P90l33r36
2273h11O92l11J048m68k03L24r77Q15R17j209K57l32O26k71j397J703l26q76M19
$$ plain form
2134 502 301 -900 -67 232 922 519 -61 349 442 -692 200 182 681 -746 790 115 96 -292 837
2153 837 17 -355 219 171 -232 7 -340 -120 -333 -283 -214 -99 498 -730 -276 578 709 -460 -879 445
2173 445 170 24 177 666 315 -732 546 1118 -161 633 -301 396 -621 90 -165 -162 446 -439 -517 -520
2193 -520 -267 1 -401 -433 -352 -137 560 75 187 -376 22 229 117 601 38 -71 728 -171 -153 465 -512
2214 -512 809 -672 578 49 -755 399 199 -714 -537 -697 -433 352 -163 -403 347 16 53 129 486
2233 486 140 786 -219 409 405 96 -163 105 659 -8 518 -1034 -312 -96 791 -231 230 -272 -198 -475
2253 -475 -151 201 -141 316 -148 -523 640 -671 629 -253 309 -82 -127 -220 -524 105 -332 458 125 -811
2273 -811 -119 -430 618 150 -53 271 -706 109 1026 -183 74 -258 368 97 -1300 403 77 -799 -380
2292c80J186p99J22R9p25J54J090j245P46K04r14pJ226n79N54j273J03j08O48
2311A02J7l15P9O05j74j323J036K52p62O5O81k69l82P8L96j62q59J034o8L38q6
2332B83o45R40n35k75J54j121O54O04J146j539L69Q47j019Q73r96K81J09J96l50
2351b4l44L32l3J86J91o86j85O3L5J79L33M65k97l46K71l73L72M02q64p99K056
2372I34j193N77j135N32L16o76Q36m20j33K0J30J23M17m31n58K38M2M76r2l64
2392c61Q15k54r16J274p63r3L13J013j454L62M79l5k25o8j30j48O4m62o3P65O0
2413A73K41m92J52J89n08pm92Q38O47o95m71L03M11J02J16k2j389N58J32L28k6
2434H8q59J227m00o13M29p9J271o14m13K90l67k66O07M36m60m68L54J17k96l11
$$ plain form
2292 -380 806 7 129 228 -497 -343 747 -498 248 452 -462 -469 757 178 732 -541 -438 -546 102
2311 102 119 -196 -117 488 314 -1009 27 279 -483 -418 263 -6 -388 -310 86 -76 -935 99 31 369 283
2332 283 -362 578 43 -232 -78 -1199 -545 59 1205 -334 35 882 -137 736 -260 21 130 326 -24
2351 -24 -368 -36 -69 117 308 -378 -563 -500 -465 -286 47 512 215 -131 140 -233 139 541 -323 -1122 934
2372 934 -259 318 -817 -285 31 -645 191 -229 -362 -342 -212 -89 328 -103 -661 -423 -381 95 3 -361
2392 -361 454 200 -716 558 -205 -298 15 1028 -426 -64 415 380 155 87 -43 -191 -127 -589 -652 113 173
2413 173 414 -78 74 263 -245 -252 -744 94 741 46 -425 -122 289 391 507 485 -904 -346 -214 114 88
2434 88 -771 456 56 -557 -128 -207 1064 450 37 327 -40 -306 301 737 277 -191 163 280 -16 -327
2454c27O48o06j33k5j11K61j38J41J028k43o68K03J83n6N70J67j494P06o3K42
2474B85l40J15P14o58m03N51q25K45j79R73n29l8O67m95n61M97k23J25o53O15
2494a17n2L03K18k1K09k21j25n59J6J13N18l1j05J44p15l53L04N55j125j44J145
2515d3L03Q61j858O88k01J032o38K62P0l20j03M58n5p33M18l07J31O0j87K94l44
2536b12J27l33P9N32O3m87P44p20L95l15k51r01K074r28q5P03p30p6N37k09O93
2557G00j218J077l14n96K22p0M78K86m63o81M19P52j046O53L46q03K60J61p71
2576f08R57m34Q0n96J81j86L25P72o74J240j581L70M34j76M12l13j98o93J001
2595C13n04J28J184j244O94j19r43L70N1l04N51J26j015J99K09j93M40p43K77
$$ plain form
2454 -327 321 -285 -418 -443 -554 -293 -431 -290 738 495 -173 30 213 157 727 894 -600 106 43 285
2474 285 -55 60 774 116 -287 264 -561 -316 -495 478 -51 -89 578 83 -478 19 -204 -79 -732 -117
2494 -117 -169 134 352 331 540 319 194 -365 -349 -236 282 251 146 290 -425 -778 -474 81 -1044 -1188 -43
2515 -43 260 1121 -737 -49 -250 782 144 406 476 156 53 511 456 -277 141 -166 -35 25 -162 132 -212
2536 -212 -85 -418 -339 193 256 -231 513 -207 188 -127 -378 -1279 795 -133 -218 485 -245 -321 216 7 700
2557 700 -518 559 245 -351 -129 -199 279 565 102 -579 -160 592 -454 199 545 -258 2 163 -608
2576 -608 349 -85 -5 -601 -420 -606 -281 491 -183 1057 -524 -154 280 104 516 203 5 -688 313
2595 313 -191 -63 1121 -123 571 452 -491 -121 -70 -374 177 303 -712 -513 -304 -497 -57 -800 -523
2614e23N75m71M87N06j82m41L45p88J081k27j027Q35p22M57O45o07J95M25r30
2633c67M99p79J022o15Q3R59l77L7N94j650N38J41Q4N58r90q8k11O26j9K90J84
2654E19n95L75k12k82M63l41Q30n25j55n49P51n3O79j690M52O69p11K28oP15p1
2675D91K0m5n5j281P75K54m72j62K19O68k78n76O52k02P85n58m02NN08j089O71
2696g2J3L56j47J90L34n52J6o71Q09l70K24L35p98J41L59rj102N85K3J273o5q27
2718D5R2k78l69K90l84P58L85j184P4J203l15r15J030j65J001l16r28k96O48j008
2738f32M58N09l43M41o77k55J49M89K20m98M5Q34j837J79N87l8J056n77P43j08
2758G45p66j64L70k85n33K59N75m18L63M1L24o94M83j049M60P93j125M39j45j083
$$ plain form
2614 -523 52 -419 68 574 392 -49 296 -492 589 362 -665 170 -552 -95 550 -57 138 563 -367
2633 -367 132 -647 375 -240 -157 802 425 462 1056 -594 -56 85 169 727 -263 -351 -562 64 45 335 519
2654 519 -76 299 87 -195 268 -73 757 232 77 -472 279 226 905 -785 -333 336 -375 -147 -153 562 491
2675 491 511 466 411 -870 -95 159 -313 -475 -256 412 134 -442 210 8 793 235 -167 -162 346 -743 -72
2696 -72 -59 297 150 340 674 122 138 -533 276 -94 130 465 -333 -192 167 158 -944 -359 -336 937 872 45
2718 45 137 -141 -510 -220 -604 154 539 -645 -571 632 317 -598 432 267 1268 952 24 -272 376 -632
2738 -632 -174 335 -8 433 -244 -499 -350 139 359 -139 -94 740 -1097 -918 -331 -369 687 110 853 745
2758 745 -21 -185 185 -100 -633 -374 201 -217 146 187 511 -183 300 -749 -289 504 -621 -182 -327 -1410
2778a410J841k14m49PM7l24L58L4M8p4n64J088j24n07Q99o38R4K02n22J8Q4m91
2800e97O94r5l53N04K5M31m82p81m92J481R9l91m20R8J691k019P71K06J99j5L88
2821I42j395L45m22K84M26K10k06l67L89j36r5k64M63L34J0r16R42j86J51q53
2841c44M16K7K38o67l72J67m4J272L18o44l98n41J094q30n5L02Q71j077n62J263
2861D34l00p5M19k94o68P88o59O86r85j09J118l76j60Q3k71R0Q54o22k27O40l93
2882b7L20j022J293p41M68j118P17N25j488J534o19J45N75l98J7J012o45j205
2900f57k33R58j62j18J00K11M29N20j375O22k39K44j002J3P26k7J77K27j011M24
2920a73J31k66l27J132k65m75M53l30Q85q02O59j13p86l68J372P8n23J25j106
$$ plain form
2778 -1410 431 217 -232 -225 -178 -502 -144 -110 -62 -136 -700 388 264 -243 656 18 112 314 -208 -190 -106 -597
2800 -597 97 2 -351 153 178 609 127 -654 -1146 335 434 43 -377 -279 1412 -607 164 370 569 554 942
2821 942 -453 -108 -530 -246 180 390 184 -183 206 70 -25 -289 174 508 518 -398 544 358 509 -344
2841 -344 72 99 337 -330 -702 -535 -579 693 1011 367 -31 -572 522 -308 -363 -61 810 -267 -829 434
2861 434 134 59 478 184 -484 304 -355 331 -654 -763 355 -21 -181 -98 -369 -279 575 -47 -274 366 -27
2882 -27 293 -729 564 -177 291 -827 -110 415 -1073 461 -158 -13 562 164 181 1193 548 -657
2900 -657 -890 68 -94 -212 -112 99 528 1048 -327 295 56 300 -702 -689 37 10 187 414 -597 -173
2920 -173 -42 -308 -635 497 232 -243 210 -120 765 -37 622 509 -277 -645 727 805 282 407 -699
2939f99O76j54K53l40M66L79o77K3j74K77K3n42J38j01M06K57m4k78n6p66J076
2960A43J67p28L70k68M84m09N19J24n06m28P43l62J275j126j09o6l22K35k60J256
2980G32l42o42R72j210Q75K27l88p66P74n20J49M10L54p58L4J80K52p61M81K80
3000C33M52o82k51j95k05P33m12R62r14K36M57N86p76j70J98k95r91R15K61L47
3020E89k97j698J407J065j623M50m23K20L21L5r44M68kJ126r60J77L34l02P43
3039F86n84j72K61m65J04J91k70Q79n48j03L63n50M62n81k9Q1j22o4O97K90j900
3060a374J418k13J72p7M25p07J62j31q0M31p11N77O24j034Q15K9m44M84n03O89
3080E52j149J26Q79K46q4q35L55K99m56P58q33K05l83l54M02M58p93l61R57j63
$$ plain form
2939 -699 -23 -177 76 -264 202 581 -96 -73 -247 30 53 -489 -351 -452 -46 211 167 -111 -167 -933 143
2960 143 310 -418 -48 -316 168 -241 278 402 -104 -532 211 -151 1124 -2 -111 -177 -499 -264 -524 732
2980 732 390 -252 720 -490 385 612 224 -542 232 -288 -139 271 625 -133 -99 81 333 -428 53 333
3000 333 785 103 -148 -343 -548 185 -227 735 -179 57 514 1100 324 154 352 57 -934 -19 242 589
3020 589 292 -1406 1 1066 -557 -107 -530 -310 11 46 -898 -430 -432 694 -266 -89 245 -57 686
3039 686 102 -70 191 -274 -170 21 -249 630 82 -21 342 -208 254 -327 -356 -275 -397 -461 236 526 -1374
3060 -1374 44 -169 3 -74 351 -356 -194 -325 -405 26 -685 -108 516 -518 297 326 -118 366 -137 552
3080 552 -597 -471 408 654 570 -265 90 389 -67 691 -142 63 -320 -674 -272 186 -607 -968 -11 -174
3100a74j72L48j007J506j117J528l06p39L9m48J008pq13r6K10R9M97R77j413L26
3120B46j062M47O69p97L15mM98K82j31j56o13M16J257j062j19J19m53M98j401
3139a051J155o50Q95j139M66l13P02P14q95k03j00M92o25O36M6q45O58r0l49J041
3159E45l14l95N47k00p58N4L42J115j825J004J24k41j50n1KR25j41o13L31R5k19
3180A77o27j4J042j104J63j30L69l36P65n38Q38j61n29l6M69o19J85O40r90O72
3200B36m16P5O02m34K16K21m89l91K09M6j47m19L55m3K25m07K40l74N81K05j24
3221c3M09r76Q91k99K83o9N50m68N10j380N74K07J225n37p02j86M71l73J25M27
3241F49j077N20n19k96K7J88O43j714J344J94R53j369O04n35N37O47p65L93r4
$$ plain form
3100 -174 -346 2 -1005 501 -616 912 606 -133 -94 -542 466 459 -354 -450 -240 -141 356 1333 -80 246
3120 246 -816 -369 300 -497 -182 -186 312 594 463 307 -306 110 1367 305 186 305 -148 350 -1051
3139 -1051 104 -546 349 -790 -324 -637 65 779 -116 -319 -419 73 -552 84 130 -715 -57 -147 -496 545
3159 545 231 -164 383 183 -575 -521 -179 936 -889 115 239 -2 -152 -203 -201 724 583 -30 301 396 177
3180 177 -450 -464 578 -526 -363 -493 -124 -460 305 -233 605 444 -85 -121 348 -271 -86 554 -436 236
3200 236 -180 -105 497 63 279 500 11 -380 -171 -125 -272 -691 -336 -379 -154 -561 -321 -695 -114 91 -33
3221 -33 376 -600 291 -8 275 206 756 288 798 -582 -8 199 1424 887 185 -1 470 97 222 649
3241 649 -428 92 -427 -723 -696 -508 135 -1579 -235 -41 912 -457 147 -388 149 796 31 424 330
3260C30q19M39N94l26J93l27J090j089K36p2N29n85l8j2p73O51J21j88k11P16
3280D59j095M04P8m10J485L38p83o98k70J448j175J118R5j192K12J01j1m87M04
3299B1M21m28J87k56j21K24l72M41l18L5j88o1O01m98pJ86l45N33l6Q0k06m27
3321e34o8O85n76M27O99j420J88N05Q09m47J94Jl62n88Q8K80j73L8O84l34m77
3342c81K75L67p29K76L10M95j73k59k0P38n94p70J548j487P4J31L67L2j515J306
3362iL23j81n74L33j28M93J29o69K04m34k82M77M11J24m5o65l54M73O17n64N30
3383B09K06J48r56j17M54P3J076j483R37j007j37M60J217j286N68l0l71J507r71
3402D97o73l79O87R1n71J51K24J05K77Q0j496J72R85m91N6l27O25p98J312K16
$$ plain form
3260 330 -489 -50 544 218 411 84 1174 85 321 249 778 193 155 143 -630 21 142 -46 -257 459
3280 459 -636 -232 -154 -564 921 1259 476 -222 -492 956 -219 899 994 -198 14 115 104 -383 21
3299 21 442 14 201 -55 -176 48 -324 117 -201 -166 -354 -415 186 -312 -319 -133 -478 55 19 99 -107 -534
3321 -534 -602 83 -493 -66 633 -787 -599 -94 715 268 462 463 101 -487 -399 -119 -292 -254 430 96 -381
3342 -381 -106 261 -468 -192 118 613 440 181 161 899 305 -465 1083 -404 -330 -199 168 200 -1315 -9
3362 -9 314 133 -441 -108 -236 257 386 -283 -79 -513 -795 -318 93 217 172 -493 -847 -374 243 -321 209
3383 209 415 563 -393 -510 -56 17 1093 -390 547 -460 -597 -137 1080 -206 362 332 -39 1468 497
3402 497 -176 -555 132 223 -348 -197 27 132 409 489 -1007 -835 150 -341 -285 -612 13 -785 527 743
3422G43r45K70L77j4l06k14Q68n40n93J77N24p48N46R5j123Q74K35R1J54q40R02
3443E33j102J47Q61q8K44p56K42l69O79N4p5r69j28N18J226j447K7L7P50j176
3463g92N05J114m90p47N01N18j146l96J919p85m35k1L65k28K74l4R9j80k46P73
3483E68r21P38J23q15O4L31q4M35p47M68r4j29N34k97m10J60K44o47n85J315l63
3504a12M5K3o87P29M3j41l99P12l39O97o51O26K08l08p17O09j81k06K1J5O54j048
3526d07N99L6K42j076O27r34J416j49j047J262n72P4l03q18J661m24J06q15k67
3545g89J268n11l0N18j61j14j31k07J4k36Q52o01R59o59L15q21m1l55K49k52Q41
3566A08j92R34j184r0N67N4m8M46j035Q08j009Q57J2o34R10j250J259l25P97j184
$$ plain form
3422 743 -202 68 445 431 125 -89 779 239 -354 -177 347 -401 145 240 -883 -9 226 317 471 -369 533
3443 533 -569 -422 439 351 595 -161 81 -288 391 445 370 -599 -727 -209 1017 -430 -403 -366 384 -792
3463 -792 -287 827 337 -410 91 609 -537 -933 986 201 -234 -255 110 -118 156 122 221 41 -205 568
3483 568 -353 385 508 -307 -243 88 4 439 -308 160 66 -63 471 174 -236 -76 168 -479 -1064 251 -112
3504 -112 -67 -44 -731 -2 41 -100 -499 213 -126 571 -80 546 754 446 -271 338 157 -49 -28 -13 641 -407
3526 -407 192 228 470 -606 21 -913 503 354 -693 569 -3 71 -232 -1050 611 187 293 -522 -789
3545 -789 479 -32 -62 456 295 181 50 -157 -143 -379 473 -128 831 172 487 -334 -375 -730 -481 -733 108
3566 108 -84 850 -334 -424 143 197 149 595 -440 368 -641 216 228 -406 504 -746 513 188 985 -199
3586a99O24J16k60J39j062O11n26R93j132Q02P7L59m01k19L72n81M56q01K182
3605A550k223O16J58Q71j438P2p10O6M67j98O99o49J476j128M55J2q7j18O82N28
3625A101q35j46j31j54M45K4J07j035P43m9r43J062l43m95J294n86m40J3J181
3644H13k77m90l67M3L48r88M92L70q7o46J086k63K5K88k83K92k28k35l3m24R87
3665D23l55J28Oq80J345j35k25J75l90q12O2L64K76k54J233p44j04j09r39O49
3685b86M40l26qr4K97j10P03r67M63O3n01N41o1k70o3M39k50l6Q97r63O28j64
3707C72q22J371j610R36j62Q7m52O20K6n24L76k1r7j00k57L70J73l35P4k76Q32
3728E81o14M19q83O60m97m37J088j137K7Q4J027N36K3n98o84P10J60l13l67J63
$$ plain form
3586 -199 425 541 281 420 -642 -31 -557 436 -696 106 183 542 141 -78 294 -287 169 -632 1550
3605 1550 -673 -57 101 972 -466 -394 -1104 -1038 -571 -769 -70 -719 757 -371 84 96 9 -109 573 1101
3625 1101 266 120 -11 -165 280 304 411 -624 119 70 -873 189 -154 -649 645 59 -381 -368 813
3644 813 536 46 -321 -278 70 -918 -426 -56 -143 -789 297 34 59 347 64 356 128 -107 -140 -564 423
3665 423 68 196 202 -678 667 532 307 482 92 -720 -658 -294 -18 -272 961 217 113 4 -935 -286
3685 -286 154 -172 -180 -274 23 -87 616 -351 112 175 -326 215 154 -116 -179 260 10 -26 871 -92 536 372
3707 372 -450 921 -689 247 85 172 -280 340 366 -158 218 197 100 0 -257 113 286 -49 25 -251 581
3728 581 -33 386 -497 163 -334 -771 317 -820 -793 -709 318 854 877 279 -405 305 465 152 -215 -52
3748e2j22Q78L4o40M57j251k63Q86O37L89j474P85n96P67l86N3L54n50M13K15
3768E34j245Q42j58m23j70o54M90P61R49M0j160o9R61q61j30J35R14n68K37n56
3788a31m11K18j23J001k03j30l89Q03l24k51N14j320Q50j51M72J63j270J295j016
3807d03j1j91Q58K64m67p3O2l8K42K89r5j276N58n51P04L22q68M74M46K12l46
3828A12j074P77M0K48p35Q29K93q09j88L56K9K16m13Q17k97L41j027L76l55J003
3848E39k37j226J669o74J47N9oL78m96p1k7pj10j02j32L80j061N78K3k78N67q5
3870a72Q15r49N04j0M8r8k82P87k84m24L47o57K30J76Mk7J52j51j47K08k68m06
3892f04J06J278p70j1j28j92J111j305P7N20L48r8j42k28M63k29m05O96K84m10
$$ plain form
3748 -52 -174 704 738 98 555 -696 -959 -73 564 953 -521 264 -332 435 49 102 456 -94 319 534
3768 534 -711 131 -27 -450 -620 -1274 -784 -23 926 966 -194 -263 698 -163 -293 -158 756 188 425 -131
3788 -131 -542 -324 -447 554 351 221 -168 635 311 60 574 -746 104 -47 425 588 -682 613 -403
3807 -403 -414 -605 253 517 50 -23 39 1 243 532 437 -839 -281 -832 -128 194 -674 -200 246 458 112
3828 112 -962 -185 -145 103 -632 197 490 -319 -507 -151 -122 94 -319 498 201 542 -485 -109 -464 539
3848 539 302 -924 745 71 218 277 271 649 153 82 55 48 -62 -164 -296 84 -977 -399 -376 -654 -87 -172
3870 -172 643 -306 198 188 236 138 -144 643 359 -65 282 -375 -145 31 35 8 160 9 -138 70 -198 -604
3892 -604 -498 780 10 -1 -129 -321 790 -515 -438 82 430 332 190 -38 425 196 -209 487 771 361
3912C61o36k35O87o42Q90N2j214P56m67J01k64n6K73l49J226K2k09k61l05N01
3932B31k44J76N12o03m51N56j030J278j076P44l40k98R75K59p54m11O34O8j461
3951a235J313o31K98J121r60l46M92M7p68M54m70k57m68R81M07P6q9l99M80m83
3971d37O56m22O54l37l08l67j20J235l63m36O02o62P91J28k06p26Q46j204O14
3990f2Q45q33O6n77l67R63J87n54J076o71L46r0j007J741j055k38o65J281J91
4009E77l36j14q05n9M94J004j054K31Q8n96J630j331O23J67r63L22J26p77R98
4028B25l06M13j077r4M26J287j576R25k47K72N32j014N31o93P02q19K71L74k21
4047h9m63M9J005r37M09m52n6Q18n1J52q59L95P76m18j467J127j35o23J83P28
$$ plain form
3912 361 -275 -510 177 -465 425 477 -737 19 -448 -347 -611 -667 -394 -743 483 505 296 35 -270 231
3932 231 -13 163 675 72 -379 177 -853 425 -651 93 -247 -545 430 689 -65 -476 158 226 -1235
3951 -1235 78 -553 -255 866 -94 -440 52 99 -669 -215 -685 -942 -1410 -429 -22 54 -35 -434 46 -437
3971 -437 219 -203 451 114 -194 -561 -681 554 191 -245 357 -305 486 614 408 -318 528 -676 -62
3990 -62 783 -50 16 -561 -928 35 222 -332 744 73 419 329 -678 1063 8 -230 -895 386 577
4009 577 241 127 -678 -737 -243 761 -293 -62 26 -570 1060 -271 352 519 -444 -122 4 -773 225
4028 225 -81 332 -745 -839 -413 874 -702 223 -24 248 780 -234 297 -396 306 -513 -242 132 -89
4047 -89 -552 -503 502 -435 -26 -478 -534 284 233 385 -474 -79 697 279 -1188 -61 -196 -819 -636 92
4067I2j25j62K53l52N08J96O28q59j044R57J45K95m03m83M14L10r51j52Q83j68
4087a8r87J365p67j92N03K45k65L3L42j56M94m34O07K48j447N01r31Q60Q50n11
4107C40l92O30j511M18o16J084k49R04q07l18L71m9P31l04j36p4k5p4k46M28J235
4128A340r42q98J089j951J036r9O69q4r41N99q53J372n54J95m77Q76n3m03n64
4147f43O03m69J86N39Rl88P35P9m38o13Q02l71J19J46m75L89j63l31m1N35r36
4168g26P76M87m77J89n64P30n4K47r67O94L2m76k37J008l87m2n67L28p7n9K23
4189H1N13j193L63P29j10j067L17L08k32J133j241k96J652j645K70J143j198O64
4207A91J46j013J353m23p74L44j30K48O54k82l04m66L17O10m68K27j27J197j444
$$ plain form
4067 92 -33 -195 58 -294 214 410 1038 179 -865 92 237 532 129 -354 60 370 -581 -733 150 -18
4087 -18 -1005 360 -407 -599 -96 149 -116 -83 259 103 597 163 770 1018 -429 72 -859 1 851 340
4107 340 -52 578 -933 -515 -1131 -47 -296 608 -199 -517 -146 -195 536 232 96 22 -3 -77 -323 105 1340
4128 1340 398 -500 589 -1362 -326 -425 244 160 -781 -182 -1035 337 -217 -22 -499 377 324 -79 -643
4147 -643 -40 -509 -323 216 225 -163 572 651 213 -400 402 31 150 296 -179 210 47 -284 -325 210 -726
4168 -726 50 537 60 249 -315 415 361 608 -359 335 367 -109 -346 662 275 233 -334 -6 -83 -142 81
4189 81 594 -599 -236 493 383 -684 -367 -59 -291 842 -399 -695 957 -688 -418 725 -473 191
4207 191 337 -676 677 254 -520 -176 -306 -58 596 314 10 -456 -139 471 3 230 103 1300 -144
4226a44J40Q83r38M22n97J569j364P30q24j25N96p99L94j04J111m74n20Ll58P57
4246C58k19p5L5K09K99j111L08p29j14J144J04O90j641M64P11o60L21K2M3q48
4266f89O18pN53p57q64J197J160j006L8L36j100K75P66n23Q52m48q67K68Q7o90
4286h01J405j334M50k29K43K27N75n25k30P7l50r7R89o00M07l27Jm53J20k27p1
4307g50Q56l37J8m71M18N48l68J19o6P31j017m7J31pQ81p24J04j62L69o52P71
4328C45Q17j572P2J18k16L17m53O17M2m93K90k97K12L63l68k58j27M44N66J77
4348E96j645J009M4L90k49J131j385K30N85j019R12m69j18J99J008j404M43L87
4366F45k49m96j408J868l13j16r39N33J412r48J21j50O5R2J91k51m30M71J94p87
$$ plain form
4226 -144 -4 879 -59 363 -234 1335 -29 701 -123 -248 348 -451 -57 -161 950 476 -44 -41 -399 358
4246 358 139 64 99 308 607 -504 -196 -925 -1039 105 209 899 -742 -278 433 -227 94 116 159 -689
4266 -689 -71 -78 475 -282 -1146 51 1211 205 243 579 -521 -246 520 -3 849 401 -466 -198 -111 -801
4286 -801 604 -730 -280 -509 -266 -39 536 11 -219 -142 -492 -589 400 -200 207 -120 -119 -572 -452 -679 -750
4307 -750 106 -231 -213 -684 -266 282 -86 33 -33 698 -319 -366 -235 -242 639 -85 19 -143 226 -426 345
4328 345 1162 -410 -338 -220 -436 -119 -572 45 87 -406 -116 -413 -201 162 -206 -464 -591 -147 419 596
4348 596 -1049 -40 4 394 145 1276 -109 121 706 -313 599 130 12 211 1219 -185 258 645
4366 645 396 -100 -1508 360 47 -69 -1008 -475 937 -11 110 -40 25 117 308 57 -373 98 292 -495
4386d95k85J352j159O88m04k94N70M14l01M96q25p0N56p05M89n5j54R96p99K97
4406C12m17m98n15Q19n27M7O73L28l8n12J244j653l20J022jK63K82q11Q23k13
4426C08R7r4k0l45M02k72k8K97O97l26p23P47o07m75j7O91K52o65m31P09k50L14
4448B61q89P49N91r73M80q40N23k64P12j0p28N93J50k49j11j05m00jR52l06N7
4469A92n87J109m12q38l31J487q31lQ45r64L49O91m42m30m34P61l52n60O72l9
4489a17k76k05J179k90n91Q03p02M42k80j51O04m29j83N87r48M05P24o86Q92j084
4509c06M08l73L00J77r21N37L68J06l63p43R96L5j47K81r38J69O69l85R7M43p21
4530c11J64L46r0q49N66N40K65j729R99J341j577J187p96N31o97M94l53l59J55
$$ plain form
4386 -495 -780 572 -587 101 -303 -597 -27 387 86 582 -243 -313 243 -462 27 -28 -182 814 15 312
4406 312 -105 -603 -1118 -299 -826 -779 -106 222 184 -328 916 -737 -1057 -35 -36 227 509 -302 521 308
4426 308 405 311 291 -54 348 76 48 345 1042 716 -7 740 133 -342 -359 332 584 -81 -512 197 -53 261
4448 261 -628 121 712 -261 219 -621 -98 -362 350 340 -388 205 355 106 -5 -110 -510 -511 441 135 192
4469 192 -395 714 302 -536 -867 620 -211 -214 631 -333 16 707 265 -165 -599 162 -190 -750 -78 -117
4489 -117 -393 -598 581 291 -300 503 -199 243 -37 -188 416 -13 -196 391 -557 -152 572 -114 778 -306
4509 -306 102 -271 29 206 -715 -178 190 296 -67 -810 186 221 74 355 -583 -414 255 -130 -33 410 -311
4530 -311 -147 199 109 -740 -174 366 631 -1098 -99 1242 -335 852 56 587 -110 384 31 -328 -173
4549a73m8m22L90L01o11P63p10J238p43n37L5L50J252j905J174q44L51n94O73
4568f0l55j51N49J71P0M77q91k77J25K58K04M9M27l44k13l37J46K73j77N84K49
4589G77l29k56K50l78K14o3j90Q47j207J4k22m58J246k31L18J42M96j137Q90l46
4609C77l74K48k85J44K57R7j39l92Q4J17q0m25L64m73O68j186J088m59R3O33q1
4630B76L7k65J59L85l00n24K18n73K71k15O98j06m5K63j011Q94K22r57K74j72
4650d71K84r2p77J509L30r58m87N16l77J94n13O69j85O99l37o16J241j065N93
4669A57O43j48m18O91j387j01N99n96J62J168r50J3N89j35JM9J8l95J11K91q98
4690e36J534j308l12J124k34l34l9Q9k37q4N47p84O90K1m18Q26m85p15J299M72
$$ plain form
4549 -173 -221 -643 -253 48 -563 200 -510 728 -15 -552 -517 -167 1085 -820 354 -490 -139 -733 -60
4568 -60 -415 -566 -17 154 224 701 -190 -467 -342 -84 120 169 596 252 39 -298 -152 121 -56 528 777
4589 777 448 192 442 64 278 215 25 872 -335 -321 -543 -1001 245 14 332 474 970 -167 723 377
4609 377 3 251 -34 110 367 464 325 -67 17 134 54 -371 -7 -480 188 -998 90 -369 -276 357 276
4630 276 313 48 207 592 292 -232 -14 -587 -316 -531 167 61 16 279 -732 162 384 -573 -299 -471
4650 -471 -187 -279 -1056 453 783 -175 -662 -146 -523 -329 -842 -173 -358 341 4 -612 629 -436 157
4669 157 800 652 234 925 -462 -563 36 -560 -398 770 -180 -167 422 287 288 337 355 -40 71 362 -536
4690 -536 998 -310 -622 502 268 -66 -105 -16 -253 -337 210 -574 116 137 -281 545 60 -655 644 1116
4710A116j504O85o37Q5j01o36P26J13P11k71p71M51p70O06K29p70K43J96o08J694
4730G87n38j268L24J97N0O45k61L58l76n03P69o76M5R91k00j13m02m45J177o9
4750D92n46k17R05j207J197j159Q44J35o81J99n83L4M51J69L9M93p04n12J447
4769G96j039J06R85p14J54N1r55J088j228J422n48R88o17r31J195m4n81J3m8q
4789H5j61L46O60r04L09q5m08L82j052j07R36l37J460j182o78J807j029k2N15
4808E35p6O72k239J629j35q61N83m51O31J31j038M89L63k93J74j05j26L47P8o2
4828B46K52n60Q34p40n23P84R8q03L2L16K63j09J02q23J90o36O71j29J104o73
4848a04J67p06R85j074Q83Q5o70K32m69L15J59L65j91L54n73q9l32K33Q4O21j56
$$ plain form
4710 1116 -388 297 -340 -255 -356 -992 -266 -153 558 287 -484 -33 -803 -197 32 -738 -495 -299 -907 787
4730 787 249 -1019 -695 -498 -448 197 -64 294 -82 -585 184 -492 -447 544 344 231 -171 -616 561 492
4750 492 -54 -271 634 -573 624 -535 309 444 -237 -38 -621 -587 -136 33 72 565 -139 -651 796
4769 796 -243 -137 848 134 288 339 -616 472 -756 666 118 1106 489 -442 753 709 128 141 93 85
4789 85 -76 270 930 26 335 250 -158 224 -828 -935 1 -336 1124 -58 -736 1071 42 20 535
4808 535 459 1131 -1108 521 386 -475 108 -343 288 419 -619 -130 233 -60 114 9 -117 230 308 246
4828 246 498 -62 772 32 -491 293 391 -412 -380 -64 199 90 192 -631 -441 -1077 -406 -535 569 -104
4848 -104 63 -643 342 -732 151 236 -434 -202 -671 -356 -197 168 -23 331 -242 -331 -663 -430 -346 275 119
4869A19q80L87P34r55K43L94L3j43Q20j187J218j338J273j083O19n66L34R34j37
4888H19j066l29Q63l06M67L34n34m23J16rJ160m39q57R54p11k07L74K12r5J58
4908D81j74m48l13O18l60O29l56o04M19L81j119J700p05q07M18M74k2l46M68k44
4928I0j49m04l39Q20N2j49N32r32O66o47O40l77K5m32J226j335P66l22Q2L02K71
4949C86l32O0j061J019p2L76K74k50n73M38j35j83N9L63q86O56o51L81J20N56
4969E45l92m05L63K75o73L43p30J61l25J221l03J032j354N55M38k6k07k96p45
4988e23L8R53j058J96M76l69l43J592m9l40N70l30l59J53j070N34l05j03m17J337
5008E83q82j70K33L67O15j16j72j166R31k12l5J04j266J174Q94j486M37O57l18
$$ plain form
4869 119 -761 -374 360 -595 -352 42 75 -68 752 -435 783 -555 718 -365 254 -312 22 956 819
4888 819 -247 -576 287 -19 448 782 248 -175 -59 -68 1092 653 -204 750 39 -168 206 418 323 481
4908 481 307 -141 -454 164 -196 433 77 -527 -108 273 -846 854 149 -658 -240 234 212 -134 334 90
4928 90 -59 -463 -802 18 70 -79 453 -479 187 -460 180 -197 -172 -604 622 -713 53 -269 -187 115 386
4949 386 54 114 -947 72 0 376 650 400 -173 265 130 -53 6 369 -517 139 -512 -131 -11 545
4969 545 153 -252 111 386 -287 56 -674 -513 -838 383 80 1112 -242 313 751 725 518 222 -523
4988 -523 -485 468 -590 -394 82 -287 -630 962 913 573 1143 813 454 607 -463 71 -234 -337 -754 583
5008 583 -299 -469 -236 131 746 630 458 -708 223 11 -24 80 -1186 -12 882 -604 -167 490 172
5027A72N88j024k03J481j520l22J173R46r13q74M1M20M07L70m15M24n49o09L82
5046b5r2l11P69o28r0K80K06m9J0M20j126Q55j092N33K04J15m34N28L47K13l45
5067B88n37R75n40q27j97J595r51P95n81k62Q41n60n34K49K49l03P44l63k26L21
5087A76o5q24J8P35L63O1O7j86j09N21m28P8k76o2Q00r53O17n54J40l63O06k07
5109A55N0j5N8k56l19j033J204K85L47p42j97L14k54N78K92q65k3R11j186R88
5129B92N9rl73J655j785O71j154N00K75P7k04m04O85j706Q43J039o33j6Q1M20
5149C13k99M37j7K91l20j56k03P12r03L78q37M98K36J35k7m1o09J37M57p96R07
5170B93l31J96o73N55o46N17l21m78J095j20p23N97l75K02o88m8J443m40n47M86
$$ plain form
5027 172 760 -264 -467 1014 -506 -828 345 1291 378 -496 -455 -35 372 742 327 751 202 -407 -25
5046 -25 -117 -428 341 -287 -377 -97 109 60 70 490 -636 219 -873 -340 -136 -21 -455 73 420 633 288
5067 288 -249 726 186 -641 -838 757 -194 601 20 -242 599 39 -495 -246 3 -300 444 81 -145 176
5087 176 111 -713 -695 40 403 464 531 345 236 757 329 407 131 69 869 -84 533 -21 119 -244 362 155
5109 155 205 190 248 -8 -327 -1360 -156 129 476 -266 -463 -149 -403 175 467 -398 -421 490 -696 292
5129 292 351 342 -31 1624 -161 510 -644 -144 131 208 4 -400 285 -1421 -578 461 -172 -188 -107 313
5149 313 14 451 434 725 405 249 46 758 -145 233 -604 -106 130 265 238 197 -412 -275 182 -614 293
5170 293 -38 158 -515 40 -606 -89 -410 -888 207 87 -636 -39 -414 -212 -900 -948 495 55 -492 -6
5190fJ28k41j78m80Q29M92m85N35l89J61k0M00q7m89n19k79P46N16o22l26N23
5211B09P32j327Q94l46m19J272j205N7m27Q26j21p65J49Q33j0O87j083P20J23
5230G99j374M89k46j64l16O26o35Q47N48K9o34M81j49M02j013R12o09m58J000
5249E35n20k03j6O05O3J7o51L30M0k70Q44j320O63P51r11N14n71P38l68n56k4
5270c10N38r12L72J107j58j238L12K55J94K37n14M36P3k97N52l98l04k59L87P5
5290A48M4p41O30l73J54J56M53k10J30l08k6K28m37O8q68J300j84o61O81p2K68
5311C80P89q91n67o62Q31o4m57O06K40p43J278j618Q23l02J84o7P91l08j97o0
5331a4L34k89l61O44j7o30q8N14M44l09N3o04l19R17m5N63j295M61L4m34K0L44
$$ plain form
5190 -6 122 -119 -297 -777 52 544 59 594 205 366 346 746 659 170 -349 -628 118 634 12 -314 209
5211 209 941 -386 508 162 -257 1015 -190 -133 -560 266 145 -620 -471 362 352 1039 -44 676 799
5230 799 -575 -86 -332 -496 -812 -186 -821 26 574 603 -31 450 301 703 -310 602 -7 -465 535
5249 535 15 -188 -204 401 464 481 -170 160 200 -70 774 -546 117 868 -43 471 -100 638 270 -286 -310
5270 -310 228 -684 -312 795 637 -601 -289 -34 160 397 -117 319 392 95 647 249 -55 -314 73 148
5290 148 192 -549 81 -292 -138 18 471 261 391 83 57 285 -152 -84 -952 348 164 -497 184 112 380
5311 380 1169 278 -289 -951 -120 -184 -641 -35 205 -538 740 -878 -55 -357 -173 -240 551 243 46 -14
5331 -14 320 31 -330 314 297 -333 -421 93 537 228 281 -323 -642 275 230 793 -502 -41 -7 -441 -421 -77
5353g7L5k69j72m42J188l34M13j00r6o3K08l31j062J847K36q17l91P84n96r78
5373a017J379q45P05l16L8J65n44P67R6n74k5P26o08K31j95K53n33k12J167j331
5393f73J151j20K7K47j125O44l12P06n88R6j54M61j369J632j250N40j43l68L45
5412b53l36J009K49K98j253k56O04n4o6M19q8m18O91q5k49r77R27p8j29l53J046
5433F48j050M20L74o96o3j90O76L56n66J01L11ll09o2n29L43M60O6o06K82J52
5454A15K75k30j8L49K11j146J121j231M14M75O99m19q18R92r41L57p09M29L13
5473B38j39K91L02O84j559P78n24j064J291j091R00R5j52o5m33N4O01j168K75
5492f86J356p52O41j124Q20q0n03j98J537j364M01m09n58R23m22K35j86R79m06
$$ plain form
5353 -77 -42 -311 -483 -925 263 -71 342 242 146 83 291 -40 -1102 745 981 164 -227 557 -39 -1017
5373 -1017 362 -483 222 -94 -56 109 -435 332 428 -146 -171 555 -53 178 -17 236 -297 -509 658 -673
5393 -673 478 358 385 632 -493 151 -161 545 -43 53 -101 360 -1009 623 -627 -87 -230 -598 -253
5412 -253 -589 420 669 967 -286 -542 62 8 -58 361 273 -145 546 461 212 -765 162 84 -45 -398 648
5433 648 -402 18 392 -304 -367 -557 119 475 -91 10 321 318 9 -53 -582 -239 221 287 -319 -37 115
5454 115 390 160 142 491 702 -444 677 -554 -140 335 1034 615 -203 789 -152 205 -504 -75 238
5473 238 99 390 692 1376 -183 595 71 -993 298 -793 107 202 50 -15 -448 -394 207 -961 -686
5492 -686 670 -82 559 -565 255 175 -328 -526 1011 -353 48 -361 -919 4 -418 -183 -369 610 204
5511B04L50j103L84k36K69k02R67l62o23R30K70o42j2l11m77Q14m77l14M43L1
5531i7k61J14N00n03k65LO87l8k90L38m08P39k86R88j322q46J577j190Q14n89
5551c35O09j224J067J94r57L79L48m67M33J02n68R54m02M44o2j039J392p88q61
5570g81J107N59j266K8O6J021r21l94Q62j04M82Q6k80K80q28J05j89O15j073o4
5590f89J475o22j85J73k96M50o64J83o55K86l97O25K71L71j32j031Q52j07M52
5609C60p80L9N38m0N24k72j26m25O40o69k88N93j87j07N85o07N07K5r5K37l83
5630F9O0o37j98M63n44O79M84m5N05q41N49m91J10L5j14q88J417p73K31Q54m09
5651E16k09l95O10r61j08K74l24N40K51l03N30j06L12p93j80J004p81l44k40J129
$$ plain form
5511 204 554 -549 -165 -401 -132 -334 633 271 -352 578 848 206 194 -117 -594 220 -257 -571 -128 -97
5531 -97 -358 -244 256 -247 -512 -509 178 140 -150 188 -220 519 233 1221 -101 -947 630 -560 254 -335
5551 -335 274 -950 117 311 -646 -267 81 -386 47 149 -419 535 133 577 515 -524 868 80 -781
5570 -781 326 885 -381 -353 -287 734 -187 -581 281 177 659 745 465 745 -83 22 -167 448 -625 -689
5590 -689 786 164 -21 152 -144 306 -358 -175 -830 -544 -941 -316 -45 326 194 -837 15 -92 360
5609 360 -420 -381 157 117 641 369 243 -182 458 -211 -499 94 -93 -200 385 -222 285 310 215 452 69
5630 69 129 -508 -706 -243 -787 -108 376 331 836 -5 544 53 163 198 84 -804 613 -160 71 925 516
5651 516 307 -88 522 -439 -547 -273 -597 -57 194 -109 421 315 627 -166 -346 658 -123 -467 -707 422
5671D22j138R9O28L75J31m60j39J20J96l90k44m81O71N12k69K46N57j064J124
5690H96j727L34P58o14O49ql35m86M65J67l95k89Q20p9l83K4J030p7l33p65K68
5711h0L39j243K87N61K87k15N52j86j403M57R50n17N01o38J163m34o09L61K23
5730C56m51L47q09M09L15L36P2j06o35o43J085R85j575P44P41j206L12p9l36Q7
5750e1N90n98R13r98Q26n21m16M06o00K7J324q56k79J93k26O73j00l6j725J699
5770B45m26k12R22J37j72l50l07K39N2R5o01M66q44Q66k45Q07j454P78o91J348
5790F53k48r56O91K96l25k46J21k17P15l78J001k92j035K58k80L94l44Q96O51
5809A355j651J79m26OL86P06l49p65L15R14j276M35l95M53L18J17o00K45n90Q3
$$ plain form
5671 422 -716 -617 11 386 517 57 -82 38 234 -156 -400 -881 -210 302 33 279 836 -228 896
5690 896 -831 -497 261 -353 296 288 -47 -533 -68 99 -296 -585 235 156 -227 -203 827 750 417 -348 -80
5711 -80 259 -984 -697 -136 151 -64 488 302 -1101 -644 306 -211 290 -348 815 381 -228 133 356
5730 356 -95 252 -557 -148 167 503 575 469 -166 -809 276 1261 -314 430 1171 -35 277 198 -138 -51
5750 -51 539 -59 854 -144 682 161 -255 151 -449 -422 902 46 -233 -40 -266 407 307 271 -1454 245
5770 245 -181 -393 529 666 494 144 -163 76 128 223 -378 88 -756 110 -135 672 -782 -4 -695 653
5790 653 405 -551 140 436 111 -135 -14 -231 484 106 1107 815 -220 38 -242 152 -192 704 1355
5809 1355 -296 -117 -543 -537 -151 555 206 -559 -244 670 -606 -171 -566 -113 205 322 -278 -33 -623 -540
5829e40K11J000j10J46j47q66rQ64K7o04M70q24O19K6j097J872j227jKK58m60
5850c90P71o98K84k36o02K83L49J97K65l07j20L7j97J144p46l73R49n39j61j98
5870b88M93p01J318j195k9K42P49M7q71M45R0M6m16P02j02k31J63K9p35L17M53
5891E26k12L26j080P99p44O01l61R79q29L0j88R8L21k71J050j246k60O27rm16
5911b59m95J294j000R48l33o37J185j488L82N7O31p9Kk58O29l23j26L04o47k77
5931d90J388q75l29N74Nl78J058Nq51j25q2K43j96K25k21k93P4J87R95j621J319
5952F12r20J324l41j75j002P20n43J0J08n02O72Q26o12l81J110p20p48m2O19k33
5972b18k8M15J279j536o13N39O71p64m86O92K65j32k34J76l3K85K44l41O7m73
$$ plain form
5829 -540 -329 671 561 707 560 -306 -315 549 576 -28 442 -382 237 263 -834 1038 -189 -190 -188 70 -390
5850 -390 381 -317 -33 -269 -871 -588 -239 -42 223 -84 -204 -167 -364 780 34 -339 610 71 -90 -288
5870 -288 205 -496 822 -373 -402 -160 589 636 -235 210 300 346 -70 632 530 299 462 491 -244 73 526
5891 526 314 640 -440 359 -385 216 -145 834 5 35 -153 -55 266 -5 1045 -201 -461 166 157 -259
5911 -259 -754 540 -460 488 155 -482 703 -785 -403 -346 285 206 208 -50 579 256 130 434 -213 -490
5931 -490 898 23 -306 268 273 -105 953 958 107 -18 -100 143 -53 172 -49 -342 -268 -81 914 -707 612
5952 612 -308 1016 675 500 -502 218 -325 -315 -207 -709 -37 789 177 -204 906 186 -562 -604 15 -218
5972 -218 -246 169 1448 -88 -701 -162 509 -255 -741 -49 216 84 -150 26 -7 278 522 181 248 -225
5992b25M89r71Q51p73P06l56P0L52l83J29N71o17J90J96j56m8k42j43K72K19L91
6013E22j7p24O84o16m45O79n20K25K12oJ83q83N48j47O97K54J53j070j21J82m50
6034f60J565l41k11L22j049J008r07M33o16O6P58r95m7Q39L45q67M74K7L11K95
6054G50n37k58K96n10O14m48Q86j183N73j03m05o48R04l19N38J16L25j122J227
6073F96o31l78L63q25Q83m12J345q63k10l26N24K82o93K15q35P44ql00M04J64
6093A39k01M08m09n5L36R32j7j074J19O3o55P23k99P33m97K00L84j255M42P8k88
6114a93J661n02p67K54o89m3N00m17J81Q8R14l68k3n37P35p7m43q33J248m03l21
6135c5k02Q4J28O64n4p02O07p60q2L24P6p17J37P07m17p86J226r75Q41K72j409
$$ plain form
5992 -225 264 -707 144 -629 77 -279 -209 143 -240 -111 460 -157 33 229 73 25 -217 -360 -88 131 522
6013 522 505 -219 465 -151 -596 83 -437 -212 0 -6 177 -706 -158 -305 392 646 799 -271 -392 -210 -660
6034 -660 905 564 353 675 -374 634 -273 160 -456 -390 368 -627 -674 165 510 -357 117 144 455 750
6054 750 213 -45 251 -259 355 -93 793 -390 183 80 -325 -973 -69 -388 150 266 591 -531 696
6073 696 65 -313 50 -775 108 -304 1041 178 -32 -358 166 448 -245 -30 -865 -121 -129 -429 -25 139
6093 139 -62 346 -63 -118 218 1150 1133 59 178 241 -414 309 10 743 246 446 830 -425 17 95 -193
6114 -193 1468 966 199 453 -236 -279 221 -196 -15 73 987 619 596 59 794 717 274 -559 689 286 -35
6135 -35 -237 -153 -25 639 585 -117 490 -270 -352 -28 48 -669 -532 175 -242 -1028 198 -777 64 336 -1073
6156a073J312L5L1o00L1L35J36l28M63p9N8n49K18N45l56N39m89M38k76o01Q32
6177F22p12l89K64j86m53J278p73J140p79K65j18L50o51J41o98j90J082N2m26
6196a81p68K68O16n65J148K2o62J392o72m93o19J019k83o5q35L98M23K40p27P12
6216C68j25j2L38l82k04m85N80o1O20j60P6rj69m24o4j33k19o0J456l30p82J083
6238I02j230J90l2j27P22r1l16O6l07Q32m04j37K55j57J85j162K41M90O95n95
6258B0M15o62k04J2O74r9J23o77N58l14k08K86j06j46M73J65j60P71q47k38N69
6279D05k35K54p64r4O33l4m67K3K99k89p78K022o98p67Q35n12m6R7L71m52O08
6300D11q80J568j72p78M76j62q46J75J56k60j03M33N1o39Q81pj027K39J423j179
$$ plain form
6156 -1073 239 274 305 -295 -264 71 207 -121 342 263 321 -228 -10 535 179 718 229 667 391 -210 622
6177 622 -90 -479 -215 -401 -854 424 -349 791 12 277 159 509 -142 -1 -699 -889 193 245 -181
6196 -181 -949 -681 -65 -630 518 540 -122 1270 598 105 -514 505 222 157 -678 -280 143 383 -344 368
6216 368 243 231 569 187 -17 -502 78 17 637 477 553 544 375 -49 -113 -246 -465 -525 931 601 -181 902
6238 902 -328 -138 -170 -297 425 334 18 84 -223 609 205 68 323 166 351 -811 -570 -80 615 20
6258 20 435 -227 -431 -419 255 156 279 -398 160 -154 -362 -76 -182 -328 145 310 150 921 74 -164 405
6279 405 170 424 -340 -434 199 165 -302 -279 20 -269 -1047 975 277 -490 345 -167 -213 -116 255 -197 411
6300 411 -469 1099 927 149 625 463 -383 -208 -52 -312 -415 18 69 -570 311 304 -723 -484 939 -240
6320b40O02k39r65J178q60K69J49N05j61r4j51o6L20n86K3L52m67r4O23k46j45
6341b93M27m14M14m1j106L96J140o95l14J226n62j18j28j72J96j98j33k84J123
6360D64l05n13R91j368N39R80k87k60N16r63m3o1n07O49M56p17j98J019m98J066
6380I60p28M09J42p09L34m40L80R5k43L86r25N64o47J82M84k39n20L83J73j95
6400a54M61N94j667J279k92o40K21P99o54J24o3M99o60R76j517M43N66P60n62
6419E13l25N61q43j12l84O74k54R21j685Q30L24l00N79j83j92J78k2r39K00M39
6439b0k06R2P6M2k65K27L8J15Q58o18J06o29n12J080o31K53q2l54N73k23K44Q3
6461B47q12j75J079N7J23k60K50n62K03p8k89k06L57j58o83R76K65N89p08R9n05
$$ plain form
6320 -240 362 123 -842 336 -524 -255 -106 399 238 144 -7 -73 247 -339 -316 36 -431 -525 98 -148 -293
6341 -293 134 -280 134 93 -1013 -617 523 -172 -486 740 178 60 -68 -240 -44 -242 -375 -659 464
6360 464 159 -354 637 -731 -192 788 501 241 757 -206 -249 -310 -817 -168 288 -429 -627 392 -106 960
6380 960 232 641 783 74 408 -32 348 443 200 586 -339 225 -422 -240 244 5 -515 -132 41 -154
6400 -154 307 901 -766 513 221 -419 -198 601 -53 71 8 507 -153 823 -694 -251 315 1075 513
6419 513 188 749 -94 -206 -590 84 -170 751 -934 -104 220 -80 499 316 124 302 280 -659 -459 -20
6439 -20 -226 -134 -58 -16 -281 -54 -16 99 957 339 445 -184 -696 384 -247 6 -76 -430 143 -80 164 247
6461 247 -565 -740 339 396 519 259 509 -53 150 72 -217 -423 -66 -224 -907 69 334 923 215 314 -191
6482a91k58M66K08ok31O88k32p74J05K47M6k61K3O61K1p72K52q34Q87o04K14Q30
6504D85j316J279r75P12Q3m74j4K98j20J39Pl07K28K2Km90M83j02j98m29Q45N76
6526G34R3j786R70P31r91M31m7n87O62m1q70J593q66n55M45k08Q77n78l23J236
6546I20p47j48P93j6n36J72M28p50l6n48p27J419K06q72J090j16p36q27P51Q17
6566E37j93m48J42n75R69k73O51r73K91m52M02n04L34K2P51l3j87L6J27j512R28
6587D0o01M03p3J1J486m27q42j82K68l59N71L23k65n10J242j347m74N89k0o7O77
6608D43j045J131j0m74P57o37R01m21J8j137J002n70K21K23n25N4l04K2P29l55
6628B3j09N9R84j99q86k61M37N32r78N06M98n15Q9k1N62o34J38j74l22p97R23
$$ plain form
6482 -191 -449 17 225 219 -12 676 444 -330 -225 22 68 -193 -170 491 512 -260 -8 -842 45 -559 -345 485
6504 485 -831 448 -527 185 268 -206 -220 78 -42 97 104 -203 25 47 49 -441 42 -60 -258 -687 158 734
6526 734 827 -959 11 742 -249 182 135 -452 210 169 -701 892 26 -529 -84 -292 585 7 -316 920
6546 920 173 25 818 802 266 438 866 116 80 -468 -1195 224 430 -442 648 532 -204 -1031 -280 537
6566 537 344 -104 38 -537 432 159 810 -163 128 -324 78 -426 -92 -70 681 648 461 497 624 -888 40
6587 40 -561 -158 -231 -220 1266 839 -3 -185 83 -276 295 618 353 -157 1085 -262 -736 -147 -167 -234 443
6608 443 -602 529 519 45 802 165 1066 645 663 -474 528 -42 179 402 -123 -69 -373 -351 378 23
6628 23 -86 -27 957 758 -128 -389 48 580 -398 108 606 91 180 159 721 87 225 51 -271 -1068 -145
6649a45K30l38q52J045j03o0L46r54M57K23k6O8p81J443p05l89M92J43l87L89
6669I6N33j247R09J74L2j3n93O5n52P48Q3J39j64J35M57n70k74M65q44N6P83n75
6691a57R70q07j63N03o02O39k0j041Q34L69p82R9M39n68M25l06R42n09L91r87
6711c31Q33pl96o65O85O2J031j536P01j283J417l23p22R30j170L34O24j22j50
6730h8l54J277m74M88m79m75L71j336Q49L12M93j463J191p58M48m1K04R4M6j85
6750A20O29k39L03r17l10K92JK10K10q76Q55k20N44n83n04m4P06o21q6J193j58
6771E05q39p95J475J41k39o54L66N23N2q51o6Q87K93j079K09Q69j563P47K09j162
6791i72J391j242J651n32k19k20p5m88Q65L09p86q4L67k82O9O12R76j420R05j442
$$ plain form
6649 -145 85 -253 -1105 -60 -163 -223 123 -831 -374 -151 -177 -109 -890 553 -152 -541 -49 94 -293 96
6669 96 629 -618 291 465 497 484 -109 -44 -596 152 235 374 210 345 802 232 -42 423 -421 -365 418 -157
6691 -157 813 6 -157 346 -256 383 363 -678 156 525 -257 -158 281 -287 138 -168 774 265 656 -331
6711 -331 502 495 99 -566 119 181 1212 -324 377 -906 511 188 -534 396 -774 -440 184 62 -88
6730 -88 -442 835 361 849 370 -105 266 -1070 -221 91 584 -879 312 -446 2 -39 165 259 305 120
6750 120 749 510 813 -104 -414 -122 -121 89 299 -577 278 58 602 19 -485 -529 177 -444 -530 663 505
6771 505 -334 -1129 346 487 248 -406 -40 483 535 -316 -382 505 798 -281 -72 797 -766 -19 190 -972
6791 -972 419 -823 828 296 77 -143 -218 -706 159 468 -318 -402 -35 -317 -248 364 1340 -80 825 -617
6811f17Q56K27J47r98j33R06o0j656J420n17R89k03q70J03K55J92o43j60J72O67
6831G7m7p40N14P2J71n16J50M30L94r7J24J5j215N64O15k71p91k69K44K60l4K33
6853a17l09N37j025J604j317K37O64m46N65j374J103K51o38O14M72o45l75J188
6871I89j555K83K93J95K0o76L47k79N33p64N52K82M37o8j191M31j46J28r49J580
6891D42n89m46N18M2o68Q93k40K91o76Q26J93j195M70o72J091j027N84M25J7j09
6911A70%r32O49K7K10K22o94l33P38O52j41o22K14Q1q07j70Q80l51l9N51m30J29
6933DL1j89p56O70Q11j073J135p34J28RJ73N13j149K2J77N95o69m42N62O87M23
6954I28p24o1K70k34k39N80K31j14L4N88l97r86J37k93Q40j209J020n86m23O66
$$ plain form
6811 -617 239 466 613 -385 -518 388 328 -1328 92 -425 564 361 -509 -406 -151 41 -602 -762 -590 77
6831 77 30 -710 -196 -124 47 -469 -319 111 505 408 532 547 -668 -104 511 240 -551 -820 -576 -316 -350 -117
6853 -117 -426 111 -914 690 -627 -390 274 -172 393 -981 122 373 -265 349 821 176 -199 989
6871 989 -566 -283 10 205 225 -451 -104 -383 150 -614 -62 220 657 589 -602 -171 -317 -189 -1138 442
6891 442 -147 -593 -75 -33 -701 192 -48 243 -433 393 586 -609 -139 -811 280 -747 -163 262 279 170
6911 170 170 -762 -113 -86 124 346 -348 -681 57 709 568 -54 160 241 -566 -736 144 -207 -246 305 -125 4
6933 4 35 -154 -910 -240 571 -502 633 -101 27 36 209 722 -427 -405 -228 367 -302 -744 -182 505 928
6954 928 204 143 413 179 -60 520 751 637 671 1259 862 -124 13 -280 560 -649 371 -215 -638 28
6974B8m9J61Q7p55lO40J62q80M21P0k56N63L94j019J106r22k94O60p28O05R21
6995I12o40l39o20K09l16R10q23K34Q53K58p03M42L36p90J6j12m6M08J117k245
7015i39J547j035N12j57K70n59P88R12k003J201o10M44M92m07o61M2n77J396j702
7034a046J060O70j64o18M35N6l24m8J91p5m41J00l21P7J159o67M13o97K16J63
7054A39j244J159j29o35Q66m67M44O57J82j84l30j28p38l36P11J86j16O52K12
7073I01p36o16O66m95O72n53m45J186m5n45L80p74k9L59N82k90l14M14l31p60
7093g73Q71N03o51J12q42P52KK87k98N25n23N23q82J163j133L40L64R1m61M82
7113D52p76J46K62j53k77M60m05M48J43l79q91pJ873k4l30k21J20o66L61k5P28
$$ plain form
6974 28 -21 140 227 -528 -531 109 271 -609 -188 -118 -374 189 583 -436 670 -252 -546 114 -614 -9 912
6995 912 272 -67 -687 -478 -794 116 -707 -473 380 638 -65 377 713 -77 -61 -173 -219 189 1306 -939
7015 -939 608 -427 85 -72 198 -361 427 1339 -664 537 -73 371 863 456 -205 -163 -740 656 -1046
7034 -1046 14 684 520 -98 337 393 69 21 212 137 -304 -204 -525 -448 711 44 457 -240 -24 139
7054 139 -1105 54 -75 -710 156 -311 133 790 972 788 458 330 -408 -744 -33 153 37 689 901
7073 901 165 -451 215 -280 392 -161 -606 580 535 -10 370 -404 -433 -74 508 218 -96 318 -13 -773
7093 -773 98 601 -50 62 -780 -28 -26 261 -37 488 -35 488 -394 769 -364 -24 340 431 -30 452
7113 452 -324 -178 84 -69 -346 114 -291 157 300 -79 -970 -977 896 872 542 321 441 -225 136 111 839
7134H39j074L27K36m91N87k37L94L39l14j128j00P8J31L95o09J576q76q10J660
7153I23j423L04K76R2n77P44J59Q57j088L97n2p90M95N67j244l8O23k08Q5n28
7173d26M16l84j47P21l36O73p2k30m98K7K99o09K47O01l27n03J183j436R19l15
7193a97N17r78J446j773M07K16j08L8J62k34Q92k31M99p43k50L13n11Q19j29k26
7213g1n51L69L37J51r51L75Q80M83q19p1j74q8q8R39m05l75j37L15k11o37J131
7234D02O41j028j53N4L2r59O07L72L06p43LL82n09P31k96J19l37N40q04J086l16
7255A30J054j371m33j56O28J10n4K99k99L50j27n94N95L46m31l5n18M09j6O75
7275E62j082Q78k85J40N9j7k88m6M2k2o3p06J443n77m39J22M22K15l70k73P72
$$ plain form
7134 839 -235 92 328 -163 424 187 581 920 606 -522 -622 -544 -413 -18 -627 949 73 -737 923
7153 923 -500 -196 80 172 -405 339 498 1355 267 664 612 -178 317 884 -360 -398 225 17 102 -426
7173 -426 -10 -394 -541 180 -156 517 445 215 -283 -256 43 -566 -319 282 -45 -548 635 -801 118 -197
7193 -197 320 -658 788 -985 -578 -362 -470 -432 -270 -504 388 157 656 -87 -337 -24 -535 284 155 -71
7213 -71 -622 -253 84 235 -716 -341 539 1022 203 132 -42 -130 -218 721 316 -59 -196 119 -92 -729 402
7234 402 1043 15 -138 -84 -52 -1011 -404 -32 274 -469 -466 -84 -593 138 -158 -39 -376 164 -640 446 130
7255 130 1184 -187 -620 -776 -148 -38 -92 207 -92 258 131 -463 132 478 47 12 -506 -97 -113 562
7275 562 -520 358 73 213 272 255 -33 -79 -37 -59 -122 -828 615 38 -401 -279 143 358 -12 -285 487
7296D87K44m32N08k11k67K36J63r48M01L39R9q51J014j132M04O86p01n4L26kk08
7317A01J50m67P02o87k85L73K41j37K78m77m39N81M85l59p9n98Q73L52m96l28
7337b16j59n50P53j87R12j28p60N65l94j48m16N58K85M20j088M44j36k00J06l48
7357f87M62O04q4k3l30K00K21R9k83J102j757Q26J94R4m44n93O19r99J261j161
7377f79M50P21q79K54m05K22L02k48k15P78n56P47r78L55J196j415P51r09R67
7396D59J26j87r47L58j96P90q72J043l88L84q42p35M70J452l12p07O24n48LP1
7416D6M40J48r08N98k8Q2L61p80Q57j023N49J26K81q31L3j09P94j910J304N42
7436E72n91l76P87n43m45J088n53K39q9k4L44N71j020Q17j256J153m71Q78m85
$$ plain form
7296 487 731 299 807 596 329 565 728 -220 181 520 619 -232 782 -350 54 740 39 -15 311 309 101
7317 101 251 -216 486 -201 -486 -113 128 -9 269 -208 -647 -66 419 60 -19 -617 256 608 112 -216
7337 -216 -375 -925 -172 -359 553 425 -335 230 -164 -312 -728 -170 115 535 -553 -109 -245 -445 -339 -687
7357 -687 -225 379 295 272 -58 142 363 462 179 1281 -476 350 544 638 194 -399 220 -779 482 -679
7377 -679 -229 492 -387 -133 -538 -316 -14 -262 -477 301 -255 492 -486 -131 1065 -350 401 -508 459
7396 459 585 398 -549 -191 -387 403 -469 574 186 570 -272 -1007 -537 915 603 -104 520 -28 -25 46
7416 46 486 634 -274 324 296 378 739 -41 816 -207 342 468 749 -82 -49 -158 636 -1274 30 572
7436 572 -19 -395 392 -151 -596 492 -61 178 89 65 409 980 -40 777 -479 674 203 1081 596
7455E96j573Q74O73n1j115N18J92m08j30k53J06N59J066j051l79P95j228M19M00
7474A0P9k55J33J92k32l89j38J244n57l43N05l29J28J44m58M75J26n48O82M51
7494I20j306p7p9J578j355L16K88j65n70N99p04l43R84m02N32k73K77K02k23n21
7514c22P8J30K96K11ok55o32k61K79Q74p54m45Q97J38L42r93N84P1K07j04l37
7535bl2m68Q79m88j5Jj57l48N42M10m47j20L66p00J000j13n36K03O81q83J461
7556A234j154L13r52O77r05P21q3O59o11n92P12n46J423j207N69p65J734l42q32
7575E3J038j029M38M3j308J263K91n92p41J89O3N38J245j357N00n20l69L38j059
7594i76J668k7q70j81N23m18L4L83m63Q73r79P87k33P6L15m01m54K11J98k60O80
$$ plain form
7455 596 -977 -103 570 519 -596 -78 114 -294 -424 -677 -571 -12 1054 3 -376 419 -809 -390 10
7474 10 89 -166 -33 159 -73 -462 -600 644 87 -256 249 -80 48 192 -266 209 335 -213 469 920
7494 920 -386 -463 -542 1036 -319 -3 285 120 -450 149 -555 -898 86 -316 216 -57 220 422 199 -322
7514 -322 -244 -114 182 393 387 132 -500 -761 -482 392 -362 -807 90 228 570 -423 161 232 439 335 -2
7535 -2 -34 -502 377 -111 -126 -125 -282 -630 -88 322 -125 -245 121 -579 421 308 -228 -25 656 -227 1234
7556 1234 80 393 -559 118 -787 -66 -149 510 -101 -693 19 -527 896 -311 258 -507 1227 885 53
7575 53 1091 62 500 543 -765 498 789 197 -544 -355 -292 246 1491 134 634 114 -255 83 -976
7594 -976 692 665 -205 -386 137 -281 -247 136 -327 546 -433 354 121 197 512 111 -343 -132 66 -194 486
7615D86o8q30r7R3O80l48l23J118r27k3L34l60J48O75m05j62M95k06l23K60K7
7636B44m52K27N44j224J168r11J169j025M15K30k07m45J71L03N37o01Pl51k07
7655d08N0l30J2O94k76j24O3n99J056j30L0n50J074l58j07N68k88m41J29o98R75
7676C42nj22P8j39n9Q73o81l27J14j31J43j261N74N54O91j197M29l97O39P46j076
7697b12N2N47p32M40p60R10R8r12L84p42P03N25n27P52r47o3O26l67P36J66j120
7718d43J297q63k64Q48m37o03R18r33P9J267j021Q28j096Q54k09L65o87M3L26
7737B69j238N47Q54j59J98k46q33M56N63n35Q18q49n18R19m12P82n30L13J29l45
7757A83q01O83k48R36j620Q38l24qj41P05p6n10N16M27l47R08l42l38m70R34m38
$$ plain form
7615 486 418 -412 -509 -416 264 -84 -407 711 -216 -239 95 -265 -117 558 153 -9 486 280 -43 217 244
7636 244 -208 19 563 -661 507 -404 765 -260 155 385 178 -267 -96 207 744 143 150 -201 -408
7655 -408 -358 -688 -676 18 -258 -382 -319 -918 138 8 38 -512 562 204 97 665 377 -64 65 -633 342
7676 342 337 215 293 154 95 968 287 -40 74 -57 86 -1175 -601 -47 644 -553 -124 -521 118 864 -212
7697 -212 -160 387 -345 95 -665 245 343 -569 -185 -927 -224 301 -226 526 -421 -484 142 -225 511 677 -443
7718 -443 854 -9 -273 575 138 -465 453 -480 -401 866 -155 673 -423 431 222 587 -100 -57 269
7737 269 -969 -422 432 273 471 225 -608 -152 411 -124 694 -155 -673 246 -166 616 86 399 528 183
7757 183 -618 65 -183 753 -867 -29 -353 -361 -502 203 127 -383 133 560 213 1121 779 441 -29 905 467
7778D67j113J126K72p21j29O76q00l24l03J611r13J75K6j91L20n22P03M51m10
7797D01j307O14P24L1j032O48J2L62K17q84R07p76M63p39l04P83K50K13q8p52
7817b57J7O08K86j30p82K37K3N0q0K82O7J92O36k86p37p84N85Q10p35J11m51k02
7839e40M15J20M04q5N7K66j343O81N61L78o05j01R3n1o8l71J95o40R71q22K26
7860b59M06l96Q49r05K74J20j53J58k15J71J118r82K43l49L28l87N9L9j42O60
7880F37m38o43N25l70n03J763r12o49j71P14L60j19J33P7p80q41J227n15J031
7899E26n90M20p78j90Q47l56L39l44R95K10j28o56O01r34m1l30M86J80l71l83
7919d97M27o47P63j58l72Q31r93Q14p75J254n65k64Q9L82k85k45O99n8o5l85M65
$$ plain form
7778 467 -646 480 752 31 -98 578 -222 -546 -849 762 -151 24 50 -141 179 -343 360 811 401
7797 401 -906 -292 432 463 -569 79 91 453 670 -214 693 -83 380 -359 -663 120 370 583 495 -257
7817 -257 -240 368 654 524 -258 -21 2 52 -28 254 321 513 1149 863 126 -658 -73 737 2 113 -338 -540
7839 -540 -125 -5 399 314 371 637 -706 -25 536 914 309 208 301 250 182 -189 6 -634 337 -485 -259
7860 -259 147 -249 600 -305 -31 89 -64 94 -121 50 1168 186 429 80 408 21 80 119 -23 637
7880 637 199 -444 81 -289 -792 971 59 -590 -761 -47 313 194 327 404 -376 -1217 10 -505 526
7899 526 -64 356 -422 -612 235 -121 218 -126 869 1079 951 295 896 -38 -79 -409 77 257 -114 -497
7919 -497 -70 -717 46 -112 -484 347 -646 168 -607 647 82 -182 -93 289 4 -241 458 400 335 -50 415
7940D15r26P21K29p55KM16q78K21R4N41k57K94j76j69Q3j89J3M45P8K68j143Q41
7962A68l34j86O08j010P44O46N02j268N07j53m04J5J58M90r00l01L41n25P50K13
7982F1r6N68k78p2m12M36j03R6q33J38J35R04m2l38R37l99q11O42j38L4n17L81
8004B93M2l95j65N93m30L70p39o8P52n60Q18J60r31M46K61r1J34r93J180L20q50
8025A47j67L4j93Q05K00K37j027j14J05K25k21l34q3O91J24j063J468n57m17o2
8045b02N94M9O1k80M9K16j059O97p04L9M82P9K28j264M50K92R69j375O06l79l8
8066d90j71J0K67N98N47p41l77N34o63J059j10p46O22Q3K2m24n11P61L21m08j347
8087a164R42J204j187R80j523J362m54J60q10Q23l03J023j096k39j38J95O35K64
$$ plain form
7940 415 -511 210 439 -316 -314 102 -776 -555 -461 80 -177 117 -59 -228 -145 -334 -321 124 202 470 -673 168
7962 168 -166 -352 256 -754 -10 636 1138 -130 377 224 -180 -165 -7 483 -417 -718 -377 -902 -152 61
7982 61 -35 533 255 183 -229 207 104 200 -633 -495 -360 544 502 164 1101 702 -109 533 395 429 -88 293
8004 293 335 -60 -225 368 -62 308 -431 -499 253 -307 511 671 -260 186 447 356 490 -503 677 997 147
8025 147 -20 14 -179 626 826 1063 36 -78 27 252 31 -303 -386 305 429 -634 834 277 -140 -202
8045 -202 392 441 502 222 271 487 -572 125 -579 -540 -58 21 249 -1015 -565 -273 696 -679 -73 -452 -490
8066 -490 -661 -651 -384 214 761 20 -357 177 -486 573 463 -283 339 422 444 20 -491 270 591 183 -1164
8087 -1164 -222 982 -205 775 -748 614 160 320 -490 333 30 1053 -43 -282 -420 -225 410 674
8105F74l55l8R9l79K68j186J534j69m16K83n81J184j646J240l76K03m52R40r34
8124a07m97Q27m08N63j008J057j83m72Q36j73n7J52j248Q46m57j52J99j27K53
8143a56L69M23p21j41K94K72J54p66M89j30j95J125j547P55k03p46m69O68P48
8162B23q7o4j96j68L46N75j337N07p0J91J88m4O6M19j92q9o15N18J52k68M5n82
8184d82J145k64n98J46K90O75j278
$$ plain form
8105 674 319 281 380 1 269 -917 617 448 32 315 -266 918 -728 512 136 339 -113 827 -107
8124 -107 -604 223 -185 378 -630 427 244 -228 608 435 378 530 -718 128 -329 -481 -282 -409 -156
8143 -156 213 636 -85 -226 68 340 494 -272 217 87 -108 1017 -530 225 22 -724 -1193 -525 223
8162 223 136 72 -124 -292 54 629 -708 -201 -271 -80 108 64 130 549 357 268 -347 171 323 55 100 -482
8184 -482 663 399 -199 -53 237 912 -366
8191c66
$$ Imaginary data points
##PAGE= N=2
##DATA TABLE= (X++(I..I)), XYDATA
0@%%%%%%%%%%%%%%%%%%%%Lj08K13k16K16k16K16k20L00m04M32m40N33o33O62p60
36d22Q66r63J074j196J338j473J641j815J998k206K435k695K976l264L592l966
52b080M368m817N328n906O559p317Q206r244J0495j2041J4002j6581K0122k5301
66a4207L3579m8920Q6133l28562k99611Q72479k42457n16263O01923K24578n89192
77b20520K75672M20120m51522j31033M25528k45067l38219L18873O9003l59562
87b36727J48782K78812k19235p1865K99242p3194k57712J57351R6137k94301j4071
98a86781K42698j43996j42094K86944N9874k25533J63169J86572k57095l9519
108e5761K28074j82059j93896K34592L724k37521J74831J79324k03481K5473K33535
$$ plain form
0 0 0 0 0 0 0 0 0 0 0 0 0 0 0 0 0 0 0 0 0 0 3 -105 108 -108 108 -108 108 -112 188 -216 216 -224 309 -324 338 -422
36 -422 444 -519 555 -641 697 -776 865 -950 1048 -1158 1277 -1418 1558 -1706 1886 -2080
52 -2080 2288 -2529 2799 -3107 3452 -3865 4341 -4903 5592 -6449 7553 -9028 11094 -14207
66 -14207 19372 -29548 56585 -271977 -571588 300891 58434 -457829 144094 368672 -220520
77 -220520 55152 475272 23750 -107283 318245 73178 -265041 53832 122835 -236727
87 -236727 -87945 190867 -28368 -100233 199009 125815 -131897 25454 121591 -172710 -186781
98 -186781 55917 -88079 -230173 56771 116645 -108888 54281 240853 -16242 -55761
108 -55761 172313 -9746 -203642 30950 34674 -202847 -28016 151308 -52173 -26700 206835
119B06835j43485j41999J79467m2384k18169R9714R9108j64949K2060J88013o0266
130B3945p0759J55932J6911j47134M5800O7851j46957m9779J22460m8823r6422
141a26975J34593P1671j16457N4084J25401j14451o9794J14209o3228j42562R3518
152c9991M4237j29324N9794J41587q5127k1572J48679l9635j17318Q6007J3787
163F1124j46061K5184Q7210r1152j6222J31148r422o5773R4136L9196j06749K901
175E520N7445r1408o1662P7567j1878p1580P5686P2257o5443J7226R4446n5379
187D2797o9005O6765j7070j09090L5856N5437p7756J0561J08229k6342l7444R1295
199G4233P060r1276K7253L1518r4815k1225O5096l5853l4434Q1653K5669m5785
$$ plain form
119 206835 63350 -78649 100818 58434 -159735 -60021 39087 -125862 -103802 84211 23945
130 23945 -46814 109118 126029 -21105 24695 92546 -54411 -104190 18270 -30553 -126975
141 -126975 7618 79289 -37168 16916 142317 27866 -41928 72281 9053 -133509 -39991
152 -39991 4246 -125078 -65284 76303 -8824 -30396 118283 78648 -38670 47337 61124
163 61124 -84937 -59753 27457 -63695 -79917 51231 41809 -23964 70172 109368 2619 5520
175 5520 62965 -28443 -90105 -12538 -24416 -95996 -20310 51947 -13496 3730 98176 42797
187 42797 -26208 40557 23487 -85603 -49747 5690 -72066 -61505 46724 20382 -17062 74233
199 74233 81293 -9983 17270 48788 -46027 -67252 -2156 -38009 -72443 9210 34879 -10906
211a0906M6047M8227o0854k2703M1189m5461o0792L7506J2354m5707L2748O0474
223C2122k5362n51N9384j5228n1973K3015m7p0219p44L7914l3702p773O5241Q716
237B0793k4873M5983K1978n2699k541K2900n1037l2543L4482o362k8358M2631
249i646L4941k3319J9307L8104k8693k6427K0953k3125m6673J4051J2667k7851
261d5711J7952M3955o382k94L7651l688l3739P412k317m4096q730K0157j5876
274c3706m825M0586J4234j1661K6378J6360k9355q008Q427l0295k7300J6602j136
287b3699j6915K5232K9968p261R184K8080j2521k4039R899j2048l7249L270J1273
300a6826j7965P284L5340L286j759K6091K543k5529j29K62l2626j4014J4306q347
$$ plain form
211 -10906 35141 83368 22514 -189 41000 -4461 -65253 -27747 -15393 -61100 -28352 32122
223 32122 6760 6209 65593 50365 -1608 21407 21360 -48859 -49603 -11689 -45391 -53164 12077 20793
237 20793 -4080 41903 63881 11182 8641 31541 -19496 -52039 -17557 -23919 -52277 -9646
249 -9646 25295 1976 21283 59387 30694 4267 25220 2095 -44578 -30527 -17860 -45711
261 -45711 -27759 16196 9814 9520 47171 43483 9744 17156 14839 -29257 -37987 -17830 -33706
274 -33706 -38531 2055 16289 4628 31006 47366 18011 10003 18430 -11865 -39165 -22563 -23699
287 -23699 -40614 -15382 14586 7325 16509 44589 32068 8029 17928 5880 -31369 -28099 -16826
300 -16826 -34791 -27507 7833 11119 9360 35451 37994 12465 12336 12598 -20028 -34042 -19736 -28083
314b8083o463K9824J5961n713J8232J4714j6809j0063K963k0314k2986P747k33
327b1223r312J6077K3091J66O775J9200n476j6706J317q965k6402m253O536q677
341b7852J768K4601R253o09J6893Q348j6183p140K52k0023j5515N650q67n797
355b7221J8528J6919r2J0364J3005o631j2047l80j3208j7729k051N64l154O156
369a6977J7806O470M597J2898L2j0349m119p344j5091r530J820k139J620J5447
383d859J1872L234J0542M956p377o061m078j3683j3345j081p32j598J1136J2400
397A326N602Q425P750k666p779l590r182j2425n513j458O78N363R854J0925N653
412A2963P912J252n222o590p279j0777p905k804n64L351P545J0185O903O376M123
$$ plain form
314 -28083 -34546 -4722 11239 5526 23758 38472 21663 11600 14563 -5751 -28737 -20990 -21223
327 -21223 -30535 -14458 8633 8799 15574 34774 29298 12592 13909 4944 -21458 -25711 -19175 -27852
341 -27852 -26084 -1483 7770 7161 24054 32402 16219 9079 9331 -10692 -26207 -20557 -21424 -27221
355 -27221 -8693 8226 8134 18498 31503 24872 12825 12445 -763 -18492 -20543 -19979 -23133 -16977
369 -16977 829 7299 11896 24794 24826 14477 10358 3014 -12077 -21607 -19787 -21926 -20306 -4859
383 -4859 7013 10247 20789 25745 18368 12307 8229 -5454 -18799 -19880 -20612 -22210 -11074 1326
397 1326 6928 15353 23103 20437 12658 9068 -114 -12539 -18052 -19510 -18832 -13469 -3615 7310 12963
412 12963 20875 22127 16905 10315 3036 -7741 -15646 -18450 -19014 -15663 -8118 2067 8970 15346 19469
427A9469k391n426p554r049q378m071k217J931P383P444R247Q692L375j73j984
442A6298p687j0213o563n692m919J316O854N244Q156R921L591n68J261o361j0048
457E90n307o563o828P41M859L792O715J1297M785m10L010k252j1250o459l833
472g113p658l884N197N091J449J1279Q783o58J274J414p671j0824j935l940r243
487a8439L432Q134Q08M711J2982L250m052M384j765j2722m863m08r298l648R255
502h239K843L84J1802P351m280K710J093j0657q232M41p025p429O812N800q5R358
518B647R375n61p95L930o081j0108j295l560q734J342P351M83L412J2256K266
533A1928k365M078j873j0693m458K9q038m646Q412K887j321J2072P384o045L240
$$ plain form
427 19469 17078 11652 4098 -4951 -13329 -17400 -19617 -17686 -10303 -2859 6388 15080 18455 18282 16298
442 16298 8611 -1602 -8165 -13857 -18776 -17460 -10606 -5362 2794 12715 16306 15738 16999 10638 590
457 590 -4717 -11280 -18108 -17367 -12508 -8716 -2001 9296 14081 13671 16681 14429 3179 -3280 -7113
472 -7113 -14771 -18655 -13458 -8367 -6918 4361 13144 12486 13760 15174 7503 -3321 -5256 -9196 -18439
487 -18439 -15007 -6873 -6065 -1354 11628 14878 10826 15210 13445 723 -4140 -4548 -13846 -17494 -8239
502 -8239 -5396 -5012 6790 14141 9861 12571 13664 3007 -5225 -4784 -11809 -19238 -12426 -6626 -6711 2647
518 2647 12022 11461 10666 14596 8515 -1593 -2888 -6448 -15182 -13840 -6489 -6006 -2594 9662 11928
533 11928 9563 13641 11768 1075 -3383 -3354 -11392 -16038 -7626 -4739 -6060 6012 13396 7351 10591
548A0591M109j0710p744K133n663j0367O928O417k635O457J3524l891k488P342
562A4003n423j1937J11r17j0796J031R283j706P88J3847L716o801O311K125j2258
577A377m711L586q830o157R330K620m450R802R656n552j131P983p767j0894M109
592a029k687j1293L972R974o744L502J4815j494o641R766j766j3822M63M605j3481
607a1860j379J1807l193k267J3977L992q758O763L999j2067n168M973o376r448
621a5005Q630M327m571P573J0557o256k316Q833m638j2049M067J32j1933J832
635a0817J0446m227j414J5310K96p911P228K515j3495k279N837j0002n338J1117
649b734K78n612J1354P339r099L593O894r705o734N202l654r511O296O122o403
$$ plain form
548 10591 14700 3990 -3754 -1621 -7284 -17651 -10723 -4306 -6941 -484 13040 9149 6661 14003
562 14003 8580 -3357 -3246 -4163 -14959 -13928 -4645 -6351 -5563 8284 12000 5199 11510 13635 1377
577 1377 -3334 252 -8578 -14735 -5405 -2785 -7235 2567 12223 6671 5540 13523 5756 -5138 -1029
592 -1029 -3716 -15009 -11037 -1063 -7807 -4305 10510 9016 2375 12141 10375 -3447 -2984 1621 -11860
607 -11860 -13239 -1432 -4625 -6892 7085 11077 2319 9082 13081 1014 -4154 819 -5557 -15005
621 -15005 -6375 -2048 -6619 954 11511 5255 2939 11772 7134 -4915 -848 -716 -12649 -10817
635 -10817 -371 -4598 -6012 9298 9594 1683 8911 11426 -2069 -4348 1489 -8513 -13851 -2734
649 -2734 -2456 -8068 3286 10625 1526 5119 12013 2308 -4426 776 -2878 -12389 -6093 29 -6374
664f374M734J1623l616l784P589k148j2566K950K246j0148j801J0936k825l499
678f683J2632M208r744N519O359j2702m626P885q336p577J0717K049o477Q608
692A832Q379o720o98Q027o928r249O508j854j0742L917Q419o381J881J1767j690
707F468m957N893M9r831j165M867q387k678Q787Q22n454Q730N890p148kQ267q676
724A475p739P026k529j0174O416P545p952M096J1096n937l868Q475l063r331M253
739b11J151r672J067R391m423j508J0593k09n253M166K564r095k543N052n130
754d060n062O469K811n122N253N938l786j613O234l860q687N338O9r133L630O377
770G96l934J11R889k484m854O366M00r746J636L195o936k044P234j395l087P885
$$ plain form
664 -6374 -1640 9983 6367 2583 10172 8024 -4542 -1592 654 -9494 -11295 -359 -3184 -6683
678 -6683 5949 10157 413 5932 12291 -411 -5037 2848 -5488 -13065 -2348 -299 -6776 1832
692 1832 10211 3491 2793 10820 3892 -5357 1151 -703 -11445 -7528 891 -5490 -3609 8158 6468
707 6468 1511 7404 7453 -2378 -3543 1324 -7063 -9741 -954 -132 -5586 3144 9034 1886 1884 10151 1475
724 1475 -6264 762 -1767 -11941 -5525 2020 -5932 -1836 9260 3323 -545 7930 4867 -4464 -211
739 -211 940 -8732 -7665 1726 -2697 -4205 6388 6179 926 5092 7656 -1439 -3982 1070 -4060
754 -4060 -9122 -2653 158 -4964 289 6227 2441 828 7062 3202 -5485 -147 -78 -9211 -5581 796
770 796 -3138 -3027 6862 4378 -476 5890 6290 -3456 -1820 1375 -5561 -7605 -371 -1766 -4853 3032
786C032K859o047K312N168p391l554N218l437n487M504L615m121L214O223l477
801B631j285M685k928n508J817P44o289R28N244k000m90O504J109n259K706K906
817E515p340n63L880n121l205O082R85m010M596M218m010N15M918n398m046L366
833C82r06n373K299M400l056J778N238r12l321K902On464P6K057l635r89L877
850f41n65p64L944J967l786K343J264l553k446K668l329k145K987K307k181K340
866D10L117k895q9L078j659l813K069j444l415J508K380r38J835L479o34j575
882A414J719r33l099L0J04j920q78L003J89j151L094J602j315K68J105k547j893
899a208J278k044j298J899R50j109J024L841j598k34Q04j551j594K23K70j964
$$ plain form
786 3032 5891 -156 2156 7324 -67 -3621 1597 -1840 -7327 -2823 792 -3329 -115 6108 2631
801 2631 1346 6031 3103 -2405 -588 156 -6133 -5205 39 -1961 -2451 4053 5162 -97 2609 5515
817 5515 -1825 -2388 1492 -3629 -6834 -752 233 -3777 819 5037 1027 1542 6460 1062 -2984 382
833 382 -524 -5897 -3598 802 -2254 -476 4762 3850 529 3431 3437 -2027 -1951 106 -3529 -4518 -641
850 -641 -1206 -1970 1974 3941 155 2498 3762 209 -2237 431 -2898 -5043 -2056 251 -1930 410
866 410 3527 632 543 3621 1962 -1851 218 -1226 -4641 -3133 -753 -1691 144 3623 2989 1414
882 1414 3133 2200 -899 -869 -765 -2685 -3563 -560 -371 -1522 1572 3174 1859 2127 3232 685 -1208
899 -1208 70 -1974 -3272 -1373 -423 -1532 -508 3333 1735 1501 2305 754 -840 -617 -347 -2311
915b311N79K167j541Q62K134J33j286J323J19k830m28J611l536K80K755o01j101
932a671K778L87r35L84J437k124r59J391k334j156J393J136j867K269K295r82
948A442j556J398J04k361R9K50k384P72J994r65J054J672j05j809K457J32k202
965hM7j67j410n70J559j45q37J869Q93j0n19N47o48r25J49J39k181Q98K084k339
985a574J244J285L60m8n54L40p53m09L49j200l88J009Q3O1J367q75p38R84k22
1004C21r28J88J017j825q22J731m88j5J109J360k179J361P48j353o34O49p66m17
1022i43R12k8n78Q59J47L5l45R25k72j419P20L3j284N48l36J57J132K79R62j190
1042C14R94k73r00q24N42r9M3n11K42J09l72J448L87j064K006k098n56N4P23q82
$$ plain form
915 -2311 -1732 435 -1106 -244 1890 2023 737 2060 2179 -651 -1079 532 -3004 -2724 31 -570 -1671
932 -1671 1107 1494 559 943 2380 256 -703 688 -1646 -2802 -1409 -273 -2140 129 2424 1442
948 1442 -114 1284 1388 -973 -874 -624 -3008 -2236 -242 -1207 -153 1519 1414 -395 2062 2194 -8
965 -8 39 -128 -1538 -2108 -549 -694 -1531 338 1231 1221 702 1249 601 -324 -175 -36 -2217 -1319 765 -1574
985 -1574 -330 955 1315 1267 713 1053 300 -109 240 -960 -1348 -339 -256 -195 1172 297 -441 543 321
1004 321 -607 -419 598 -1227 -2049 -318 -806 -821 288 1648 -531 830 1578 225 -409 240 -526 -943
1022 -943 -31 -59 -637 222 369 404 59 984 712 -707 13 46 -1238 -690 -1026 -869 263 542 1504 314
1042 314 1308 1035 135 -689 -147 -246 -203 -714 -472 -363 -735 713 1100 36 2042 -56 -612 -558 165 -717
1062g17j32J36l91Q02M57J087m14K74p59j73J18o69k07Q25p33o62J139J94L87
1081E62n53J312j094m43L93r0m95P69r89n5Q83n13K71m6P0O58l10m7q78j412J541
1102d66q0R85j084Q24l91R00m51J034j131L0j85o50J088k45m01m87O13R74l66
1121E11k37O40j082l98N66r0m33p7L06l6K25N36l78J08Q73r22n98Q66N28k083
1141a175P10M06J73j206J666n43m5M68m0p30O93P06j981N27J021m75n39M93n50
1160d21j168J724n69J61j95N55l3p33Q46j001O08J596p12q02J41Q21m48r99J827
1179A198j204k40j72R97o25m26P70j019J77M97J689k627j22J251p84j03P40K8
1197B5j329Q01J204q97L69L74q37Q1J012l7o49k33J163j581L47L95l47j49L85
$$ plain form
1062 -717 -849 -713 -1104 -302 155 1242 828 1102 343 170 288 -381 -588 237 -496 -1158 -19 175 562
1081 562 9 1321 227 -216 177 87 -408 361 -628 -683 200 -313 -42 -88 -18 640 330 283 -595 -2007 -466
1102 -466 -546 439 -645 179 -212 688 237 1271 140 170 -15 -665 423 178 -223 -710 -97 877 511
1121 511 274 914 -168 -566 0 -90 -523 -600 -294 -330 -105 431 53 161 1034 112 -486 380 908 -1175
1141 -1175 -465 -59 114 -1092 574 31 -14 454 414 -316 377 1083 -898 -371 650 175 -364 129 -421
1160 -421 -1589 135 -434 -273 -468 87 54 -679 167 -834 -226 1370 658 -144 -3 818 370 -629 1198
1179 1198 -6 -246 -418 579 -46 -472 298 -721 -544 -47 1642 -985 -1107 144 -640 -743 -3 25
1197 25 -1304 -503 701 -196 173 547 -290 -209 803 766 117 -116 1047 -534 -187 208 -139 -288 97
1216I7N82Q1q76O88j209L14Q85j064N80m6M1j705J142N81k19o60N15P83j01m81
1236g2N60j899J877j8j101M46J947j078j144Q98N48o54l29J837k150k6J971j901
1254b88m98Q77L86j138J75P69K02N63o71l72j830J931k93N1L80P73j312m01K127
1273A431j992O54o32J714j354o29J428j562P68L15k70j106P32J03K18l77J933
1290A374j020j068J625j142q52J242k87r40M83J315n09J96l94J524j332k56Q14
1307G73q23R8O01k02j176J723L73k402K101j181o5L03N62q68r64Q11P93j341J035
1326A51L6o38j23J706j341q21J767k03j840M06J509r86o55J826j24j132n21J094
1344A11m54J226j201j33j5P62L29q54M49O52j232O28O85j287J66R68p21r00Q28
$$ plain form
1216 97 679 760 -116 572 -637 -323 562 -502 78 32 73 -1632 -490 91 -128 -788 -273 510 409 -72
1236 -72 488 -1411 466 448 -653 -207 1740 662 -482 416 964 310 -19 1818 -332 -358 1613 -288
1254 -288 -786 91 477 -661 -486 283 485 1048 377 5 -1825 106 -187 -136 244 1017 -295 -696 1431
1273 1431 -561 93 -539 1175 -179 -808 620 -942 -174 141 -129 -1235 -503 -400 -182 -559 1374
1290 1374 354 -714 911 -231 -1083 159 -128 -1068 -585 730 221 417 23 1547 215 -41 773
1307 773 -50 48 649 447 -729 994 1367 -1035 1066 -115 -180 123 685 -183 -1147 -336 457 -884 151
1326 151 187 -451 -574 1132 -209 -1030 737 534 -1306 -900 609 -377 -1032 794 670 -462 -983 111
1344 111 -343 883 -318 -451 -466 296 625 -229 220 872 -360 268 953 -334 -168 800 79 -821 7
1363GO39q27p8O16r62m19J768o76k27J76M09p33j028J729o5o26L84O7l05M8J04
1384AM20j579K077o34m78N66M3j546J658p54l57J70J474r37n19J074m13j113N24
1403c23m83L51j001K766j048K88O35j082q20J087j187o17J716n1M7j274J093k3
1421G4q22O33J382k271R85P43p78J11r95j70M46j12J600l33k99n13L25L40J3N33
1441H92j337l93P61m51O9O56p68M26O9o2M13k64R18j174K8N41o18n96J235k9l14
1462BM59P6J38r29J24p0J26L47p85j39N21O44j21l04J86k16n24K63R87j035j426
1483a676J151J49K48J17M09m6p85J407q20m9R09j371r32J149p23L73J123l47M11
1502F97j082J419j13j574P57P64p70j108J114j07o11J627o10o24J123m12l1k2
$$ plain form
1363 7 646 -181 -259 357 -605 -1024 744 68 -159 17 426 -307 -1335 394 329 -297 87 154 -151 -103 1
1384 1 421 -1158 919 285 -193 373 416 -1130 528 -226 -583 -413 1061 124 -395 679 266 -847 -323
1403 -323 -806 -455 -1456 1310 262 550 1185 103 -717 370 -817 -1434 282 231 278 -996 97 74
1421 74 -748 -115 1267 -1004 -19 724 -54 57 -938 -1108 -662 -774 826 493 194 -319 6 346 359 892
1441 892 -445 -838 -77 -528 -459 197 -571 -145 -76 -138 275 11 929 -245 -217 324 -294 -890 345 316 2
1462 2 461 537 675 -254 -130 -200 -74 273 -512 -651 -130 514 393 89 275 59 -465 -202 785 -250 -1676
1483 -1676 -525 -376 -128 -11 398 352 -433 974 154 105 1014 -357 -1289 -140 -863 -490 633 286 697
1502 697 -385 1034 921 -653 104 868 98 -1010 104 -3 -614 1013 403 -221 902 490 459 437
1520D37m53R6l34k80P0n2R02p3L18L5o12J41m30N95q01P39q97Q97l4j91M01l01
1542A73n57N79N08j189k14K93J293o97k80k87M60P83l80l72l28J016j375K04J321
1561I51j088m68K94p93P24m29J439k41p41J415j640Q25J49k20N8L89m65j193Q09
1580b25O04n41pO25kj303J013j069J309j097L12N62o63n4M21P62j110K58L0K63
1600H8K6k55m38K17n31J208j26j65L20j48l39Q1m1J27K3m07L63R9j05k79k10Q00
1622C08J86L57j021P69m58l41k5K72J14r1k57Q4R34k04j52j32j397L25J322p16
1642a23M79o51m60P01k37K54N67q17J069k75M42k38r43p44P67O38o24K88J33Q1
1662C07L07j174O92R88j209P90j510L93q3m98J538o32Q28q44j98O47L65R4j739
$$ plain form
1520 437 -16 80 -254 -534 -464 -516 386 313 631 666 54 195 -235 360 -441 298 -599 298 264 73 474 173
1542 173 -384 195 703 -486 -700 -407 886 189 -91 -378 82 865 485 113 -215 801 -574 -370 951
1561 951 -137 -605 -311 -1104 -380 -809 630 389 -352 1063 -577 248 397 177 235 624 159 -1034 -225
1580 -225 379 -162 -169 456 454 -849 164 -905 404 -693 -381 181 -482 -536 -115 647 -463 -205 -175 88
1600 88 114 -141 -579 -362 -893 315 189 24 344 196 -143 -62 -103 24 47 -360 3 102 -3 -282 -492 308
1622 308 494 851 -170 599 141 -200 -225 47 161 70 -187 -103 831 627 475 343 -1054 -729 593 -123
1642 -123 356 -295 -755 -54 -291 -37 530 -287 782 507 949 711 -232 -976 -209 429 -195 93 226 307
1662 307 614 -560 132 1120 -89 701 -809 -416 -499 -997 541 -91 737 -107 -305 342 707 801 -938
1681i38J129p21K43k10N40q88Q47k45J220q02j37N93o04k65J41q67Q45l24N1M01
1701IK11n86Q07n82R07o30j275J036n17R09k7M62r00J64j3j27K08L0j200J120
1721FK50O4p18J121j356N24j78P68j23K66j422K142k172L68l4L62K62J74k93m25
1741d14J33Q29m90Q84q35o64N45J66l16o88O50J02Q62r12O25m85P51k89l36L04
1761D22p92N63k61o7O77l11j4o65J493j427lL40J91p21J45O31p79M18K73O4J90
1782C67p82P4J3M97o25J405q74m39k39L80k37K08N92m65K81K81m52J79o22N21
1802F3P98n65K8K83n59k8k50J062l30j10k78N90q86K75p57P6J138q18k38N05M80
1823D79k46K27k52K5p61M3K97k35K14M92k64m43J60P75n71R12n59K86m99R91m81
$$ plain form
1681 -938 191 -530 -287 -497 43 -845 2 -243 977 175 38 631 27 -238 -97 -964 -119 -443 -392 9
1701 9 220 -366 441 -141 766 136 -1139 -103 -620 289 262 724 -176 -12 -25 -152 56 86 -1114 6
1721 6 256 320 -398 723 -633 -109 -287 481 358 624 -798 1344 -828 -460 -494 -132 130 304 11 -414
1741 -414 -281 548 58 942 107 -557 -12 154 -162 -850 -200 -98 764 -148 477 -8 743 454 118 422
1761 422 -370 193 -68 -135 542 231 217 -448 1045 -382 -385 -45 146 -575 -430 201 -578 -160 113 177 367
1782 367 -415 -341 -328 169 -456 949 75 -364 -603 -223 -460 -252 340 -125 156 437 -15 164 -458 63
1802 63 861 296 324 607 48 20 -230 832 502 392 114 704 -182 93 -664 -588 550 -268 -506 -1 479
1823 479 233 460 208 233 -528 -485 -188 -423 -209 283 19 -424 -264 511 -60 852 293 579 80 1071 590
1844E90L23l44j54q91L38O8k10Q23q3Q55j811n81J561j238Q54p77Q16m75J100
1863G64o2m28q03Q46O4l08l62J04L78k79L58K58j90n78M52n86L31J02k13J47J51
1884A46o20k39K96r6J020p33J21J49L4Q4j206Q49m13N5m5J054p11k3N86Q80p44
1905D44q52K04J017j415P51p82M58j82J30M64r2J96p87P52M36p77J19l40o92J022
1925G4L62l02l10K51m06L44r39J043P63j412k3N19M21q05P54J55j174J20M92J75
1945A02j019Q32K38j048N93K72j154N20O01p6l78j73J010l03m12P90q36L68m74
1964e47l30J247m85M60j123M04R08j72J68j67j072J14J221J92j226L11k73N46
1982A76l67N5K48L55m22o93L85M31K47L1r27J074q74N85k43P82m07K22qq95P93
$$ plain form
1844 590 913 569 415 -476 -138 -70 -280 543 460 1315 -496 -1077 484 -754 100 -677 139 -336 764
1863 764 702 274 -529 317 381 73 -289 -185 193 -86 272 530 340 -238 214 -372 -41 61 -152 -5 146
1884 146 -474 -713 -417 -513 507 -226 -105 44 78 162 -1044 -195 -608 -553 -598 456 -255 -278 308 1188 444
1905 444 -408 -204 813 -602 149 -633 -175 -357 -227 237 145 341 -446 306 742 -35 84 -256 -948 74
1925 74 436 134 -176 75 -331 13 -926 117 880 -532 -555 -36 385 -420 334 489 -685 -565 -73 102
1945 102 -917 -85 153 -895 -302 -30 -1184 -664 -63 -139 -517 -690 320 17 -395 395 -441 -73 -547
1964 -547 -877 370 -115 345 -778 -374 534 362 530 363 -709 -595 626 818 -408 -97 -370 176
1982 176 -191 -136 112 467 45 -648 -263 168 415 446 -481 593 -281 304 61 843 436 658 650 -245 548
2003E48j390J202q54L44k31L40J38L74r29Q74L30o71L74N92j373J36m96J348k61
2022C95n59l51J153l11K24k24o01K06m04j39M76L43k69M1J99p70O62m88O47o10
2042c80j22O70j29j13k89O40k20j10j35l88Q80o26M09J27k47K16k99k56p7J213
2062G64p61Q23j262M4L74L57oq94P75r96J439k24n43o33J519k19n63L43n06k78
2082d47j74j90O76j65K14J78k07o20J655p07j68m9m4K88n03N85j041K53O00j5
2102A19L6J83l10L80l71O88o01J20l14o84J379n51K46M8l21K66o28M97q36J069
2122D15j215K40m66J468o94O0k65j15J1K80Q22l59k95J56q70R71K76j458O83K96
2142e9j11J48M16p87J385j051M93j024K31K01j20J204j300m20P19L65n65Q47L6
$$ plain form
2003 548 -842 360 -494 -150 -381 -41 97 471 -458 416 746 75 449 1041 -332 -196 -692 656 395
2022 395 -164 -515 638 327 551 327 -274 -68 -472 -611 -135 208 -61 -20 179 -591 71 -417 230 -380
2042 -380 -502 168 39 -74 -363 277 57 -53 -188 -576 304 -322 87 214 -33 183 -116 -372 -449 764
2062 764 3 826 -436 -392 -18 339 333 -561 214 -782 657 433 -110 -743 776 557 -6 337 -169 -447
2082 -447 -621 -811 -135 -300 -86 92 -115 -735 920 213 45 -4 -48 240 -263 322 -719 -466 134 119
2102 119 155 338 28 408 37 725 124 244 -70 -754 625 74 320 368 47 313 -315 182 -654 415
2122 415 -800 -560 -1026 442 -252 -192 -457 -572 -561 -281 541 182 -113 43 -827 144 420 -1038 -355 -59
2142 -59 -170 -22 394 -393 992 -59 434 -590 -359 -158 -278 926 -374 -794 -75 290 -275 572 608
2161F08j442J740k062N76l17J258n82P17l68k41O08j429J677q49k75j0N02m58
2179c47N32j141R88o4M28k45k7j287J402l24O20j030K11M36j131J108r37J011
2197B03l55K11o35q7N26m47O40l36K69L61k18n18K271k001R50m80k43N90m68P2
2217C05k56J22j018N44M57p58k0Q02m01K7N44p48M72o01j83J050l96m64K015j665
2237a72K1N72n78N74r56J261q15n17J241q78O70p58N23l94n50M63K24N83J4o70
2257a42j52M56n16j12M48n80J129m00l98L45O60j74k26o1k23p98N19N28q59L28
2277b28L49L54o54K80k04O89j259l49J092O9k61K58m73O38mk52N92p67Q75n18
2297B27l82K70k23k97O76N4m7l97J54M13q19M28L81m39P16p81l59n9l08Q65Q15
$$ plain form
2161 608 -834 906 -1156 -580 -897 361 -221 496 128 -113 495 -934 743 -106 -381 -391 111 -347
2179 -347 185 -956 32 -32 396 151 124 -1163 239 -85 535 -495 -284 152 -979 129 -808 203
2197 203 -152 59 -576 -663 -137 -584 56 -280 -11 350 132 -386 1885 -116 834 354 111 701 233 305
2217 305 49 171 -847 -303 154 -604 -624 178 -223 -196 348 -400 72 -529 -712 338 -58 -522 1493 -172
2237 -172 -151 421 -157 417 -539 722 -93 -610 631 -247 423 -335 188 -206 -756 -293 -69 514 528 -142
2257 -142 -294 162 -354 -466 -18 -598 531 131 -267 78 738 564 338 277 54 -744 -225 303 -556 -228
2277 -228 121 475 -179 101 -103 586 -673 -1022 70 139 -122 136 -337 301 297 45 637 -130 745 227
2297 227 -155 115 -108 -405 271 325 278 -119 35 448 -371 57 438 -1 715 -66 -425 -484 -792 73 888
2318H88j625Q93M2J41q97J321l98n9k82J96j151L62q8J27K26J11k8j2k50P99j756
2339a440J001J7L64N9k77Q0M65j04K51M10j45r32K22j04J44j28m15K53P08J96
2359F25j185L33J205j366O27N81j620p6M81JN5N25l71K45n01K75M05J26o37N72
2379C00l36o56M18k27O24j11m24M86J89p38Q27l5o42Q1M7M02m68M91m19P80r79
2400c90J023m05k42K90r74N70N8J33J8m04M15M09k38l48l62O34p90L16P19o68
2420b36L20l30L33K7R9L81K9j729J209K10m40q03N64J22M87j016L73p30R47K27
2440D4K6M06n0p54j54L80L34m35J34L57j065O94J83k83q27J551l70q96J086k77
2460H4m60P02N14m46N33Q00j480m02n72P62k10K09j4p07K95N57J0L70q69J55k2
$$ plain form
2318 888 -737 156 198 339 -558 763 365 306 24 220 -931 -569 -657 -530 -304 -193 -221 -233 -483 316 -1440
2339 -1440 -439 -422 -58 1 -276 -196 269 165 416 826 681 -251 -29 -133 11 -117 -532 -279 429 625
2359 625 -560 -227 978 -388 239 820 -800 -876 -395 -394 -339 186 -185 60 -441 -166 239 365 -272 300
2379 300 -36 -692 -274 -501 123 12 -412 74 263 -475 352 317 -325 -244 -197 205 -263 228 -191 589 -390
2400 -390 633 228 -14 276 -698 -128 -70 63 81 -323 92 501 263 -85 -447 187 -603 -287 432 -236
2420 -236 84 -246 87 114 213 594 623 -1106 103 313 -127 -930 -366 -244 243 -773 -400 -1130 -183 44
2440 44 70 476 426 -328 -482 -102 232 -203 -69 288 -777 -83 100 -183 -1010 541 171 -725 361 84
2460 84 -376 326 840 394 927 1727 247 -155 -727 35 -175 34 20 -687 -392 165 175 545 -324 -169 -191
2481a91L83j31n15r3L43K20j02o37q3J57J37k4N83l90N48M3J21k68Pj65K48o68
2503d77l84P12P8L29n32l88R20j039Q90N93m65P11n60n60J90n74k59O91j229J76
$$ plain form
2481 -191 192 61 -454 -547 -204 16 -86 -723 -806 -649 -512 -536 47 -343 205 248 369 101 108 -57 191 -477
2503 -477 -861 -149 -71 258 -274 -662 258 -781 109 702 237 948 388 -172 18 -556 -815 -124 -1353 -1177
$$ [...]
8191a9
##END NTUPLES=NMR FID
##END=
