##TITLE=1H_UK-23
 CD2Cl2
 8 sc, 
 8.12.2021
##JCAMPDX= 6.0         $$ Bruker NMR JCAMP-DX V2.0
##DATA TYPE= NMR FID
##DATA CLASS= NTUPLES
##ORIGIN= UXNMR, Bruker Analytische Messtechnik GmbH
##OWNER= root
$$ XWIN-NMR		Version 3.5
$$ Wed Dec  8 11:08:49 2021 Russian Standard Time (UT+4h)  she@DPX200
##.OBSERVE FREQUENCY= 200.131346
##.OBSERVE NUCLEUS= ^1H
##.DELAY= (6, 6)
##.ACQUISITION MODE= SIMULTANEOUS
##.ACQUISITION SCHEME= undefined
##.AVERAGES= 8
##.DIGITISER RES= 18
##SPECTROMETER/DATA SYSTEM= spect
##.PULSE SEQUENCE= zg30
##.SOLVENT NAME= CD2Cl2
##.SHIFT REFERENCE= (INTERNAL, CD2Cl2, 0, 15.7039)
##AUDIT TRAIL= $$ (NUMBER, WHEN, WHO, WHERE, WHAT)
$$ ##TITLE= Audit trail, XWIN-NMR		Version 3.5
$$ ##JCAMPDX= 5.01
$$ ##ORIGIN= Bruker BioSpin GmbH
$$ ##OWNER= she
$$ F:/spectra/data/she/nmr/H-F/1/audita.txt
$$ ##AUDIT TRAIL=  $$ (NUMBER, WHEN, WHO, WHERE, WHAT)
(   1,<2021-12-08 11:07:38.95 +0400>,<she>,<DPX200>,
      <created by zg, POWCHK disabled, PULCHK disabled
       configuration hash MD5:
       00 E9 B6 7A A2 85 ED C7 34 08 36 98 17 FE 4E 26
       data hash MD5: 16K
       D7 4E DE 69 DA 85 C6 AC 38 CE 12 59 79 FD A8 64>)
$$ ##END=
$$ 
$$ hash MD5
$$ D8 50 20 3D D2 98 3E CB BF 0B B7 98 D4 DB 6D 17
##$RELAX= 
##$RELAX= 
##$RELAX= 
##$RELAX= 
##$RELAX= 
##$RELAX= 
$$ Bruker specific parameters
$$ --------------------------
##$DU= <F:/spectra>
##$EXPNO= 1
##$NAME= <H-F>
##$PROCNO= 1
##$TYPE= <nmr>
##$USER= <she>
##$AMP= (0..31)
100 100 100 100 100 100 100 100 100 100 100 100 100 100 100 100 100 100 
100 100 100 100 100 100 100 100 100 100 100 100 100 100 
##$AQSEQ= 0
##$AQ_mod= 1
##$AUNM= <au_zg>
##$AUTOPOS= <>
##$BF1= 200.13
##$BF2= 200.13
##$BF3= 200.13
##$BF4= 200.13
##$BF5= 200.13
##$BF6= 200.13
##$BF7= 200.13
##$BF8= 200.13
##$BYTORDA= 1
##$CFDGTYP= 0
##$CFRGTYP= 5
##$CHEMSTR= <none>
##$CNST= (0..31)
1 1 145 1 1 1 1 1 1 1 1 1 1 1 1 1 1 1 1 1 1 1 1 1 1 1 1 1 1 1 1 1 
##$CPDPRG= <>
##$CPDPRG1= <>
##$CPDPRG2= <>
##$CPDPRG3= <>
##$CPDPRG4= <mlev>
##$CPDPRG5= <mlev>
##$CPDPRG6= <mlev>
##$CPDPRG7= <mlev>
##$CPDPRG8= <mlev>
##$CPDPRGB= <>
##$CPDPRGT= <>
##$D= (0..31)
0 1.2 0 0 0 0 0 0 0 0.06 0 0.03 0 0 0 0 0.0002 0 0 0 0 0 0 0 0 0 0 0 0 
0 0 0 
##$DATE= 1638947258
##$DBL= (0..7)
120 120 120 120 120 120 120 120 
##$DBP= (0..7)
150 150 150 150 150 150 150 150 
##$DBP07= 0
##$DBPNAM0= <>
##$DBPNAM1= <>
##$DBPNAM2= <>
##$DBPNAM3= <>
##$DBPNAM4= <>
##$DBPNAM5= <>
##$DBPNAM6= <>
##$DBPNAM7= <>
##$DBPOAL= (0..7)
0.5 0.5 0.5 0.5 0.5 0.5 0.5 0.5 
##$DBPOFFS= (0..7)
0 0 0 0 0 0 0 0 
##$DE= 6
##$DECBNUC= <off>
##$DECIM= 32
##$DECNUC= <off>
##$DECSTAT= 4
##$DIGMOD= 1
##$DIGTYP= 9
##$DL= (0..7)
0 120 120 120 120 120 120 120 
##$DP= (0..7)
150 150 150 150 150 150 150 150 
##$DP07= 0
##$DPNAME0= <>
##$DPNAME1= <>
##$DPNAME2= <>
##$DPNAME3= <>
##$DPNAME4= <>
##$DPNAME5= <>
##$DPNAME6= <>
##$DPNAME7= <>
##$DPOAL= (0..7)
0.5 0.5 0.5 0.5 0.5 0.5 0.5 0.5 
##$DPOFFS= (0..7)
0 0 0 0 0 0 0 0 
##$DQDMODE= 0
##$DR= 18
##$DS= 0
##$DSLIST= <SSSSSSSSSSSSSSS>
$$ [...]
##$SUBNAM2= <"">
##$SUBNAM3= <"">
##$SUBNAM4= <"">
##$SUBNAM5= <"">
##$SUBNAM6= <"">
##$SUBNAM7= <"">
##$SUBNAM8= <"">
##$SUBNAM9= <"">
##$SW= 18.0517287032376
##$SWIBOX= (0..15)
0 0 2 0 0 0 0 0 0 0 0 0 0 0 0 0 
##$SW_h= 3612.71676300578
##$TD= 16384
##$TD0= 1
##$TE= 0
##$TE2= 300
##$TE3= 300
##$TEG= 300
##$TL= (0..7)
0 120 120 120 120 120 120 120 
##$TP= (0..7)
150 150 150 150 150 150 150 150 
##$TP07= 0
##$TPNAME0= <>
##$TPNAME1= <>
##$TPNAME2= <>
##$TPNAME3= <>
##$TPNAME4= <>
##$TPNAME5= <>
##$TPNAME6= <>
##$TPNAME7= <>
##$TPOAL= (0..7)
0.5 0.5 0.5 0.5 0.5 0.5 0.5 0.5 
##$TPOFFS= (0..7)
0 0 0 0 0 0 0 0 
##$TUNHIN= 0
##$TUNHOUT= 0
##$TUNXOUT= 0
##$USERA1= <user>
##$USERA2= <user>
##$USERA3= <user>
##$USERA4= <user>
##$USERA5= <user>
##$V9= 5
##$VALIST= <valist>
##$VCLIST= <CCCCCCCCCCCCCCC>
##$VD= 0
##$VDLIST= <DDDDDDDDDDDDDDD>
##$VPLIST= <PPPPPPPPPPPPPPP>
##$VTLIST= <TTTTTTTTTTTTTTT>
##$WBST= 1024
##$WBSW= 4
##$XGAIN= (0..3)
0 0 0 0 
##$XL= 0
##$YL= 0
##$YMAX_a= 117057
##$YMIN_a= -95196
##$ZGOPTNS= <>
##$ZL1= 120
##$ZL2= 120
##$ZL3= 120
##$ZL4= 120
##$ABSF1= 10
##$ABSF2= 0
##$ABSG= 5
##$ABSL= 3
##$ALPHA= 0
##$AQORDER= 0
##$ASSFAC= 0
##$ASSFACI= 0
##$ASSFACX= 0
##$ASSWID= 0
##$AUNMP= <proc_1d>
##$AZFE= 0.1
##$AZFW= 0.1
##$BCFW= 1
##$BC_mod= 2
##$BYTORDP= 1
##$COROFFS= 0
##$CY= 11.3945322036743
##$DATMOD= 1
##$DC= 2
##$DFILT= <>
##$DTYPP= 0
##$F1P= 2.36226072786647
##$F2P= -0.459571619588291
##$FCOR= 0.5
##$FTSIZE= 0
##$FT_mod= 4
##$GAMMA= 1
##$GB= 0.15
##$INTBC= 1
##$INTSCL= 1
##$ISEN= 128
##$LB= 0.24
##$LEV0= 0
##$LPBIN= 0
##$MAXI= 10000
##$MC2= 0
##$MEAN= 0
##$ME_mod= 0
##$MI= 1.114404
##$NCOEF= 0
##$NC_proc= 0
##$NLEV= 6
##$NOISF1= 3.799351
##$NOISF2= 2.8
##$NSP= 1
##$NTH_PI= 0
##$NZP= 0
##$OFFSET= 15.70392
##$PC= 1
##$PHC0= -15520.69
##$PHC1= 19.2008
##$PH_mod= 1
##$PKNL= yes
##$PPARMOD= 0
##$PSCAL= 0
##$PSIGN= 0
##$REVERSE= no
##$SF= 200.130013532006
##$SI= 16384
##$SIGF1= 3
##$SIGF2= 2
##$SINO= 400
##$SIOLD= 16384
##$SREGLST= <1H.CDCl3>
##$SSB= 0
##$STSI= 0
##$STSR= 0
##$SW_p= 3612.71676300578
##$SYMM= 0
##$S_DEV= 0
##$TDeff= 0
##$TDoff= 0
##$TI= <>
##$TILT= no
##$TM1= 0
##$TM2= 0
##$TOPLEV= 0
##$USERP1= <user>
##$USERP2= <user>
##$USERP3= <user>
##$USERP4= <user>
##$USERP5= <user>
##$WDW= 1
##$XDIM= 8192
##$YMAX_p= 0
##$YMIN_p= 0
$$ End of Bruker specific parameters
$$ ---------------------------------
##NTUPLES= NMR FID
##VAR_NAME=  TIME,          FID/REAL,        FID/IMAG
##SYMBOL=    X,             R,               I
##VAR_TYPE=  INDEPENDENT,   DEPENDENT,       DEPENDENT
##VAR_FORM=  AFFN,          ASDF,            ASDF
##VAR_DIM=   8192,          8192,            8192
##UNITS=     SECONDS,       ARBITRARY UNITS, ARBITRARY UNITS
##FACTOR=    0.0002768,     1,               1
##FIRST=     0,             0,               0
##LAST=      2.2672688,     0,               0
##MIN=       0,             -95196,          0
##MAX=       2.2672688,     117057,          0
$$ Real data points
##PAGE= N=1
##DATA TABLE= (X++(R..R)), XYDATA
0@%%%%%%%%%%%%%%qJ6j6J6j6K4l2L2m0M8n6P2q1Q9j04J21j41J64j85K09k38K68
36A42l02L40l80M23m70N23n83O47p14P87q71R63j061J169j289J419j562J722j903
55a000K104k330K591k889L238l651M151m773N564o614Q083j0298J4068k2193P4090
70F0141n8695k6906J42517j05233o3726J12924j1829j11217P9889M1504r3461
81c4092J5085P7409o9527l3272P2267j8707o7552M9744K8270o1266R392O2128
93B9879l5075l1015N5343O509n5553K5082L9357m6564j5315N4001j5331m1487
105c0169M2932K0706n1482J3374M2751m1701k2083M9748j4721m6226L9218K1672
117B4019m9192J2885M5533l5282j9359M7791j0048m1642L0888J7028m4111P211
$$ y = [0, 0, 0, 0, 0, 0, 0, 0, 0, 0, 0, 0, 0, 0, 0, -8, 8, -8, 8, -8, 16, -16, 16, -24, 24, -32, 40, -41, 48, -56, 65, -76, 88, -97, 112, -126, 142, -160, 180, -200, 223, -247, 276, -307, 340, -374, 413, -458, 505, -556, 613, -676, 743, -819, 903, -1000, 1104, -1226, 1365, -1524, 1714, -1937, 2214, -2559, 3005, -3609, 4474, -5824, 8244, -13949, 60141, 1446, -25460, 117057, 11824, -51902, 61022, 49193, -62024, 17865, 59369, -34092, -19007, 58402, -11125, -44397, 27870, 9163, -58389, -8645, 19625, -41641, -32249, 29879, -5196, -36211, 19132, 25641, -29912, -4830, 34527, -12037, -27352, 26649, 11318, -30169, 12763, 33469, -18013, -4639, 38112, -3589, -25672, 24076, 9355, -36871, 2347, 24019, -25173, -12288, 33245, -2037, -21396, 26395, 16347, -25295, 5593, 22621, -21490, -14279]
129a4279L7076k6699j6057L9476l408l2720K3055J6018l7173n62K9426k2768k0893
142b9508L1664K690l0824J9487K5889k7494l681L3199j4291k5884K6486O291l2663
155a8639J1358K6675k4447o720L4233p294k5047K4342R878l2838N284K2861k5664
168f018j4656K8239n410k5406K2641J5746k7616L854K6695j9573j7103K6112j889
181E616k8241J6374J7811k4861N01K9422j3161j6379K6892K888k8306J2265J6607
194A7428k5737m930K6185j1184j7880K3639O025k4211J0255J8809k1979p515K2342
207A1247r064j9297J8050P805k0541P054J9384j5053p679K0371m889j9373J2996
220A011P893k0628K178J8575j1840r403K0230P82j7749J1176J1005j9610k709
$$ y = [-14279, 22797, -3902, -19959, 19517, 16109, -16611, 6444, 22462, -14711, -15273, 14153, -8615, -29508, 2156, 4846, -25978, -6491, 19398, -8096, -11777, 21422, 7131, -18753, 7733, 14024, -18639, -7281, 19394, -5053, -11773, 22460, 15166, -9881, 14461, 24339, -8499, -3215, 19646, -6018, -20674, 7565, 2155, -23251, -610, 15136, -12480, -8626, 18069, -1504, -18607, 7505, 5616, -22625, -6251, 11560, -13301, -12800, 16622, 3461, -12918, 13974, 16862, -11444, 821, 17428, -8309, -13239, 12946, 1762, -16118, 7521, 13546, -10665, -410, 18399, -3580, -11095, 11247, 2183, -17114, 936, 8741, -11800, -4746, 14638, -415, -8094, 12277, 7388, -11985, 1011, 8904, -11724, -9546, 9029, -2811, -12214, 8016, 8798, -8951, 2225, 13230, -6380, -9089]
233i089J8038j1367j3796J9035L663j7953J1342J5643j7213k671J9087j0104j5478
246a0863J5725K023k0315Q138J4561j4998k309J9925n850j3423J4988L205j8669
259g862M027J2226j5381n528J7160m477j2064J4889P047j4578L775J3252j2674
272a88p988J3608l168j4516R931Q385j3612K354J5612p903q387J4499j90j5577
286g140O788Q685j5196j459J4870p502r178J5388K688j4555P480J0360j4841l250
300f862J3810p266j1403J3130L021j3612O979J2030j1840k839J4321n952j1859
313h342J0857L019j4174M687J1300r835l594J4025k691j0604R702M644j4136J371
327c771J0384j0054o356J2814o88j0620R145P501j1543M64J1404q547q176J0774
$$ y = [-9089, 8949, -2418, -16214, 2821, 6484, -11469, -127, 15516, -1697, -4368, 14719, 4615, -10863, 4862, 6885, -13430, -5292, 9269, -5729, -8038, 11887, 6037, -7386, 7602, 10807, -7862, -3835, 8391, -6990, -12518, 4642, 165, -11899, 2990, 10037, -4541, -766, 12486, -188, -8176, 5432, 2264, -12252, -2321, 6064, -7548, -5194, 10418, 2515, -5872, 8627, 8437, -7140, -352, 8333, -6863, -8322, 6548, -954, -10132, 5256, 7944, -6611, 869, 11229, -3612, -6862, 6948, -318, -11721, 1409, 4430, -9182, -2203, 9827, -2013, -4852, 9469, 3517, -8342, 2515, 5534, -8640, -3953, 7347, -2488, -6082, 7943, 5252, -5352, 4350, 8994, -5142, -3771, 6613, -3441, -9797, 3017, 2329, -8291, 854, 8355, -3188, -2724, 8680, 133, -8043, 2731]
341B731r00j2220P250Q799j0388L59J3274n399q032J1332J000j3360M415P342
355F203j1228k850J2595l837q247J1573L889j1533L753Q685j0524m564J0160m178
369a03r928Q901M733r871L541J0906p039m847J0710k336j0801O185M729j1271
383f491O87J0086o117m609J1152L83r188O227N029j0048j187Q997o300o496R184
398A309J672q686N940P669q406j343R464m998p729P865J042r785L245P871p637
413b507j737J0086l161p255P212K296j0171J859O942p357l782R414q98p180P180
428I41M846q491J472P529o665m952Q022p32q484N833N712p747R62R249m516n812
444b833Q010k08r893L937N222q676j112R182l405n812Q768J895q652L901O121
$$ y = [2731, 1831, -10389, -3139, 5660, -4728, -4369, 8905, 3506, -4526, 6806, 7806, -5554, -1139, 6203, -5025, -7875, 4720, 883, -7364, 4209, 8098, -3435, 318, 9003, -1521, -6085, 4075, -103, -10031, -1130, 3603, -6268, -2727, 8179, 1140, -3707, 7003, 4667, -6134, 51, 4780, -6491, -5804, 4282, -1835, -6444, 4708, 5091, -4097, 2130, 7159, -2889, -4076, 4921, -1379, -7875, 1309, 2981, -5705, 235, 7904, -502, -1845, 7619, 2621, -5108, 2757, 3799, -5986, -2741, 5130, -2507, -4244, 5842, 2681, -4574, 2638, 4934, -5237, -3378, 3564, -3793, -7575, 1839, 941, -6239, 941, 5787, -2704, -1232, 6297, -368, -5320, 2702, 1970, -6514, -681, 5031, -2716, -1754, 7495, 2979, -2833, 5177, 4969, -4924, -987, 4235, -4441, -5553, 3629, 224, -5588, 3180, 5075, -3577, 324, 6445]
459F445q647k871Q181m056o757Q013K677p876L594P583o694k281P884k893p274
474d972N152K485q365J559P575m461l015Q350K42p348M888M134p700j397P190
489D317m713n496P380J563p256M578O306p077j235P554m010o988O320Q26q626
504f557L780O425o786q17Q344k984n848P183R21q472K687N366o645j927Q058k112
520F16m659O695K597o933J981N306n901l167O470j653o149N009L386n599Q16O542
536E357l458m587O330o26p171K392M546o503q24P549k813m484O908J708p622L152
552a46N055p200k167P216l635n581O967K500o989L963O277o251k110P512l773
567A638o295N722J836p389K550O198n093k064P374j320n740M802K061p107K24
$$ y = [6445, -2202, -5073, 3108, -948, -7705, 308, 2985, -4891, -1297, 6286, -408, -2689, 5195, 2302, -4972, 180, 2665, -5700, -4141, 3434, -1027, -4042, 4308, 4550, -2798, 2090, 6224, -1476, -2873, 4317, -396, -5892, 1488, 3051, -4205, 373, 6679, -398, -1633, 5921, 1911, -5077, 1243, 2069, -6557, -2777, 3648, -3138, -3955, 4389, 1405, -4443, 2740, 3661, -4811, -2124, 3242, -3403, -5330, 2728, 616, -4043, 2652, 5249, -1684, 297, 5603, -298, -3465, 3005, 1352, -4797, 212, 3598, -2001, -1185, 5357, 1899, -2688, 3642, 3016, -4155, -1763, 2783, -3720, -4544, 3005, 192, -4292, 2616, 4324, -3298, -146, 4909, -2291, -4458, 2758, -877, -6458, 509, 3009, -3980, -17, 6260, 9, -2101, 5411, 1638, -4657, 1065, 2901, -4488, -1938, 4260, -833, -2897, 4477, 3157, -2583, 2219, 4280, -2827, -2603]
582b603N592m956l265O773J12n302M401L746n985lN689l881m587N442K49o519
598e097L486M683n302m40P155k963m842O053Q69p515K280N213o231j497O871j902
614H21m973O278K365o866K424N109n909k961O623k111n415N487K595o126J628
629a031O065n029k885O540k044n785L990K479o418Q30O120l853k394O349n4n823
645b943L544L117o190o12N839l184l751N768R68n319L089M719n215j612N959k954
661A223n069M450J542o209K126N359m271k047O599j419n629M764K095o744R91
676b239N190m779k504O612r14n155N005L306o394Q55N329m886l336N882j083n696
692d807M573L382n468O77N854l701l117N324n57n360K449L057m910l66N530k108
$$ y = [-2603, 2989, -1967, -5232, 1541, 1653, -3649, 752, 4498, -1487, -1490, 4199, 318, -4269, 1173, 1422, -5097, -1611, 3072, -2230, -2670, 4485, 1522, -3320, 2733, 3602, -3913, -1633, 3580, -2651, -4148, 2723, 821, -4152, 2126, 4491, -2375, 49, 5158, -751, -3712, 2911, 800, -4615, 872, 3467, -2659, -1031, 5034, 5, -2880, 3660, 1616, -4169, -179, 2300, -4118, -3288, 2832, -1021, -3415, 2934, 2880, -2943, 601, 3718, -2472, -3084, 2755, -429, -4180, 1588, 2556, -2763, 326, 5045, -170, -1782, 4177, 1223, -3846, 604, 2146, -4063, -1937, 3422, -849, -2896, 3703, 2284, -3345, 1419, 3514, -3230, -2239, 2951, -1828, -4332, 2280, 1366, -3789, 1216, 4522, -1872, -1017, 4312, -574, -3910, 1972, 889, -4807, -234, 3148, -2320, -1643, 4211, 510, -2607, 2717, 2160, -3200, -751, 2306, -2604, -2970, 2560, 452]
708D52l109M713R94n030K081L794m919k053N035j672m184M015K480m903J270N136
724D100m083k678N282q32n726L889K709n948R90N549l926k606O224n82n098L539
740H03K631n566R3M884l604k671N381j05m770L445K898m482l22M168k174l705
756c096M092L80m520J901L829l695q09N160j708m029L634J456n311J260L749l419
772a126j821M828n23l844L592K100m582M45L892l264k556M259n60m137L211K900
788B814m612P09M462k741k501L798m09m444K439K268m021K39M008k131k077L986
804A787L08l815K020K257l822p69L804j934k716L899N93l420J698L118k997j151
820a140L403j550l148K696P96l394J120L363k492j382L434m91l138K521J229l467
$$ y = [452, -2657, 2056, 3050, -1980, 101, 3895, -1024, -3077, 1958, 286, -3898, 117, 2597, -2306, -1036, 4100, 17, -2661, 2621, 1789, -3937, -48, 2661, -3287, -2297, 3252, -674, -3280, 2944, 2362, -2736, 803, 3434, -2132, -2039, 2845, -759, -3430, 1951, 1846, -2924, 521, 3419, -1063, -1385, 2783, 609, -3096, 996, 1376, -3144, -1243, 2586, -1109, -1918, 3242, 1534, -2495, 1139, 2595, -2716, -1456, 2293, -1126, -2947, 1881, 1358, -2486, 1106, 3206, -1376, -931, 2961, -303, -2859, 1400, 840, -3297, -86, 2814, -1798, -1089, 3373, 632, -1869, 1929, 1520, -2924, -485, 1783, -2238, -1999, 2009, -122, -2199, 1787, 2095, -1720, 300, 2557, -1265, -2034, 1770, -164, -2880, 1019, 1612, -1808, -110, 3008, 11, -1140, 2263, 713, -2435, 261, 1057, -2337, -1217, 2146, -346, -1728, 1706, 1215, -1923, 598, 1827, -1640]
836a640J82L022k383j649L693j15k944K223K233l444k33L202k190k260L123kl024
853b206K093K271l118j01L203j553k451L033K34l438J574K114k947k10K788o50
869F36k023K369Q82l292J278J830k239j179K888j027k244K420J171k585P15K644
885B244k300j327K518m79k681J669R67k241L79K468j225j446K873K4k335J164
901B72J385k404j09K116j243j720K589J54k249J555J492j995l20K044j272j836
917a541J844K15k079Q62J824j995j20K226r46j754K161O16k812P32K124j871p32
934a246K331p78j620J727J036j942L08J927k254r10K233o69j816K035P92k176
950a022M43K128j714j029K069k31j985J396J046k140M67J823q35j519K211l38
$$ y = [-1640, -1458, 1564, -819, -2468, 1225, 1110, -1834, 389, 2622, -822, -1055, 2147, -43, -2303, 820, 818, -2206, -113, 2158, -960, -1061, 2142, 589, -1862, 1171, 1405, -2033, -459, 1655, -1292, -1502, 1286, 636, -1387, 982, 1864, -1428, -150, 1680, -559, -1738, 1150, 123, -2121, 299, 1470, -1115, -400, 2244, -56, -1383, 1135, 656, -2025, -356, 611, -1630, -1251, 1217, -8, -1454, 1419, 1443, -892, 272, 1657, -747, -856, 1260, 17, -1703, 886, 1040, -1209, 346, 1838, -157, -477, 1567, 295, -1541, 303, 518, -1561, -699, 1125, -870, -990, 1236, 290, -1464, 697, 1313, -1499, -767, 1357, -514, -1246, 1085, 307, -1313, 414, 1450, -492, -184, 1743, -511, -1421, 812, 143, -1673, 362, 1154, -1022, -579, 1549, -165, -1194, 875, 644, -1341, 55, 1101, -1039, -572, 1251, 416, -1103, 1108, 770]
966G70j591Q30J225j945k30J737j064j354J849M98j850J051J282j773m42J915
982I08q55j609J644P55k083Q17K038j464o58J918n61j754J292P81k062K33J867
999A207j616q87J954j59j496J189Q73j830J48J835j343j116J760l74j356J202
1015iJ107j711J27J655r19j006J617l6j679O34J073j497r0J709n79j450J580N86
1033A112j882M49J386j302p64J870m08j887J601O71j767K73K068j637q28J970
1049I25m59j466J163P59j764L38J669j169r73J489J84j815J035R66j700J61J364
1066G07r67q99J807Q7j631R93J092j861n8J612m89j370J357O43j784N33J440j309
1084i7m88J780o31j322R59N02j487K93J063j037j50J305p5j558J028Q27j531J81
$$ y = [770, -821, 9, 1234, -711, -941, 796, -268, -1622, 227, 725, -1125, -74, 1208, -565, -1007, 908, 53, -1556, 88, 843, -1240, -423, 1615, 151, -507, 1411, 850, -904, 388, 1169, -893, -660, 1207, -409, -1296, 658, 499, -997, 192, 1065, -765, -617, 1218, -125, -1241, 519, 145, -1211, -9, 1098, -613, -486, 1169, 250, -756, 861, 825, -854, -220, 853, -644, -734, 975, 396, -1054, 526, 1112, -770, -321, 1065, -237, -1001, 869, 461, -1426, 175, 846, -921, -648, 1420, -217, -1045, 925, 466, -1000, 163, 922, -842, -504, 1165, -4, -977, 512, 696, -1119, -84, 882, -818, -657, 707, -260, -1159, 648, 735, -896, 97, 1189, -672, -730, 882, 393, -977, 380, 1023, -761, -228, 1212, -97, -585, 1195, 564, -758, 201, 703, -784, -491, 572, -465, -615, 690, 615, -943, 85, 912, -619, -438]
1102d38J518j075j028J536j64j520J107J194j790J40J793r42j162J456K33j805
1118i47R09J047j392l21J455l44j415J562L75j612N21J052q58o16J156k95j204
1135i27J017P34j415K91J256j182m76J358k47q03P16L83j226mJ550j040p20J091
1153C56L21j443P06Q63j294j55J616q07j045J496L40k096J002J030j414k56J649
1170H69r72r92J478K29j467P68J011j264l37J496m16j340J046M93j204M24J336
1187A158j483j33J132n12o78P14L12j220K16J264p67p09J259rj106N59R18j166
1205b51m72J547n10j158J241K95j273N27J011j470j04J287o03j136J241N93j660
1222h95P85R66j150m34J470m67j240J250L72j472N98J162j026l78J318k96j435
$$ y = [-438, 1080, 5, -1023, 513, 349, -1171, -64, 1130, -660, -520, 1273, 331, -831, 625, 858, -947, -38, 1009, -383, -704, 751, 407, -1008, 554, 929, -683, -162, 890, 32, -584, 572, 277, -927, 90, 824, -591, -300, 956, -226, -702, 656, 409, -394, 322, 705, -521, -525, 1025, -15, -735, 356, 677, -766, -60, 803, -491, -646, 970, 163, -882, 614, 954, -1142, -140, 890, -524, -780, 869, -103, -1095, 383, 612, -855, -87, 924, -340, -677, 819, 403, -937, 109, 602, -602, -178, 1158, -325, -458, 674, 162, -516, 198, 510, -710, -494, 770, 3, -706, 553, 544, -562, -3, 915, -251, -723, 824, 314, -844, 397, 692, -581, -54, 957, -513, -617, 670, 67, -1069, 172, 765, -895, -110, 856, -294, -728, 742, 275, -965, 285, 657, -815, -217, 945, -81, -459, 859, 563, -872]
1239h72J043O98j308J96R87q60n01J142m1j267P45P18j080J5J104r46n87J136
1257C22J35j448P70P60j024j32J469o83p15P84M05j011K84J026q60q40J334k32
1275C44j021N83P76j266M30J206j012p69J358l37j219P68Q94j486L97J097r33
1292a90n00J291j22j200J007N10j256n5J127p65n32J157k2j160O87O25j087q3
1310e68J108o52n82P72K85q95N08M86o98l8Q62l84q20R76J13o91K17P44p37n15
1330e09J175j82r16N28N16j067j37J179p56n58R91j71j010R15P62j270K92J115
1348H97j302m37J270k44q87M86P59q89j35R94m45m96J137k13p88N60L37r27k40
1367e63J155m84m62N64K27r55L83R66r72l37Q62j43j074R08Q9p34J89R61p38l09
$$ y = [-872, 171, 869, -439, -243, 744, -116, -617, 525, 484, -783, -38, 680, -400, -385, 719, -227, -814, 322, 457, -991, -221, 539, -485, -617, 852, 169, -546, 238, 643, -368, -84, 942, 82, -758, 576, 344, -677, -94, 682, -584, -154, 1052, 40, -729, 629, 292, -927, -159, 735, -751, -354, 743, -190, -690, 601, 479, -721, 286, 796, -460, -515, 612, -153, -685, 472, 450, -710, -23, 602, -485, -568, 540, -112, -694, 78, 363, -532, -24, 462, -236, -274, 588, 204, -616, 360, 473, -218, -1, 743, 6, -509, 666, 484, -432, 96, 612, -455, -592, 587, -169, -727, 264, 93, -917, -2, 760, -510, -218, 897, -405, -842, 428, 184, -703, -217, 542, -347, -482, 512, 67, -429, 708, 495, -293, 267, 604, -323, -563, 592, 108, -354, 210, 437, -518, -135, 831, -141, -478, 384, 241, -833, 75, 164, -570, -381, 580, -158, -467]
1387d67P74L1q87P18L26r39J40Q06q72k77Q63k4p43N96N79j128K58Q48o03n44
1407e45P32L08j206O76P32p99j2N36q8q11Q16k49n08M00L10o90J07O50l98o28
1427f67Q71J41r73P8Q17o37j33N84mo21O81M34p37N2L82k26k79O07j69o57O24
1448A68J75n44j13Q41n31k23P54j62p65M05L11n62j07P21m15m74Q12L55j003M94
1468A37K65o93K29K53k60n41N84L07o72K67M84o87J35P73l17l92K07J71p75M60
1488f5L88n59k16J040j95m81K56K32o28J18K08n10k69Q88j01l60K39K60o58L33
1508h0M32k27m04L50j9m14M71K36l17j15O71n14k15M42o5n43J86M06n49j20N56
1529A68j33l19M44k6j85Q0K78m23l41O00k14m67O14J50n22jO85l14k22M12k37
$$ y = [-467, 307, 338, -549, 169, 495, -444, -304, 502, -370, -647, 216, 192, -551, 45, 624, -504, -246, 602, -1, -545, 187, 495, -711, -35, 697, -102, -114, 422, 334, -477, 339, 90, -418, -18, 292, -398, -291, 359, -39, -667, 204, 345, -628, -550, 267, -370, -503, 81, 77, -544, 137, 571, -166, -114, 268, 42, -237, 370, 201, -456, 168, 343, -201, -314, 527, -4, -227, 527, 365, -400, 5, 316, -246, -353, 368, -47, -521, 291, 646, -357, 137, 402, -291, -62, 191, -69, -610, -26, 281, -391, -124, 360, -327, -192, 581, 264, -128, 79, 250, -525, -65, 323, -236, -452, 588, 393, -88, 168, 400, -228, -110, 98, -412, -681, 207, 106, -254, -15, 245, -413, -80, 352, 125, -279, 71, 52, -362, 109, 345, 28, -87, 584, 70, -145, 297, 232, -311, -125, 281, -268, -388, 168, 35, -284, 160, 134, -51, 29, 307, -116, -457, 143, -71, -538, 76, 226, -296, -297, 388, 74, -148, 264, 27]
1550B7m20O47j59o18K51M86m03l23O39k2m07N57L7p30L93O03o40k60M99m6o37
1571e26O28J60l42J82J10n9m70L34O5l62L18K56k90k51N11j54k68M95j39l95l3
1592b30N22l25n52N69P7n19O69%l53O4M93l56j06O6j0q6J60P4m12R5N57k40k25
1615f8M69k07n37M37K1k44p6N23n18KK27L3l52J82M68l75k93M12l56K54m1n0k17
1638c06M98K09n41K33m2k14j61L66M3k54k4M69n08J71M73l67j34P1K70l81L9J28
1660C8j78j59O16n58R2L83j21j34J58L83n15l19M42k88j46K94J81l52K61K81o4
1681B95n27K53j84l8J81o3k08j23N44j41p9J27J74m08L52R1l50r4K40rl01L62
1703I4J70l68N29ll49k01K62k05l5K13k04k11Q0N67l84j12L43J47m36L8L33l78
$$ y = [27, -393, 254, 95, -523, -272, 214, -189, -512, 127, 105, -302, 255, 292, -438, -45, 558, -82, -342, 157, 111, -526, 102, 262, -80, 102, 212, 153, -317, 17, 82, -280, 38, 294, 4, -247, 264, 110, -158, 337, 198, -197, -230, 292, -33, -585, -16, 61, -458, 211, 211, -142, -78, 415, 59, -47, 19, 9, -77, 83, 157, -255, -160, 397, 157, -68, 401, 194, -343, 94, 115, -129, -205, 318, -200, -198, 29, 62, -290, -108, 360, -15, -308, 104, -252, 2, -39, -89, -306, 192, 401, -140, 93, 51, -163, -324, 42, 85, -169, -193, 276, -232, -61, 412, 45, -89, -18, 252, -129, -90, 38, -140, -299, 317, -241, -149, 234, 113, -21, 137, 520, 5, -314, 128, -160, -306, -12, 169, -183, 78, 359, 295, -232, 21, -163, -201, -20, -83, -291, -414, 130, -11, -90, 37, 211, -197, 155, 246, -104, -198, 42, 33, -268, 94, 264, -104, 425, 422, 73, -128, 134, -71, -106, 107, -97, -308, -228, 339, -45, -157, 186, 333, -103, -65, 268, -110]
1725a10k41N82k28k02M35j17r7J39P4m05J94L36l25n67M93n0j73J54J65j13j68
1746b24N99k61j7J17J67p61L07K32k24k62N05k32r9K07K21j82j51K28k29l12N56
1767A85k39k07K21L99m78k4M64k21j24L16k78j37N5J17l27Q5O10l78l53O24K2
1788C32l54L00P3k34l26N55m50J9K44l2l21K47K38m93J41J82j36l72M31j6m40
1809d12L45L55j67j87K56j52k76O0P32q18pM49l94K0L50O7k81K28M2j67k40K1
1831a76K37l32L63l3k58L5M20n62kN12l59P0K21l2m15K76N6O7k79L22Mk32N46
1854D49j90m68K39J54k50j42N41k46l90K07L47l96J93J36j64j76K56P0n49M51
1874G2J18m19J12M45k69j52J56R0l48J94K63n09J28J67j63m73N99K4j84l7M79
$$ y = [-110, -351, 231, 3, -199, 236, 119, 22, 161, 235, -170, 24, 360, 35, -532, -39, -89, -262, -108, 57, -56, -224, 375, 114, 97, 214, 381, -380, -73, 159, -65, -327, 178, -54, -153, 54, 275, 93, -58, 170, -59, -371, 185, -54, -261, -40, 359, -119, -143, 321, 100, -24, 292, 14, -123, -68, 49, -278, -193, 417, 39, -314, 310, 332, -22, 278, 351, 117, -209, 346, -104, -85, 159, 127, -194, 53, 291, -202, -61, 121, -15, -387, 44, 28, -412, -67, 288, 121, -66, 190, 38, -238, -178, 554, -264, -271, 178, -216, -196, 154, 221, -60, 168, 210, 43, -197, -176, 61, -271, 92, 59, -199, -164, 256, -306, -308, 204, -155, -85, 136, 104, -311, -35, 21, 88, -191, 131, 135, -97, 449, 259, -209, 30, 184, -66, -208, 333, 87, -303, -96, 251, -145, 48, 184, 20, -156, 100, 170, -379, 72, 190, -229, -117, 328, 59, -93, 63, 153, -195, -1, 262, -247, -119, 48, -115, -588, 11, 35, -149, -186, 293]
1895B93k45k27L82k5n27L82j30j14J30N96n29J02K96l84j40K48rj29R6r9J26l34
1917b41L34j21k44N03k3l90J08Q1J58l28J59J27o26N19K78j44j9q6L0j22K81m7
1939A87l40R5L35l91j01K36j4k0J71r1%m3p1J14m59P64k43o04L91K00n8p3J89
1962A74k22RJ41p1n2l6J83k07K33p6l67K76j1J84l57L29o9k1M5K11j76k72J34
1985a8L26n03K63J93k46n3K41m84j23O44j80l73K04K39l64j7L66o8k4J82p2m16
2007b83M48j32j35k43N02k77j49M05J45k78l43N00k64L5J11j5l67M45N9n87N51
2028A28N6l20J04l5K07m31K64K41m24O1L28N4k37PK7j93K4J64K7j97M5K87n33
2051c46L44J90l29J1L13j26n8R0n6l14M01k10k5K05K34m45K38oK05m48J77j92
$$ y = [293, 48, -179, 203, 178, -349, 33, -97, -211, -81, 515, -14, 88, 384, 0, -140, 108, 99, -30, 66, -33, 93, -241, 93, -28, -272, 231, 208, -182, -74, 7, 165, -163, -4, 123, -503, 16, 294, 150, 131, 45, 75, -47, 234, 187, -153, -58, 277, -114, -215, 21, 7, -13, 158, 67, 67, 24, -47, 67, -392, 372, 129, -475, -84, 116, 58, -15, 174, -48, -39, 102, 31, -21, -57, 126, -81, 152, 76, -291, -15, -26, 158, -199, 130, 61, 40, 85, 296, 120, -152, -18, 308, -195, 68, 261, 15, -38, 203, -281, -404, 240, 60, -313, -109, 130, -234, -251, 115, 47, 23, 205, 133, -283, 165, 33, -102, -345, 157, -120, -269, 136, 281, 3, -340, 160, -104, -69, 42, 27, -340, 105, 164, -423, 128, 184, -136, -32, -67, 140, -291, -27, 214, -210, -149, 179, 233, -4, 3, 30, -163, -139, 25, 52, -145, -100, 187, -346, -2, 188, -141, -130, 183, 57, -1, 89, 33, -281, 120, -90, -115, 90, 324, -121, 117, 111, 316, -132, 45, -147]
2073a47L5n6K04K46m00P1J90k86L74k22M0KJ23l85J53J53j73n9J26K29l84J85
2095A9J19pk40K24j86L9P1L69n71L1L41l61j56O03j48n69K82K26l6j1J08j44k05
2118b02K68J9j61Q4L8m0J53j70o8j03L28o7j33J1L38l6m60K14J69p4J59m9k34
2141a6J3J10k74L4J33J20j79j44K32j92L07K69l84j49K17j5j54J27J25j48J1R1
2163A34J0k23K27J34l90j14M79j57p3j55L0j9L66m05kL3L13m56K14J46j58P3j91
2186a84M34m08K41j42J08o7n8Q7R1o4J88l6m68M95l30J45J45m66K63j26J93Qk62
2209b13L14J02l41J72K0m95K43L22j89j54J83J20q1N4P7k03l7J69r2j6J95k44
2231i4O8J22j18l0J36mr0p7N4J4j20K44q4n4R9l3j34nJ73N1k63J22%p8J3L40k73
$$ y = [-147, -112, -168, 36, 282, -118, -47, 143, -143, 231, 9, 49, 51, 174, -211, -58, 95, -78, -137, -11, 218, -166, 19, 138, 131, -109, 115, -71, -32, 39, 408, -163, -132, 209, -152, -308, 295, 147, -422, -140, 86, 50, 39, 147, 3, -202, 66, 85, -76, 8, 46, 6, 159, -11, -79, -182, 146, 79, -54, -43, 295, 259, -201, 13, 182, 108, 267, 218, -16, -3, 107, -167, -133, 0, 120, -59, -203, 29, -163, 144, 413, 29, -120, 97, 82, -72, 55, 180, 32, 43, 134, 144, -79, 148, 282, -108, -222, 257, 100, 27, -128, -98, -117, 249, -156, -158, -125, 188, -268, -54, 92, -66, 7, -184, 250, -158, 83, -59, 49, -18, -76, 11, 102, 38, 226, 190, -278, 217, -113, 32, 177, -289, -26, -152, 41, 49, -213, 101, 203, -138, 34, 54, -441, -198, 124, -65, -219, -36, 84, 3, 57, 134, -69, -106, 63, -29, -45, 150, -94, -26, 96, -22, -52, 84, 80, -10, -87, -33, -19, -139, 105, 21, -33, 66, 33, -101, -106, 67, 118, -145, -23, -23, -101, -88, 252, -21]
2258b1ORJ58l58J72K46j73k93L28l5j60J94j53j11K06J89k01j73M60k70J63k40
2280e7O8m0Rj18k8j96M54M1l98L64J41l29K74K6o12N46n0o9j77K81Rr0j68J22
2304Ck0p7M9J32l25J19K61j15K05J14k90q1mM0j31J36P3k2k33K1L67n44L29J04
2328A11r8m5R2p3Q1M0o0L1L4jk75J9J88j76J37K01j05j91m0L3j69N0J89p5M8R5
2354D1n0k7J8JM4m9k4j0j30L15o7k43K2R8k34P4K67m7j90J85J16m11N40j97K78
2379C20m58K20k23rL48k68L7O2M01o05JK22j64M0L40j77k54n5L14L4k27J70J49
2402B18k84L19j75j87K07N4o2j11L41k62n8Q4m8j75k00K18K50j12lj60R6QJ45
2425A03l17K41J00k39N4j12J21L8k70K46Q3K02J53n11j54K60nk81L19k0m1p6J72
$$ y = [-21, -15, -6, 152, -206, -34, 212, 39, -254, 74, 39, -121, 73, -80, -191, 15, 204, 3, -170, 290, 20, 183, -57, 11, -29, -20, -138, -166, -362, 92, 133, -265, 99, 240, -89, 185, 211, -401, 145, 95, 26, -151, 130, 139, 49, -119, 3, -17, -94, -45, 87, -238, -119, 142, 27, 232, 346, 56, -25, -29, 11, -120, 16, 89, 67, -166, -145, 222, -322, 7, 111, 13, -32, 60, -13, 68, 108, 48, 79, 113, 112, -163, -144, 44, -132, 5, 206, 101, -90, -130, -97, -266, -216, -27, -102, -54, 41, -9, -36, -18, -17, 27, -22, -46, -56, -186, 129, 62, -181, -159, -61, -295, -221, 46, -1, -191, -6, 110, -301, 239, 42, 320, -138, 82, -141, -150, 198, -70, -33, 29, 430, -175, -174, 48, -116, -76, 264, 87, -167, -222, 92, 126, -101, 69, 218, -66, 253, 78, -109, 98, 152, 90, -21, 320, 58, 0, 84, 36, -139, -339, -121, 129, 17, 14, -146, -50, -42, 103, -214, 27, 127, -112, -58, -170, -49, -11, -281, -35, 48, 250, 403, -108, -262, -2, -7, -288, 31, 11, -30, -106, 66]
2448F6n4L1p0K21k64K28j04j1r4K59k17R7N1%n5R8J35j94j51M3r0L0M3K18k77
2473f1K4q9j1J8L70l01p8N3K03p9m02M78p7k6J1k7j57n0J12J87k69K2J24P4P3
2498A22j19l5j00L17j93n4J89l16J74K4M9k75J52j64K84p7j56m0J04J05J58J07
2520B56k11K80l70M6O1P2k26P2J80k47K18j58M2j22p3L8k29K28K26Nj13k0P3l37
2544c09M35R8o9j43M6j32q0M16l26M8J55N9k02l8k3K33j13J06m09J58K3O9j47
2567a45j43K54n0L97j70k00J4K78j36K36k36p4K9k08O0J60L8j13l9K92o18M16
2589D2J9k37J53o7K9J25l13M39j98J84n3j39pO0K1j74P1K31k64J01Nk07J06P3
2613@k1L8N2N2m44L15r2J68j0j64R6N5J84k5j96j55J9r4J76J32j91J43J29J82
$$ y = [66, 12, 43, -27, 194, -70, 158, 54, 43, -51, 208, -9, 88, 139, 139, 84, 182, 317, 123, -28, 15, -75, -45, -2, 216, -61, -37, -126, -137, -119, 251, -50, -128, -75, 128, 49, -353, 125, 48, 22, 33, 6, -151, -201, -89, 98, -171, -149, -25, 49, 122, 3, -32, -132, 185, -8, -62, 127, -189, -15, 9, 58, -217, -65, -229, 55, -22, -178, -218, -114, -9, 149, 256, 45, 325, -45, 1, 62, 134, -92, -20, 160, -87, 131, -27, 15, -107, -180, -142, -371, -143, 83, 88, -25, -45, 28, -309, 126, 224, 155, 12, 58, -74, -154, 262, -64, -16, 139, 198, -4, -42, -65, 168, 55, 161, -248, -90, -67, 2, -145, -288, -34, -84, 313, 143, -57, -43, 235, 99, 335, 99, 25, 54, -154, -94, 66, 104, -9, -48, 244, -374, 42, 61, -176, -23, -90, -61, 64, -249, 190, -8, 176, 123, -16, -23, 37, 58, -116, -45, 186, -78, 23, 28, -179, -73, 0, -21, 17, 69, 121, -323, -8, -100, 68, 58, -106, -10, 45, 229, 204, 8, -147, -128, -222, -46, 86, -105, 38, 167, 349]
2637C49l53L5j11J35L5Q9m31K27j41J21J28l8j8j20L28k91o4J22J35j47j23K66
2659A33k19K5J79m76K63l6K14l6j44J93j9o6l53M04L3j58J09k5P4N6J1M6l09J78
2683G7p4k08L02k7l3o3M3k54J82m0J57k03Q8M9k79K64r0j06K27lO9J07j89l7K89
2708B48j58k1j02m8j31j07L71j01J24K28k01r6j2r5J35k32J25K29r6j62O4J35
2730I7j44l3R5m8K18j90J09M6k13Q4j23L3J50J25n4k18J51J53k34j18M0o0N8K18
2754A42l42L66l09J85m5j94M30k99M4j03K34j93K5P0rJ04j1K12j94j7j46j3p6
2777a39K5o5KK13o5P1R1l60O1M11l48r9O8M6K59j68J98k02m9Q5J12k91K19m6Q7
2802A16j7j10K1j67m0j44J4J14L54m18M58J46k13k03o7L44k83J24q8J11L8J63
$$ y = [349, -4, 31, -80, 55, 90, 179, -252, -25, -166, -45, 83, 45, 27, -93, 235, -56, -120, 2, 137, -10, -133, 133, -86, -61, 118, -358, -95, -131, 83, 47, -97, 96, 77, 11, -342, 62, 95, -63, 46, 21, 95, 151, 162, 208, -101, 77, 3, -205, 97, 70, 37, -26, 17, -237, -55, -95, 62, -141, -53, -4, -283, -19, -109, -215, 12, 9, 78, 185, -4, -41, 248, 90, 69, -33, -81, -212, -319, 52, -49, 75, 303, 102, 6, -6, -101, 34, -198, -73, 156, 60, -102, -38, 97, -47, -80, 15, -33, 185, -5, 104, 150, -63, 21, -102, -69, 81, 206, 152, -66, 85, 238, 4, -114, -74, -134, -76, 142, -200, 166, -143, 42, -3, -197, 233, -66, -22, -125, 109, -84, -59, 11, 2, 106, 95, 307, 113, 96, -50, -63, -139, -114, -179, -177, 36, -29, 42, 133, -227, -166, 245, -103, -202, -134, -88, 171, 3, 201, -1, -50, 35, 147, -144, 75, 29, 116, 99, -11, 10, -157, -197, -341, -327, -213, 141, -277, 181, 327, 114, -89, -156, 188, -95, 29, -59, 52, 90, 253]
2824B53l42K1O3m1R7j59O0l9J49l6k88J48L8L7m2L19J85n09n2j8K87j07j87j9
2848a82M26l79J69j24o7M27j97k12K98l15N8J20k8p6R3Q1K03k78J83r7j30Q4p3
2871a6m8k02K18J39j97k02M80k10l0J39J94k58n2J08k98J74j06L30l03K06Q5j20
2893C1J71k01j09K1n3R3m0J85j07j70K45M4j24q8K06k54P6J04L8l08K30J0l6k48
2917b84K92J3J42l19Q4Q1P7l80J66J9P1j24K01q2K0j37L68m5j69l6J45j54p1J24
2941BJ02o3N2O5k64J02k2J31k72O5M7N7L6J1k07K6K08k34K85k71K74o7j95J63
2965C1j88J80l0j11J70k0j3L8J71o0j80K8M8n5j7J40K2k34P4J8r0r5M79k28k34
2990a56L91k65j64J40J25j83L50N2l42m6J18J7j9j65J31j09L0j22J92j40K54J3
$$ y = [253, -89, -68, -5, -46, 51, -108, -48, -87, 62, 26, -262, -114, -76, -39, -81, 238, 423, -86, -138, -156, 131, 24, -163, -182, 244, -135, 34, -90, -157, 270, 73, -139, 159, -156, -98, 22, -6, -82, 11, 92, 295, 17, 200, 103, -27, 57, -16, -64, -266, -48, 91, -106, -308, 172, -38, -68, 71, 265, 7, -45, 63, -235, -61, -167, 163, -140, 66, 151, 31, 202, 1, -108, -87, -140, -47, -87, 98, -9, -179, 66, 110, -14, -102, 104, -150, -74, 30, 68, -240, -10, 0, -36, -284, 8, 21, 163, -156, -72, 9, 86, -294, -128, -109, -38, -162, 39, -43, -23, -160, 208, 163, -6, -42, 103, -51, -122, 2, 104, 41, 93, 158, -106, -4, -26, 105, -167, -102, -55, 2, 38, 49, -158, -132, 76, -158, 127, -144, 130, 63, -132, 31, -157, 23, -7, -118, 52, 32, 19, 57, 228, 168, -12, 16, 64, 9, -8, 132, 154, -80, -6, 12, -78, -173, 306, 78, -156, 235, -30, -194, -54, 71, -112, 238, 290, -52, -98, 20, 37, 18, -147, -16, -125, -95, -217, -25, -165, 89, 102]
3012A02m7j12J59r4k69L16k82N0K48j19J56m0r1j15J59QK68N6l53j0j39rK75j91
3036g4R7j50J88J01j06j08P2j47j24K96j68M1R7l2l8K96L6k27j63J20J02j65L6
3059b0j97n4L31R4j02j32J92k26K60r1j66O3n6J39l47R1M02j61O3N7l5j04m8N8
3083A1k67P6O5Q9j64L78m51L42k85K69N7r7Pj59J58l1J46l51O3J91j12P2o3K69
3107B13k04p8O4r8o6N7R9N7j6N0j56K89p7k02J97L3j60j07J04k72J30L01j69J43
3131A32j16J54o4j19L8L5K6j10Q8j11N0K7m2M8Q7R0n8J26k97J01j90J42l6l14
3155c13M01k16J03K2L06m50L14l0k35j9%Q4k01L06o0K2Q4J0j81L15k10j38J5K13
3179A42j30J91l29M6KJ15j06K55n7j71K48l76oJ71j82J2J30J5J83j26J18r1j9
$$ y = [102, 55, -57, 102, 8, -261, 55, -227, -177, 71, -48, 108, 68, -23, -138, 21, 29, 297, 353, 0, -10, -149, -158, 117, -74, 23, -127, 61, 162, 56, -52, 20, -127, -251, 45, -123, -82, 15, -17, -55, 241, 277, 50, -113, 7, 109, -56, -20, -217, -271, 60, 154, 52, -80, 112, -114, 146, 55, -111, -48, -104, 35, -312, -221, 181, 20, 83, 140, 105, 1, -47, 11, -256, -180, -115, -26, -190, 188, -263, 79, -206, 63, 120, 23, 30, -129, 29, -2, 144, -207, -144, 47, -65, 7, -56, 213, 9, -69, -5, -103, -169, -112, -13, 44, 28, 78, -78, 211, 134, -68, 129, 162, 2, -105, -1, -273, -143, 158, -11, 132, 16, 170, 106, -13, 25, 60, 86, -24, 64, -47, 3, 30, -12, 36, 123, 213, 155, 281, -16, 85, -105, 37, 1, -313, 88, -128, -25, -3, 303, -147, 167, 137, -98, -117, -117, -33, -234, 72, 12, 34, 118, 128, -53, 262, 52, -86, -71, 142, 12, 203, -126, -80, -78, 37, -69, 186, 129, -42, 206, -170, -176, -5, -187, -175, -45, -30, 153, 27, 145, 54, 35]
3202C5J91q6j11R4k30J2K64k62J34l41L38J16m55K90K35l06M8p4N3J0J34o6kq7
3226f6K93l08K10k19o9P3P8J2J5n5J26Q0k98J88o6r1JJ28kr6P9J56l31J26K27
3251A91j64Q0P6o4K5j54R8k58K1J83r9l8K01k44K01J04j16P5mj18j5K78j51q5
3275B3O1j63L4M2J28j21J17n4J80m24K84l55J17K22r8r4j33M38k20J56k09K88
3297B19j70oj2j23l3J99nN2k06L64m51J48N3m1j24K37p6ro5Q1j88K42k2J35l29
3322a30J38k09K23j01J33J41l36K25L9j35q7M0j27K70k04LP9O8J07n0J31p5j69
3345b6J61k16K6J92j57p2M3JO5k77N7J4J34J12K5O5l27K8J41l3J15m2j46j4J44
3370A3K81l43m1M04k80K8n0j4Kk72K43J21j09l5N4l9K65l41RK08j54k6q7PO0J64
$$ y = [35, 226, 140, 29, 123, -107, -95, 169, -93, 41, -300, 38, 154, -301, -11, 224, -82, -34, -108, -55, -45, 89, 23, 21, -66, 227, -81, 129, -90, -159, -86, -8, 4, 19, -36, 90, 170, -128, 60, -6, -97, -96, 32, 30, -66, 13, 169, -162, -36, 191, 27, 107, 183, 119, 144, -10, 88, -170, -149, 34, -65, -103, 98, -146, 55, 159, 43, 118, 114, -4, -19, 259, 108, 23, 84, -79, -45, -3, 125, 4, 121, 67, 247, -177, 107, -248, -131, 91, -7, -101, -234, 204, -16, 140, -69, 219, 49, 43, 31, -92, -125, 74, 69, 121, -85, 279, -172, -24, 29, -12, -136, 101, 25, 16, -49, 32, -156, 86, 64, 199, -130, 8, -201, 22, -79, 54, 195, -141, 84, 123, -12, -99, -59, -186, 84, -120, -117, -38, 30, 137, 87, 218, 143, -26, 135, -81, -55, 137, -20, -92, -49, -48, 17, -260, -203, -189, -55, 57, 82, 147, -180, -152, -11, -44, 71, 29, -117, -131, 13, 294, -49, -90, 314, 34, 62, 12, -2, 0, -272, -29, 92, -17, -52, 2, -37, 228, -113, -104, 104, -50, -76, -163, -156, -96, 68]
3396F8J20k01k4Q7J51r6N8j05K07k28r8M4j25P1J82p4j43K01J16k06j94L24k04
3419f9LR4l2j61J21k9j31M32j07q0J31j61k69K81K07j35j14p5L2L7N1j74K25J64
3443B41l15j09K63j05r5KJ17R6M1j72j04L21M1m79J77J02Q2l15J30j39nL09j7
3466F7P0j28ol08K59MK1j15J92j27j66K00R4m9j1k5j44K26J47l84K14k1j12k9
3490a31K09j33K28p0j54R8k36L68j66o1j70J53R2o8M5q7N6K91k34Pr7J88k68Q9
3514e1P3j09J52P9j18J2K31k27r1J95m2k15pR5J32j74L29j34k92K1pJ56j40N2
3538h0nQJ60j8m1l8J85k04j9J02j9M4J16m64J61L5o8P9k66K36P7o8J47j07O2L2
3564D7l7K6L6k05J57j83L26j47p7j39M06j53l7mK6K39l09j02m7L14j51j24K77
$$ y = [68, 188, -13, -37, 50, 201, 105, 163, 58, 265, 37, -61, -17, -142, -71, 111, 37, -106, 95, 211, 5, -189, 135, -69, -66, 28, -4, -165, -44, -73, -204, 228, 121, 41, 172, 11, -258, 23, 230, 95, -19, -94, -62, -25, 26, -148, 77, 241, -74, -183, 80, -25, -120, -118, -1, 95, 136, -36, -140, 181, 222, -257, -80, 22, 104, -211, -81, -220, -225, 84, 67, 137, 9, 3, -305, -46, -42, -21, -136, 56, -71, -237, -37, 57, 8, -3, -28, -172, 54, 201, -183, 31, 10, -102, -131, 78, -55, 173, 103, -51, 47, -189, 179, 13, -48, -218, -65, 27, -41, 4, -83, -27, 264, 30, 37, -60, 128, -140, -51, 22, -87, 65, 144, 26, 38, 269, 42, -49, 146, 104, -111, -118, -23, 109, -65, 264, 130, -162, -141, -148, 8, -132, -80, -85, -77, 83, 65, 24, -14, 171, -33, -52, 50, 31, 75, 191, -273, -112, -77, -145, -66, -332, -96, -19, -87, 60, -47, 15, 47, 10, 36, 72, -133, 24, -159, 167, 20, -57, -196, 210, 57, 20, 16, 42, 281, -28, -130, -177, 137, -14, -138, 139]
3587A39J15k25R0l09L60j49k29J39J78l9nR0j58q8J74p0M9J37j04q3L7K5j10R2
3611E6qp8J10Q7k20k26L26L6Pl11J85j78K39o5J9n2j47K03J76k25k5J47l71J92
3635a23N1R4j39K06j82K97j61j01K01j92k1M9k43J17Q3jJ59k1O0k36J54l14L73
3658A10k96j7J10K00j65m7K53m0m75M65k83J03L2L9p6j90J12L51p6j91K12l46
3680b15J74Q6K85k01K0p1p4p4p8K34l0j31N2K15j18l3K06k26m1J06k86K20r0J68
3704I8k67L9J02M3K49k44k3m8J70r1MR5m37M48l84J25K02n6j8J82l79L06N0j67
3728arJ60l31J74q1K11O0r4n5j59J70r8J07O6j60k9j30oK42q8r5L69j01L3j17
3753C8O7p4%j30j59L57o2o2r2L06k37R7J02j06k09O1j1J94o1J80l31j22L69K47
$$ y = [139, 254, 29, 119, -190, 170, 21, -208, -69, 109, 70, 65, 155, -3, -91, 83, 13, 62, 199, 95, 12, 49, 74, -36, 56, 48, -30, 80, 167, -53, -279, 47, 83, 90, -221, -36, -214, 25, -40, -21, -73, -220, -17, 159, -66, -91, 56, -315, -123, -72, 22, -117, 89, -93, 204, 43, -58, 143, -49, -70, -21, -264, -147, -64, -65, 94, 73, 133, -103, 51, -263, 110, -186, -203, -93, 107, -58, -105, 148, 108, -367, 98, -185, -82, -50, -11, -87, -277, -165, 186, 110, -81, 131, -215, -41, 45, 330, 129, 149, 78, 4, -70, -148, 86, 56, -75, -23, 192, 74, 41, 247, 21, -20, 86, -200, 20, -70, 98, -169, -130, -28, 15, 264, 20, -3, -51, 119, 28, 32, 127, -310, 138, -246, -121, 81, 25, 7, 189, -190, 116, 166, -1, -10, 150, -181, -7, -88, 123, 183, 89, 34, -125, 45, -53, 54, 120, -40, -69, -199, -205, 37, -51, -146, 223, 122, 155, 38, 105, 31, 31, -99, -258, 99, 37, -25, -117, 189, -48, 49, 151, 45, -164, -103, -114, 80, 19, 199, -132, -254, 115, 362]
3777C62m58j3J02J18R2n39N65l76L26k21J28k0LKK3l30lO6JJ02K45k84J7K85J15
3802C08m44K15j12j29N20k68j48J09J2k28N22m15l48M32p3R8j36K08r5j50J69
3823D7R2j1k6j51K26l03K64k01o3J00k3L75l18j05r0o8K77J08k44O4J59l24L98
3846A83k37rj0Q1K13j03j01K4Q4j01P4r0N3q0m1k03K38k03L69L2j52l3r0J26N
3871B9j56Nj1J25n6K39l28jr6P2M16m02M25j48j34j60L37j15j85rj0J93j20k6
3895a16J92L5p3j11P4j65J51J61j27L56k97j73Q9L6n2J02j79J43j75N6nJ12j32
3918i8J77j36K15j62k51L98k72L14q7P9l35K34j95J78O5k14O3O0k51L26j66J41
3940H3j46k0o9L03k85J21r0O5J27q3kj14J92k17K75j78l8j29Q7P7%j39J10R9j98
$$ y = [362, -96, -109, -7, 111, 203, -336, 229, -147, 179, -42, 86, 66, 69, 71, 94, -236, -239, -173, -172, -70, 175, -109, -92, 193, 308, -136, 79, -33, -162, 358, 90, -58, 51, 63, -165, 357, -58, -406, 26, -47, 51, -85, 123, 28, -122, 47, 139, 128, 102, -49, 177, -126, 138, -63, -126, -26, -49, 326, 8, -97, -187, -255, 22, 130, -114, -50, 109, -215, 183, -54, -63, -73, 8, 221, 118, 17, 41, 125, 24, 98, 8, 61, -19, -60, -263, -25, -228, 141, 173, 21, -12, -102, 24, 29, -127, -122, -133, -8, -64, 175, -153, -154, -250, -178, 238, -164, 261, 113, -21, -181, 156, 41, -144, -153, -163, 30, -90, -116, 76, 111, 38, -73, 1, -164, -13, 148, 21, 377, 80, -93, -4, 32, -20, 82, -97, 46, -129, -73, -78, 34, -98, 79, -57, 158, -4, -255, 143, -129, 185, 98, 177, -158, 76, -119, 59, 124, -90, -27, 33, -218, 108, -58, 83, -63, -83, -152, 151, -134, -13, -103, -38, 89, 6, 4, -110, 82, -135, 140, -38, -76, -205, -118, -41, -41, -180, -70, 29, -169]
3965a69J71kj19K07k31j32K23nM8Q9k21J62j0l27L17qJ51k39r1p6L23R7j68M31
3989D21o06R3Q7m4K4j39K5J57J69j15j73J36MK6m3N1Rj10j67K73n2k29L38l8m4
4014E3j9M6m8m8p4j5J39J55j73m8K42l8k55J02J5J01j44J56j65J66J7j45J4j71
4038a37O5L51m45k8J55k31Q1J63l5L61k67j47J3P9J85m44K09K6m2L08k06J1m9
4061b4J88k36K61m09J29o1L00k55K6n2J30j53J38L4M4Q2n50M85j9J60k27J7k90
4084b82L76o4l42K84l9K00k24lK05Q0k93J91l81J66K25k08k9K60j00j80J19J52
4106A13j03J16q3r5P0O6Pr6K85l72J04l9K48q2p4j45J48r7J43L8Lj68j55J69k20
4131b19m1M01p5k69J77K44q8j72J07P2m69K19J22j16J09K9K25l34K12j07M4N8
$$ y = [-169, 2, 0, -119, 88, -143, -275, -52, -57, -9, 80, -141, 21, 11, -316, 1, -7, 144, -95, -186, -262, 61, 158, -10, 421, -185, -92, -5, -49, -25, -164, -139, 18, 187, 72, -101, 35, 39, 65, 22, 73, 82, -28, -195, 78, 26, -203, 135, 97, 53, 34, 80, 32, -16, -90, -105, 34, 189, 16, -32, 210, 172, -83, 19, 34, 135, -9, 147, -18, 148, 165, 20, 34, -137, -72, 279, -166, -194, -39, -270, -189, -26, -61, 300, 33, -114, -101, -22, 163, -281, -72, -46, -88, 220, 14, 25, -24, 164, -72, 189, -220, -91, -152, 148, -107, -81, -133, -3, -156, -18, 16, 60, 142, -408, 77, 58, 218, -9, 8, -282, 94, 30, -312, -28, -67, 133, -91, -94, 111, 191, -102, 89, -292, -126, 99, -109, -138, 122, 22, -158, -39, 113, 10, 126, 43, -52, 18, 84, 91, -5, 280, -92, 12, -27, 221, 139, 65, -80, 68, -29, 114, 152, 155, -13, -168, 1, -219, -260, 141, 66, -203, -26, 218, 130, -42, 65, 137, -332, -113, 9, -107, 2, 31, 256, -78, 134, 27, 71, 129]
4153A29%p7l2J98j06J61m05L02m6j53J64j70M0nq3Ljo3J36R1Oj1j55J21L6o3j51
4180a34J12j39J78j19L8J93O7p1j13o9J53p1M4j52R1pJ13k42R3k63K10%N2J06
4204G0k24L78k71J89m25K37j32J09k5j48J34K16O9k16K0N8R2q4k72J63n0K39p9
4227D8J6n3l9l2M0Q0J6j61K07l6k85M17k52K06j83J28qO3j45j74M6j9J26rq8R6
4253Eo1j76M12k48j83J55Q6j1L31m39J00m4K11l4q8p2o5K14j15R4k41K13nr6J1
4278d6j76J99Q8p2kJ89j08J8r6k03J92M5N7j69Pk7NJ16M9j0K8P7p9j79on3j84
4305c40P9J56k06K95qj44J18p2J83j24M8J20j9j88K78k09Qj2J24K0Ql47J69Q0
4329A7q9N9q7K16J04l21N43n98J50M0K6q4L0Nj67NL27k62K59l75K33N0M5n5q2
$$ y = [129, 129, 52, 20, 218, 112, 273, -132, 170, 124, -29, 135, -35, 5, 0, -83, -80, -81, -144, -8, 83, 89, 78, -77, 44, 80, 17, -134, -22, -161, 17, -102, -64, 129, 196, 125, 12, -57, 96, 25, 69, -83, 8, 1, 114, -128, -35, -298, -88, -88, -36, 70, -154, 224, -47, 142, -283, -46, -178, -69, -94, -242, -108, 108, 177, -39, -19, 39, 131, 47, -225, -62, -112, 127, 48, 64, 11, -28, -60, -20, 60, 76, -85, 122, 86, -199, 218, -34, 172, -11, 117, 109, 172, 27, -147, -101, -120, 6, -3, -91, 5, -56, -232, 180, -68, -251, -96, -10, -21, 310, -129, -29, -73, 138, 104, 16, -56, -121, 93, -22, 72, -169, 44, 39, -57, -46, -222, -23, 65, -7, -9, 180, 72, 90, -6, -209, -17, 28, 85, -84, -77, -104, -99, 17, 66, 56, 84, 161, 82, -97, -103, -156, -340, -261, -105, -311, -16, -24, -168, -50, -122, 61, -63, -15, 105, 86, -102, 176, -33, -25, -37, 87, 107, 115, -232, -63, 17, -72, -13, -100, 116, 220, -101, 442, -156, -6, 34, 60, -24, 6, 11, -156, -151, 176, -86, 173, -202, 31, 81, 126, 71, -11]
4354a1J80k49J68k25RO6k6q9K27j2M1j48J66k89N30m48L9J53m15M23j75J16j47
4377a16j3J38k45L12J15j62J3j05k0J08j38N6P6M3j5l1q2J71j99N8R5q0J45Q8
4401B12j98qP7K8j46J00j67J44K11k44j06K15K6j1k4m1m5N6m49M96K11l07m4J68
4425A54k13n3J94q2Q4j37p6L4K20L0l18K62j82J36j57O4j40r1M43j89J21j2j94
4448a02K32J2J1j30L3q5j11R9P6q0Q9j4j76K7M3K05k63K40k12J31j07J6J40k5
4472D9Rj24Q3Q8k88J90Qo9lK0o0J54k9l7j25Q1lLN8p2O5M9k7LM8k01q0m4PK14
4502c3K4N7L5j40kK30j54o5j98K60j73L59l41K18l5k28K08k58L8J82J23Ml1N5
4526A35o1j20L01m53K39j13m1M5K32k9j34J73k61J17n8oR6kM7Jj14J11l9j23Q9
$$ y = [-11, 169, -80, 88, -137, -128, -62, -88, -177, 50, 38, 79, -69, 97, -192, 338, -110, -71, 82, -333, 90, -85, 31, -116, -129, 9, -236, 76, 191, 29, 42, -63, -83, 25, -113, -57, 19, 62, 47, 16, -66, 105, -94, -36, 59, -21, 124, 212, 14, 6, 83, 111, -35, 65, -102, 42, 253, 9, -97, 118, 144, 133, 109, 68, 23, 79, -370, 126, 337, 30, -14, 154, -59, -112, 82, 0, 84, -53, -129, -95, 125, 155, -163, 99, -83, 53, -104, -40, -180, -271, 172, -17, 104, 92, -102, 130, 142, 153, 23, 56, -29, -140, -41, 35, -45, 44, 30, -146, -119, -76, 129, -134, 106, -106, 25, -82, -66, 74, 49, 58, -66, 17, 105, -183, 7, 15, -54, -57, -37, -97, 57, 28, -9, -134, -53, -56, -53, 5, -67, -2, 47, 20, 23, 71, -130, -210, -254, -247, -33, -9, 48, 83, -57, -59, 171, 17, -48, -246, 14, -159, 200, -141, 77, 42, -186, 22, -236, -198, -16, 107, 111, 80, 135, 74, -46, 255, -198, 41, -72, -113, -68, 164, 135, 1, 174, -87, 30, -28, -34, 62, 60, 107, 108, -6, 105, 66, -57, 32]
4551C2m3q9J24L4j89J87l33N11k34o2k73K05J53j77J60K02o5j3N5j72rO0o5j06
4575a07mJ54J2o6J13qJ4k30L23j02m6k78J65r0J07k72L35N7Q4k11q0N9J40P6j17
4600B8K39k89m93L81K23k45K53o6j69L99j26k27n5L7l14K94M3J07J86m39L00j69
4622a02M0J8J7O9j77J45K73k60L3l24K91k3J06q5K19l96K71k64K25j14j41L38
4644A59Op3M4J44k90k58O9K09NJ03j09L08l39O9j73K72j81R6M2k58lK04p3k14
4668b41J68q5R2R0l3K84k26j26Q7P6j43O3n2J71j96k51L60j61L32k59J7q7L42
4691B22j58k5np9n0J12j33J81j05J3L7r1J58p8l1m8K91l33J98M8k84J4J38M9K8
4716F9k87M12k97J86J19l67L59k94K23N8l17j30l0K33o5J7K05j74J67j84K43j87
$$ y = [32, -11, -100, 24, 58, -131, 56, -277, 234, 0, -62, -335, -130, 23, -154, 6, 208, 143, 130, 185, 13, 4, 64, -1, -107, -111, 43, 55, -11, 102, 94, 108, -122, 201, 99, 53, -225, -60, -150, -43, -315, 20, 77, 161, -50, -130, -71, 69, 145, 28, 267, -22, -515, -134, 89, -156, 97, 31, -138, 261, 135, -92, -147, -110, -424, -130, -87, 20, 206, -233, 67, -102, -62, -44, -27, 42, -135, 10, 283, 23, 56, -268, 23, 0, 106, 21, 240, -156, 115, -149, 76, -38, -179, 159, 165, 92, 136, 280, -10, -268, -199, 10, 15, 118, 9, 317, -22, 47, -126, 146, -35, 61, 103, -155, -158, 46, -27, -241, -73, -158, -66, 24, -9, 275, 49, -77, 10, 86, -57, 6, -46, 125, -71, -322, 38, -123, 209, -50, -33, -120, 222, 64, 39, 34, -45, -95, 17, -116, 65, -40, -27, 10, -81, 77, -1, -32, -80, 211, -122, 76, 124, -160, -146, -8, 41, 69, -218, 194, -103, 83, 202, -165, 194, -100, 123, 181, -136, -266, -296, -63, -128, -111, 94, -80, 87, -97, 146, -41]
4738d1k2P1q4L48k79J31j38n3J03J78k30o2J04N3j68M9M3K89l66O0J19k22K4j1
4762a04J87J13k87K22k38J04K39l64jmJ72j64J30k71J37k9J13J09j39K36j42k32
4784b13K70j84K22l01J75j1lJ11J62k94Q9r2K29k24J13N3k0k35O8K91l86K16k78
4807b42J25J58J3k43J32N9J04o7j40J32R0k82J48J0Q3j19kl7r9K44k96K24J05
4830A00j39P8N5m73M07k01j0J63P6k61J75Q2N0J1J43j85M0J32j90k1qJ75ol42
4854a49J74j16P3J13k85J75l1J64j52L4l77N54j86K8K37m61J35p1J2O4L5L67m43
4877a06j51L70m22M00p3j89M03j91k3p5J44k26R9L7K62j85j15r6L7J1j23K65j26
4900g3p8O7j1J38P9L2k60P6O4rJ2m8m6j6J51k79K30J0j01j76J86k5K58j74Q4l20
$$ y = [-41, -63, 8, -76, 272, -7, 124, -14, -67, 36, 214, -16, -78, 26, 79, -89, -40, 3, 292, -74, -14, 105, -117, -93, -104, 83, 196, -91, 131, -107, -3, 236, -128, -129, -133, 39, -125, 5, -266, -129, -158, -45, 64, -75, 161, 19, -213, 57, -127, 95, -206, -31, -42, -45, 66, 228, -66, 23, -69, 160, -64, 49, 102, 82, -153, -85, 206, -180, 36, -242, -117, 41, 54, -189, -57, 2, 106, 39, -101, 31, 121, -161, -13, -3, 80, -39, -41, -78, -177, 67, -229, -5, 100, -39, 39, 94, -379, 28, -173, -183, -20, 56, -205, -30, 52, 102, 113, 256, 71, 111, 243, 53, 32, 24, 199, 193, -149, 25, -91, -18, 95, -190, -15, -46, 118, -34, 0, -377, 177, -9, 19, 256, -205, -70, -141, -129, -65, -30, 337, -106, -257, 113, -309, 91, 18, -171, 232, 41, 18, -57, 87, -139, -40, -3, 259, 74, -41, -137, -100, -89, -212, 53, -73, -151, -84, -95, 43, 122, 154, -106, -30, 34, 25, 37, -11, -57, -73, 78, -201, 29, 39, -62, -238, -52, -77, 181, 7, 91, -229]
4926b29J78k0j32K67l0r2J6J3j04M06j06k80j04J56mM5N3J41j67j81J19J45o1
4949B9j26K08N1m5k76L63p9qo5j0ok64L08l4r0k7J2J27J8q0k20R9K11j89M04l69
4975e8l0j8R1R6L7j76p8j02J57K09m09L23K9J24j87J5K3j07j02J69J14p8j05J49
4999H6k75O0M25m55M54l62o2J34O2j61K21j68l06N99q8j97R0J63p9k26J24P6k60
5022a45K23j21J39j08Q4r6p3J41R2l7j34K18k30m6j45K35J01m9lJ2j65K00j70
5045g7J92k82L37k42J06J89j92J33p1n5k37L71k20j44l5K34m7j1j7P2q7K83l92
5068a92L80m07J35K09m7l44J23J7K50j92J32R3jO6m60L18j36J13p7l0J34M0p5
5091D9j92N4P8j40L71k45M3j08J48r5j5L11j97m45L06K1k88M85O8k31K17j01N1
$$ y = [-229, -51, -71, -203, 64, 34, -58, -42, -29, -133, 273, 167, -113, -217, -61, -65, -20, 33, 174, 7, -174, -55, 90, 29, -97, 111, 162, 117, -159, 204, 125, 117, 52, 42, 36, -228, 80, 46, -44, -71, -59, 68, 86, 6, -214, -115, 96, -93, 311, -58, -88, -106, -15, 81, 118, -58, -136, -238, -81, 128, -281, 42, 71, 195, 8, 23, 46, -61, -163, 6, 120, 42, -63, 86, -189, -129, 296, -159, 295, -67, -129, 5, 67, -94, 127, -41, -347, 252, 164, -33, 57, 220, 141, -85, 39, 115, -145, 78, -43, 96, -12, 72, -24, -97, 44, 136, 99, -35, 183, -47, -93, -238, -3, 98, 49, 46, 58, -107, 93, -77, 115, -167, 170, -72, 34, 223, 31, 164, 93, 38, -199, 172, -48, -192, -227, 7, -40, -51, -68, 4, -83, 200, -192, 188, -219, -84, 125, 78, -266, -143, -126, 124, -68, 64, 157, 156, 222, -238, 80, -56, 57, -20, -50, 84, 124, 49, -143, -89, -11, -151, 220, -25, 18, -90, 58, -37, -52, 259, 62, -383, -77, -56, -344, 141, 209, -22, 195, 94, 145]
5114A45k66K34JP1l13K8O3N4p7K9R5k4Q4j74J02j0Q3j24K09k09rP2j30R3Q8j95
5140h0K32l30J04J24j88On1M3K15M1k84K70L6k16J50oP0k21J84M2j70R6P1L0k04
5165c6K65k47J10o5K2j50O6J27j38r6k6O9P0p6J11j56J61k19K42O4j46j60L3J32
5189d3j56j58L98J91m11K16j02J04K6o2j30K54L6k83J3l9J93o9k27L96j96j58
5211b07Q0M72l37k54K09J13p8j94lL99j33P1r6j78J40l26N17m52K39o2J80k57
5233a57L67m47L34j86J48o5J37j43j47M09j99pJ26k03r5m7L32o0q4j25J94j70
5255h8P0k15M51K0l21Q9j93K05K33k10j34L22k66l8K49k20R1Rk68J96J75k9j73
5278d5n6k64L94L3j01Q6j65O7J84j87j08M56j90p1m8k5n7J56k06J25j5m4K76j56
$$ y = [145, -121, 113, 114, 185, -128, -100, -37, 17, -60, -31, 64, 40, 124, -50, 52, 42, 125, 1, 210, 1, -8, 64, -66, 27, 115, -80, 152, -178, -74, 50, -138, -132, -183, -140, 75, 116, -168, 102, 138, -78, 72, 66, 136, -85, 99, 141, -29, 67, 138, 168, -36, 229, -18, 92, 27, 49, -101, -35, 92, -46, -142, -168, -99, -29, -105, 6, -150, 11, -208, 34, 98, -48, -208, -175, -43, -199, -357, 41, 232, -179, 37, -65, 39, 65, 3, -127, 127, 163, -120, -107, -146, 47, -22, -249, 147, -49, -207, -127, 345, 8, -246, -37, 76, -2, -196, -199, 200, 67, 138, 42, -136, 4, -322, 195, -257, -18, -80, 100, -157, 210, -237, 97, -89, 59, -6, 131, -12, -159, 250, 51, 44, 170, -33, -128, -175, 157, 97, 13, -112, 82, -88, -18, -233, 218, 238, -83, 6, -187, 18, 251, 41, -93, 229, -37, -75, 174, -46, 45, 54, -214, -18, 157, 128, -45, -101, -365, 29, 62, -39, 47, -118, -51, 133, -54, -162, 294, 104, 33, -15, -40, -97, 59, -147, -22, -37, -81, 195, 39]
5302C9k7k6k03N51k66k52K78l1j80Q4k4j35k9K57J3l7J18J08l52m8J58k41L05
5325F0k22j51M56j10l57K87K76j0j97j4J10J27j00j35M6J60r3j19M6J47j58J38
5347A87l74J36J07l49M35k26j9N0O1l1K51k18k3q2J98j06J46j18j66M4J26j65
5369a36J29r9K3r1K51j0j40L62j65k26M5J25r4K3P5J11k73J62l27L98o0O8n7K4
5393A18j40j34J28J71k09L8k02J56l3J57KJ29j71r0J31k78K14J30P0k3J4k45J04
5416C7Q2m11K50J36j91O7L5k15J88K65m8o5k5j83J54J27k79PJ53k37K98l8j62
5439e5M9J38l93K54J7Mk24k4J70J15O6j10Kp8Q9J02Q2k9m7P0n5R7l24k1J56n2
5465aK61k63p6O2oL49k88J35j78n4J69M9J1j24r5J38lj95L54l68j3Q9o4L0J28
$$ y = [39, 12, -14, -217, 334, 68, -184, 94, 63, -117, -33, -57, -192, -221, 36, 49, 12, 130, 238, -114, -162, -4, -245, 60, -162, -313, 143, 33, -324, -37, 239, 229, 32, 18, 128, 255, 155, 20, 66, 226, 133, 14, 60, 207, 49, 187, -187, -51, 56, -293, 142, -84, -103, -53, 8, -23, 228, 10, -13, -95, 103, -3, 143, 25, -141, -97, 29, -136, -7, -106, -83, -174, 77, 67, -73, 289, 124, -102, -57, 68, -26, -3, 72, 183, -90, 72, -255, 143, 83, 151, 94, 118, -22, -156, -28, 143, -66, -28, -230, -74, -107, 50, 52, 181, 10, -80, 51, -227, -13, 117, 187, 164, 178, -67, 37, 119, -292, -42, 94, -97, -30, 5, -210, -22, 243, 195, 130, 105, -78, 76, 203, -76, -69, 84, -153, 145, 107, -55, -6, 132, -261, -7, 10, 14, -210, -234, -64, 51, 117, 7, 9, -69, 20, 122, 204, 175, 128, 198, 143, 240, -84, -105, 51, -1, 260, -3, -79, -17, -23, 326, 38, 173, -5, -59, 110, 159, 170, 46, -49, 89, 86, -109, 245, -123, -136, -47, -111, -81, 47]
5490D7q8m1q3J25L19l12PJ04P9m58K33K34l16r7L09j69m6J00J41p1rJ03j21n9
5514f9L8J45O2l2o7J92m19J61l1p8K86l32J55PJ66l21M7J49K2L8j18Jj89K03k7
5539a1M7o0m4J06j11K10k09J06no5k5K4J36J68j30l55J64k5J83n1K1l0j25N0r
5564d0p5J42j88K73k9n7k1M4J34j75j38K58l68K98Q6J94n6l66o0N7j07K04K54
5587B64l19N0K43k87J12J0j56J35k53n0K54KoK11k38J35j64k07K06N1k3j74M2
5610a62r7J10K40k80K47q7n7LJ73j17L00k6l09J27m5J01j67O8j3J84O9k28n3K72
5634B53kk67o6J35n1J36m64M55j53n4P0Q7j13J88O4l98J20L58m51K76k08K02j92
5657g5r8K16k53J58J62m7k7j05j9l12M43J5M2L3p1j16J10j39K88m9j71K60k99
$$ y = [47, -41, -82, -165, -40, 279, -33, -26, 78, 157, -301, -68, 166, -150, -247, 62, -107, -153, -53, 88, 17, 8, 111, -10, -69, -31, 114, 176, 144, 77, 269, -150, 11, -20, -98, 188, -144, 11, 18, 184, -137, -90, 59, 81, 119, 1, 2, -187, 16, -11, 36, -24, -68, 38, -73, 137, -72, 34, 29, -36, -61, -37, 99, 267, 137, -218, -54, -79, 104, 53, 74, 44, -81, -31, -40, -115, 27, -161, 112, 83, 26, 5, 49, 183, 8, -130, 128, -240, 58, 144, 338, 282, -84, -144, -87, -194, 10, 264, -55, -5, 238, -49, 63, 73, -83, 52, -201, -251, 3, 5, -1, 210, -28, 107, -57, -264, -58, -7, -30, -204, -162, -259, -149, 91, -189, 58, -29, -86, -83, 90, -27, 273, 247, -62, 65, 20, 121, -46, 22, 9, 193, 262, 34, -19, 253, 251, -16, -82, 53, 2, 138, -326, 129, -24, -78, -8, 79, -34, 154, 218, -180, -60, 298, -153, 123, -85, 117, -75, -173, 43, -210, -52, 110, 63, 36, -69, -88, -400, 43, 58, 100, 133, 62, -54, 56, -83, 205, 156, -15, 245, -54]
5680e4J41l07J23K56k09J97r5J13k67N6K0J17k54L91j39j49Q0j29K12j02J06O4
5702A71m51N40r1k08K9K8p7kn0K40j03J11j59N1J7jp4K2J45jj75J75j79lM4J03
5728A02p3J72k20n7l0R2l0J10L1j94L4J43k47R0J01j26J79l07P1L03N7k20l0O3
5752A4J13j92L29j93k7o0M8j53J42k85K56m2R7j41J7P0Jk6k18J64j64L99j52N9
5776E6o3q8K8K55j99K19j84j92M2Q3M7L7p7o0J54k64j0K00L57n18O3L9J82k18
5800a11J93l33L99j16L2r4J03J61k84O0j2K61m29J26L00M8l12K20j81pm1J16j89
5823i0J38L1J55j69q5J7K10p5o7K90l01o6L06l58N9j27J62K18m23L14o7M1ll38
5847b28j02K31J55r0l7J80j45L4j43P7K53J2l55L12j29M7l06J93K45l34r3J9j68
$$ y = [-54, 87, -220, -97, 159, -50, 147, 52, 165, -102, -46, -26, 91, -163, 228, 89, -60, 20, -109, 103, 1, 107, 171, -280, 260, 169, -39, -10, 18, -59, -61, -111, 129, 26, 137, -22, 29, 46, 45, -29, -7, 138, 137, -38, 137, -42, -45, -1, 102, 29, 201, -19, -76, -106, -14, -44, 66, 97, -97, -63, 80, -167, -77, 24, -102, 77, -230, -159, 144, 201, -19, -49, 14, 127, -65, 264, 71, 44, -16, 32, -121, 21, -264, -8, -50, 47, -94, -77, -7, -6, -32, -250, -86, -250, 149, -3, 56, -7, -95, -67, 188, -11, 208, 24, -168, -126, -43, 4, 41, -36, -96, 58, -206, -216, -16, 341, -177, -114, -75, 107, -111, 82, -251, 148, 32, 64, -30, 73, 234, -50, 10, -2, 259, -170, -44, 256, 304, -8, 212, 31, 24, -17, 99, -90, 48, 79, 234, 65, -20, -3, 207, 132, 65, 355, 54, -12, 294, -64, -5, -132, 30, 248, -175, 139, 72, 113, 110, -228, -330, -99, 56, -34, -71, 109, -36, -2, -145, -68, 185, 197, -158, 154, 25, 72, -234, -41, 204, -130, -223, -204, -372]
5870c72M18k10M35p0r1Lo2j81l9N19n62K58j44J09p3Q6J98k34L7N4k24K84n4q2
5894Cj02J23j59L4L52q9k28K59l21Q4J27k57O9LJ97l29J62J07NJ57l48J90m2k5
5918b8L9M4rJ7%k7r5R7J37k75KQ1P7j26K09k01JK06j35j39j24L3J38j09J33L69
5944C15j80m5R3j66j91J78k66L14j42n7J30J69m57L76j16K7Kj93L10j37j53J91
5966BK9jk34R4%K16l12M3L49j90K13n9j30o8j57N13j91j14j18K04q0L8j89J68
5990B6J49j74j05J65J9k2p8q5L13k32m3N7NJ30K06m80L23k47J85j59j34L74k19
6013b6l5n1K02J5j4q1j31J09p0J31l0j29JJ11O4j72J94O8l29L77j55j07R5K3k85
6038b25L93j86K9l0K25p2j93P0K43l49M9J32j0r2l2J01Mj94J28L42k33Q5l88L04
$$ y = [-372, 46, -164, 271, 201, 110, 113, 51, -130, -169, 350, -212, 46, -98, 11, -62, 24, 222, -12, 25, 79, -145, 139, 85, 3, -99, 24, -135, -101, 251, 162, -66, 193, -128, -44, 83, -174, -105, -102, 95, -234, -72, 35, 40, 197, -151, 39, -3, -28, 11, 55, 46, 63, 63, 36, -59, 38, 175, -100, -98, -17, 60, -66, 143, -58, -57, 149, 14, -125, -249, -216, -78, -187, -54, 315, 135, 90, 183, 17, -174, 4, -262, 52, -90, -147, -17, 152, -305, 71, -45, -18, -16, -209, 101, -36, -189, 2, 31, 30, -204, -110, -110, 106, -206, -163, 186, -4, 209, 150, 20, -48, -205, 308, 117, 3, -115, 89, 9, 47, -142, 26, 175, 1, -104, 61, 80, 58, -20, -105, 208, -24, -67, -10, -5, 125, 331, -149, 174, -73, 112, -47, -181, 193, -26, -61, -112, 90, 105, 91, 10, -121, -12, -82, 49, 19, -110, -109, 2, 66, -106, 88, 156, -173, 204, 49, -58, 37, 60, -225, 168, -18, 11, -19, 206, 134, -59, 11, 254, -95, -46, 86, 76, -16, -48, 53, 57, -137, -9, 333, 100, 185, -203, 101]
6062A01N8j79J87j77l2K96l19J7O9j18J78L6k05o8J88L7J31k57k0N2K46k94K21
6085A48k52LJ84km6Mj89J83P1j14M2m4k00K99j19o3J23Jo9j21L32o5j99l0K27
6110A04J00k96j5M8j90K73J02j83k2J81j56K93r8k16K3L3j03J82j82K46p7P7k01
6133g7R8m3k2j60K83o2j30O7J5K23m07L1j3J62J25J39k45p0J16k20K62j77K0J43
6157E8j32j29L4J84L3N9R9k49n8P6L2l8J69j5k25Q5J17K6J06j64L2K21l35l1P8
6182C3K69k59LO7O6j64j7K5r0J13M1j14J0J87j68R3p6L2R3k1k22j1j45J23J35
6207CJ40k03J02j61L5K5O9mM6j12L10k67j6jo3J37K51j73j28q1J71j2R3o8p7j32
6233a16J29j4J59m9N7L6j83k12J08J03K2p8j15N7O4K58j87l0j5J01k37J75O9j58
$$ y = [101, 159, -20, 167, -10, -42, 254, -65, -48, 21, -97, 81, 117, -88, -156, 32, 69, 200, -57, -77, -25, 221, -73, 148, -104, -101, 83, 81, 35, 39, -150, 33, 104, -10, 32, -12, -212, 87, -32, -95, 28, 29, -40, -161, 171, 106, -93, -123, 104, 204, -92, -107, -59, -249, 24, 126, -57, -79, 102, -54, 239, 141, -75, -52, -19, -122, 60, -122, 124, 47, 124, -77, 21, -22, -44, -204, 79, 17, -113, -46, -31, 192, -215, -184, -197, -35, 90, 229, -16, -86, 30, -190, 72, -105, -85, 58, -74, -203, -169, 15, 48, 107, 206, -43, -101, -25, 7, -31, 138, 123, -102, -17, 100, 126, 232, 68, 100, 321, -14, -45, 33, 302, 43, 46, 113, 179, 15, -2, 23, -67, 46, 87, -27, -17, 170, 2, 95, 19, 51, 144, 123, -99, -110, -255, -132, 3, 143, -60, 42, -119, -84, -59, 10, 6, 52, -60, 250, -17, -33, -34, -97, 40, 291, 118, -10, -91, 80, 68, 161, 93, 16, -116, 13, -1, 158, 109, 166, 202, 19, -193, -85, 18, 40, -38, -153, -96, -32, 226, 39, 9, -6, 95, -142, 33, 102, -56]
6257e6J50L4m5j06J22N0j19N8o9R0q6n3J65m45J00M23j71n5J00j5m6j10M7P8j12
6282g1PK43p8p1j07m3J09k40L66J1l17R3n2J66Q7k75K49k25J25j2nJ81j11j2N9
6307G7m5K9j37J11j03j06O8J10m8Q1j81N0K67N9l55J42J45q1k90J54J27j91K64
6330A47J3j81J82N6k14R3k52j01J58J30M4j99K35j91Q1M7l18L32k11L82j15j40
6352b2J01j09J50j19K9J34j42o7k30M05k30J98j71q7J80L7o9K68k92J25J0j16
6374a7K90m67M28q8j70J24k6j27M1j40K72j9m6N1k21K58j22K48k31k12K33k3K02
6397B38l29j6K30n0k13O9J40P0j13O5K02l24K9K4m5o5J94k37o3K21J7p5R0m7M8
6422F0L2j52r9J83j2mJJ23n4J09k36j43J42j63L96k41O1n1J09j34K31k63J06%
$$ y = [-56, 94, 128, 83, -23, 99, 149, 30, 88, 19, 109, 23, -30, 135, -310, -210, 213, 42, -13, 87, 72, 26, -84, -37, 41, -71, -64, 179, 101, 30, -77, -120, -11, -251, 115, 126, -191, -98, -150, 16, 103, -172, 77, -148, -23, -35, -40, 141, 30, 18, 77, 32, 61, -76, 35, -68, -174, -106, 4, -44, 37, -144, -94, 173, 232, -123, 19, 164, 83, -207, -53, 74, -117, 147, 160, -21, 161, 217, 3, 96, -156, -257, -99, 31, 75, -124, 111, -80, 1, 48, -270, 62, -149, 233, 118, -22, 79, -30, 120, 1, 30, 164, 22, -45, -275, 130, -100, 98, -73, -160, 20, 57, -12, 256, -36, 89, 99, -17, 273, -194, 234, 146, -24, 100, 74, -53, -12, -152, 120, 101, 55, 106, -115, 143, 21, 269, 38, -174, 59, 36, 238, -91, -107, 123, 73, -140, -71, 69, 139, 26, 91, 293, -31, -2, 22, -23, -88, 106, -131, -194, 27, 44, -31, 59, 12, 60, 92, -60, -159, 24, 12, 8, 9, 132, 78, 187, -49, -192, -50, -213, 183, -58, 3, -48, 61, -73, 158, -105, 1, 1]
6446Aj97J71n5Q8J00j17J13j50J10J87k12j62J91m45L42k4N9K11k17l5K40k75
6468g6R9k1o9NJ08J23j59j75K99o5l7J43l12K43j83P1J44j98J21j13n0R2L2j8
6492DP4K13l77M0K17o5j92J42K2j67r8L35j56J96l1j50K6j46J31K67k25j84K06
6515H2j58K13O3p6k08J94P5jn0j36j0n6m7K23m3l2m15M90R6k86L33j58k24J65
6539C4K83k23k17J49p5o2L45j28k12l4O1J08j53K07r3N7L7j42j45L8J94j6K60
6562B73j23j43j40K57N5k5k53J73k03K44p2K9q9j54K94k48L9M3L74l59L5J93k76
6585g6op3K8J08j66K27NM4r6J45j64M1J30j78J07k08J97r6K24n3p6j80K92m11
6609b35L03M7%l27o7J71M7M8J02N8k27K75k91L0n6K70p0m6o6r6K40j11O6j07J13
$$ y = [1, -196, -25, -80, 8, 108, -9, 104, -46, 64, 251, 39, -123, 68, -377, -35, -59, 0, 211, -6, -41, 199, -76, 23, 2, -67, -62, 46, 169, 10, -165, 134, 69, 32, 175, -137, 106, -77, -6, 138, -60, 61, -52, -102, -10, 22, 4, 78, 291, -86, -46, 171, 106, -86, 56, 78, -89, -187, 148, -8, 188, 157, 7, 33, -113, 18, 285, 60, -124, 82, -76, 137, 200, 124, -84, 110, 185, 184, 134, -2, -12, -68, -115, 108, 65, 33, -382, 108, 204, -82, 251, 93, -131, 34, 317, 94, -123, 26, -49, -111, 234, 106, -106, -140, -79, 29, -124, 83, -10, 47, 84, -58, -203, -165, 29, 13, 273, 150, 7, -133, 124, 179, 154, -99, 74, -129, 115, 43, 72, -17, -171, 123, -125, -86, -43, 331, -28, 7, 200, -76, -82, -155, -127, -19, -185, 42, 47, 91, -5, 140, -24, 17, 147, -31, 76, -132, 65, -31, 193, 140, 64, -116, 176, -235, 68, 115, 115, -212, -279, -108, -61, -13, 89, 147, -80, 195, -96, -66, -122, 148, 78, 32, -34, -130, 110, -1, 65, -42, 71]
6634G1K6l05K14k7K9J49k93J02j76K12j3j3K14j65j65J33pJ80n8j39P9k31L50
6657A67j67J63k85K53j14Q5j6p7j43J55k0k13L94J2l31J77J38j42j7L2k71J64
6679e6J66k1j27o6J0J14n7J87Rj61N1oJ12j33K35r9j53p7M75k56M7r8j29J71k99
6704a61J77k4O7K3j24M7J05Kl04M31j27k76K60J33k68L9L0J6j73R7R4j83J15o6
6728g0P6N6J70j77j39J60M1l0k00R1q7L27j56q5Q7K90l45j53P1q1j8J44L8p7n0
6753a17K74l18J85l69L03K3L3o5O2j08l8K19P2l29o3K81j90P0k5K22m7k9j65L05
6777A86k51oO9j75J42Q5n0j95R5J65m2N0J20M4k40J0J46j20J00l63K96k15L13
6800A64l49J84N0p9J81k02K45k90K63k78Q2o1J91P7j7j52K17k61KJ27l9J28j78
$$ y = [71, 97, -208, 6, -21, 8, 157, -136, -34, -210, 2, -11, -24, 190, 25, -140, -7, -14, 166, 108, -31, 48, -183, 167, 0, 163, -122, 131, 17, 102, 86, 9, -134, 21, 1, -212, 182, 194, -137, 40, 178, 36, 19, 51, -220, -56, 110, 89, -38, -104, -94, 20, -37, 150, 159, -2, 49, 43, 155, 22, 257, 158, 5, -72, 403, 147, 194, 96, -33, 138, -161, 16, -8, 59, 82, -42, 5, 110, 112, -192, 239, 112, -164, 96, 229, -39, 0, 30, 46, -127, -30, 64, -119, -4, -70, 6, 62, 232, 55, -84, 76, 117, 87, -113, -22, -109, 218, 62, -23, 64, 354, 9, -144, -73, -154, -172, -28, 10, -67, -117, 157, -161, 24, -345, -42, -19, 14, -51, 11, -97, -135, 84, 156, -173, -236, 45, -145, -75, -100, 122, 75, 46, -119, 186, -65, -71, -2, -177, -35, 50, 0, -195, -100, 65, 23, 73, 193, 237, -3, 7, 153, 33, 133, -230, 66, -149, 164, -185, -1, 49, -30, 151, -51, 194, -96, 167, -111, -29, -90, 101, 178, 161, 9, 226, -35, -33, 94, 55, 183, 5]
6823EK4j24J16q4LP3J47p5J4m1j44K24N3l44J23j30K56m9j24J85J0j67N9l12J00
6848b02K85m29K01L21l36J98j17l19M44n2Qk4Q2k08K39N8l18p4J28R1O5r5K41
6871A87l85J46lJ21j92m7J96K48k65j07J4n2P6J34M9l71L03m3J21l16K14J6K6
6894G0j69P4O4P8j9k15n2K32k8J23p5R7J5k66L84k24o7R0n8j94K15N0k93J54r8
6919a12J85o8m7J05l9j03J9j19K48j89K03j07R2m2j87M42j30j45j3J31o9l0q0
6942e5J54K43l54m7RRL0q5O7kj80L24r1k31K13LJ13k12L03j00K0p3j91n3J30j53
6968b09J78J28j9J44p3k10O5O0o4j62K51r6Q2p8m9K2p6K55K6J31n84L17j18k10
6992b89K77JQ5ML3k4j55J28j01N1J21k1k70K67Ql3k47J95L0J8j72J67k14J87k08
$$ y = [5, 29, -95, 21, -63, -60, 13, 160, 85, 99, 58, -86, 138, 191, -153, -30, -160, 96, 47, -77, 108, 118, -49, 10, -302, -202, 83, -346, -145, 176, -160, 38, -79, -398, 46, -6, 2, -22, 60, -148, 91, 149, -169, -243, -115, -24, 41, -54, 187, -198, -52, -55, 66, -126, -173, 23, 271, 6, -101, -87, -139, -63, 71, 120, -251, 52, 9, 130, -186, 28, 44, 70, -99, -25, 39, 117, 98, -117, -169, 63, 35, 158, 83, 180, 195, -71, 313, 89, 22, 112, 54, -140, 75, 125, -168, -14, -112, 73, 5, -42, 63, 24, -79, -60, -179, 69, -120, 83, -24, 68, 26, -161, 281, 151, 6, -7, 124, 55, 25, -55, 99, 342, -12, -59, -50, -41, -11, -96, -29, -31, -211, 113, 22, -209, 4, 7, 120, -92, 211, 111, 131, 58, -133, -186, -56, -209, -31, 97, 78, 222, 149, -61, 4, 64, 0, -162, 89, -7, 75, -3, -52, -30, -106, 149, 175, 306, -278, 39, -79, -289, -12, -11, 74, 78, 111, 87, -68, 60, -41, 10, 131, 110, -160, 107, 115, 82, -165, 30, 60, 78, -94, 73, -141, 46, -162]
7017a62J52j21J53k29N8j12M55l36q6K89q9P3j13J55J8p5r7Qo3J42j17L06j65
7040D4M3l29K01k5J7j79K42k0j25K4K43k97K57k17P0K14l20K04m3l8J53j1r9j43
7064a34K92k55Q6K9K4j01J14j68N3Q8J29O4j41q1k05R7J16L1J94q9k13OP6j31
7088a19oK05j94J86j60L7M8K9P4N2L0l25Q5P8j7rl7m3J98j53J61j79K05p5Lj89
7114a15L17k02j50J78j21J41K25k69Jj7q7J24j48L52R3k49N5j07j68j2J53j13
7136a19l2n5J21l9Lk8M3K41J13k43Q7j2j56P5M2O0l14O8K47j50j30K53m5l6k5
7161c1P5j03l0O8q5P3J66r1k02K22j10m5J78or7N5k56K82K2N4m06L43r2Q3j01
7186c4m1M8Q0o3k72L9J69j60L08p5J62k7k26J77o1k18R1R8O1N8j38R7J20k51M8
$$ y = [-162, -10, -131, 22, -207, -149, -261, 194, -142, -228, 61, -28, 45, -68, 87, 105, 30, -67, -59, -122, 20, -97, 209, 44, 87, -242, -41, -66, -49, -228, 14, -6, -131, -107, 136, -161, 96, -121, -51, 163, -157, 47, 4, -34, 119, 108, 9, -134, 158, -97, -11, 18, 42, -59, 55, -113, -60, 28, 157, 221, 80, -1, -206, -109, 7, 38, 232, 143, -70, -64, 12, -119, -125, 80, -114, 72, -88, -51, -3, 26, 100, 152, 182, -143, -58, 20, 3, -6, -43, -86, 112, -41, 120, -59, 146, 71, 74, -115, 202, 0, -150, 28, -93, 48, 273, 4, 5, -12, -99, 25, -123, 229, 322, 73, 128, 21, -147, -159, -6, -119, -151, -206, -85, -124, -121, -149, -106, 135, 248, 5, 92, 80, -76, -1, 41, 101, -213, -145, 102, -48, -178, 75, 30, -6, -31, 44, -59, -89, -21, -106, -33, 133, 42, -160, 62, -48, -93, 85, 79, -18, 37, -219, 63, 85, 139, -267, 76, -16, 67, -34, -75, -27, 53, -10, -282, -243, -74, -234, 74, -1, 161, 134, -92, 85, 24, -194, -103, -5, 56, 114, -24, 73, 193, -58, -10]
7211a0%J0P1l3j44M1N5L2k09L18j07lK33j38j74K46k37J52j59j11K23R3j46p8
7235g5J33J01P1k8l49L50j50P6m7l1K5j36J23j37L82l80j02J33O6j10J58j24K09
7258A58j11n5J92k37J26j12m4J3MJ72l45K06L1j04J44k27L9L28k53%K4q6J32J93
7282A88l40J13l6j06K92K1j24J09j25k1R8Jo6k9rj15J62k5k1P3K17j50k72J18
7306d7qk7k6l2O6J36l8L2M9j5k85O5J81jj72K55N5n1l44J50N5j43J22L06m18j93
7332c28J98K91k67j06J71M3p9L9j12J3L12o9r8R9k17o2J42J31n6j46J86k15J87
7355E7l5k55J53J04j58J79j19N0j62L81l54K07J0k31M3K74L8j74J35j83J09l32
7377b63J52J06M1Lj40N6J26J03j75J70k27j4K11k41MJ32l5j70Q6N5j55L9Q5N4
$$ y = [-10, -10, 0, 71, 38, -106, -65, -10, 22, -187, 131, 24, 21, 254, 116, -58, 188, -49, 103, -56, -167, 56, 149, 3, -75, 58, 159, 230, 202, -147, 203, 53, 129, 82, 51, 76, -60, 63, -74, 308, -72, -174, -41, 25, -85, 73, -51, 158, 47, -8, 184, -53, 73, -39, -83, -70, -66, 106, -239, -33, -2, -106, 38, -189, -150, 178, -75, -75, -51, -137, -5, 188, -152, -39, -75, -181, 111, 132, 8, 117, -8, -29, 69, 70, 4, -25, -34, -149, 13, -12, -33, 40, 257, 107, -165, -47, -55, -82, -108, -140, -74, 62, 24, 56, 105, 90, -195, -130, 51, 50, -122, 133, 188, 137, -207, -57, -2, -145, -23, 283, -135, -328, -130, 161, -106, -212, -41, 2, -77, -38, -150, -137, 175, 106, 8, 107, -110, -172, -30, 101, 45, -101, 85, -130, 57, 22, -233, -80, 24, -134, 45, -74, -24, -186, 195, -159, 48, 58, -173, -130, 144, 182, 8, 143, -40, 69, -263, -111, -5, 36, 39, -101, -45, 81, 184, 9, 179, -48, -62, 149, -92, -88, 44, 9, -161, -75, -20, -175, -136, -51, 3]
7401CJ54j55J07j15J5J39l2l28L98Q5k12P8l76J40j65J64K23j85j37J2J96K03
7423B12k00J8M0L2j53J12mK87m14N3j02L9J8O8L6m5K28j92J11l4l5J12j06j36
7447e5J18k8j28q0L77k31J74N7j24j9M3j80K42j84m1J51LOn0O8k7K0r5j41P2K5
7473b7j11L00K6j78J37k10K7M8p8J63r4nN0j09K51r6p2J52j69MJ02p8j86J59J28
7498A34k46J62m2n9K00o7q1k8p3J77j02L2J11k6N9o8q8J6p8K6J93k56J97K2k00
7523h5m4K32j57l3J51oK91k04n4r3M8k07L6M9J43k84K98n7j05K22k78l1Q7K50
7547A69pj34J9k49L21j47n9J41Q1n0j0l6N4j24M0N7J05j99K47j46j14J9j61p2
7571b55L15j42J35m1M9J6j33j9O2L2Q5k9o5P1N0q8j36J45j80N2K57k13K10m65
$$ y = [3, 157, 2, 109, -6, 9, 148, 116, -212, 186, 271, 59, 137, -239, -99, -264, -100, 123, -62, -199, -187, 9, 212, 12, 30, 70, 102, -51, 61, 57, 344, -70, -17, -119, -80, -62, 6, 42, -3, 225, 33, 144, 110, 75, 187, 81, -55, 63, 35, -93, -173, 204, -27, 147, 204, 80, 61, 104, -76, 166, -18, -59, 92, 95, 101, 51, 119, 92, 112, 17, -124, -52, -27, -138, 162, 188, 10, 147, -63, -36, 12, -66, 97, 3, -2, 48, -61, 190, 94, 22, 174, 5, 9, 111, 33, -153, 6, 134, -112, 50, 8, -51, 149, 82, 1, -27, -100, 77, -25, 7, 118, 92, 151, 83, -5, 11, -67, -41, 152, -104, 93, 115, -85, -129, 103, -54, -87, 64, 58, 349, 145, 91, -2, 46, -161, -125, -76, 67, -217, 81, 24, -81, 141, -137, -168, -81, 169, 162, 28, 47, -202, 119, -28, -87, 54, 135, 85, 75, 39, 93, -31, 9, 66, 171, -28, 219, 73, -41, -22, -183, -255, 60, -82, 53, 12, 61, 77, -56, -75, -13, 19, 104, 75, 10, 81, 131, 43, -93, 52, -128, -76, 181, -32, 178, -287]
7595b87J70J74n9q2O1J48r1p5P1j1j0L11m92M9K41k56K94q2J8l0J86l25J40j27
7619f4L1J82l16J3K84k75N0j08R6q7J43m2n7J21J54k37J70k04J24j29M56j03l36
7642a34J84P5J15m15J18j14L16j80J97j21p4N4p9L1j68K86N1k82J8M15k84j71
7664a62L06m0k55o0K99k92J35o4N0J34L05k66n6o2J56k30K15J97l32K7j85K58
7686G8j76r5K82j76P7n4MJ69k86R5q3K54j24j2l2m2P0j19J99K48l50K22k75L08
7710A82l14J62j07J31j47N6K3k2K6l8K15p2k4k59J31rO4r7K39p7K1o7Q5k70J38
7735c0j36M5K97j37J9O9j95L7J43l5O5j74M3j3r7J51q5j9Q4n1q1j27K57k19K08
7760A9j00J77p8j12L00k22N6K0J2J6k5k05K58j08l4J62k68L45M0k95J26R6Oj82
$$ y = [-287, -117, 57, -2, -84, -23, 125, 34, -41, 30, 19, 9, 320, -172, -123, 118, -138, 156, 74, 92, 62, 248, -77, 63, -64, -33, 149, -167, -154, 130, -145, -95, -203, -107, -194, -51, -93, -150, -29, 125, -112, 58, -146, -22, -151, 305, 202, -134, 50, 125, 240, -175, -57, -171, 145, -35, 162, 41, -33, 21, -58, -27, -195, 91, 142, -140, -122, 293, 9, -162, 144, 104, -151, -211, 88, -204, -69, -133, -83, 51, 356, 90, 34, -28, 128, -102, 113, 310, -22, 5, -180, 78, -98, -193, 89, -87, -10, -64, -60, 109, -177, -82, -165, 89, -35, -47, -79, -121, -51, -170, 29, 277, -73, 149, -126, 182, -132, 30, -77, 54, -93, -37, -14, -36, -10, -48, 167, 95, 71, -188, -57, -66, -2, -99, 140, 63, 84, 17, 102, -168, -30, -166, -121, 176, 39, 58, 127, -68, -31, 112, 77, 142, -32, 11, -2, -99, 52, -33, -52, 32, -19, -100, -227, 30, -189, 19, -81, 96, 18, -94, 206, -16, 40, 60, 72, 88, 63, -142, 116, 8, -26, 136, -132, 213, 253, -42, 84, 180, 186, 4]
7784DJ0k54K77K7J04k69L1L07j17Q0k50J36j95J38j60J50n6J05l4j17J40n8nj01
7808a07J43J46j25o8m8L49r1k39l3j46m6L35q5n1J01k20J19q5J91j85L29j21O6
7831A29k06J37M5j30k7P1k11L94j00j0m62L99m7n2j6KK12p5klK49k74q0q9R4J44
7857I2r8m5J47j24J61r1p9Ol42K35KK52q8j25K67j56O1l40J72kK91l57K47n3j85
7882a52N9J66n0j75J62r4J67j20J21L6j68J27n8j86K57k19K88o0jom7J24r2K24
7906C03l15J27n5j23K0M5J01P4J7j91j31K06m7J27j29J42k95J65J09O9k73P9K
7929B7O9j40M0j03K60j43J36k26J25j7j13K19o8K9l3j13J62k25J05k61L04r4J46
7952H6M9o2m7k36K66k13J28K22j19nk73J91Q7n0J11n1j50P8n2lJ15l05K79j3o5
$$ y = [4, 14, -240, 37, 64, 168, -101, -70, 237, 120, 200, -50, 86, -109, 29, -131, 19, -37, 68, 34, -83, 57, -1, -6, -107, 36, 182, 57, -11, -59, 290, 199, -40, -73, -219, -265, 70, -15, -66, 35, -185, -66, -151, 40, -145, 184, 63, 129, -77, 60, 105, -25, -52, 19, -192, 202, 102, 92, -370, 29, -18, -70, -86, -84, 128, 53, 51, 48, 297, 23, -57, -146, -52, 92, -6, -51, 96, -28, 133, 42, -37, -31, -373, -138, -136, 116, 28, -97, 170, 14, 75, -265, -93, -95, 196, -161, 86, 33, -152, -93, 73, 23, -152, 10, -84, 83, -37, 84, 120, -48, 79, 21, -165, 92, -127, 161, 101, 100, 94, 47, 171, 79, 303, -12, 115, 60, -63, -43, 2, 103, 177, 194, 3, -128, 78, 31, 158, 29, 171, -124, 41, 150, 219, -54, 25, 27, 96, -44, -4, -107, 153, 10, 146, -80, 45, 28, -85, 134, 66, 95, 62, -51, 111, -114, -9, -270, 34, -60, 86, 135, 73, 26, -210, 56, -157, -29, 193, 74, 69, -204, -13, 74, 24, 135, 84, -66, 12, -40, -43, 72, -233, 46, 33, -32]
7977c2k19K13L0l0J23j25J28L5k61O0j6N3K4l9J9R4q2j25K8K63j50O0k82M5K25
8002C9Q0r9j46L00n28K79K10k42L6l9K01k63k0L33k14q8L75k02R2k55L24l03J27
8025cm0o7r7L06Q7l03J12J91k81J57M2o2J02p7l15J03R4J14j21J82K8j80K3r6
8049a01L28j64J83n6j72r1M1P0p5K53l08J55j8j94K06k04J46m1O8K40m57K63j07
8072c5N5pj4j35J23J47k49J48Lp5K2Q8O4j73j05K83k3j66o1j41L07Nj52K98j30
8097G7n2o1j58J50O9l2J42k14j72r0J78L1KJ01J61J7k22J5Q7k2j4l2J48jj40j04
8123a36m3L11k53L3J60nQ1l84J71O0j3P5j67j54R4K78m2Nj36P7O3n5k6j23K74
8148A45k72o9J87Q2j15j2P6j17k13K07qj83M94l97J19J64P7l86K41l3M5m5J63
$$ y = [-32, -251, -38, -8, -38, 85, -40, 88, 123, -138, -78, -94, -41, -17, -56, -37, 57, -25, -150, -122, 141, -9, 51, -231, -186, 39, 119, 20, -126, 174, -354, -75, 135, -107, -71, -110, 91, -172, -192, 141, -73, -161, 214, 12, 104, -151, 173, -130, -3, -43, -110, -207, 99, 186, -117, -5, 186, -95, 62, 104, 42, 144, 67, -248, -145, -51, 63, -58, 124, 152, -28, -5, -101, 227, 63, 246, 190, 18, -73, -32, 38, -37, 216, -92, 63, 45, -149, 57, -147, -1, -42, 26, 266, -191, 72, -35, 20, 13, -1, -136, -13, 134, -115, 33, 36, -39, -17, 71, 135, -38, -143, 140, 117, -49, -110, -251, 56, 61, -91, 207, 77, 25, -36, -194, -44, 25, -7, 135, -79, -251, -341, -163, -132, -130, -29, 132, 149, -73, -58, 29, 7, -7, -39, 109, 108, -32, -136, -179, 132, -121, -88, 72, 67, 148, -236, -65, -5, -18, 57, -110, -264, -170, 108, 66, 71, -65, 12, 75, 20, -6, -129, 145, -127, -196, -9, 73, -42, -54, 22, -95, -308, -101, -109, -292, 202, -195, -76, 88, 165, -221, 20, -13, 32, -13, 150]
8171A50k61M0M4J00J52k42J81J33k31j53K08J04m54J96J50k35K58M3l93L51
$$ y = [150, -111, -71, -27, 73, 225, -17, 164, 297, 66, -87, 121, 225, -229, -33, 117, -118, 140, 183, -210, 141]
8191A41
$$ Imaginary data points
##PAGE= N=2
##DATA TABLE= (X++(I..I)), XYDATA
0@%%%%%%%%%%%%%%%%%qJ6j6J6j6J6k4L2l2M0m8N0n8O8p6Q8j00J10j24J40j57J75
39I2j95K18k42K67k96L28l61L99m41M85n34N89o50P14p86Q72r67J075j200J344
59G11j515J722j979K304k729L316m179N566q137J4369n4439n0206J60110m7611
73A7303r4788J16114L2758j18416N4036P7565r1511j5551Q8445n0111n8009P1921
85B9756N502p5044L6679M8386n8365j0591O2838k7097n0671M3560J6752n9761
97c8056R381M9462l5893k6431N6038K939m6586L2665L4316m9030m486M8203l0659
110A863l6469M7066L514n0137K9244L6973m5077l431N0623k5377l4539M2474K933
123A9660m8512K0189K9856l9419l507M3832j5883k5678L7101P541l7265J4455
$$ y = [0, 0, 0, 0, 0, 0, 0, 0, 0, 0, 0, 0, 0, 0, 0, 0, 0, 0, -8, 8, -8, 8, -8, 8, -16, 16, -16, 24, -24, 26, -32, 36, -40, 48, -52, 58, -66, 74, -83, 92, -103, 115, -127, 140, -156, 172, -189, 210, -231, 254, -280, 309, -341, 373, -413, 459, -508, 567, -633, 711, -804, 918, -1061, 1243, -1486, 1830, -2349, 3217, -4920, 9449, -44990, -95196, 64914, 17303, -77485, 38629, 71387, -47029, 7007, 84572, -6939, -22490, 65955, 15844, -42165, 29756, 35258, -39786, -3107, 45279, -13086, -23677, 39161, 12064, -38607, 4953, 21705, -38056, -28675, 20787, -15106, -41537, 14501, 17440, -29146, 3519, 37835, -11195, -15681, 32522, 1863, -34606, 12460, 15974, -34163, -4919, 32054, -13023, -16454, 34169, 8792, -25747, 16727, 19660, -28852, -8663, 21193, -18226, -21733, 22099, 6216, -19462, 17639, 25180, -12085, 2370]
135B370K4874l3450r964L3066j2880k6514K7829J1848l2642Q699K8725k5091j5982
148a9112L0458o896l1939K0465J6805l1020L860L2644j7079j6334L2020Q80l0599
161a5847J7438J8660k9702j995K9903j5288j8615K8977N103k7712J4214K0051
173B5187k7818p871K6754j3886k3926K3116P587k7706J0637K4158k0999q528K8160
186A4865q181k4769K0126R082k9143N252K3999j8298r537K8787j860k1989J8827
199G161J2280k6035R49K0729j8002j3855K2534j014k0916J5530J5170j9390P21
212d138K1014j1692j5219J7608j11k1721R173J4121j6976k599K1321o149j3948
225i316J7431N790k0756M478J4312j7224q290J8975m768j6457J6407R788j8973
$$ y = [2370, 27244, -6206, -16170, 16896, 4016, -22498, 5331, 17179, -15463, -6764, 21961, -3130, -19112, 11346, 4450, -27489, -7024, 9781, -21239, -17379, 15265, -1814, -18148, 13872, 14752, -15847, 1591, 20251, -9451, -11446, 18457, 3169, -15446, 13531, 18634, -9078, 5136, 25187, -2631, -10502, 16252, 2366, -21560, 1556, 9143, -18563, -7926, 16232, -4767, -13295, 14865, 6684, -18085, 2041, 11123, -18020, -12768, 11231, -7067, -16604, 12183, 10323, -11666, 7161, 19441, -6594, -5645, 15084, -2918, -16773, 5761, 4747, -16169, -639, 14531, -4859, -4138, 16876, 5184, -10035, 7573, 7462, -14259, -5086, 9035, -7941, -10540, 10781, 4632, -9316, 8115, 13905, -6851, -2373, 11939, -5285, -13575, 5400, 632, -15825, 582, 10370, -8603]
238h603N084J8162j4695r449J8408m245j8723J3014R390j9028L807J8669j1671
251A20q284J8920j444j7785J1025P937j8083o1J5799j0154q762J7085R47j4786
265g526R684R907j5540k326J4009q982j1326J3287K678j3965P587J2499j1863
278a877k813J5119n936j3068J0939L717j6246M226J2650j0977m415J6570k106
291E783j2140J1840O109j6481J834J1990j2449p825J4983j937j2686J2199Q430
304I650j3237J983J3475j0657q642J2503k405j4353Q296Q047j2756J554J4389
317G847o290o783J2771L92j3472N953P156j3150j835J2505n683q405J2902L282
331G190j1210N375R698j1391m164J0990n621j0749R670L866j2283M563J1346q756
$$ y = [-8603, -3519, 14643, -52, -9501, 8907, 4662, -14061, -1047, 8343, -10685, -6878, 11791, 120, -8164, 10756, 9312, -8473, 2552, 10489, -7594, -7655, 8144, -2010, -10772, 6313, 7260, -7526, 2158, 12065, -3475, -5801, 8208, -774, -12100, 1187, 3865, -10100, -2513, 9986, -1877, -4690, 10429, 4493, -8575, 2364, 6081, -10165, -5939, 6711, -4266, -8681, 7889, 5783, -6357, 5483, 11592, -4889, -3055, 8935, -3514, -11339, 3644, 1707, -10979, 1220, 9650, -3587, -1604, 11871, 1214, -7428, 5075, 2670, -11683, -3387, 4660, -8096, -6542, 7847, 1557, -5226, 7545, 7937, -5535, 418, 7574, -5576, -7411, 5094, -589, -8994, 3908, 7190, -4020, 1355, 11053, -338, -4502, 6488, 867, -9882, -212, 3654, -8629, -4066, 7280, -1476]
345a476l846J2887l083j1701Q588M318j3100J662J1206q294m852J3229l28j0629
359e419Q512O278j1876m13J0081p836p758J1111M46j0626P196Q120j0142q41J1321
374H154n870q621R115P05j1531M703Q181q627j615J1721l351p596R271K076j0900
389d185K374P214r344l901J0207k522p525Q841M880r263K343Q805p798n381R252
404C997k484r403O374N147q338J644J0246n248m472R228k65r798M443M430r759
419d258j202Q700m803m660R061J596q034M464N867q518k137P315m343p431P521
434h62K304q430M421P829o108k052R103k508p971O028K648r499J840P754o535
449b038k991R922p98p421O577L902r525P0P301o922m542Q759n62p917O655N389
$$ y = [-1476, -5322, 7565, 4482, -7219, 1369, 5687, -7413, -5751, 5455, -2839, -7691, 5538, 5210, -5419, 3093, 9371, -2505, -2918, 7163, -673, -8431, 2680, 3126, -7500, -304, 7816, -2326, -3167, 8154, 2284, -6337, 2778, 3483, -8048, -3345, 4836, -3791, -5406, 6315, 2964, -4632, 4639, 6715, -4185, -1811, 5403, -3941, -7842, 2365, -157, -7682, 1159, 6039, -3224, -881, 7924, 126, -5255, 3997, 1513, -7890, -1516, 3631, -4707, -3063, 7183, 1935, -2537, 6691, 6426, -3372, 1071, 5501, -4258, -5460, 3240, -1563, -6223, 2838, 4434, -3600, 864, 6731, -1787, -3924, 3391, -952, -8383, -862, 1442, -6988, -2567, 5262, -846, -2898, 6205, 3697, -4274, 1754, 4402, -5097, -3257, 4497, -2038, -5029, 4893, 4095, -3326, 3251, 7153, -2372, -2302, 4999, -1923, -6465, 2294, 1732, -6185, 470, 5859]
465E859q301J025P847n633n623P614p73q265M301N199o930j16Q151k574n157O447
481C071J389q563K287N329o409l085Q239j549o013O701M106p492J711O905n952
496F75m535P149j564p469N489M307p498J866Q057n374l803P688j511p880M530
511A27L342q512L59P418m646l534Q257J89o705M731M036p509n51N712m055m626
527e967O536J086o195M103N389n070j378O812k676n728M724J897p873J816N798
542C274m457k458P833q63o216N056L001p627M30O030n750l949P565r25o804N952
558I2M652p218R02O892n509m653P222j022p459M979M477p083J032P519m259l802
574c238O913J94p232K898M167o563p27O317k631l727N812J931n947K146M727o075
$$ y = [5859, -2442, -1417, 6430, 797, -4826, 2788, 2015, -6250, -1949, 3250, -3680, -3796, 4355, 1781, -3376, 3071, 4460, -4103, -1816, 3513, -2896, -5981, 2258, 709, -5304, 1397, 5503, -1989, -278, 6627, 675, -3860, 3289, 1725, -5744, -255, 4052, -3446, -1580, 6477, 1103, -2700, 4988, 3477, -4403, 127, 3469, -5043, -4684, 2734, -1912, -5446, 2811, 3000, -3705, 1026, 5062, -2447, -2998, 2714, -1341, -5967, 569, 1655, -4540, -437, 4952, -118, -1496, 5316, 2640, -3088, 1636, 3533, -4340, -2524, 3274, -1183, -3641, 4192, 3329, -2887, 2169, 5170, -2457, -2027, 4003, -1747, -5696, 1869, 944, -5860, 92, 4744, -2474, -1572, 5320, -189, -4842, 2380, 1358, -6101, -1122, 3355, -3728, -2696, 4823, 564, -3238, 3675, 3869, -3363, -465, 3702, -2861, -3588, 2729, 98, -3629, 2183, 4114, -1833, 313, 5040, -1035]
590a035k097N907k276n424M949K241n916K141O072m217k678O414j591o853M470
605A07K840p003O28O717m137l412P468l62o172M308L641o917m99O050m376m120
621e239O465P85n849M187M786o278p2O205l648n049N475M30o751L270M375n285
637b193m05O692k350m767N414J015o607J809M387n352k055O122j385m556N186
652I55K747n961J219N188m099l367N476o55n824L610L854n383L99O304l407l765
668b709N479N36o578L070L706n967q95O377l115m055O312J156o375K951M352n870
684a625j498O428l424m236N454J053n479K755M766n092r90N748k600m967M626
699I19J078n537J728M663l797j639N692j111m570L624K137n433K15M526l117k878
$$ y = [-1035, -3132, 2775, 499, -4925, 24, 2265, -3651, -1510, 4562, 345, -2333, 4081, 2490, -4363, 107, 2947, -4056, -3428, 3289, -848, -4260, 3208, 2846, -3326, 982, 4623, -2294, -2793, 3257, -1119, -5239, 1226, 2011, -3838, 349, 5135, -1143, -1215, 4990, 1342, -3707, 1768, 2198, -4553, -1283, 3092, -2193, -2598, 4094, 1744, -3023, 2391, 3406, -3201, -1392, 2995, -2357, -4412, 1710, 325, -4231, 955, 3702, -2259, -1040, 4148, 49, -3318, 2158, 1503, -4321, -711, 3143, -2240, -1841, 4463, 1056, -2709, 2770, 3306, -3272, -202, 3504, -2463, -3358, 3019, -96, -4151, 2161, 3317, -3058, -107, 4245, -1625, -3123, 3305, -119, -4355, 1099, 2152, -3327, -572, 4194, -898, -1888, 3860, 1260, -3707, 919, 1997, -3540, -1812, 2851, -946, -2585, 3107, 1996, -2574, 1050, 3187, -2246, -2031, 2495, -622, -3500]
715c500M876M27n117L502L856m901p38N363k998m468N092J88n543K681M351m975
731a904n80O026k069m375M974Q21o003K135L925n186j331N881j951l598M532J663
747B960m600J345M065m389j875M599j577m264L714K110m539J549M163k860k166
762a765M083n94m648K823J830l980j94M568k237k708M391R99m547J941L393m556
778a201r17M321k131l553M059J431m484K080L744l754j273M493j926l809L614
793F94J064m571J872L481l453j136M374r60l505L095J214m339Q29L425l390j515
809b821M084n17l159K876J991l748N10L460k849k026L387l70l446K666K002l195
825a155M25L188j459k608L298M24l932J531K125l235n68L359r87k533K993J042
$$ y = [-3500, 1376, 1803, -3314, 188, 4044, -857, -1595, 3768, 770, -3698, 1394, 1582, -3961, -1280, 3071, -1904, -2484, 3542, 1473, -2902, 2072, 2893, -3110, -975, 2950, -2236, -3567, 2314, 363, -3235, 1297, 2960, -1640, -295, 3770, -619, -2494, 2105, 528, -3736, -22, 2088, -2451, -902, 3261, 401, -1765, 2318, 1724, -2924, -101, 1729, -2251, -2445, 2123, -114, -2822, 1569, 2568, -1979, -38, 3355, -1201, -2118, 2203, 72, -3481, 578, 2009, -2475, -395, 3349, -405, -1678, 2815, 889, -2920, 694, 1758, -2813, -941, 2540, -913, -2049, 2325, 1365, -2140, 955, 2169, -2170, -1341, 2084, -1306, -2821, 1263, 746, -2413, 463, 2454, -1294, -784, 2676, -173, -2199, 1188, 818, -2628, 38, 2040, -1155, -730, 2458, 999, -1609, 1689, 2113, -1819, -288, 1837, -1398, -1966, 1393, 406, -2127, 866, 1908]
841A908l197R00K967l107j511L652j263l006K703J638l614J159L391k746j330
856a456L278r04k895K337R60l536R65K839k113j225L327l65k786K378J025l106
872a277J10K781j944j717K870N7k351J659K106k606l14K364j477k055K387L93
888I86k701J125J843k092n79K837r37k176K394L77k798M84K334j831q89K770q96
905B51j778K170J163k595M75K004j847j157K514m31k257J805J148k338M61K452
921B040k189q11J996o63k117J613R17k203K72K208j229j184K415o3k052J068J271
938A289k233o2K220j388j330J936N28k434J511J793k323l42K471j627j708J958
954B59M43k195Q04J881j852l46K423p14j697J794P56k376N11J644j452j096K003
$$ y = [1908, -1289, -389, 2578, -529, -2040, 1612, 349, -2657, 46, 1684, -1930, -771, 2620, -126, -1456, 1822, 918, -1977, 360, 1320, -2216, -1251, 1588, -525, -1750, 1577, 1212, -1574, 804, 1829, -1277, -1167, 1614, -330, -2047, 823, 880, -1471, 188, 2294, -312, -626, 1738, 261, -1794, 593, 986, -1715, -590, 1253, -839, -1418, 1419, 482, -1694, 700, 1077, -1721, -1237, 1097, -734, -1623, 1147, 251, -1527, 643, 1806, -789, -314, 1690, -157, -1314, 1200, 769, -1488, 317, 1465, -873, -412, 2040, -149, -960, 1036, 373, -1744, -131, 786, -1417, -1145, 1063, -166, -1350, 1065, 1002, -1050, 18, 1289, -944, -1006, 1214, -174, -1504, 432, 960, -1474, 37, 1830, -493, -835, 1636, 9, -1699, 259, 702, -1493, -689, 1192, -660, -1006, 1417, 703, -994, 800, 1556, -820, -309, 1335, -117, -1213, 790]
971G90m55j320J491Q17j908J21J907j603j189J917j91j953J365J121j652k91J907
988H74r55j276K043K92k289J153J518k153O1K001j157j166J852J71j971R59J412
1005A369k110OJ601q45j427J969L16j979Q17J491j574o93K000q73j305J334M04
1022E01j431L97J597j152r57J971k41j568R87R25j796K81J310r37j022J732K12
1039H09j778R83J061j542k78J590n15j580J648L29j822J148Q88j367k10J898q92
1056C70j335J406P74k374R92J032j429l17J934r38j310J424Q33j625K8J517j351
1073c69o61J432j80j521J211O63j231J21J722j210r17J784l12j477J157P09j326
1090d05j13J525r33j212J585k1j356P80Q58j163n85K006p83j274J470M57j849
$$ y = [790, 335, -985, 506, 1323, -585, -464, 1443, -160, -1349, 568, 377, -1576, -211, 910, -742, -1033, 874, -81, -1357, 686, 978, -1311, -158, 1360, -793, -732, 1269, 112, -1054, 798, 969, -1002, -43, 1369, -741, -735, 866, 21, -1406, 563, 879, -1100, -283, 1208, -366, -1059, 941, 68, -1237, 97, 501, -930, -533, 1064, -88, -1045, 926, 685, -883, 104, 1029, -767, -486, 824, -113, -1135, 597, 809, -969, 14, 1075, -467, -745, 845, 330, -1250, 398, 727, -1095, 53, 941, -426, -636, 1262, 370, -965, 441, 1215, -1159, -167, 865, -564, -881, 1053, 115, -1195, 229, 1062, -563, -535, 982, -369, -1030, 402, 222, -1299, -88, 575, -656, -535, 1187, -23, -940, 844, 532, -945, 212, 921, -405, -518, 1007, 74, -1138, 447, 426, -930, -150, 708, -455, -1040, 966, 183, -1091, 379, 836, -1013]
1107a013M36J642j291l96J582n03j844J468P72j536K93J599j388n74J946p16j577
1124a100J156Q15j389J35J254q53o91J205R0j504R04J001j502K00J073q81o57
1141g44J156j73r63N34R02p80n88J461l85j056J057N38j760L81J370j261n36J628
1159G81m66j336J105J010j657J09J608j303o37J482j52j619J052R59j794K70J588
1176A000j138r42J729j66j633J313P58j717J30J629r11r02J085K35j314Q54P12
1193G22j092k28J353n16r11O39P71j121J45J099r93n81J351k00j510J349M38j027
1211c12k34J529q38r55J394j36j304Q56P88j702L06J796j217p24J365j15j462
1228i65P37J136j397p7J213p57r39J361J28j583J086J144j606j80J636o36r25
$$ y = [-1013, -577, 1065, -226, -622, 960, 457, -1387, 81, 853, -683, -390, 1209, -179, -753, 1193, 477, -1100, 56, 871, -518, -383, 871, 18, -673, 532, 622, -882, 22, 1023, -479, -279, 794, -87, -744, 412, 239, -724, -190, 712, -68, -656, 805, 420, -636, 421, 959, -801, -420, 950, -311, -847, 781, 315, -1021, 84, 1094, -563, -454, 1154, -149, -786, 696, 544, -1075, -23, 936, -858, -588, 1000, -138, -1080, 649, 483, -1150, 163, 921, -796, -666, 963, 52, -850, 235, 470, -844, 10, 722, -370, -598, 755, 239, -672, -33, 738, -383, -238, 861, -132, -713, 638, 438, -1072, 277, 715, -312, -546, 983, 145, -810, 584, 448, -856, 0, 788, -914, -608, 1188, -29, -753, 612, 497, -965, -228, 908, -489, -566, 647, -110, -1049, 312, 440, -1143, -57, 1087, -519, -699, 937, 301, -624]
1245f24R96J98j046N35Q16j197j66J220m41r06Q38P02j311m0R12o74n19J166k56
1264B03r20O38O77j109K3J092j081l76J442J56j523P23P86r94m74J690p73r50
1282g70J165K06j253M74R89r93l33J286n25r52R70K67j449N95Q86r60N2J226o39
1301B42q22J032M02j428L29J072q55n56J083k67r37N78O08r95M72N86p75j74P97
1320C92K7j179N65O66r46R7P23l58m00R36O9j277N38Q79j064Q6R44n23q94J225
1340E06J70j271O86Q28j129l92R25k91q28R22K37j234O05O74q61j75Q65l67m96
1359f26P69M51j273N15Q67r73k22Q97K3o81N79J34q68J70R68o83p74J108Q4j047
1379e82L59J006r76k56R34l06r40J164j53q56J80Q32n51k04J122p67o18P98L22
$$ y = [-624, 372, 570, -476, 59, 875, -322, -488, 732, 291, -615, 223, 925, -386, -426, 486, -188, -707, 459, 203, -717, -79, 598, -511, -488, 604, -477, -853, 589, 745, -778, -55, 731, -263, -737, 953, 180, -770, 395, 601, -652, -178, 811, -182, -515, 771, 246, -706, 264, 531, -918, -323, 563, -397, -345, 881, 242, -580, 452, 854, -574, -245, 827, -28, -584, 499, 232, -705, -127, 481, -514, -42, 544, -231, -405, 392, 419, -760, -195, 471, -475, -378, 345, -13, -413, 523, 592, -685, -147, 732, -332, -246, 698, 175, -719, 506, 676, -595, 91, 919, -210, -602, 323, 32, -796, 126, 363, -871, -266, 408, -453, -628, 237, -130, -626, 143, 594, -679, -164, 703, -270, -492, 405, 428, -253, 326, 460, -408, -238, 730, 47, -727, 381, 465, -582, -223, 783, -193, -449, 485, 179, -761, 403, 250, -606, -426, 406, -145, -349, 773, 6, -612, 186, 508]
1398E08p53K53N55r96l4Q17k88p44P44L85j213P93M52p11k70Q79l08n36O89J86
1418D08q96M14N86l21m31M93J31q90P89J51q58K6R02l28o20P82J74r03M35O10
1438F54j097J49Q49m86o50O73J76o93L73L44p26J87O17m1q91Q39K02p49N2O16
1458C98l17l61Q97n85k67N23j89n17K74N79p24j70N70J77p11N93P7n33J71L22
1478B07m52k0M35R6p93N11L65m16j36N52j58n07O19J6p16L93K45p05K9P42l42
1499c5k04M43M5p07P36K73p51q5M27j96o01N40K88l99P7N79l50m59O91k89m37
1520d14O43L4o18P9L43k18k14O07J34o79L24L09l30k20K77Mm01L77j1l14L07L61
1542C80l41j57N31l70l30N40j08o14L67L47k66k78M95k50l53Q25j12p25M20J10
$$ y = [508, -245, 8, 563, -433, -467, 350, 62, -682, 62, 447, -766, 27, 479, -232, -502, 377, 69, -467, 222, 408, -488, -74, 512, 191, -240, 253, 384, -506, 283, 434, -424, -398, 504, 176, -444, 338, 512, -391, 44, 654, -443, -294, 555, 69, -581, 92, 268, -425, -52, 292, -434, -247, 370, 329, -562, 277, 479, -270, -218, 398, 81, -280, 617, 32, -235, 288, 99, -418, -144, 435, -289, -459, 111, 288, -423, 170, 247, -286, -115, 207, -245, -265, 170, 266, -527, -16, 349, -67, -203, 349, 191, -316, 303, 319, -397, -4, 241, -464, -435, 307, -35, -239, 204, 249, -458, 278, 551, -200, -285, 142, -54, -655, -115, 173, -226, -149, 430, 80, -379, 312, 23, -414, 229, 263, -355, -276, 67, -151, -365, 242, 376, -303, 21, 330, 0, -220, 57, 61, -340, 37, 26, -288, 19, 380, 39, -118, 413, 43, -287, 253, 145, -469, -102, 245, -21, -299, 196, -54, -407, 418, 306, -419, 1, 111]
1562A11m18R9M74m13k65O96j3m69L18J80m00n0L78m04L8K46J25o19L28K16k65
1583a07j10O57l4o76J79J31l01j41O50n02K43L29j30n31N78m6m30L5N16m24k47
1604c61N60q3l84L12K07l08K23N12n82m34K65L19q05M55M22m73l6L97P4n20O77
1625D37k51l86K08O1l82K66N3j70l48M30K49k28j1L65l54l15Q21l35k32Q1P9k35
1647a97RO55m16k5K35k35k07J39K58m83j43N61j99p9L75j06k73J40K67m64J57
1668c1M12m44l39M56L4k81J59J45j01j95P33m47n41N96j35j82mL46m54r5O41q5
1690A88k52J67L14l45k05J52j18r6M70l04j74J51L57m00PL75l62L7K3L6j30m3
1712a52L06j68r8O14l01l74O11l19k44J62J01m38m3L85Jl41K59Rk44J6M17n46
$$ y = [111, -307, -208, 266, -147, -412, 284, 271, -198, 120, 300, -100, -150, 228, -176, -138, 108, 233, -386, -58, 158, -107, -217, 440, 406, -270, -91, 40, -261, -402, 248, -254, -11, 318, 188, -343, 235, 189, -241, -206, 310, -114, -361, 199, 116, -268, 44, 251, -57, 166, 678, 96, -338, -73, 246, -559, -104, 318, -155, -191, 206, 280, -240, 437, 186, -200, 8, 69, -313, -47, 6, -164, -512, -82, 167, -61, -72, 293, -61, -376, 445, 110, -122, -41, 38, -197, -188, 467, 51, 26, 261, 26, -181, -42, 216, -267, -410, 151, -48, -127, 248, 142, -131, 9, 276, -188, -31, 381, -63, -402, 54, 88, -193, -34, 111, 10, -185, 548, 101, -440, 156, 21, -161, -165, 181, -273, -368, 273, 188, -64, 103, 417, 72, -133, 19, -99, -195, 275, -29, -203, -52, 305, -95, -88, 287, -75, -38, -15, 21, -109, -152, 154, -14, -112, 502, 201, -173, 438, 119, -125, 37, 138, -300, -343, 42, 43, -298, -39, -30, -274, -258, 159, -387]
1734c87J51M66k98l22L75K68n17J77L41j40n06N22J30m29K04M7k78j05M35k51
1754a17M3M12j36j76l6L26m35k38L82p6j69K71oj29J48L83m40J05K76m14k09L98
1776A63j40r9p5M44j55m01N35l37l19O73n3p10M87K98l66l58O81l26j61M11j15
1797G7r6J25J83p0l59J88J28k14K28r0l13J09J77j55k13L69P7j44k98M24m96p5
1819d38N40k57j56M63k7m73L81J73j32j18J49j36k74L23J48m57L02M02m69k06
1839b62N17O0q23N94M4l35nM97m20m1K79o8p2j31K51k03j5M76n12j35K31K04l27
1862a96J68O22n83J6M91m74j68L58O5l00j26M87l22k6L87r8n37L32m9m25K78K25
1884A25k69j92N38k73q4L09K06o80L66M6j03k7J23J66n40M05K04n14J5L99l90
$$ y = [-387, -236, 230, -68, -390, -15, 253, -264, -87, 254, 114, -392, 130, 260, -169, 35, 82, -196, -301, 134, -117, -74, 338, 202, 26, -10, 316, -119, -357, 25, -51, -220, 51, 45, -84, 64, 447, 7, 112, 388, -26, -235, 163, 23, -76, -151, 293, 138, -263, 272, -65, -384, 289, 236, -474, 13, 311, -55, -413, 268, -58, -219, 192, 77, -19, 106, 289, 219, -140, 48, 176, -38, 190, 100, -213, -104, 73, -82, -295, 74, 151, 7, -291, 133, -363, -438, 102, -155, -311, 152, 125, -348, 33, 206, 74, -44, 105, -31, -305, 18, 166, -291, 11, 413, -56, -262, 255, 315, -508, 86, 130, -205, -210, 287, -133, -174, 105, 37, -35, -166, 85, -118, -133, 343, -169, -304, -73, 131, -196, -28, 594, 11, 27, 518, 44, -124, 234, 299, -1, -127, 360, 38, 12, 399, 301, -236, 96, 47, -378, -100, 125, -144, -336, 202, -71, -155, 154, 360, -320, 46, 92, -11, -38, 85, 251, -289, 116, 320, -194, -179, 220, -170]
1905a70j14O85n8l52j15K93k98l9N09m01l12N41K2k52K46K36k05k78K81o3k82
1926a26K45j30m58M23L34j73m46N49k04k18L13n2l80N6L32k41Q7K34l6k96M82
1947B95o4k79J30N2j44l47M06j25k43K59K60k01M6R9r3j54L39k80l35K34L48m19
1969b16J50J51k1l17J42J98j60p4J68j91p9K64kk42L84K8m53M53q5k66K26Q3k00
1992e9L1J92R5l22M0L29q5k59K29j95k9p9L7j03K68oJ97m65K49J07m21R0K85j77
2016e1j11J45J25l23K95P3k29j12K87k13k49L61K18m41K72P5k86o5P62n10l08
2037b85K56J9J52k28K02k39O6l5J79l00L59k28j6J77L15l12J08J19k57p4k05L98
2059A71j43j91J09R2j30K24k60J09L27k22l27K02n7m0J61K19j83k00J08J61l64
$$ y = [-170, -284, 401, 343, -9, -124, 169, -129, -168, 341, -60, -372, 169, 191, -61, 185, 421, 216, -62, 219, 156, -126, 119, -11, -469, -46, 288, 115, -331, 218, 14, -204, 109, 57, -323, -267, 65, -176, -89, 145, 109, -187, 295, 231, -48, 82, 134, -10, -357, 49, -76, -319, -60, 200, -1, 45, 144, 51, -103, 236, -44, -379, -145, 203, -216, -66, 85, 64, -253, -111, 87, -73, -147, 21, -170, -249, 15, 13, -229, 155, 183, -270, 183, 98, -168, 58, 141, -59, -28, 164, 259, -63, -23, 306, 221, -38, 191, -4, -33, -112, -75, -178, 90, 84, 281, -184, 65, 172, -249, -159, 126, -51, -162, -17, 108, -215, 80, 153, -76, -188, 99, -114, -363, -2, 216, -225, 47, 122, -164, -229, 533, 23, -285, -29, -10, 142, -86, 116, -123, -57, -92, 87, -213, 146, -82, -98, 79, 394, 82, 190, 309, 52, -22, -227, 171, 28, -163, -54, 38, -92, 132, -128, -19, 308, 86, -241, -39, -96, -136, 25, 244, 61, -139, -31, 130, -234]
2080b34K20K19l69LL85R1m45Q0J94m53K77j59K61k91L08q9k00K38Q3k71J36K74
2102B58l06j04K73R3o14L90K8k4j83N78n79j27L52K56l04j39L67l02j0K46j60
2123a1j0K69j35k79J57K85n34J00J93k82r3N51L0l35J57J24m21M3L54k76K33r3
2145B7R6l97L45L7k17J19N6j69RK52n8j87j67M21k47o3L18P7n60K47j21o9K98
2168D7O7j09M6n3J54j30j9K04j65k24L38r8j14J35q8r8K36j27q5J61K68m18KK58
2192A88j75j9j8j05l2J75J60k18K35l6j13j0Ro3n5L6J31j79k6J50Kk68j40M88
2216A17n1l21J02K54l19K49K08m23J29K51k17N8Rj3LO7r0j7Q3j73M59l78P6J28
2240A91j58j8j1q7J75m7k01K47J6j50K25k10J34k37K58k15R0o5p9K68k97K40J56
$$ y = [-234, -14, 205, -164, -161, 224, 315, -130, -50, 144, -309, -32, -191, 70, -221, 87, -2, -202, 36, 119, -152, -16, 258, -48, -152, 121, 214, -400, -10, 18, -6, -189, 389, -190, -317, 35, 291, -13, -152, 215, -87, -97, 149, -11, -21, 248, 113, -166, -9, 276, -258, -158, 35, -247, -340, 211, 241, -94, 63, 187, -234, -191, 163, -113, 120, 27, 123, -274, 71, 108, -109, 10, 66, -103, -94, 158, 100, -87, -254, 167, -80, -143, 175, 252, -308, -61, -182, -251, 47, 114, 5, 51, -2, 152, 22, 3, 207, 42, -182, 156, 58, -56, 79, -9, -107, 129, 2, -83, 78, 346, -72, -70, 188, 13, -6, -24, -129, -161, 14, 174, -44, 191, 155, 42, 32, 41, -22, -77, -41, 90, -89, -115, 35, 37, -231, -371, 117, 66, -255, -153, 101, -218, 31, 239, -184, -55, 196, -21, 37, 46, 33, 36, 103, 13, -4, 79, -94, 365, -13, 63, 191, 33, 15, 4, -83, 92, 45, -156, 91, 107, -43, 182, -28, 106, -131, 127, -88, 2, -63, -142, 126, -171, 69, 225]
2263B25l91k6L15j28k19K69Q2Mk28K26q4j31K40J06m71L48k2k00J22P7j21RQj02
2287i2p2R0J68l77L87N7k28kJ80k76k44N24J7j24j33J50j12rL12l06j05L16K9
2310A50j87Q4k17K33k2m9N9J83l44j1q7K52J9N7j71J53J24l89l3K95O8j91K47
2333B23j55j97j6L29k53K3J19Qj27K28j54q4J47j4j11P2M17k45l57J42J30k64
2355a39K56Q9j89k5K58m56n4J23K45k44R7K84l83K21k01Mr2J75K6J2o5q1J74k59
2379b24M02j43j07L55j02k70p9K09l2k93M63L9n08J86K63j29J63j15O8l18K12
2400D0k34K71j12Q9k46P5J51r6J84J8j50k18j1K62k07k56M49m8k78O25k86j89
2422a67J79R2j09n3o3J3jO7M4k22L05O1q2l7J63j73J19l7j23n8Q0m9Q9m4l09L04
$$ y = [225, -166, -192, 123, -5, -224, 45, 127, 131, -97, 129, 45, -86, 154, 260, -211, 137, 115, -85, 37, 114, -7, 2, 10, -92, -164, -74, 94, -283, 104, 161, -67, -69, 111, -165, -409, 115, 132, 8, -125, 25, -87, -96, 216, -90, -195, 121, 150, -37, 47, -170, 63, 41, -8, 51, 234, -110, -121, -208, 44, 63, 120, -51, 102, 226, -163, -196, 99, 167, -24, 223, 68, -129, -145, 184, -69, -46, 73, 81, -46, 182, 28, -56, 91, 77, -34, 38, 455, 210, -147, -5, 125, -139, 117, 206, 17, -8, 250, -206, -260, -137, 108, -136, -39, 245, -138, 83, -118, -114, -206, -31, -5, 7, -58, -139, 35, -224, 178, 35, -72, 283, 181, -89, -168, 41, 9, -284, 179, 218, -290, -104, 159, 30, 193, 78, 146, -172, 40, -194, 77, -35, 54, -192, -117, 34, -62, 122, 140, -10, -228, -239, 23, -184, -440, 9, -39, -317, 308, 22, -167, 12, 104, -5, -58, -121, -108, -109, -42, 2, -220, 85, 146, 64, 27, 190, 17, 136, 99, -24, -82, -2, -51, 38, -6, -315, -11]
2448a1k9K49j36k27j30L42j48p2L13n2k18K29j2l21N0K83k08m3K80m5m28K96L53
2471C15l79J84j0L2k20J55p0n2j11K45m14J31J08L36k68n3L76k14J34qm78K09
2493e2J33j1r2p2J67l04K12J36k30N2J19K5k19K8J36k4o1lK58k52M0q6j30J01
2517a29J71K7j80K08r6l99J65K70k55O1K09l10J88Q3l3K8M9P9m4n2J96l70l9J54
2541a9J48k90L1N36o86J59L21n60L47K01j8k27K03L2k38Q4J21Q8k78P7o6j16m7
2564a97L96j30J52j11k68J32k1j7M8k97J0J26RK4K71m58L71L2K8J8j2m8j79L18
2588A97j00j57K89j03j54J27K69l16j34L02m69P2J17m5k4j24O7L92k45J91j61
2609ik5k00L24j26J09M0n4l98K51J08o5M8K23l3j42p5o2K33r5j00n8J15ql1N2
$$ y = [-11, -40, 209, 73, -154, -284, 58, -90, -162, 151, 99, -119, 110, 98, -223, -173, 110, -98, -141, 139, 94, -334, -38, 315, -64, 120, 110, 142, -78, 77, 7, -45, -156, 89, -325, -194, -86, 250, -18, -71, 305, 91, 225, 217, -261, -52, 81, 70, -22, -94, 73, -231, -19, 117, -113, -61, 58, 83, -136, -108, 28, 4, -57, -60, 198, -54, -14, -100, -230, -129, 42, 69, -111, 97, 1, -398, -233, 37, -218, -157, 52, -258, -70, 13, -20, 8, 57, 136, 92, 40, 236, -134, -173, -19, 129, -161, -130, 406, -280, -121, 200, -360, -13, 188, 170, -57, 146, 178, -60, 24, 145, 233, -45, 32, -34, -150, -197, 199, 69, 221, 110, -158, -26, -47, -64, -16, -313, -303, -177, -168, -144, 127, -331, 40, 72, 100, 118, 106, 58, -121, 197, 97, -60, 229, 126, -28, 99, 368, 52, -82, 220, -249, -177, -60, -105, -129, -253, -186, 206, -39, 152, -9, -34, -234, 90, -36, 73, 113, 59, -339, -88, 20, -45, 3, 226, 193, 51, -24, -86, 147, 52, -48, -106, 9, 1, -30, 22]
2634B2l8J51l13L55m45mp6N09j38j94N79l99j84K17k7j44Q1j6K36j25N1p7j26
2657a05l1M03k37o1O1NO7Q0k2l58J70K5k69J55pL1J27J02K12l47N3j9k9j24L27
2682B09l43L4J1K01j88J07N7j78J84l20K04j42M3p0J47J24J42n9j41K32l6k93
2704g5K4mN8q2K25k27j8K54l60P7L84k11L3P0k10n4o9J64j9L0L9q0k4K51j63K52
2730B65l54J55j23k61L32jk5J23L3j65o4K12J26n29R9KR8l6P1o1J2M9K42k19J56
2755A37J04J50l17r7K54n95K23J91k66L28k23m3J82Q3l2l9Q9l9j15L7o4J02J25
2778A75j49k66L38l01K19q4l1J04O2l8j95J45K40r5m1p3Ol0j0j26J19O2o8J15
2802G8Q8k88j07J33J54OJJ88k91ML2l1L5Q7P3k00K7K1O8q4L46k6l60J13Q1k77
$$ y = [22, -16, 135, -178, 177, -268, -272, -348, 161, 23, -171, 408, 9, -175, 42, 15, -129, -48, -64, 172, 47, 98, 21, -105, -136, 267, 30, -31, 30, 35, 102, 182, 160, -198, -28, -3, -272, -117, -124, -93, 34, 136, 348, 1, 54, 35, 6, -118, 209, -134, -100, -89, 112, -76, 31, 88, -90, 94, -226, -22, -164, -121, -191, -44, 80, 222, 163, 22, 254, 218, -75, -51, -55, 3, -79, 146, -81, -99, 155, -205, -128, 256, 45, 78, 148, -62, -116, -185, -21, -40, -10, 29, -51, -75, 176, 13, 265, -89, 66, -57, -318, 14, 13, -12, 111, 144, -21, -85, 127, 253, -276, -177, -175, -77, -113, -42, -103, -91, -42, 200, -19, 137, 241, 391, 74, -23, 231, -364, -141, 50, -216, 112, -111, -154, 28, 111, 79, 40, 129, 90, -25, 12, -52, 50, 175, 26, -240, 98, -203, 16, -68, -99, 5, 67, 29, -166, -21, 219, 124, 83, 10, 16, -14, -24, -150, -31, 31, -37, 78, 166, -122, -229, -96, 58, 64, 65, 253, -38, -34, -2, -33, 2, 89, 162, -38, -11, 10, 78, -6, 340, 314, -46, 67, 148, -129]
2828a29L9R5q7k38M97k71l6J27m9j25K87j04j96J43k11K87j34K98k01L9o5O8m7
2851a3r9P8o7k21L03j91J00J11Q2j48k5L89l81L8J19j31M9k18L31k06l2J54L0
2874E2l6N4N7j1j46J30n1lk22K07j7P1J85k32L1J26j46Kk29N5n8R5j45J44j50
2899b37K44J1k00L55j17lJ82j36k50P6jn3J82k56J91J0P1k57N9J50QPj19j44o8
2924b95J26Q3K22k89K42M9j4m9jl4n8l30K18R8J4K58j23j32J31j20Q3l0K46p1
2948B24m01J85N1k56K14O4j20m3J85j3j64J13lk77J40p1J74r3K08L1k04M5n7N7
2972a1J24k48K78j27pj63K94o4j61J22j11J01J07n5j30K5k0k22K29J3l1J32j27
2995e2l4m0L93n19J33J19Q0j26R1j36P5k6R9k55J67J18J40j25p8j41O5k8R9l47
$$ y = [-129, -90, 5, -82, -320, 177, -94, -130, -3, -52, -177, 110, 6, -190, -47, -258, 29, -105, 193, -8, 31, -34, 34, -13, -112, -34, -101, -322, -19, -210, -110, 1, 83, -65, -90, 299, -82, -44, 75, -56, -7, -225, 106, -100, -132, 22, 52, 16, 70, 127, 116, -30, 100, 49, 46, -176, 31, 14, 85, 270, 38, 69, 195, 49, 51, -178, -123, -181, -86, -231, -87, -237, 7, 18, -182, 173, 56, 53, 235, 99, -151, -75, -76, -129, 53, -203, -12, -2, 69, -188, -129, 21, 29, 36, -83, -227, -295, -169, -86, 136, -153, 89, 138, 124, 75, 74, 40, -18, -348, -130, -32, -18, 240, 117, -15, 116, -4, 79, 49, 295, 224, -177, 8, 59, -197, 17, 81, -39, -82, 103, 90, -74, 39, 36, -241, -101, -172, 2, -91, 117, 148, -56, -11, -68, -11, 113, -135, 143, 16, 9, -154, 140, 76, -85, 37, -74, 27, 134, 79, -51, -26, -46, -268, -39, -26, -57, 75, -52, -86, -126, 267, -252, -119, 0, 80, -46, 45, -91, -16, -42, 57, -198, -31, 87, 227, 102, 24, -117, -52, -80, 19, -328]
3019c28K76P2L0q2o9j5N6L1J33J05l23J71k04Q4P9K00%k53K08k23J58J3q3j58
3043a22j02K79k15K54l65K82k7j12K89j23j77J56r3q0j13J01k3N0O6n8K60N9j97
3066a1Mn2R0l72K23R7j58L62l88K25j82L70j80Lro1j00j46M26j05N1M0J97k75
3090D9r4L2j49OO2J63j50J37jj98J23J63j0j90L01k06J4j21R8j41K32o7j5j37
3114i9K34j79r5J59j12m7n6J59Q3j09P2q4J2J03J14K1j8q4N4m11L72j20n3J9O0
3139eJ65j49O6j02K07k48L00m00l1J66L1j37L04l12K29l20O02j79k9k12q3J17
3161b0J16j81j71K25j43J52m5%K66n8J35m44r5J41q5J29j3L24l11J48O6j8n6j06
3185d4J15m7j12m3J42P6J05j78r0R4J07j85J9J09j21l9o1K76l69K36L1j55J66
$$ y = [-328, -52, 20, 50, -32, -101, -116, -60, -29, 104, 209, -114, 57, -147, -63, 16, 216, 216, -37, 171, -52, 106, 119, 36, -122, -224, 55, -160, 94, -271, 11, -16, -128, 161, 38, -139, 17, -76, -156, -269, -168, -191, -141, -75, -133, 127, 186, -11, -7, -59, 31, -341, -118, -21, -179, 183, -205, 20, -162, 208, 28, 31, 22, -39, -139, -285, 141, 36, 87, 127, 324, 49, -45, -13, -162, -156, -94, 69, -81, 56, 55, -143, -20, 143, 133, -57, 244, 38, 52, -69, 29, -112, 120, 53, 38, -99, 135, -44, -139, 20, -92, -139, -195, -36, 47, -62, 10, -74, -62, 41, 155, 176, 158, 74, 128, -283, 89, -31, -84, -65, -5, 160, 11, 77, -25, 182, -66, 234, -166, -197, -31, 0, -137, 167, -145, 84, -236, 366, 187, 158, -54, -137, -20, 96, -85, -256, -31, -174, -22, -67, -67, 199, 141, 276, -168, -263, -122, -207, -78, -91, 233, -78, 70, 136, 118, 62, -44, 71, 24, -88, -131, 11, 87, 192, 14, -76, 18, 125, -60, -41, 68, -53, -92, -153, 123, -246, -10, 21, -134, 32]
3208C2j41O7n8J24K23k47l7J17j04J8K28j81j65K11l3M2P6J60k84k07J07N1j11
3231a12j31J85j25K43r9K56r6j46R5j91P0J1J41m66L37L5J0k27L1mL78j55j87
3254a47K45k69K47j30K96l92R7kK60j47l28L13j70L3J06r0o8MK14N2l08J53J36
3277A05nk20O7Lj2K18k21j4mK40j03j08J54j27q4O4K00l01p4K61j57JJ75n5J09
3302A12J9J3j03K34k76N6r6j39L47k05K4k42L77M22m54j50J88l28J40QO4k56K58
3325A3j76K72j92j04K72N4k45J80L4k17J87k34J09o6R0j9j79Q8K91n0j47J42j1
3348I2j50l3K31l40J53M7J03j43J17OjK6j76K7K88j95k55j7L94m0J06k85L3j40
3372a52L47k17j57K44P5k55J74k70K24P9q0O2j65R3n5L5j5q6MJ97N1k31J18J29
$$ y = [32, -109, -42, -100, 24, 247, 0, -37, 80, -24, -6, 222, 41, -124, 87, 54, 96, 172, 332, 48, -159, -52, -1, -112, -243, -58, -183, 60, -39, 217, 121, -25, 70, -121, -51, -40, 101, -365, -28, 7, 17, -210, -179, -183, 195, 40, -147, 98, -171, 76, -54, 242, -150, -53, -55, 205, 58, -270, 43, -127, -94, 12, -78, -146, -142, 72, 124, -184, -31, 105, 100, -120, -53, -50, -62, 156, -65, -79, -83, 157, 54, -54, 100, -27, -111, -47, 153, -148, -222, 39, -118, -117, 58, 3, 112, 131, 144, 41, 275, -1, 55, -41, -180, 167, -38, -14, -256, 121, 543, 89, -61, 127, -201, -61, -53, 11, -245, 13, -163, 109, -83, -187, 85, 139, -106, 74, 108, -109, 78, -156, -47, -113, -23, -42, -221, -133, 158, 108, -39, 103, 92, -58, -91, 140, -200, -47, 0, 103, -40, 77, 83, 82, 108, -68, -41, 247, 52, -203, -220, 174, 134, 240, -45, -12, -152, 195, -22, -179, 65, 140, -115, 59, -211, 13, 92, 12, 74, -91, 2, -53, -18, -33, -119, -115, 82, 133, -98, 20, 149]
3396A49j89k2pJ62Q7j51M4K12k76o7J2J74Mj17l9L07k90O8l02K09o0R3L01k81
3420B1Rm5k8j78L39r6n1J13k27Q8J69j48n1J07k22J51O7q2KJ41K3j15q1P0j29
3445a53P9k0J77j47J72m7q7M7R8l11Q4K01n4k17L1K55j99J27j09P8J53o7J40j19
3469A12R6m10J23Q9r7J12R4j2j90Q3J57L7o3j23O6j71J85k57qL20p1k39K34j04
3493c7R4L4p9P8k26k5l6J80P5j65K89m9k24J04j9Q2o1J00n3J04m69L08j9J66m2
3518A10j7k43oj05N0J30O4K7k83M08l60l6J30J48P1J4k48J57o1n8p0M16l81K71
3542A28o2Q6Oj75K11J76m61q9J25J27j66MJ56k91J91K2rp1J92q6k16R9J87j44
3566f0k90N37k08L8oj76J66k4l3j24K49j33j4m1r1J48J66Qr0j50M15k65r3J92
$$ y = [149, -40, -62, -69, 93, 180, 29, 73, 285, 9, -58, -46, 128, 132, 15, -24, 283, -7, 61, -241, -32, -92, 1, 302, 21, 30, -15, -43, -221, 118, 22, -29, 84, -143, -55, 114, -34, -85, 22, -200, -49, 18, -64, -62, 79, 102, -13, -94, -24, -153, -74, -94, 83, -64, 108, 61, -26, 21, 119, -192, -108, 93, 39, -178, -147, 108, -91, 36, -73, 5, 158, 91, 231, 112, 208, -202, -79, 10, -87, 25, 119, 107, -83, 0, 157, 194, 131, 8, 74, -97, 88, -169, -177, 143, 72, -167, 67, -37, 57, 91, 12, 90, -136, -161, -197, -17, 58, -107, 182, 133, -91, 13, -6, 76, 15, 115, 62, 166, -303, 5, -14, 152, 110, 93, -150, -156, -261, -211, -81, -17, 10, -273, 135, -225, -261, -131, 17, 88, 102, -146, 11, -50, -108, -178, 238, -143, 128, 66, 152, 158, -17, 194, 370, -91, -180, -55, 72, -94, -90, 66, -225, -34, -12, -21, -92, 100, 14, -202, -103, 84, -60, -350, 187, -21, 17, 11, -165, 1, -23, -56, -180, 69, -64, -78, -119, -210, -62, 104, 112, 22, -128, 287, 22, -71, 121]
3590A21j77j56K98P8Pk65R6o2J29q6M7R7l18L58m25L91m2J0J1j18K19k26O8k51
3614a96K2R2l29L85K24j66J12j87r0M00m06K35n8K62q9l34j2LK25j61%O3O6m3
3638A8o7K4j0J11m1j7L7n1n6j06K83j83P7k4j21J49J44k84J26R2o7k98L28j18
3662e4J31j96L10r1k12L97m52L27k52J15j41K76m82K30Q9j1J96j89lj40J66l01
3684b87L82k8j14pK2k51L47J00k03J17J04j07j23R2N2l83L00r0nJ81o7j20Q9n4
3708e3J63j7J69k66jJ55k54J14r3j3J93NN6j31P3k21J07j03J2%J95p4MP2Jn3o7
3735b7P9k46K19j37J48l24K92r2J29L4J79j0k08j49K88l76K93k32O6L04l43K52
3757A39o8Rl8n8J71j07l13L53k19J12j26K52l3q6K14q7m12K05K9J86k09K25j19
$$ y = [121, -56, -212, 86, 164, 171, -94, 2, -60, 69, -17, 30, 127, -191, 167, -258, 133, 91, 101, 112, -6, 213, -13, 55, -196, -174, -82, -411, -26, 198, 32, 144, -43, -133, 267, -139, 96, 38, 300, 211, -123, -135, -132, 93, -68, -68, -5, 61, 18, -49, -25, -35, 76, 35, 18, 55, 4, -52, -158, 125, -58, 19, -5, -126, 23, 167, -117, 9, 101, 34, -264, 64, -54, 77, -119, 191, 100, -112, 285, -167, 160, -92, 23, -118, 158, -324, -94, -5, -16, 180, -9, -12, -152, 14, -287, 95, 67, -47, -54, -32, -283, 64, 164, -39, 78, 182, 75, -48, 44, 96, -287, 13, -77, -82, 99, 32, -88, 1, -53, 110, 93, 262, -4, -5, 150, -104, 10, -83, -96, 97, 102, 158, 27, 100, -121, -14, -117, -105, -105, 90, 16, 20, 92, 93, 40, -27, 52, -194, 25, -112, 36, -288, 4, -88, 41, 75, 254, 244, 36, -113, 175, -201, 92, -140, -74, 230, -113, 139, 71, 80, 42, -16, 155, 48, -265, 88, -131, -19, -145, 107, 74, -12, 202, 115, -297, -92, -63, 123, -86, 139, 20]
$$ [...]
8191h9
##END NTUPLES=NMR FID
##END=
