##TITLE=1H_UK-22
 THF
 8 sc, 
 9.11.2021
##JCAMPDX= 6.0         $$ Bruker NMR JCAMP-DX V2.0
##DATA TYPE= NMR FID
##DATA CLASS= NTUPLES
##ORIGIN= UXNMR, Bruker Analytische Messtechnik GmbH
##OWNER= root
$$ XWIN-NMR		Version 3.5
$$ Tue Nov  9 11:32:03 2021 Russian Standard Time (UT+4h)  she@DPX200
##.OBSERVE FREQUENCY= 200.1313468511
##.OBSERVE NUCLEUS= ^1H
##.DELAY= (6, 6)
##.ACQUISITION MODE= SIMULTANEOUS
##.ACQUISITION SCHEME= undefined
##.AVERAGES= 8
##.DIGITISER RES= 18
##SPECTROMETER/DATA SYSTEM= spect
##.PULSE SEQUENCE= zg30
##.SOLVENT NAME= THF
##.SHIFT REFERENCE= (INTERNAL, THF, 0, 15.7039)
##AUDIT TRAIL= $$ (NUMBER, WHEN, WHO, WHERE, WHAT)
$$ ##TITLE= Audit trail, XWIN-NMR		Version 3.5
$$ ##JCAMPDX= 5.01
$$ ##ORIGIN= Bruker BioSpin GmbH
$$ ##OWNER= she
$$ F:/spectra/data/she/nmr/H-F/1/audita.txt
$$ ##AUDIT TRAIL=  $$ (NUMBER, WHEN, WHO, WHERE, WHAT)
(   1,<2021-11-09 11:30:22.42 +0400>,<she>,<DPX200>,
      <created by zg, POWCHK disabled, PULCHK disabled
       configuration hash MD5:
       00 E9 B6 7A A2 85 ED C7 34 08 36 98 17 FE 4E 26
       data hash MD5: 16K
       B1 68 00 42 6F 02 CE D7 08 01 86 CC DB 80 99 A9>)
$$ ##END=
$$ 
$$ hash MD5
$$ 63 93 A7 E3 89 27 11 DB 0D FA AA 52 23 10 E5 A1
##$RELAX= 
##$RELAX= 
##$RELAX= 
##$RELAX= 
##$RELAX= 
##$RELAX= 
$$ Bruker specific parameters
$$ --------------------------
##$DU= <F:/spectra>
##$EXPNO= 1
##$NAME= <H-F>
##$PROCNO= 1
##$TYPE= <nmr>
##$USER= <she>
##$AMP= (0..31)
100 100 100 100 100 100 100 100 100 100 100 100 100 100 100 100 100 100 
100 100 100 100 100 100 100 100 100 100 100 100 100 100 
##$AQSEQ= 0
##$AQ_mod= 1
##$AUNM= <au_zg>
##$AUTOPOS= <>
##$BF1= 200.13
##$BF2= 200.13
##$BF3= 200.13
##$BF4= 200.13
##$BF5= 200.13
##$BF6= 200.13
##$BF7= 200.13
##$BF8= 200.13
##$BYTORDA= 1
##$CFDGTYP= 0
##$CFRGTYP= 5
##$CHEMSTR= <none>
##$CNST= (0..31)
1 1 145 1 1 1 1 1 1 1 1 1 1 1 1 1 1 1 1 1 1 1 1 1 1 1 1 1 1 1 1 1 
##$CPDPRG= <>
##$CPDPRG1= <>
##$CPDPRG2= <>
##$CPDPRG3= <>
##$CPDPRG4= <mlev>
##$CPDPRG5= <mlev>
##$CPDPRG6= <mlev>
##$CPDPRG7= <mlev>
##$CPDPRG8= <mlev>
##$CPDPRGB= <>
##$CPDPRGT= <>
##$D= (0..31)
0 1.2 0 0 0 0 0 0 0 0.06 0 0.03 0 0 0 0 0.0002 0 0 0 0 0 0 0 0 0 0 0 0 
0 0 0 
##$DATE= 1636443022
##$DBL= (0..7)
120 120 120 120 120 120 120 120 
##$DBP= (0..7)
150 150 150 150 150 150 150 150 
##$DBP07= 0
##$DBPNAM0= <>
##$DBPNAM1= <>
##$DBPNAM2= <>
##$DBPNAM3= <>
##$DBPNAM4= <>
##$DBPNAM5= <>
##$DBPNAM6= <>
##$DBPNAM7= <>
##$DBPOAL= (0..7)
0.5 0.5 0.5 0.5 0.5 0.5 0.5 0.5 
##$DBPOFFS= (0..7)
0 0 0 0 0 0 0 0 
##$DE= 6
##$DECBNUC= <off>
##$DECIM= 32
##$DECNUC= <off>
##$DECSTAT= 4
##$DIGMOD= 1
##$DIGTYP= 9
##$DL= (0..7)
0 120 120 120 120 120 120 120 
##$DP= (0..7)
150 150 150 150 150 150 150 150 
##$DP07= 0
##$DPNAME0= <>
##$DPNAME1= <>
##$DPNAME2= <>
##$DPNAME3= <>
##$DPNAME4= <>
##$DPNAME5= <>
##$DPNAME6= <>
##$DPNAME7= <>
##$DPOAL= (0..7)
0.5 0.5 0.5 0.5 0.5 0.5 0.5 0.5 
##$DPOFFS= (0..7)
0 0 0 0 0 0 0 0 
##$DQDMODE= 0
##$DR= 18
##$DS= 0
##$DSLIST= <SSSSSSSSSSSSSSS>
$$ [...]
##$SUBNAM2= <"">
##$SUBNAM3= <"">
##$SUBNAM4= <"">
##$SUBNAM5= <"">
##$SUBNAM6= <"">
##$SUBNAM7= <"">
##$SUBNAM8= <"">
##$SUBNAM9= <"">
##$SW= 18.0517286264689
##$SWIBOX= (0..15)
0 0 2 0 0 0 0 0 0 0 0 0 0 0 0 0 
##$SW_h= 3612.71676300578
##$TD= 16384
##$TD0= 1
##$TE= 0
##$TE2= 300
##$TE3= 300
##$TEG= 300
##$TL= (0..7)
0 120 120 120 120 120 120 120 
##$TP= (0..7)
150 150 150 150 150 150 150 150 
##$TP07= 0
##$TPNAME0= <>
##$TPNAME1= <>
##$TPNAME2= <>
##$TPNAME3= <>
##$TPNAME4= <>
##$TPNAME5= <>
##$TPNAME6= <>
##$TPNAME7= <>
##$TPOAL= (0..7)
0.5 0.5 0.5 0.5 0.5 0.5 0.5 0.5 
##$TPOFFS= (0..7)
0 0 0 0 0 0 0 0 
##$TUNHIN= 0
##$TUNHOUT= 0
##$TUNXOUT= 0
##$USERA1= <user>
##$USERA2= <user>
##$USERA3= <user>
##$USERA4= <user>
##$USERA5= <user>
##$V9= 5
##$VALIST= <valist>
##$VCLIST= <CCCCCCCCCCCCCCC>
##$VD= 0
##$VDLIST= <DDDDDDDDDDDDDDD>
##$VPLIST= <PPPPPPPPPPPPPPP>
##$VTLIST= <TTTTTTTTTTTTTTT>
##$WBST= 1024
##$WBSW= 4
##$XGAIN= (0..3)
0 0 0 0 
##$XL= 0
##$YL= 0
##$YMAX_a= 64704
##$YMIN_a= -95141
##$ZGOPTNS= <>
##$ZL1= 120
##$ZL2= 120
##$ZL3= 120
##$ZL4= 120
##$ABSF1= 10
##$ABSF2= 0
##$ABSG= 5
##$ABSL= 3
##$ALPHA= 0
##$AQORDER= 0
##$ASSFAC= 0
##$ASSFACI= 0
##$ASSFACX= 0
##$ASSWID= 0
##$AUNMP= <proc_1d>
##$AZFE= 0.1
##$AZFW= 0.1
##$BCFW= 1
##$BC_mod= 2
##$BYTORDP= 1
##$COROFFS= 0
##$CY= 11.3945322036743
##$DATMOD= 1
##$DC= 2
##$DFILT= <>
##$DTYPP= 0
##$F1P= 2.36226072786647
##$F2P= -0.459571619588291
##$FCOR= 0.5
##$FTSIZE= 0
##$FT_mod= 4
##$GAMMA= 1
##$GB= 0.15
##$INTBC= 1
##$INTSCL= 1
##$ISEN= 128
##$LB= 0.24
##$LEV0= 0
##$LPBIN= 0
##$MAXI= 10000
##$MC2= 0
##$MEAN= 0
##$ME_mod= 0
##$MI= 1.114404
##$NCOEF= 0
##$NC_proc= 0
##$NLEV= 6
##$NOISF1= 3.799351
##$NOISF2= 2.8
##$NSP= 1
##$NTH_PI= 0
##$NZP= 0
##$OFFSET= 15.70392
##$PC= 1
##$PHC0= -15529.46
##$PHC1= 33.80082
##$PH_mod= 1
##$PKNL= yes
##$PPARMOD= 0
##$PSCAL= 0
##$PSIGN= 0
##$REVERSE= no
##$SF= 200.130013532006
##$SI= 16384
##$SIGF1= 3
##$SIGF2= 2
##$SINO= 400
##$SIOLD= 16384
##$SREGLST= <1H.CDCl3>
##$SSB= 0
##$STSI= 0
##$STSR= 0
##$SW_p= 3612.71676300578
##$SYMM= 0
##$S_DEV= 0
##$TDeff= 0
##$TDoff= 0
##$TI= <>
##$TILT= no
##$TM1= 0
##$TM2= 0
##$TOPLEV= 0
##$USERP1= <user>
##$USERP2= <user>
##$USERP3= <user>
##$USERP4= <user>
##$USERP5= <user>
##$WDW= 1
##$XDIM= 8192
##$YMAX_p= 0
##$YMIN_p= 0
$$ End of Bruker specific parameters
$$ ---------------------------------
##NTUPLES= NMR FID
##VAR_NAME=  TIME,          FID/REAL,        FID/IMAG
##SYMBOL=    X,             R,               I
##VAR_TYPE=  INDEPENDENT,   DEPENDENT,       DEPENDENT
##VAR_FORM=  AFFN,          ASDF,            ASDF
##VAR_DIM=   8192,          8192,            8192
##UNITS=     SECONDS,       ARBITRARY UNITS, ARBITRARY UNITS
##FACTOR=    0.0002768,     1,               1
##FIRST=     0,             0,               0
##LAST=      2.2672688,     0,               0
##MIN=       0,             -95141,          0
##MAX=       2.2672688,     64704,           0
$$ Real data points
##PAGE= N=1
##DATA TABLE= (X++(R..R)), XYDATA
$$ [...]
1727A33r9lM8j34N3n7J08p8j94L35l40L59k92J86k71o2M77r1p4l3j96O7J21J52
1751A15k64J38K22l08m8K66R8m23J69O5p0J90k92J16N3Qj72R9J01j26Q4L6l5K25
1775B47m87M49l70R9L42k19l6K16k59p6J60J18l27j0K29k08K45j23J6J26j65M7
1797A4K1j55K14m19N40n49J94K51j97K82m3M0k22%J20J37l25K04l04J97J00j7
1819H3o3j44K4P2j47J8J04J9P1p3P8jj39O0j77K35N5q3L21k68N1j24M6O3k42L72
1845B11k15j70L88m70M12k63j98P10m27J2J41m5M1L4j49n8l0o4L13k72J55j21
1867f5K48k05j28j54R6K65o5O0P9j00j12L26j56L6l16L81j20M9l35K70j70j63
1889b79J94L3l4%KJ62K40o51L92p8n9M02l50R2l91K80R7O7P9m59K53j10j9K76
$$ y = [133, 34, 31, 79, -55, -2, -59, 49, -29, -223, 112, -228, 131, -161, 25, -246, -308, 169, 78, 4, -29, -225, -158, -37, 115, -149, -11, 211, -97, -145, 121, 219, -204, -35, 30, -40, 150, -142, -26, 27, 35, -137, -38, 63, -63, 21, 57, 22, 247, -240, 209, -161, -62, 280, 61, 25, 241, -18, -94, 66, 184, -143, -153, 76, -132, 113, -10, 6, 132, -33, 14, 35, -120, 94, -325, 215, -334, -140, 111, -86, 196, 153, 193, -29, -29, 91, 228, -97, 107, -197, 0, 100, 83, 20, -124, -100, -28, -175, -157, -53, -34, 37, -36, 42, 41, -98, -38, -215, 20, 75, -8, 313, 45, 96, -28, 18, 81, -161, 211, -4, -174, 214, -256, 156, -107, -305, 405, -22, -10, 131, 86, 127, 161, 12, -46, -76, -140, 173, -99, 56, -65, 183, -22, -150, -304, -208, 57, -8, 52, 131, 31, -81, 245, 89, 125, -191, 190, 70, 119, -216, 54, -116, -279, -85, -52, -86, -86, -84, 78, 318, -333, 59, -19, -78, 324, -26, 66, -325, -45, 52, 119, 198, -261, -8, -118, -137, 139]
1913A39p3m5J22k71OM1k2M7K30k96L07k32P1j72K52n8n8K27l52L3L02k07m7j31
1937a87R9O8r1K4o9O1L49l52J30k15K64l4k56J91Q7j76o8J62P9j86L16k59j15
1960a78K50k22n7L15l04K83l29p6J88%L39j40K12k37r8j56L03l4J58k47j39L24
1982A55j77R9J1j64J28l20K49n8R0K9o6k5N1M%j29L1l8J41R9m48J68Q2k66L73
2007A9m9J8m1j25L78k06l0j2J45J21k40J71j41J28j66L6L12m07j59L05p9M4P0
2030I2j60m7Q5j81L84k56L59k40j43J32k50J49P6k7K66j39k47J18J64p3p5k23
2052b36J09J51Lj42l9j45M72j93j19L76n68J7M7J81kp4J31J72k21o7K46j31K33
2075B01m05R4L08j59k27J32K4Jo1k5L38k95l1N2K59l08j5K28k60J21j82L7L4L69
$$ y = [139, 66, 21, 143, -128, -122, -81, -103, -56, 174, -122, 185, -47, 24, -148, 104, 46, -12, 215, -137, -104, 198, -9, -56, -187, -88, -20, -111, -87, -156, -95, 254, -98, 32, -183, 81, 47, -209, -18, 69, -107, -175, -13, 66, -120, 196, -63, -178, 72, -150, -207, 108, -196, 87, -242, -318, -130, -130, 209, 69, 281, 44, -54, -210, 93, 59, 217, -30, -169, 155, -22, 77, 88, -76, 52, -268, -19, -77, 13, 42, -24, -49, 2, 6, 6, -123, -92, -130, 11, 110, -338, -170, -88, -354, 19, -30, -12, -53, -178, 200, -6, -36, -48, 97, 218, -22, 149, 8, 136, -30, 6, 318, -89, -248, 57, -22, 22, 92, -68, -115, -30, -211, 173, -83, 276, 36, -107, 25, -225, -76, 0, -27, 239, 100, -147, -29, 135, 62, -13, -236, -127, 24, 27, -115, -154, -299, 173, -20, -139, 237, -331, -314, -267, -86, -88, -162, -31, 141, -80, -147, 99, -32, 201, -204, -110, 198, 39, -188, -56, -32, -31, -92, -117, 221, -74, -105, -53, 206, -102, -117, 111, -149, -28, -210, -173, -139, 230]
2099B30r2j99J09m4J4J18n5j26J88l88M21J1k03K03k71J08J67l23L74k59J7j26
2121a26l4L10j21R1j44N4J26k15j32K12J9J19l01K44n6q7R2l69K42R5o6J89j80
2144c8j10J88j54M36m64j11K98j16K70j23m6K30m37M34j70K9m6l42K89j94o6J71
2166g2J09j16J78j63j14j2M08k87M1J91l48Q5J56r4J33Km6J54k59R2j58J9J09
2189Hm2J01q1o6L78k52r3k31m1L70k75L09r3J98j94j51J75j11J50J72j74j76r7
2212b16J27R8J0p9J41K4r7j3Q7j19J45j60Mq3K22M5k62K99J1n34M69N1q9k78M0
2237a57K82R5m59K10J87l85K02K74j63K08l85j07K07k30J14M9P8j18J23j25J08
2258HJ4j86o1J93j3m8K74j67J36m0j18J7j47M52l59J57p4rP8%J5Ko7j49J03k54
$$ y = [230, 138, -61, 48, 4, 18, 136, 81, -45, 143, -245, 176, 187, -16, 187, -84, 24, 191, -132, 242, -17, 0, -126, -160, 150, 29, 120, -24, 30, 156, -59, -191, 21, 40, 159, -142, 102, 46, -41, 51, -318, -76, 19, -47, 142, -38, -148, 40, -114, 322, -142, -253, 45, -71, 199, 76, 30, 260, -177, 257, 87, 116, 70, -272, 17, -177, -243, -72, 37, -79, 99, -64, -178, -190, 218, -69, -28, 163, -185, -100, 56, -38, 95, 97, 51, 205, -54, 38, -120, -101, 8, -34, 67, -14, -80, 298, 46, -47, -278, -319, 51, -224, 85, -8, 190, -4, -155, 20, -91, 59, 231, 57, -119, -216, -89, 9, 19, -60, 81, 105, 8, -5, 82, -37, 108, -52, -48, -131, 91, 136, -126, 173, 184, -350, 119, 170, 81, -197, -157, 125, 220, -239, -29, 158, -227, -25, 249, 86, 294, -91, -198, 9, -221, -107, -58, 20, -98, 25, -100, 8, 22, -164, -225, -32, -45, -93, 181, 14, 150, 110, -8, 9, -138, 314, -45, 112, 38, 29, 107, 107, 122, 124, 57, -92, 11, -243]
2284b43K31n2O0Q0k65L28j32j5j92K26m52L20k36L36J13l43K01J5k66M18M6k95
2306a17K60K7j12k6J99j50Km7k3Q9n3j46K7K81k08l4L73m00K73m04M41j89j7k0
2330B6k2l2J58k53M6J86R6k44K16o3l5p9j06M5m2o5J79O2k02Q2K7J1J99j15r4
2355a9J71j99J13k84L46j15k11J00L98l71R5O6l3K7j77K18k38P3j31J01J02j16
2377h4J98j73jj74L23J9K52l61k1NJ03P0k39L24l49K75l2m7m3j2k23K59j04k5
2401f0r0J68K21j17k45K60o3l18K75R9j29R8n6k68M33j22N3n7k9Q8j31j43J38
2424Eo7K19M5n9R2j71r0K67r2j9k43K77r1j38O0j38J38r4q7J49J18L6j19j4K15
2449A99j3j43k0k7P3j46PK21M6q6l59K97l4j34J27j82K45j80l0L14k67K16P0k44
$$ y = [-243, -12, -64, -4, 76, -189, 139, 7, -8, -200, 26, -426, -106, -342, -6, 107, -236, -35, -20, -286, 132, 178, -117, 143, 170, 58, 32, 231, 81, 83, 36, 13, 102, 49, -97, -70, 211, 3, -31, 342, -58, 215, -189, 252, 63, 46, 26, 4, -28, 130, -123, -77, 109, 205, -39, 177, 114, 79, 0, -106, -61, -103, -168, 11, 73, -129, -47, -20, -9, 190, 75, -19, 152, -47, 66, -218, 128, 13, -198, -98, 300, -71, 24, 90, 57, 84, -93, 125, -113, -40, -171, -70, 32, -84, 114, -59, -60, -234, 89, 108, 360, -1, -22, -17, 86, 156, -83, 241, -108, 167, 135, 88, 45, 33, -190, 69, -35, -60, -150, 18, 239, 122, -123, 137, 74, -244, 31, 130, 1, 99, 43, -225, 208, 86, 139, 82, 53, 141, 10, -133, 5, -62, 157, 202, 143, 235, 64, -26, 241, 149, 130, -113, 164, 73, -65, -5, -143, -5, -99, -186, -37, 81, 117, -2, -16, 199, 186, 43, 23, -4, 69, -77, -70, 151, 197, 111, -248, 49, 15, -119, 8, -174, 71, -109, -139, 175, -92, 124, 194, -50]
2473e0K42m5n3k36J64J98k49j77O2K02r7RN3k13P4L18j49n2k59L10N51l84l71
2496a52l1K56l9p0Q7J34k46m8qJ47J52k62j2J92N3l3j39oJ05k18K13j93J33J49
2520A64m26J53L69k49j66K00j84n1K59j67p3K31j26L24k63P1J25m21K73n0K7k41
2542b21K46j14N7K26m98m9K75R4j14L13q6l50K90k44K37m9k0J75j05J08j60r3
2564h2J2J22j4k45P7K39j85J00K9L6j26K11j78k19L79j14J65J25l22l60M15j16
2586e1p5J25P1qj9oO3nq4k1Q1k7q6O1j4k8J09k74M00k57O1J9L5R7Q9k94k6J34
2614G0j46N7P9J6j57J20j37k24J35lJ46j02n8K74j48Q0Kp5J32p6J40j5k52K34
2638I2R3j39L31k71p8PO3n1l38K94j99M05n1m7k17n7J11O8j83P6L12k94J93j38
$$ y = [-50, 192, 147, 94, -142, 22, 220, -29, -206, -144, 58, -39, -30, 23, -190, -116, 202, 53, 1, -258, 52, 603, 219, -152, -183, 73, 34, -36, 51, 185, -61, -109, -117, 30, 182, -80, -92, 100, 153, 120, -19, -25, 80, -138, 75, -118, 15, 164, -262, -109, 260, 11, -155, 45, -139, -190, 69, -98, -171, 60, -66, 258, -5, 66, 191, -230, 43, -7, 20, -221, 25, -89, -32, 194, -304, -353, -78, 16, -98, 215, 129, -221, 69, -175, 62, 13, -7, 168, 63, 171, 11, -82, -70, 52, 38, -207, -130, 109, -76, 24, 53, 89, -37, 174, -4, -223, 156, 42, 207, 332, 10, -350, 65, -51, -126, -1, 70, 62, 43, 37, 100, 95, 11, -10, 71, 44, -42, 19, 5, -23, 86, -188, 212, -45, 16, 35, 70, 167, 256, -38, -64, 70, -76, -19, 60, 76, -81, 39, -98, -322, -187, -190, -44, -146, -204, 70, -78, 2, 4, -71, 61, -15, 125, 110, -142, 92, 185, 46, 377, 106, 28, 35, 98, 47, -291, 3, -196, 209, 158, 111, -106, -163, -52, 16, -167, -91, 221, -73, 120, -18]
2662a8k32J97o0J21K8j51J45p7o7K5K62j43N6l39J68N6m6P0O1Qj39P7j35J84m0
2687A1J17J19l78J23%K12j45k54J35K36l4k64K16J09j57k61M81k13p8j28L63k06
2709DK38k68k83K74P2j65l7N69m77J62j33K19j77n3J96q2J73l0j66J74j99N0P7
2732A38r4k95O8K24N5q5j00J32l6K63m74K04J34j80L31l36J64k32qJ43J17j0j60
2755c7O8J70k11K33m16J38J63j09Q0N3k34J88j1j52J84l13K13O5o7N5q0K16k4
2778A72j95q0K64J32l55J16K27m66kL62k01L3j54L39k61j07L16r6j4R8j89OO4
2801IO5k17nJ11j83J25q2K66r9j08K6K94k97K65o5j03J26j28K01k68J13m2N4J08
2825A66l13J92J23j60%J38j62O7j48k02M83j87R0j9k68R0L1J45l18J28K29o9L5
$$ y = [-18, -250, -53, -113, 8, 36, -115, 30, -47, -114, -89, 173, 30, 86, -253, -85, -29, -75, -5, 56, 64, -75, 2, -133, 51, 11, 128, 247, -131, -8, -8, 204, 59, -195, -60, 176, 142, -122, 94, 203, 46, -215, 266, 53, -25, -153, 210, 4, 242, -26, -309, -35, 37, -128, -165, 404, -73, 89, -44, 175, -2, -55, 141, 59, 232, 202, 36, 210, 11, 61, 138, 44, -251, -183, 41, 96, 11, -89, 43, 7, 270, -204, 0, 134, -46, 285, -51, 113, -119, -127, 16, 133, 123, -37, 31, 201, -10, 223, -193, -55, 108, -1, 79, 132, -102, 86, 75, -77, 107, -206, 7, 72, 5, 60, -20, 196, 172, -23, -103, 161, 293, -62, 54, 281, -185, -187, 175, -26, 7, -147, 192, -69, -176, 140, 44, 30, 128, -61, -55, 9, 74, -143, -148, -37, -220, -95, -177, 89, -10, -118, -92, 202, -95, 170, 105, 2, 128, 0, 201, -67, 46, 4, 58, 166, -147, 45, 168, 8, 8, 146, -16, 51, -97, -299, 184, -3, 87, 68, -200, -110, -79, 66, -252, -124, 105, 36, 71]
2848G1N8J2m82N47l16k6J59p4J28l6l48J96K32j3j20k24J57L0J49J2J48j74j30
2871d4J93M0k46M5p9J55J7k10k0R8J87m47K23K58m92J81k18L00M4J32l41K63O5
2894A04r4m5p9O5m8J29j40j53L24j08J17J10k9l93M23j67j47jl4K99j12j4j04
2917i7L04k17j20K30k06Np9j48K31L2K6J12q9j22Q5p1K74k09J36j51n7L10nk7
2941A47o9j76Q9QK99l33K78k09m1J01k15K72k1l20N62k88L0o4p7%K96j71m9L3
2965H2j47M8m6O2j67L23k21j7J80j76K72J14l39j16J50j14K09j04n2K30l19K89
2987A41k82m1m2p0J66J78J02P9o8Oj85J19l82L56L4k21J66M8p5l02K91J40o3j01
3011fN8qK5q0j23rN0J09j2j78l5J24N5O2k43J58K3L5O0r6r8N3J15J49j85p1K53
$$ y = [71, 129, 141, -341, 206, -110, -136, 23, -51, 77, 41, -307, -111, 121, 108, -12, -236, -79, -49, 100, 112, 260, 86, -44, 149, 189, -57, -12, -91, 64, 81, -129, -149, -51, 136, -311, -88, 170, -322, -141, -359, -59, -15, 117, -224, 39, 104, 10, -35, -114, -49, -97, 32, -108, -261, 63, -45, 72, 182, 153, -240, 183, 16, -131, -132, -166, 133, 21, 7, -97, 207, -10, -130, 100, -106, -101, -180, -328, -97, -65, -39, 73, -16, -138, -53, -124, 150, -59, 77, -74, -131, 179, 174, 147, 78, -98, -9, -1, 298, -35, 243, 34, -7, 94, -121, 151, 130, -190, 372, 84, 114, 50, -27, -27, 269, 98, 49, 82, -65, -17, -63, -1, -168, 155, -66, -83, 97, -79, 193, 307, -32, -148, 2, -112, 97, -7, -59, 171, -148, 141, -141, -182, -224, -294, -128, 50, 152, 231, 163, 169, -16, 103, -279, 77, 111, -110, 56, 104, 29, -273, 18, 158, 95, -6, 52, 44, 69, -11, -134, -143, -93, 16, 4, -174, -209, -85, -30, 32, -211, -53, -30, 5, 65, -31, -129, -76, 39, 188, 3, -68, 185]
3038A85k29J00l19J86o0K76k60L0R3mK23k76k9K7J09Q0j07j01K21k20K87m57K2
3061b23L01r3O0K05j13K69j68l33L6P3Lq2J43N6J08j95k2K35k59L4Nl4J25n4J88
3086B65k15j45K10K9k33L0J27k51l3K01J45j21j35J19J00p5K20l78J62J7l12N19
3108B46o0q4r1q8K32j45j24j3K16j30P7k01J17J07k1k22J04J19j10J80k45J45
3130IJ44j00o9K77j79r9o6m1K54j98J6M11l93j23J84k9o5j05K49q9K4mj03p2M08
3155B41L1k6k91J7j26J69r3Q8P5N9J25k14k98Q3j7L37k82J22l0J14j36oK03k49
3179a04K50j39m17J85L27k36N2K22J41k52j69O4J34j75M6r5K05j2j5Lk7ONo7J71
3204A03j5k1p1j25O4J90j04J92j82k8O1l9R5j83J09qP5j35OJ03j16j62J07q7K12
$$ y = [185, -44, 56, -263, -77, -137, 139, -121, -91, 2, -2, 221, -55, -84, -57, 52, 132, 25, -76, 145, -75, 212, -245, -223, 78, -15, 45, 250, 137, 406, 238, -95, -59, 14, 17, -65, 78, 134, 242, 47, 25, 260, 1, 35, 40, 6, 131, 77, 265, 50, -95, 115, 144, -89, -59, 68, -183, -216, -15, 130, 9, -126, -7, 93, 18, 238, -140, 22, 39, -273, 246, 186, 102, 11, -77, 155, 10, -114, -127, 89, -41, 36, -165, -48, 59, 38, -184, -80, 39, -71, 109, -136, 9, 153, 53, -16, 261, 82, -17, -83, -124, 130, -68, -52, 359, -34, -157, 27, -2, -67, -172, 77, -12, 12, 8, -95, -167, 241, 272, 246, -45, -28, -154, 15, -78, 10, 85, 144, 269, 55, -243, -160, -177, 160, -122, 0, -30, 84, -52, -58, 145, -104, 146, 7, -410, -225, 102, -134, -82, 140, 281, 29, -140, -76, 58, -117, -71, -166, 39, 27, 12, 15, -12, -6, -1, -68, 103, 88, 67, -4, -129, -65, 125, 21, 213, 31, 3, 64, 25, 120, -63, 46, 38, 113, -22, -16, 87, -29, -191, -84, -171, 41]
3229D1j30J02k09J31J46k8j13k10L39L6r5r2J10l9j1J59J7k93J09nj71J05J20
3252A9m4J67q6o2P7R0k94J12L9j29J61n1K9P7j00J5J3K29k63l8M4J52l4j46p5
3277i8K50L9l20O7L22k35K8R4n24M41k88K44l60M11l12M12k02k5J0L6n1J26M5
3300A10m2j44L0o4l1Q1j17L06j11p9k6J99j69j3P4j82j12J93N0J47m35K58l8J02
3324a3p0L71j41l73J36K60J6k69k6j5J1J53J1k07K19K63m07l9j30M29j04L6n4
3347E7K28m17j61K85J27j46j38M78l18m2mJ40r7qR6K09j88j84k27K07J58j48j6
3370a09n6K66k5j20K48l63J71o9K1q5P5J0l9p8K24k36K15J61k93R1p1K2r0j0R7
3395d3j54J09P5O3l0j30m2J80J84k92Q8K24k38J38J34l63m0J49R8j57L02k85J78
$$ y = [41, -89, 13, -196, -65, 81, 53, -60, -270, 69, 105, 10, -82, 28, -11, -22, 137, 154, -139, -30, -35, -206, -101, 19, -25, 142, 56, -6, 71, 161, -133, -21, 18, -111, 50, -1, 28, 105, 5, 20, 33, 262, -1, -39, 5, 157, 123, -23, -98, 152, 191, -129, -62, 260, 25, 53, 147, -377, 64, -224, 20, -340, 71, -241, 171, -31, -56, -46, -10, -61, 65, 110, 68, -76, -46, -110, -141, -60, -177, 129, 18, -61, -87, 112, -57, -70, 4, -178, -290, -97, -47, 100, -335, -77, -115, -13, -83, 288, 147, -226, -90, 170, 186, -83, -109, -124, -113, 40, 51, -156, 63, 326, -81, -120, -250, 179, 75, 111, 57, 285, -132, -293, -8, 119, -27, -165, 313, -5, -47, -51, 89, -8, -16, 80, 289, 101, -83, -310, -103, 55, -93, -109, -165, 101, 76, -44, 204, -159, 12, -57, -36, -121, -46, -36, -75, -153, 71, -165, 50, 211, -82, 9, -62, -40, -130, -140, -43, -197, -88, -13, 50, 20, -110, -152, 28, 212, -80, 8, 232, -6, 132, 266, -97, -137, 12, 110, -47, 255, -30, 148]
3418A48o6q1o2j23J96o2J09Qj18j19K54k14J86p0K16j11Q4k04J02P6k7k82j45
3441c05K41J0O6P1M9j56L2j22K69O1Qj97l2J62j36k1l7l2J64j69J06j25L6R3l13
3466b77J1L04n8J92l60J86j10K55j70J51l58n1K91O6J0j41j24L50r1K66l15J3
3488D0j04J55M4j38K07k19l9O5n8P7r3j60J74J1j49l9J61j16L73l12K15k78K66
3511H3k89M4L2K56J07j89K16l18J17m9n1n2K76l96K94O9j88qJ24R9l11j5K22R3
3535A66k56J56P9p7k41J27m9Q9k00L80l27K88n4q6j1J10m5N2O8j81kK91l03L8
3559A2n7j18J26M5j46J17P6M3J2j42J52jk92J6P9J71j32K09j95K39p2l35j6L55
3583A46J76l33q9k6O5mP2N2j31j08J14K1p0j67M52O7l42K89j54j29K6K59m45L97
$$ y = [148, 82, 1, -61, -184, 12, -50, 59, 67, -51, -170, 84, -130, 56, -14, 202, 91, 175, -29, 73, 149, 122, -160, -305, -64, -54, 12, 83, 132, -24, 8, -114, 155, 216, 224, 27, -5, 157, 21, 0, -37, -69, 95, -74, 32, -93, -57, 36, -277, -266, 38, -20, 172, -188, -2, -112, 143, -27, 124, -234, -285, 6, 72, 82, -59, -183, 167, 76, 342, 27, 40, -64, 91, 135, -3, 204, -15, -54, 11, -47, 30, -63, -223, -49, -38, -187, -226, -65, -181, 192, -120, 95, -183, 83, -206, -162, -130, 126, 233, 44, 260, -58, 59, 10, -41, -93, 183, -213, 81, 150, -38, -46, 78, 177, -134, -149, 73, 166, -90, 66, 145, 68, -173, -46, -95, -6, -206, 174, -153, 135, 81, -5, -16, 94, 49, 101, 169, -12, -14, 277, -26, 12, -45, -163, -37, 8, -138, -21, 55, 98, 110, -32, 120, 119, -173, -157, -78, 93, -39, 170, -25, 214, 142, -193, -209, 146, 322, -11, -100, -126, -61, -65, 7, 59, -72, -180, -66, -45, -115, -282, 170, 237, -105, 184, 30, -99, -73, 186, -259, 138]
3607A38q5M3R3k25J52j75k9j55K07q8J95o0o9J3J79l09j19M16k12L36n7m78N22
3630B33k99K40j83L3j02J9JJ24r8k9Q5Jm6L79k59j28J48L0K75m56M3N1j98N2l3
3655a17K47l13M16m27J77m2O2J15q9j44j37M64l91K53o4Q5L82o87K91R9r5n8J1
3678C8J33J96m29J36J06p0l43K49o6J15M7l28K17Prk7K85l34K47j52J3Q6J35j25
3702A27j68oM4J19m3r0K12j86j21J10P9m4j46J01n2J43j04r9L12k60j16K58L6
3725A06K1k9k71K87l11L55m22pL16p6j2J84p5n7j27j19M13n7kk24J98J26k5j02
3749I0j58K74k19K0j00K05p1q3O3j82L44j79Q9j68O2j75K33o9J57P5k75n7p4M70
3773B72r2m8j37j15P7J0K04l50K98j0j68J34L5k0n6J43l30L36j05M1j15k9K24
$$ y = [138, 53, 96, 189, -36, 116, -59, -88, -243, -36, -124, 71, 11, -58, -45, 134, -175, -294, 122, -90, 246, 189, -289, 233, -66, 174, -9, 24, -78, -59, -58, 66, -32, -61, 24, 25, -21, 358, 99, -29, 119, 149, 424, -32, 11, 62, -136, -84, -117, 130, -183, 233, -194, -17, -59, 3, 118, 29, -115, -252, 212, -179, 74, 10, 95, 477, -210, 81, 180, 85, 27, 38, 171, 367, -62, 74, 180, 110, -233, 16, -50, 65, 112, -216, 1, 8, -1, -28, 257, -77, 170, 18, 31, 117, 252, 127, -41, -47, -3, 116, 73, -17, 195, 9, -112, -2, 77, 33, -113, -12, -64, 79, -25, -124, 188, -72, -188, 70, 106, 127, 98, -173, 114, -197, 158, -264, -271, 45, -31, -43, 141, 66, 9, -118, -237, 176, 119, 117, -107, 91, 217, 192, 90, -68, 206, -13, 7, -93, 112, 41, -42, 21, -161, 183, 4, 93, -75, -13, -188, 45, -24, 133, 208, -67, -124, -198, 272, 180, 132, -5, -120, -43, -33, 171, -179, 119, 109, -59, 75, 110, 90, 34, 177, -153, 183, 78, 119, 4, -25, 199]
3796A99k00o4K00k20RK72l56K75rj1k09K5J10n5K27k77L53l21J37j64l3j04J04
3819a12j8R7K98l52J55j07k7L96k04j78J53l47J68K56l14p2L55Ln5n8K6n7K0K9
3843E5l85M33l26K32M0R2j13Q6J1k61J75j27j45m0K0L49j84J70l24N7L00k24K59
3866A50k26J56k63K02j31K3J14r7O6j02M80k86j17nL4rK42j59O6k10R5N7j20J91
3890A51k1l95L65N1j19K01n70L70L55o14K11q0RL31m48J73O8K5p8J62j98k91L09
3913c3Q7q0J61q9r3R5j48N9o7N4j24K63j2j13K03l00K14K11l89M8q7k8K69j89
3937h8J00n5n3n5J46j55J94n4J02K8j41J22k13J99j04K1O7O1j06j27k5J0M51j54
3961A71k1j92N4K8n6k0J77N7k61R7n5L53k22k4j19r3N2Pj59M08j86J08K1j69J07
$$ y = [199, -1, -65, 135, -85, -76, 196, -160, 115, 106, 95, -114, -89, 21, -34, 193, -84, 269, -52, 85, -79, -112, -216, -112, -130, -33, 265, -87, 68, -39, -66, 330, 126, -52, 101, -246, -78, 178, -136, -208, 147, 150, 95, 37, 63, 6, 26, 55, -330, 103, -223, 9, 49, 141, 28, 114, 125, -136, 39, -88, -233, -273, -253, 96, -88, 82, -242, -185, 115, -109, 150, -76, 80, -183, 19, -112, -89, 25, -72, -6, -108, 372, 86, -31, -36, -2, -11, 231, 72, 138, -72, 23, 80, -40, 151, 130, -265, 100, 151, 32, 233, -337, 33, 388, -226, -15, -95, -86, 245, -203, -30, 38, 63, -15, 147, -51, -342, -33, 54, -26, 135, 46, -47, 48, -100, -41, -108, -54, -178, 85, 73, -40, 163, -137, 77, 288, -101, -53, -140, -168, 101, -88, 12, -43, -96, -151, -5, -160, 34, -20, 82, 110, -31, 91, -122, 77, -27, -6, 61, 122, 16, -111, -136, -126, 325, 171, 150, -42, 12, 40, -16, -36, 141, 198, -63, 34, -21, 332, 110, 86, -33, -126, -74, -67, -226, 182, -4, 104, 125, -44, 63]
3986F3k11J95j37L4J12p4j11L17j86q9R2j9N6J90n41O21k21j5J37j37j2p1n2j64
4010b23K23j67J52O2n5j50K67k49J05K3R5K1k12O2K02q7q1O6j52%q2K00j0Q6j16
4035b0P3Qq6l5J80j86K27j23j48J55K5j55p1K91n15L31lL6k2K5O9k08L95k37j50
4060a44K32N5j21j07J97J7j42m7Q2j24O3j69L76j33Q9j61J24L6j88j00J84K26
4082B45j28k17M46l06k36J93k65K74O7m0O2k36J08J38l91K92P1m8j98PJ72j51
4104a41K81k00M4K7m4J21Q0j94k5K81m59J88k90N22j47J03j36l2l6k15L49m4l5
4127bk95M66k46r8L17K3k56Q1J63k16J27J72k31k4l7K46j31J50k36O5K25l84K19
4150I8N0j70M5kJ10j84O5K5m2q1j07K48J44m9l11j4j27J32N9P3k69K82k13K94
$$ y = [63, -148, 47, -90, -56, 56, -18, -129, 188, 2, -87, 5, -14, 42, 232, -309, 312, 91, 76, 213, 76, 64, -7, -59, -223, 0, -167, -15, 47, -8, -158, 109, -140, -35, -12, 83, 104, -108, -46, 156, 69, -12, 54, -98, -98, -180, 20, 10, 96, -20, 53, 61, -25, -60, 120, -66, 161, 38, -110, 45, 70, -85, -156, 135, -380, -49, -52, -16, -38, -13, 56, -152, 243, 6, -144, 88, 143, 22, -85, 112, 129, -13, -60, 22, -102, -39, -208, 168, 35, 124, -37, 87, 123, -65, -165, 19, 245, 117, -100, 346, 40, -196, -3, -268, 6, 73, 33, 95, -141, -33, 105, -286, 6, 77, 29, -169, -162, 10, -141, 140, -60, -16, 11, -33, 88, 168, -26, -51, 230, -229, -41, -331, 191, 44, 147, 11, -21, -57, -272, 77, 33, -2, -297, 169, -77, -175, 142, 165, -91, -10, 153, -63, 64, 236, 5, -19, -56, 190, 59, 209, -27, 38, 263, -121, 98, 148, -22, 23, 21, 131, -53, 12, 37, -5, -86, -193, 55, 199, 150, -161, -175, -302, -170, -111, -38, -307, -25, -238, 56]
4174E6o9r0k1J78k63R5K01j32R3J20j55m11J50K65K29m06L16j34j00J55l20J41
4196a02j58J34R9K45j86j70K09M0P7m54K29P9j14K37l2j49p3K09k14R8J09m8k39
4219a74L98m31P8J08J2K07m89J11J98n0J21k96L81j54R4j24j54L54j9l37R2J91
4241A17p1q5J42j24L6N5rJ10k73Q5j5K34k46K49j35j41J08k8K8NJ5k83L28j58
4265e6L6Q5qM9J74l26J50k24J48j49M5Q2k5J25k44J80j40j06K91Rj77N9k02L08
4289H4q8Q2l0j26M1J06J54j36j70L04J9k11J12j52j66M71l34J16m0l68J3K18L00
4312A99j34K9j88L80l24J6O2J69l6j53j5K72l64M6k92L95p4K32j41l5p2K31j96
4335GN9k10J24j63J40k8m7j01K13r6K4K50j29l09L71j93J61k65L3J63m4J34k78
$$ y = [56, -13, -103, -124, 54, -209, -114, 87, -45, 48, 168, 13, -398, -248, 17, 246, -160, 156, 22, -78, 77, -243, -102, -260, -126, -27, 218, 32, -138, 71, 111, 188, -266, -37, 42, -72, 165, 133, -16, -89, 120, -94, 4, 113, 65, -174, 224, -207, -129, -21, -9, 198, -291, -180, 18, -32, 89, -207, 174, 20, 114, -10, -164, 190, 171, -166, -74, 117, 46, -39, 103, -21, 15, 70, 61, 171, -102, -17, -32, 202, -44, 205, 70, -71, 37, 9, 37, 42, 57, -226, 102, -56, -20, 65, 57, 106, 280, -46, 104, -120, 28, -121, -76, 6, -19, 106, -138, 42, -98, -204, 87, 96, -81, -22, -224, 84, -4, 78, 48, -78, -37, 69, 223, 87, -83, 221, 240, 29, 141, -11, -177, 294, -40, 76, 36, -332, -319, -101, 199, 65, 94, -94, 286, -38, -22, 40, 209, 173, 20, 5, 277, -87, -41, -333, 62, -12, 220, 79, 44, -28, 203, 7, 66, -144, -20, -183, -43, -71, -118, -219, -6, -102, -78, 172, 43, -266, 105, -88, 73, -192, -159, 4, -40, 94, -184]
4358a84L10j37k52L09q4k22J22K63j13J51k02Q7l31K44J79j13j63K40m03M27P1
4379A99j85k00K51m7r4J87j38j12J76p4j49J25J76n8j7j74K14l9j47K73J7j50
4401C4K9m6k53K1R9K73Jl38j31K50N2O4QJ07l3l0k2k08L10m23K06L07k46J23J1
4426A65k67r2L70r5j92M9L6j69J98M0j76J09L7J14O3k03k34K49l09L77J28j46
4448E2j70K14l60J40j04K39J48l2j24k16J39M1j02L19k7k82K5k5N5R4J65k59j2
4471h2j6k05K85p4M1M9mL5R9j49k35K62J11j40O1n8M37o10K26K20k35k32J42P7
4495EJ96k44J04O3J31j1k3j80j41Q7P4j74N8P1pO5L8j57J45K75m38K05m0m50K33
4520a15O7Q4j58M2J47L1l27M1L02l35M13j84Jl9r1J74k41K05N3lp9Jl5j4l1K14
$$ y = [-184, 126, -11, -263, 46, -38, -260, -138, 125, 12, 163, -39, 48, -283, -39, 140, 27, -136, 104, -299, 128, 199, 14, -186, 65, 18, -76, 111, -27, -139, 37, -37, -186, -61, 115, 57, 40, -134, 80, 41, -106, 167, 184, 34, 63, 17, -236, -215, -116, 157, 158, -180, -311, -61, -9, 55, 63, 170, 137, 107, 85, -123, 187, -236, -30, 277, 31, 154, 165, -102, -194, 176, 81, -111, -62, -26, -195, 3, 43, -133, -24, 13, 127, 190, -13, -247, 2, -307, 70, 198, 52, -118, 96, -264, -124, -228, 11, 159, 127, 3, -213, -74, -33, -135, 184, 157, -125, -100, -125, -70, 24, 189, -70, -82, -98, -303, -18, -92, -51, -2, -6, 29, 128, -21, -256, 6, 117, -23, 38, -20, 417, -193, 33, 253, 18, -214, -72, 5, 201, -43, 61, 124, 255, 244, 221, 41, -100, -13, 61, -113, -55, 16, 9, 74, 112, -45, 100, 375, -63, 142, 102, -348, -115, -48, 36, -122, -80, 67, 98, -229, -188, 114, -221, 192, 8, 9, -30, -121, 53, -188, 17, 70, 67, -12, -11, -46, -60, -91, 123]
4546A23j80o4l0k3o2K73oq0K66r7q9r2o3P4J38j7NL9j81M7J6J48q2qK75l65R9
4573F4l05L71j73j10J81l00J32j17Q6L60k03k6J66k5N3k80J3l6oL15q1kMj24n2
4598i5J66k00K3J85k01n1L67j28j67j62K64m1q5Q9j68J36J61k16L2L76j20j78
4620a3J22P6j08O6l38M13l14J10P3o8r9K16k93J59j3j51J55P7m7K2k31q8K06R2
4644B4q5p0O2QJ57l88J80K4j27l0M19k52Q2OJ25k66K67j23j31m6J4K68k19N5R3
4669D7k5L3L9j62k1L1l9J54p4j36R7J2k03L96mj76J20j32j40L40j54M9J26k95
4693a17J81k54m3L74k60J81j40J2J34k48L44k39J28P1L0k31K6P3l93M73k8J66
4715B40k60K6J45m02L81l76L64K61l99K44j90J62l94J7M26l37m3k5J69J14k67
$$ y = [123, -57, -121, -151, -174, -236, 37, 31, -49, 217, 120, 31, -61, -124, -50, 88, 71, 76, 115, -66, -19, -3, 145, 63, 55, 330, -35, 64, -241, 130, -43, -153, 28, -272, -140, -257, -171, 189, -14, -40, 126, 101, 154, -126, -113, -149, -155, 160, 79, 77, 81, -43, -95, 71, -129, -106, 79, -122, -173, 194, 66, -101, -263, 1, -40, -125, -36, -204, -68, 93, -123, -91, 285, 165, -13, 109, 185, 77, 143, -195, 218, -96, 14, 87, 19, -80, 136, -157, 2, -11, -162, -7, 70, 23, 45, -186, -274, -68, 24, -61, -131, -69, -61, 96, -292, -112, -88, -215, -245, 174, -78, 4, 10, 135, -131, 136, 13, -118, -164, -150, 118, -101, -46, 47, 22, 55, 94, -68, -89, -58, -97, 57, -17, -153, -56, -44, -247, 149, 145, -31, 89, -43, -183, 157, 3, 52, 178, -117, 64, -190, -233, 141, -119, 62, -78, -66, 68, -180, 164, -75, 53, 124, 154, -77, -51, 22, -371, 102, 74, 240, -20, 6, 151, -251, 130, -246, 118, 379, -20, 224, 34, 196, -198, -181, 245, -92, -135, -160, 9, 123, -144]
4736a44K51Kn7j90p5K29O9o8Q5J48k38q1P0j50K69k07J98j8k48J51J27k43m5K11
4760D6j36mJ23%J05k71J66m8l11M42j40J84r0l26J09K64L4l01o7L26n0p4j51j04
4784b74K40j5J16j34Q2j88J48J95k99N2q2J56J37j67l0K36k33Q9k80M35k58k0
4806i4n0R2j6j9m0j2J46j9K22m23K49j14K30o5j9J1j5n6P6j00j8lJ48j69q5K06
4832F3p6k3K33k26j0j03J28J43k65J70j90J27j83K21o9K54l34K04m4j38J63O6
4854A11J16n19L32k81K59p6J48n9n1J31j01K44j96J6j34M9Q5r1m9N2L31n20K86
4877H3k16R4j14K83q4j85J01k9j91K85j02K26l82L39k76K61l65K88j28J49l11
4898b74K93qJ68j13m4J6o8O7L1j43P6L6j63J46j45P9K49j02L0k11j11K36k85J14
$$ y = [-144, 107, 109, 52, -138, -213, 16, 85, 17, 102, 250, 12, -69, 1, -149, 120, -87, 111, 93, -155, -4, 123, -120, -165, 46, -90, -94, 29, 29, 134, -137, 29, -19, -330, 112, -28, 156, 66, -260, -151, 113, 147, -154, -221, 105, 55, -19, -170, -274, -34, -49, 67, -67, 15, -173, -25, 170, -129, -77, -159, -3, 134, -33, -63, 173, -60, 29, -251, 184, -74, -94, -144, -52, -68, -87, -127, -139, 7, -12, 210, -213, 36, -78, 152, 87, 68, 79, 64, 8, 84, -16, -34, -37, 111, -58, -143, 63, -13, -36, 197, -29, -39, -142, -14, 129, -136, 34, -156, -29, -212, 9, -60, 194, -140, 64, 20, -118, 45, 111, 227, -292, 40, -241, 18, -58, 90, 31, -20, 111, 10, 254, 58, 74, -60, -11, 74, -17, -66, -14, 317, -203, 83, -133, -39, -153, 130, 46, -139, -38, -67, -258, 27, -75, 151, -231, 108, -168, 93, -272, 16, -112, 37, -274, 19, 11, 179, 66, 22, 38, -30, 37, 68, -75, 1, 37, -126, 20, -125, -46, 203, 101, 131, -80, -191, 45, -240, -126]
4922a26j69K73K8o0j79L66j60J43p7k4MJ1J64o4j74L06l22J81k46K67r8k04J16
4945d4J07j48J01j01J04K8p2J90j09k1j37L13o4n5o1j9O7j34k33L86j3m17L81
4968D9k10J3M03l22lL1m0O2J40k25J65N3K65m26M9j5k07j09M80q3j71Nm8M12l35
4993f7o5M8J8j89M46m74M49rj16LJ27j0k29j42J85j40M37k43m5J56l70LK18l80
5017c89J42L43j28q4K60j93j69K92JL5k46J58l2j08L37n10L71k94K76N9m5j1N0
5040A15l9n9J43j89Q3Lj20K66q6l32L02j50L86l42M5o4K11j09n2K87l75K85j83
5063B6J40j87K16l01o3L87k88L4k10L80K9r3Oo3J40q3l22M5j55L86K6K1m00K99
5087c0P3J46j25k76J08J56J16k82K47%j11j09J94k38Q9k01L13J21l39pM63m47
$$ y = [-126, -295, -22, 6, -54, -233, 133, -27, 116, 39, 15, 19, 30, 194, 130, -44, 262, -60, 121, -125, 142, 44, -160, -44, 63, -85, 16, -85, 19, 47, -25, 165, 56, 35, -102, 211, 147, 92, 31, 12, 79, -55, -288, 98, 85, -332, 49, -161, -148, 255, -67, -70, -39, -79, -17, 123, -102, 63, 116, 381, -45, 4, -11, -218, -327, 153, 70, -101, -96, -144, 268, -67, -132, -84, -66, -255, 191, -283, 166, 157, 41, 44, 171, 161, -68, -210, -25, -165, 272, 29, -16, 140, -230, -227, -9, -389, -247, 96, -32, -116, 144, -49, -218, 74, 75, 110, -136, 22, -10, -118, 219, -291, 80, -214, 62, 121, 76, 65, 115, 76, 17, 160, -29, 54, 57, -63, 203, 117, -215, 87, -63, 323, -19, 26, -38, 173, 64, 12, 299, -76, 209, 26, 166, -21, 195, -106, -169, 218, -70, -36, -246, 134, 163, 70, 76, 13, 153, 70, -252, -207, -362, 24, 50, 71, -329, -30, 43, 189, 64, -212, -104, 52, 168, -114, 133, 133, 22, -87, 107, -131, -42, -243, 70, 191, -148, -155, 308, -139]
5109a39L52J33m96m2K91Mm4Jk75K13M1M9j59J6J97k13j38K30j14R0J52j33r0J23
5133D9j63J01M09n15K12k58J97k01J70m5J53j49J91j4j04l5J4J98l28P6j42L22
5155A38r8Q0J10l74L06j53j1PN7k97K51r9j45J29J10j64L48L2k14J09j87J81l53
5178b37J66p9L63k47k29N59n1k89J72P9m62K22J22p7j13J8j8K85l69M54l65O9
5200b7J29J10j44j26O4J56K3k46J15n4p7J06m2j8j29L98m48K02J26j88K0Q0k88
5223b58K41K77j82j64jK48j76J03k26K99j61OJ62j9k36J12M1k09m2K61k68K47
5245E5k40L04m0nK0r1Q5j21M7l2J41l24R0j90L10K88j71j60q4J39m9N7m8J88o5
5270A04j03k52L14k45j2J30K08k51O9l8K19j46L1P2l32J99J05J14l74J98k83K02
$$ y = [-139, 213, 346, -150, -192, 99, 103, 59, 60, -215, -2, 39, 88, -71, -55, 142, -71, -209, 21, -93, -3, 149, 16, -74, 49, -114, -13, 396, -119, 93, -165, 32, -169, 1, -44, 109, -40, 151, 137, 33, -2, 12, 210, -118, -42, -184, 138, 40, 120, 230, -144, 162, 9, -2, 5, 62, -235, 16, -83, -228, -99, 11, -153, 195, 227, 13, 122, -65, 116, -237, -71, -150, 213, -34, -263, 296, 245, -44, 128, 207, -255, -33, 89, 12, -101, -83, -101, 184, -185, 269, -96, -27, 102, 212, 68, -58, 6, 162, 185, -61, 54, 0, -77, 29, -13, -31, -160, 238, -210, -8, 118, -70, -50, 30, -258, -17, 260, 78, -86, -87, 161, -15, 88, -138, 161, 0, 6, 168, 149, -87, 25, 66, -143, -185, 76, -192, 55, -185, 119, 79, 74, 94, 3, 88, -33, 14, -18, 123, -201, -111, -301, 9, 297, 126, -34, -118, 21, -28, 29, -19, 169, 104, 1, -251, 63, -182, -194, -64, 144, -107, -38, -76, 143, -3, 28, 100, -232, -33, 72, 186, -188, 10, -273, -71]
5292g1J21j5R0k83k4K26P9j70l9m0J32j01R8L0l11J8K60k7j38K74j1J35m21r1
5316b79K47O3jJ14j49R3j04M5O5q7K7j27j04K4O0p3L0L1K62j21L1k95J83O5R5
5341I5Mk91K60k4N2k64R3J32J21k22J20j7p2J50J2j80r2J98q3J44j34%K8o0l8
5366f8L7MQ0R4K3k47K28J23j69n9l0j50j28L90j91J45oK16j78K4Pk04j38J2M38
5391B53j78Pk18R1J58P6l8j64J37o2p4Ml4L0JR3j21j49J22J14R0j76O4J11l21
5416a84K72j85J36J07j13k35J03L76l01j78O9K16M6k26J13j44Q1J20r3k7N1M8
5438E2J23J9l0k59l9J72k86K73o9K04N3k15K44j22pQ9j40M2l25j9M27l36J90k18
5462a77L98l21L7o7M7J12Rl8o8R6p3J61j93Lj2O7Q0k14J61L9J92j12j74N3J09
$$ y = [-71, 50, 35, 125, -158, -182, 44, 123, -47, -86, -126, 6, -95, 3, 33, -278, -260, 0, -27, -165, 109, 98, 233, -188, -279, -32, 31, 30, 144, -5, 88, -16, 29, 94, 7, 34, -93, -197, -173, -113, -186, -156, -125, 137, 16, 47, -248, -65, 0, 95, 99, -192, 68, 44, 96, -168, -75, 57, 178, -44, 76, 59, -13, 137, 149, -31, -123, 75, -8, 136, 2, 2, 30, -30, -68, -31, -27, 53, 147, 170, -77, 151, 274, 105, 46, 16, -134, -262, 128, -63, 82, 76, 292, 114, 138, 145, -59, -197, -185, 253, 75, 82, -136, -45, 113, 189, 151, -13, 124, 62, -12, -8, -42, -12, -11, 82, -39, -188, -66, 48, 138, -38, 26, 137, -184, 88, -97, 39, 146, 33, -202, -99, 277, -24, -202, -133, 83, 129, -97, 16, -128, -47, 73, -20, -47, 4, 52, 175, 194, 164, -95, -134, 38, -248, 25, -44, 160, 213, -2, 242, 120, 113, 202, 62, 104, -221, -240, 187, -149, 41, -177, 221, -100, -63, -130, -83, 29, 38, 0, -68, 28, -45, 116, -77, -74, -86, -19, 61, -153, 8, 47, 239, 127, -47, 6, 115]
5487A15m1l09L02N3n5J47l94K30L2P9m91N94l03O1k5J47K05m45j47K56p9J39l26
5510b55K56J20o7p4J46p7r9N5Q1q4mk9j29M5J59m8J0j19J32j48R7m4k51M67k19
5535g9L82n32J77P9j4j10K06j62P5K6L5o6l8k34M3J90J10ok71L13k17N9j07NJ31
5560ekJ42j78k8J94k56Q7K8J74p5l01M04l56J19J01J60k69J87j40j41K28j08M5
5583A0J38k66j25L91k38M5J33K2j42m0j11J80J19j93N6J96k81L43n9j81Q7k38
5605a54L20k09m3j92L48l3L3j57N8j24K27j37n6k6J43Q3n9K30k48L6j66L45j50
5628F9j44O1j5j11k8K09o4l9k21M61j92N9k45k06L51J85m4j1l20J31J39K53k02
5651G6j08J01q1J53k2k52K19k0J36k52q6K68M2j50J78k48J75J03l85K52p7r4O0
$$ y = [115, 74, -235, 67, 120, 65, 212, -182, 48, 80, 159, -332, 262, -41, 20, -5, 142, 347, -98, -245, 11, -68, 71, -255, 1, 121, 54, -20, 126, 49, -50, 5, 86, 2, -2, -31, -160, -115, 44, -4, 6, -113, 19, -129, -32, -76, -327, 140, -79, 303, -229, -52, 27, 13, -97, 109, -53, 22, 48, 83, 17, -21, -255, -212, -22, 88, 82, -189, 124, -93, -34, -141, -136, -5, -7, 135, -43, -71, 123, -133, -46, -18, 156, 81, -220, 184, -172, -53, 48, 208, -61, 126, -14, -155, 73, -35, 10, 148, -118, -243, 148, -90, -45, 88, 110, -32, -72, -183, -3, 116, -77, -21, 175, -106, 237, 178, -3, 84, -154, 166, -43, -86, -278, 70, 37, 70, -87, -29, -153, 74, -63, -119, -145, -2, 81, 22, 252, 4, 40, -126, 219, 69, -75, -14, -29, -140, -168, 41, -23, -62, -283, 178, -14, 45, -200, -406, -55, 130, 86, 75, -245, -114, 25, 278, 76, -32, 69, -12, 141, 119, -133, 86, 66, 202, -50, -136, 132, 174, 24, 202, -46, 129, 232, -153, 99, 22, -72, -12]
5674a2K98k91L7J96k58Lj15L09j24np2J63j45mk46L40j67J46k21K27k7n4k08J67
5698f3J36l9o4Q6K03j63q1j41K84j36J34k27J38k50o0M25j25l72L18J44r3K00
5720B54l28J67l47K90j29l08M61j26P5l3K83m39J90J48k82K85j14l03L82K94n30
5741a10K24R8j16j21P9k41K91o2k22L5pJ68P3j86J37J79l25p8K37J78k02K64j03
5764A90l42J01j75L42J03j89p7K32o6j97K07j76J59l34J23L2j9J67j0j14K69k24
5786BO5k11J24J45j7j96M3K75k12O9k15p5J74j9K60j06r1o4J12l1j95q4K95K0
5810F8j75L1lK2P1J02j40o8K41p6m27N55k54k7L1L7QR5l3J03k66j83L97k23J13
5835al3m8R9j96J16o0J80R6j10R4j19P3Q5j19r0J64l4j57O0j69K26p7J4J66j57
$$ y = [-12, 286, -5, 32, 228, -30, -27, -142, 167, 43, 38, -34, 129, -16, -20, -266, 74, -93, 53, -168, 59, 32, -22, -230, -63, 73, 34, -30, 56, 259, 96, 15, -126, 158, 22, 156, -71, 67, -183, -243, 182, 57, -315, 3, 147, 54, 254, -74, 93, -254, 36, -93, -401, 60, -66, 9, -24, 259, -180, 10, 158, -124, 161, 47, -256, 126, 420, -110, 114, 212, 96, -25, 54, -187, 104, 42, -180, -145, -152, 16, 89, -97, 40, 219, -106, -184, 53, 231, 29, 293, 190, -152, -51, -226, 116, 219, 30, -47, 185, 119, -78, 129, -47, 112, -222, -99, -67, -86, 81, 71, -43, 226, 2, 67, -144, -20, 125, 108, -88, -45, 230, 18, 87, -128, -203, -29, -48, 212, 106, 15, -49, 63, 32, -163, -247, 48, 68, -107, -76, -79, -57, 14, 116, -24, -92, 149, 73, -354, 201, -53, -80, -49, -12, -4, 91, 58, 161, -105, -288, 109, -114, -1, -34, -82, 17, -179, -63, -123, 57, 153, 43, 137, 18, 91, 176, 57, -33, 131, 97, -60, 0, -169, 57, -20, -6, 160, 3]
5860CK27l75K32j24P6k41J18o0M21l90K25l22P6K59o8K6K01k23RL2J23j95j12
5883h2J99k55L9K26j92K95k73J2K17k65N4N4j29J85p6p3O1j4M1j02k4K57m01K06
5907d0k9J90j34L1J90j86j67o3M32m74J63L07k18o3j94N07j00l01K05j6j93j6
5929a69L36j52j49R1m4R5Q0j07J02O5k18R0n9j40J57k5Kl2L33l67O0J67j64j64
5953b12J72j0m3J09l14K19J40k76L02LL54k94M3j12j43j09K52j33K11j23Lj31
5975i2m0J38K2j4l01L07J67Rj71j90K36j72l1l7J07J67j15k6K56k6n39M01o4r1
5999i9l8J55j05K7q7Q4J55j88k30K14R5K27k96KM3K2J69k5k48L0J88o1K15j16
6023A33j83K32K19m55K73l54J78J9k85L52q8p6K70l14J09j64JJ02M0q1mq6L6J51
$$ y = [3, 230, -145, 87, -37, 39, -202, -84, -144, 277, -113, 112, -210, -134, 125, 57, 83, 284, 61, 70, 102, 225, 30, -82, 117, -138, -99, 127, -65, 230, -43, -31, 186, -79, -25, 29, -100, 85, 9, -64, -3, -17, 24, -78, -102, 155, -246, -40, -69, 121, -13, 18, 208, 22, -145, -208, 224, -250, -87, 220, 2, -61, -255, 252, 152, -149, 56, 40, -153, -169, 167, 15, -134, -43, -87, 8, 88, -19, 83, 148, -70, 20, -39, -179, -22, -47, -45, -77, 256, -111, -51, 116, -48, -212, -40, -50, -93, 16, -298, -79, 61, -215, 87, 90, 444, 150, 193, 81, -62, -171, 81, -52, 159, 36, 39, -92, -132, 6, 28, 14, -287, 20, 187, 196, 25, -165, 71, -101, -132, -169, -62, 105, -10, -36, 220, 194, -345, 56, -8, -99, -137, 18, -87, -60, -147, -63, 92, -96, -326, -112, -17, 210, -86, -84, -41, -19, 150, 125, -123, -93, 95, 34, 249, 133, -50, 182, 401, -54, 219, -135, 43, 62, -223, 129, 41, -35, 235, -79, 30, -134, -133, -31, 9, -72, -76, -162, -126, 25]
6047B5l33K60J36R1m64K63k4K34m95O9L41k79J59k47M05k47M5J04j4M0r1R5j09
6070c6l5K39n1O6l4l10J53O1p8j22J64j17mj8K8J9k16M94p9r1n4L4K01l55L30
6095A89k44J38nP1J19m55L93k15o1J21j38J56l4j33J40j00L03l67q2l0K48JK9
6118D4rm3O0Q8l4j80j5j13J06J6Q9J13nN2K3k07K40l30Q7j7Jj7K44k63k07J90
6144h7K24m8k39o2J38j45M04l13N1K43j61k5J22j95rK28n0j70J61K4k50K24O0
6167A25j65m7J21P5l6k24L6K6K78l89r2L25k1j32N8K31k32L6K01l35J41J66k77
6190a31N26n02MK8L4k09L13K5J4k64J0J21l4m6K92l22K57j25J84j38j24K87k06
6213fn6N7J21K63k03k92K56m13K32L17k17k16J71K7j31R3r5J85j63K4J01j23r5
$$ y = [25, -308, -48, 88, 179, -285, -22, -46, 188, -307, -238, 103, -176, -17, -264, 141, -106, -61, 43, 29, 69, -22, 73, -36, -71, 168, 117, 183, 149, -161, -8, 53, -25, -147, 17, -100, -104, -122, -94, -75, -291, 203, 124, 33, -21, 13, 214, -141, 189, -55, 83, 78, 149, 268, -187, 206, -9, -70, 51, -87, 69, 35, -98, 42, -58, 245, -122, -204, -234, 14, 15, 44, 35, -8, 52, 140, 106, -74, -89, -202, -96, -80, 9, 122, 117, 169, 192, -15, 225, -105, -18, -35, -34, -51, 193, -70, -277, -87, 137, 89, -150, -212, -74, -219, 185, -128, -77, 166, 5, -20, 102, -93, -102, 126, 76, -94, 67, 91, -159, 65, 125, -40, -87, 34, 109, 73, -151, -115, -89, 189, -200, -292, 33, 12, -120, -62, 169, -63, -27, 174, -161, -20, 146, -131, 395, -107, -103, -75, -41, -250, 63, 88, 102, -162, -152, -31, -65, -111, 181, -141, 116, -9, 175, 37, -87, 200, -6, -62, -5, 116, 379, 176, -116, 140, -273, -41, 276, 59, -157, 14, 41, -90, 3, -92, 93, -70, -46, 55, -68, -163]
6236a63l6L7J97l38J58L5j76L30lP9l5P8k10o1M3j5J11j2J91l59K90k94J97L0
6260G4k32L35j47j32J06M9j24J31m5O3j12j43K49j87L61k16j46K36J66l35o7P4
6282d2J34j05l11M22n5j85K31l3K37l79K12j56k7j15J61K6J92k47k60J76J64J86
6304B26j32p3P7p9RO2k10j40L43l13J87L38m41M7m7k27N07n4j00J05j37L09j91
6327F6O2l50O8L9L16k46J32j92L4j48K21j8o2O3N6l5O3j39Q1o7k3j08L6J19O8
6352C6r7R3o5j33K19p1J75r5k87K29j41l7K57o8mj43K22k60J43p2j06P9M0J87
6376A01r1j86J21Q6k77J35j3mJ02j05J03M4m8KJ10j65J73J32l5l53K16k83K44
6399IJ69j25K48j64j35O5j03N2r9k43K99J85k7k0k83J37j03n8K52q8J60l71J49
$$ y = [-163, -199, -162, 35, -303, -145, -110, -286, 44, 41, 120, 85, 163, -47, -108, -65, -80, 31, 19, 210, -149, 141, -153, 44, 74, -158, 177, 30, -102, 4, 53, -71, 60, 15, 78, -34, -177, 72, -115, 246, 30, -116, 120, 286, -49, -116, -42, 92, -13, -324, 98, 43, -142, 89, 56, 293, -86, 126, -30, -57, -172, -11, 15, 207, -40, -300, -124, 40, 226, 94, 21, 98, 19, 28, 90, -120, -260, 83, -230, -43, 295, -146, -99, -146, -373, 134, 80, -20, 85, -52, 257, 66, 128, -222, -154, -115, 201, -45, 87, -105, -71, -219, 2, -16, -78, -15, 41, 6, 69, -70, 11, -56, -79, -187, -151, -32, 36, -61, 32, -33, -166, 53, -18, 157, 62, -225, 4, -137, -174, 83, 15, 11, -132, 90, -170, -27, -99, -205, -126, -86, 101, 10, -176, -55, 31, -246, -111, -124, -128, -26, -131, -28, 16, -32, -30, 80, -85, 88, 220, 185, -168, 48, -235, 9, 178, 53, 301, 137, 2, 67, -36, 16, -83, -326, -27, 158, 131, 111, -172, -35, -138, -196, 56, -32, 128, -243, -94]
6422i4K19N2m02L36J41k07j3j39J09L0R2j81m4K46j55J48j22j44K69j36J64j22
6444D7O8j30K40k77L7J43k40q3L55j51k5J00j8O4l08L46l00K04j99j14L24%r7
6467a4p3J46j12J88q0r8P3J05o0O1kk82J60J88k94j73J05L76l60K16k7j32m3J21
6491a1j73L6j0k7J59L07k25J12n8k05M1L5l4mK0J08j31P8j30K13J20k53m4LK91
6516B18k54Mr7K1J67k02L40k40K22m4k28K78o1m00L89m7l89L07L6n5JK04k67J21
6540B4l0j73KM70l33o3r4K81J5j86J71j79R9N1k94J69j00J02j6J43r3N6j69J40
6564gn0J02j5k49K80N6k33K6J72l15M31J09m28o4K01K07l06J87o9P9j3L0k56J08
6588a7oJ02l06m3K64mO6j39nK45l86O9m9O3P7O1lj48K71j45p6m4J91q4pJ25k45
$$ y = [-94, 125, 177, -225, 111, 252, 45, 32, -107, 2, 32, 124, -57, -101, 145, -10, 138, 16, -128, 141, 5, 169, 47, 115, -15, 225, -52, -15, 128, -112, -195, 160, 9, -16, 84, 66, 130, -178, 168, -132, 72, -127, -241, 83, 83, -14, -87, 59, -53, 135, 55, -43, 30, 135, 75, 136, 134, -148, 12, 200, -94, -267, -162, 214, -146, 70, 43, -89, -132, -11, -184, -148, -158, -185, -26, 281, 56, 168, 110, -95, -54, -19, -53, -57, -37, 71, -60, 18, -112, 101, 221, -32, -76, -73, 218, -36, -32, -129, -108, 59, -143, 197, -43, 179, 135, -93, 185, 124, -276, 113, 66, -323, -16, 20, -35, -34, 170, -97, 24, -6, -179, -177, 293, -40, -103, -197, 84, 99, -87, 84, -95, 4, 55, -239, -70, -170, -68, -84, 59, -34, 22, -147, -7, -57, 45, 30, -219, 61, 117, -116, -90, 82, -233, 198, 307, -121, -185, 16, 223, -83, 104, 35, 114, 101, 131, -125, -17, -23, 79, -227, -270, -6, -10, 56, -83, -88, 157, -229, -160, -209, -146, -69, -8, -11, -159, 112, -33, -109, -153, 38, -46, -53, 72, -173]
6615a73k09P3L35q4J85J43Rj68j63K40m98J77K85j93M2O4K85n15L90j86RJ36j58
6638B6r5J74j52J08j08k1K26j35j86L94j90%k5j38L29j67o5K14k69J51Q3l18Q2
6661h2P0k10L89M6k10J24k18J42k72J33J92j84L13m7l47J21k1j35J90j12J82P1
6683A35j49j20K18q7kl2k8L25k18J57l03K6R9p4K20k36N3j76J48r4k8J33j51M16
6707B32k20k0J08q6j37L01n1k14K4K06nOj82J49J01l14m7K64mk17q1J16J66j21
6731b6j50K24m7J19j40K25p6n1j55J6K38j10m8L5R3k59J65L5O7l46J21P5k14J58
6755e1j1j57K44J41k71j63K71m3J9LJ26q8J89k17Nj3P8J6K0l3k90M24o3k44O5
6780d3Q7k29K44q5j41J29J07j53P9j35K98j60L83j07k71Q9k58L44k58K0m3L5J82
$$ y = [-173, -382, -309, 26, -58, 127, 270, 279, 111, -52, 188, -310, -133, 152, -41, 1, 65, 350, -165, 225, 39, 48, 184, 26, -69, 105, -47, 61, -47, -68, 158, 23, -163, 231, 41, 41, 16, -122, 207, 40, -25, 189, -80, 71, 154, -164, -82, -12, -222, 167, 213, 3, 127, -91, 51, -221, -88, 104, -80, 233, 186, -161, -40, -61, -196, -6, -118, 64, 135, -14, -134, 84, -3, -5, -37, -65, 260, 42, 199, -104, -78, 21, -53, 167, -69, -16, -192, -44, -138, -166, -33, -184, 232, 12, -8, 100, 14, -123, 178, 127, -87, -63, 143, 138, 144, -38, 111, 212, -102, -149, 115, 111, -106, -187, -71, 95, -26, -176, 48, 1, 120, -20, 205, 129, 78, -77, -61, 177, 67, 19, 54, 147, -112, 53, 88, 155, -191, -70, 5, -209, -51, -62, -219, 25, 166, -105, -268, 3, -40, -21, -18, 108, 20, 209, -8, -3, -16, 62, 78, 98, 65, -225, 199, 136, -108, -43, 44, -185, 59, -26, -167, -38, 69, -84, -5, -140, 158, -2, 381, 274, 3, 92, -166, 178, -80, -60, -103, -68, 114]
6803A14p5q9p5O7Q9J35j09J60l28J05j64M9k37L69O5J89l49k68O27m25LK92k18
6826g3m4N6R8Jnj36k9L26l23j29O1L21q8j05k6n1K0J94O9Kj08j53K01Q3j39J05
6852A28o6qo5k04K79j52J76j22K22K19m47q6L65j07j33N5q0O5k02J74k76L26j73
6875a12J96j32R4O8k15J67R3l19J05J36l92N73m50J36K5K12j43O3KJ46n69J86
6897a30J45R0j07n7J02j98L01j69L6m7J38k91L07k55r5K04l6J46j21j58K2K51
6919G8k0k3j05P9N6j73j89L12M3k38R1K59r2n7k57J16M9O8oj3M3p0p6P5j50K48
6945D8M0Mm45L92n6j15L9J97k7R1j74k28J51P1j25kN7K01l50J50R4j5j02P7N3
6970B6J44L6k26m5m4L1J24j35J07j59K29j00Oo5J74j74L03o2l45J62j71J53J52
$$ y = [114, 39, -50, -125, -58, 31, 166, 57, 217, -111, -6, -170, -121, -358, 11, 76, 265, -84, -352, 275, -150, -147, 145, -73, -117, -61, 37, 38, 33, -103, -132, 194, -129, -258, -197, 124, 36, -69, -95, -146, -126, 68, 137, 139, 31, -122, 79, 162, 23, 128, 62, 54, -11, -215, 64, -88, 88, -34, 188, 407, -40, -126, 239, 132, -1, 54, -26, 39, -163, 11, -265, 61, -112, 84, -48, 46, 114, -101, 66, 159, -160, -55, 81, -311, 262, -188, -52, -27, 185, 42, 105, 107, 253, -316, -130, 15, 105, -2, -59, 43, -155, 146, -23, 13, -34, 104, -187, 120, -135, -230, -26, -62, 84, -37, -195, -173, 78, 58, 35, -70, 9, 65, -108, -297, 15, 58, -180, -89, 170, 78, 21, -236, -120, -71, -3, -9, -22, 21, -49, -125, -50, -200, 48, 88, 92, -353, 39, -17, -132, -93, 104, 77, 168, -6, -234, -83, -12, -137, -139, -82, 119, -231, -81, 13, -2, -104, -27, 26, 170, 206, -20, -65, -109, -78, 46, -89, 18, -141, 88, -12, -6, -71, 103, -71, 232, 170, -175, -13, -184, -31, 121]
6993A21J61k37j32J51N1k33r3n3K55J9p7j37J25J06k74J55K06k1m09N21m19K54
7015D0J24k29r8J07Q7j07p8K57J18k33J56M7q9K2j20k9MO1j7K31j08q8k6j00J41
7040G3j21l3J58k29K24J10j08k18J29q2R6J43o0j26j11L22k58J55p8n9K77k05
7062aj37K09M6k23P6j23j43K54O6n8j20J97q2K14m04K56J21K1p4p3O8J25k36p4
7086i5qK61j39j72L37j33m9J66l1k86L00l52Q2K0j38K04J05j33K59k98J18k71
7108b53J80R1n8K8j40p0L19J07k24J5m0Q6j85J31J76k94J48J03j03K70k12l77
7130c02M56k55J16o1K44J77l88k63K69r1J67l55J64K21m32N66l38K27nj28M2J16
7152A47k51K60J22l62L33j67R1l7K1J14j74j4Nj64R1J3J03k97K5R7K56j81k34
$$ y = [121, 282, 45, -87, 64, 115, -118, -211, -264, -9, 10, -67, -204, -79, 27, -247, -92, 114, 93, -316, 205, -214, 40, 164, -65, -163, -56, 31, -76, -154, 103, 221, -12, 144, 191, 102, 124, 4, -25, -21, 40, 23, 254, 146, 58, 32, -68, 73, -48, -81, 77, -152, 72, 182, 74, -144, -15, -97, -1, 142, 82, -44, -155, 167, -91, 64, -14, -73, 204, -1, -138, 71, 117, -106, -30, -153, -296, -42, 24, -34, -154, 43, -39, 175, -229, 27, 148, 169, 95, 22, 90, 215, -21, -95, -103, 158, 19, -153, 184, 51, 2, 168, 137, -149, 151, -201, -119, -99, -237, -33, 72, -61, 198, -100, 18, -253, -73, 18, -40, -12, -152, -222, 97, 204, -20, -5, -45, 41, -144, -13, 163, -131, 17, 120, 17, 287, 75, -302, 154, -101, 15, -46, 198, 375, -13, -276, -7, -98, 69, -286, -122, 99, -333, 233, -105, 122, 117, -11, 31, 147, -104, 156, 278, -84, 249, 82, 173, 136, 157, 271, 97, 83, 88, -76, 15, 28, 131, -166, -141, -44, 212, 31, -203]
7175b03L96j98M9J05P5k93J73r6k83M53n2N6k48j9K39j01k15J33N1j76J80q1o6
7198a21P3Q3p7J70j02K35k79n0J25j54N8L32m46K69K4R0l92P9R3j34J9O8L05M8
7222C16j68j13j22K5K97j27r1L3K9j82K15J60k35k3J68j41k69M45k85J96o3n73
7244e08L37J7K48j25o4K02j80J85k71J77J03o4J32k71M8j84R0L67k43j53J8K65
7266A26m30J10R9j47L24k16P3k1J0K94k34k3j8m9L82k5j71j26j16J30J93N1k00
7289A6j12p2L9K73j48j23L53l78J25k9q9P0R2k15J81k50J33R4J41J9p8Mj9m7m6
7314f6j50J76o1M1J11j40k3J84o9l6P4N0j54j05Q7l2j42L28j67K80k10L4L9j0
7338C9N0J1j76J89n1k43K39m4j47K57j6j47k93K71K32j02p8j78J46o4L39m02J02
$$ y = [-203, 193, -5, 44, 149, 224, -69, 104, 8, -275, 178, 126, 182, -66, -85, 154, 53, -162, -29, 22, -154, 26, -55, -121, -48, 35, -42, 128, 26, 261, -18, -68, 57, -97, -39, 293, -153, 116, 140, 230, -162, -83, 10, -124, -105, -37, 268, 316, 148, 35, -87, -62, 235, 108, 17, 50, 79, -103, 112, 272, 37, 14, 182, 41, -228, 217, -68, 128, 65, -508, -171, -154, 94, -31, -95, 107, -73, 112, -159, 18, 121, 57, 189, -82, -34, -218, -128, 239, -4, -157, -139, 126, -304, -194, -95, -242, 82, -134, -61, -82, -72, 222, -12, -35, -53, -102, 280, 255, 84, -42, -158, -28, 165, 216, 16, -96, -168, -129, 144, -4, -127, 226, -152, -27, -56, -145, -75, 17, -198, -17, -267, -134, -40, 101, 120, 42, 46, 27, -20, -66, -216, -40, -101, -60, 51, -89, -112, 72, 3, -33, 41, 91, -63, -168, -81, -113, -255, 73, -94, 186, -24, 10, 49, 39, 89, 100, -76, 113, 62, -181, 58, 14, -133, 124, 108, -39, -332, -61, 171, 69, -9, -187, -41, -105, 234, -168, -66]
7361f6K25k63L9K8J24K0k25PJ86k52L73j73J36N6k29J07k37K67j14j37J42N9R8
7384A71l47L68l63Q1J53j52J15q6n2L25n7j50k33J23L05l08J01l5qJ72J7K6j72
7407fj4J97o5m1J0k99J39m5K36j71K6J50l26K25K48k29j9k18K35jm8r9K0J68j69
7432i6K04J33k90k07M12l02J15j56N2K85q9j33M1k19J12J36K6L5R1r6Q7q9R2K2
7456A66k54N49m10Mk7J09j72Q0J73k52J56k25O8j97R5K19j2r2N7j10J40n3j96
7479a84n4M26j18nk59K99l63K91m0L4J1P4k39L7P4j18R4o1J14J27n3j79N0M4o5
7504f3K02j09J70k53K02k38K12j8m9kq2r2J42j33J09O2l8P9j96L4R5j08P0K4l
7529A7K5j23J26k15J45K14j46j9j96J38l1L3JJ90k78K81k35L13o2k46J28k34K52
$$ y = [-66, 159, -104, -65, -37, 87, 107, -118, -111, 75, -177, 196, 23, 159, 215, -14, 93, -144, 123, 9, -128, 14, 73, 171, -176, 192, -171, -90, 63, -89, 26, -60, -112, 213, 156, 6, -227, -104, 201, -107, -6, -41, -49, 123, 140, 166, -6, -20, 177, 112, 71, 81, -218, -79, -124, 112, -59, -33, 117, -209, 16, 264, 35, 16, -202, 33, 32, -16, -115, -95, 73, -96, 108, 241, -49, -256, 156, -146, -31, -187, -135, 150, 61, -72, -31, -250, -138, -2, 24, 59, 150, 54, 141, 52, 144, 166, -88, 461, 51, 55, 28, 137, -35, 45, 218, -34, 122, -103, -35, -232, -137, 82, 70, -22, 35, -75, 65, 12, -184, -238, 188, 70, 65, -194, 105, -258, 33, -7, 27, 38, 112, -127, -90, -16, -134, -40, -101, 13, 140, 87, -92, -42, 2, -63, 139, 30, 200, -53, 149, -89, 123, 105, 56, 54, -28, -120, 22, -111, -2, 60, 22, 101, -95, -61, 34, -74, -4, 20, 17, 42, -81, 45, -170, -25, 189, 43, 24, -172, -34, -65, -32, -31, 159, -119, 162, -73, 240, 178, -68, 60, -174, 78]
7552G8l3J4j4Pk0j46J21r4m1J43j76J98m7J25l86J94J52k63M12j01j67j35J94
7575A5M33k16l43p4L84j16or9L4o8J97k27J04l3J6l4J02jl56M49J35n36J73m2
7599a09j7K30j65j84M3J91J01K1j96K57l72Q7R8L39k46j43J72k46K26r3j4p0Q4
7622fm8J78p8m5q5k9J63LJ12j17n8j21M4O6L7rJ42k20m5j1Jl1P2l1J10J81k00
7649b5j44J70o1j09J25j91K98j11O0J84k06j47J02R0k51K88J1j13l6k07K59j4
7671b8J43N1m6m2l45K62Q9j18J59l37K37j73K28k1j76L82j56k33K03r7J4K29k91
7694f6mJ13LJ5j92J04J5K83l60l5P8J41j98K02k33J73J33m9j05j04N8Q2Oo1N2
7719E1k40J43M0J12J5l44L24m0m0pmj95J90l0j0K49n4l38K50j00J75j8K7k7m28
$$ y = [78, 45, 59, 45, 52, 32, -114, 7, -87, -128, 15, -161, 37, -10, 115, -271, -77, 75, -188, 224, 123, -44, -179, 15, 448, 232, -111, -185, 199, 83, 77, -22, 12, -56, 141, -86, 18, -15, 1, -33, 69, 68, -288, 161, 296, -240, -67, -109, -126, 104, -61, -245, -202, -11, 90, 111, -85, 172, -200, -113, -15, 324, 78, -65, 107, -139, 87, -6, -20, -90, -6, -54, 124, 46, 1, -84, -113, 50, 53, 165, 48, -10, -131, -87, -21, 16, 7, 149, -71, -116, -127, -126, -157, -85, -116, -6, 175, -25, -169, 1, -60, -169, -44, -235, 63, -48, 12, 196, -10, -157, -55, 35, -216, 72, 83, -30, -66, -273, -14, -28, 115, 166, 120, 78, -267, -5, 84, -34, 125, -212, 25, -148, 80, 59, -117, 265, 109, -124, 79, -18, -4, 225, -66, -70, 43, 46, 61, -131, -27, -12, 271, -89, -124, -46, 95, -103, 99, -134, 39, 172, 123, 18, -86, -28, 54, 60, -1, 51, -189, -46, -6, 106, 121, -223, 101, 61, 21, 14, 10, -185, 5, -25, -35, 214, 160, -178, 72, -28, 147, 129, 156, 129, -299]
7744b99J53j17L85n3j17j44K18kR0J56j74K6j21p2l5J10P7j62K4j1k2j15M50j61
7768H4j88J80j18M5K8Mj56J64q2Q5r1N6r0M1L21n3k26J34k33J74M8m50M02R9k67
7793h9R2J88j97r9N03o22j01K24J74j10M0J72j96J81j27J80k79MJ48j66J02Q3
7815A05k67K17ln9J51j92K38j85K12l57p1K00j04K58Ll2j93K47j47j8j68J10J22
7838F7j98J10J30Jk08o2K56J95l08p7K30j77j24K7K38j63J30j86j76J94k9P9J53
7861A02Nq5J19Q5k46j08K26k1L1nR9l99K04j16J87m4J65n07L99j25j89M62J8l87
7885a30M31o4k96M6N3O6j59Q5K4n6PjJ23nj99J24k63L05k7j32M6K9K0j00J47m2
7911C2m1J50K7l43L19j05J2j35o3L02k98qJ07K60k10J4j65J21R4q1O4M2J3k21
$$ y = [-299, -146, -263, 122, 69, -48, -192, 26, 24, 114, 270, 96, 122, 1, -71, -106, 4, 81, -81, -57, -68, -90, -205, 245, 84, -104, 76, -42, 3, 31, 35, -121, 43, -39, 46, -45, 11, -79, -38, 283, 230, 4, 138, -95, 79, 127, -323, 79, 178, -89, 3, 191, -6, -105, 398, -224, -325, -101, 73, -37, 3, 175, -21, 160, 33, 213, -66, -62, 86, -80, 22, 105, -162, 55, 52, -7, 144, -48, 190, 5, 217, -140, -211, -11, -115, 143, 146, 114, -79, 168, 21, 3, -165, -55, 67, -131, -21, 109, 110, -98, -160, 96, 291, -17, -94, 136, -41, -165, -138, 100, -63, 67, -119, -295, -101, -130, -51, 102, 107, 22, 141, 226, -20, -128, 98, 77, 108, 103, 202, -197, 7, -109, 78, 34, 199, -308, 91, -34, -223, 239, 257, -130, 301, 237, -59, -13, 40, 106, -53, 32, 56, 0, 7, 6, 129, 124, -75, 49, -214, 91, 64, -68, -22, 7, 27, -73, 74, 32, -9, 141, 168, -175, 144, 39, 51, -84, -147, 155, -143, -151, -44, 216, 6, 20, -145, -24, 70, -11, 53, 95, 108, -113]
7935a13L7n5m9M0J86J39k55K00k48k5O7K59m1k61J43l47L25j46K87j96J49L2k71
7958a43J10j83Q8J08j20L97j83K3r7J7k3K08j17n2O7j25L23m07%J18J8J22m5j53
7982d9j22J22n4r3K65Q9L3j22j61L59k30p6j23L52l5j77J79n4j69j90M31p7k10
8005a12L36j74J11j03J03r1j37L72j21k0j48n9L4l16L89j42L69l30k5rJ66P5j72
8028dl46K98J34j50l8j22l5K81L2P6k23J8l1J5O5j0J30J07k32q5M8K2pr3O8n9
8054a41L09j32J67k16J17k62K47K6j6Mj49L0j4p4j48J58jK56j83l1J58j79j71
8077b45K7l1J8q5L09J80l45p0L52M3j32n7K46l81J13P8Q8l57M41k80kn5R2K58
8101B05k56Q9q5J33k47L89k59j2K31k29L16k74j84J00J21L1K2p9J35j19k5lO8
$$ y = [-113, -76, -131, -180, -140, 46, 185, -70, 130, -118, -143, -76, 183, 142, -119, 24, -323, 2, -144, 143, -53, 96, 128, -143, -33, -216, -128, -20, -140, 257, 74, 97, 0, 17, -6, 202, 85, 33, 100, -25, 298, -109, -109, 9, 27, 149, 104, -49, -171, -49, -103, -196, 69, 158, 191, 69, -92, 267, 37, -39, -162, 190, 155, -22, 157, 103, -66, -256, 175, 98, -112, 224, 50, 161, 58, 161, 70, -67, 305, 184, 164, 16, -43, -9, -325, 64, -78, 291, -39, -64, -73, 93, 168, -4, -350, -52, 82, -68, -106, -228, -263, 18, 50, 126, -97, -79, -110, -95, -30, -40, 90, 197, -35, -120, -72, -50, -57, -150, -82, -141, 168, 36, 203, -13, 104, -158, 89, 115, 99, 103, -46, -16, -30, -104, -252, -94, -95, 161, -22, -53, 105, -74, -245, -218, -249, -231, -316, -7, 173, -172, -242, 110, 153, 21, -36, 210, -171, -58, 20, 108, -249, 192, -88, -90, -145, -53, 205, -51, 38, -47, 86, -161, 228, -31, -43, 188, -41, 275, 1, -183, -83, 38, 69, 91, 12, 147, 28, 3, 0, 68]
8124F8L3k24j8L72k34P9J46q2l42j28L50J4J33k02l6o1M1K9l1K18q4j36m5M13
8148B73m23O1O0l6j21K05P3j35J40j85J5R8J47j78J72k20K4K0J79k19Q5J26M5
8171B06j32JK3j5k1j5o2k12K53k26K68l49K92j29n1L99q2j40J03K9
$$ y = [68, 101, -123, -141, 231, -3, 76, 222, 140, -202, -330, 20, 34, 167, -35, -71, -132, -91, -62, -93, 125, 41, -95, -140, 273, -150, -89, -29, -65, -186, 19, 92, -43, 97, -88, -73, 25, 172, -6, 166, -54, -30, -10, 169, -50, 35, 161, 206, 74, 75, 98, 83, 62, 47, -15, -227, 26, -200, 68, -281, 11, -118, -169, 230, 148, 8, 111, 140]
8191A40
$$ Imaginary data points
##PAGE= N=2
##DATA TABLE= (X++(I..I)), XYDATA
0@%%%%%%%%%%%%%%%jRj6J6j6J6j6K4l2L2l7M5n1N9o7P5q5R6j10J26j42J58j75
38i2J94k17K41k66K93l22L57l97M37m81N30n83O43p08P80q61R53j056J175j314
58f94J474j668J903k191K560l050L731m732O342r315J6397n9382m6516J54778
72E9637r2614j1001N3648m066L3962n0956J8186M5741p6078N722J1990k41N350
85g20m7086P3119J7916r2414Q2132Q285p4127M1361j2159j444K415l4538O0140
98B2880j4577l9059O0188k1984j1195J1118k1639M0620m5159j1737P3190o7177
110b4531O393N0124m5112K2320j2941K579K9918o2139L7357K1930n6355L6530
122F073l124l165R055l5679N4192j5508n2029O7311j9726k8942K9584j5558K2934
$$ y = [0, 0, 0, 0, 0, 0, 0, 0, 0, 0, 0, 0, 0, 0, 0, 0, -1, 8, -8, 8, -8, 8, -8, 16, -16, 16, -21, 24, -27, 32, -35, 40, -45, 51, -59, 67, -75, 83, -92, 102, -115, 126, -140, 153, -169, 188, -209, 228, -253, 277, -306, 337, -371, 409, -452, 501, -555, 620, -694, 780, -888, 1015, -1176, 1384, -1666, 2065, -2667, 3675, -5640, 10757, -48625, -95141, 59637, -32977, -43978, 9670, 5604, 39566, -11390, 6796, 52537, -23541, -17819, -5829, -6070, -720, -47806, 25313, 43229, -49185, 32947, 41232, -32895, 8466, -3693, -5137, -2722, -37260, 22880, 8303, -30756, 29432, 7448, -3747, 7371, -14268, 26352, -18807, -30544, 42646, -24531, -18138, 31986, -13126, 9194, -3747, -1168, 28750, -33389, 3968, 25898, -30457, 6073, 2949, -216, 8839, -26840, 27352, 11844, -40185, 27126, 7400, -21542, 8042, -7516, 15418]
135A5418k3537j5936O1176m4767j5975M7668k5448J092n842L269K9754n3380J6618
148i890M3605n4085J3601J7083j1818J1373l1300L1828J3135n7622M3549Q126
160A7585l4318K0585j0858J8148p151l2365N3953j9966l3498M6653j7363m757
172c352K964j0733L5597l6404o643M8967m1665J341K1837j5801J4099k5658J5514
185F3K6102n2584K6187J9966l5612J8090n815Q762L252l4000M2267l828l7905
198b5055L6009n212j0349M876r983K7479k2074j6432M4855k4350j4661K4947j0180
211a30N651j4269K427K9532l9781N615L3340l1607N430N286o40J0757l1527K4914
225D998J4684m4001K8089P113j8531J1320j3719K3335p794k9157M2780j4293k2068
$$ y = [15418, -8119, -24055, 37121, -7646, -23621, 24047, -1401, -309, -6151, -2882, 26872, -26508, -9890, 33715, -20370, -6769, 10314, -1504, 9869, -21431, 10397, 23532, -34090, 9459, 17585, -16733, 3852, -7006, 11142, 3991, -28374, 25579, 5613, -27885, 18768, 1405, -3352, -388, -11121, 24476, -11928, -18571, 30396, -11269, -9928, 11909, -3892, 10207, -15451, 63, 26165, -26419, -232, 19734, -15878, 2212, -3603, 5159, 8411, -25589, 16678, 12850, -25055, 10954, 5742, -4607, 269, -9714, 17765, -4309, -20741, 24114, -236, -14897, 10050, -130, 5521, -8748, -6321, 23211, -16570, -10955, 22385, -9222, -3792, 1494, 854, 11611, -19916, 4998, 19682, -24319, 3770, 10883, -7648, 3672, -10047, 13288, 5494, -23663, 19117, 4824, -17244]
238a7244K6102j0281N835r539m850L1887l1361l750L2181k3870p69O527o99R259
252I428k4549J4221J9918l4637J2141J6181j7189M223m946J1828J427k8163K8463
265H346M274k9406K0862K49m400J74j1409K6976j5617j9033L5328j5579r947J3032
279C850o696J2620j8880J680K8017l2334M187K0315j6770M750o268Q446Q042k7946
293a6987K0790R722k6944J3551M379l369q23j0527K0574o008k0592K5795l881
306E680j4880J0430j185O242j0493n428K4806j8077q772K2998j1548k715J017
319a925J674J0884k1791P383J9277k4630N670J0247p825K773r867J3834L117k4531
333a5710K0286M192j7372R443j316N079n332r571K2356j0834j3622K0651o509
$$ y = [-17244, 8858, -1423, 4412, -5127, -9977, 21910, -9451, -13201, 18980, -4890, -5659, 868, 169, 9428, -15121, -900, 19018, -15619, -3478, 12703, -4486, -263, -5209, 6619, 8046, -20117, 8346, 12620, -16786, 4076, 4325, -75, 99, -11310, 15666, 49, -18984, 16344, 765, -9182, 3850, -2846, 9774, -9106, -7426, 20591, -11743, -7556, 12759, -4011, 739, -5529, 2917, 10959, -16987, 3803, 13525, -13419, 132, 4511, 1142, 319, -10208, 10366, 4358, -16234, 9561, 5680, -9200, 1230, 45, 6287, -4206, -9634, 15172, -2905, -11677, 11321, -227, -2942, -1925, -251, 10633, -11158, -3775, 15502, -9128, -3458, 6789, -1036, 1737, -8130, 5704, 8821, -15710, 4576, 8768, -8604, 839, -477, 4602, -730, -10301, 12055, 1221, -12401, 8250, 1741]
346A741m693J679m40J1449j6691Q22J9744j8578r28J1326m971N59p637Q421P167
361H970k0378J1090J0230j5968L812L559J696k199r612J5780j879j6488J5372
374C985J247r013K636k18Q313r064o425J9131j0788p883J3207m336l91m159K770
389i88J0707j7385L991J3761j4620K413L313K17J137j1388J3137K677j7047J1852
403A777L152p022R38p76P784o786o951J5478n600q917R073O94k688l436K257Q136
419G113j0902j837J3284p911m901O605N82l46o681N059P217j3952M250R429r436
434b427P29P50L900m40j0564J2529M39j2056R038Q04k665j695j578J0014q377
449a599m982J2854n990m439M323J237R49p329M537P068j0824J353P340m025k547
$$ y = [1741, -2952, -1273, -1713, 9736, -6955, -6133, 13611, -4967, -5895, 5431, 460, 1019, -6618, 1803, 8970, -11408, -318, 9912, -6056, -2244, 1315, 3011, 812, -8800, 6980, 5101, -11387, 3985, 5232, -3781, -1145, -1363, 6950, -2114, -8539, 10592, -196, -8079, 5128, 792, 401, -3758, -988, 9719, -7666, -3675, 10086, -4534, -2121, 1192, 1409, 2546, -8842, 4295, 6972, -10075, 1777, 4929, -2093, -1155, -1931, 5853, -933, -7884, 7594, 1994, -6923, 2150, 2844, 156, -3280, -1023, 7113, -3789, -5626, 7658, -253, -5154, 1451, 2033, 1687, -4994, 65, 7282, -6670, -2420, 7009, -2427, -1698, -948, 2952, 2512, -8052, 4477, 4916, -7140, 1898, 2702, 37, -1658, -3236, 6778, -1599, -6581, 6273, 283, -4156, 167, 1404, 2353, -4976, -439, 6629, -4195, -2842, 4498, 473, -2074]
464b074Q56M483j493p330P041L755r684K919N470l904j915J0N240k391p464J0141
480C660n15p991M722J624k62l394j16Q103p436k879R292m062k573J005K302J653
496C133p814M687N011q829J876M596k201j550j742N835j284o828P160J023o178
511c105K046K616Pl743K39N890l951l762O263m63m108P23L219J61m992J925N168
528D133n636j446N320j491k334O9L084N18o240M224L808n840J66L446p98j378
544c95j712M764j303n548N617P56l970J120J097J589l829q3N610m576j911M108
560A334J9j462k071L153J177m923K265L121l680q10K352J443k775j252L866l11
576A446l809K280K693l360j133L032M38k539m24L056o27l427K588J673k870J5
$$ y = [-2074, -1218, 3265, 1772, -5558, 1483, 5238, -4446, -1527, 3943, 39, -1876, -1866, 3374, 983, -6481, 3660, 3145, -4846, -124, 1500, 1238, -2156, -2272, 5831, -1605, -4484, 4808, 746, -1827, -822, 1480, 3133, -4681, 6, 5017, -3812, -1936, 2660, 459, -1091, -2833, 3002, 1718, -5110, 2050, 3073, -3105, -1059, 1557, 1564, -2179, -1940, 3950, -1, -3763, 2500, 2037, -2071, -1348, 1871, 2032, -2960, -1035, 4133, -1503, -2949, 2371, 880, -1454, -1385, 1699, 2217, -4023, 201, 4009, -1831, -1665, 1781, 983, -395, -2107, 2657, 1354, -4194, 1423, 2179, -1791, -671, 426, 2015, -1814, -1897, 3713, -863, -2774, 1334, 1353, -109, -2180, 973, 2150, -2773, -508, 2613, -1067, -1877, 475, 1918, -857, -2109, 1757, 1446, -2363, -83, 2610, -750, -1883, 1149, 1587, -952, -1376, 1680, 1053, -2374, 214, 1887, -983, -968]
592i68J488J262l104o33M512k891j827L264l96o98j955K495J738m921K501K265
608B132k438n44N33K225k509j530M353j490k435J315J571p59k389K219J111k749
624a384k2K555j54k713J426K206k279p96J854N13j871p25L466j731k174K581L21
641A073j054j335J344K041l823J124K661k404q82Q18J863j380k118L399m73k107
657a253J144J014k36k341J933J526k663R2J916p18j157K97J828j475j405K302
673H04M06j806l19J957l43k142J603O34j266l94J383R10k326R6J917r41r71N88
691b10Q97p95r88K080J46k515J145R95l40j283O80J377j976J12J703o65q94J84
709c47R11m45j219J351N89j598M30Q49j54j083K87J284r60o61J038k37k15n72
$$ y = [-968, 520, 1782, -1322, -1955, 2557, -334, -2161, 1103, 707, 9, -1946, 549, 2287, -2634, -133, 2132, -306, -850, -317, 1908, -601, -2131, 2222, 732, -1703, -388, 1183, 424, -1965, 254, 1365, -1384, -1406, 1149, 995, -1718, -292, 1914, -365, -1161, 693, 1206, -665, -1390, 2076, 345, -1829, 752, 1073, 19, -1316, 28, 2069, -1754, -630, 2031, -373, -1255, -437, 1426, 46, -2072, 1327, 854, -1253, -109, 905, 669, -1672, 261, 1787, -876, -784, 1132, 414, -743, -446, 1382, -93, -1498, 804, 1210, -596, -915, 1042, 699, -1443, 160, 794, -472, -866, 517, 1427, -899, -803, 1114, 173, -798, -210, 687, -108, -1096, 984, 1130, -1385, -240, 755, 415, -868, -188, 1189, -787, -675, 1028, 363, -531, -347, 564, 119, -1100, 251, 840, -758, -328, 521, 367, -716, -429, 855, -105, -766, 272, 35, -180, -752]
727g52J580l16j464J078N86p63o05Q04N60j465L48Q93o74l75L50O09n40p70J562
746F46n85n41M18K89J44j114Q98P80j500L38O39k14j84k27R76n16j255J292P0
765C54m81l34L30P39j554Q71P12r03J38P2O89n71p58J760r60n34M67K08K95j249
785g09J046K59j425J151n9j93j40l41J117j165J44R20p08Q1j71L16M30j076R69
804D46j69l49K16l96J067j108KJ049j056K14L90l20K94q43Q40l3o90M72K11N2
824B89l75j85Q38r53M45K74n82L51p53J267n94n77P42l03L74O2l88M96r43M84
844c1K93o00M26m25M68r3n27R57q51M0O26m34K71o45N07L20o17N88l86lL01m60
866b75N37k62l14O69n54J89J68k55K07m38M89Rl62K2L34J05m58O3M67n93L33n
$$ y = [-752, 828, 512, -952, 126, 712, -51, -656, 148, 708, -757, -409, 484, -190, -565, -215, 394, -146, -916, 646, 61, -480, -62, 227, 371, -743, 155, 935, -565, -227, 412, 198, 14, -213, 763, 247, -1008, 284, 354, -127, -461, -131, 608, -946, -75, 637, -266, -128, -56, 633, 62, -696, 1064, 104, -430, 37, 245, 540, -709, 337, 596, -829, 322, 263, 70, -70, -411, 706, -459, -315, 605, -103, -22, -193, 123, 553, -523, 446, 277, -72, 144, -252, 815, -293, -291, 758, -298, -84, 306, -14, 280, -563, 277, 244, -446, 26, 237, 289, -86, -271, 567, -386, 59, 333, -249, 102, -651, 616, 22, -555, 187, -116, 258, 320, -68, 428, -515, -31, 262, -338, 88, -337, 131, 38, -489, 468, -383, -343, 283, -151, 120, -525, -18, 302, -315, 273, -113, -116, 185, -275, 262, 0, -314, 355, -199, -10, 158, -97, 110, -328, 161, 170, -192, -170, 164, 269, -189, -126, 341, -252, 81, 76]
888G6k76J62j69J79K4l19L68J18j04Lj06N59o22j8M32n64M64l62L1K16k76M48
910B64N7n61K26j30J38R7k50N49o50K07J80n97N74k4N7j80k21N72l91R9M4l05
932b45L88m72J85M95p59M53j34L30K29n97N74n26k5J20J7J5J1j32L49p19N06k01
954a38rM16n17L72k47k32N81k87J62k30k26N67p38O32J3l95M43j84J85J60q75
975e47P12n18N24k11l4K80m47N55k74k94N04l38P9K25n48N91k12j33L06l32M21
996C09n16J79J95n25P10m78M9O7m14P26l67l8M51o23M81j57l55L52j04K51o0Q
1018A41K17q53P08l84L8N47o65K14K43l35K05m94M96m9o3M76p68M20n2j67N38
1039D13l05j29K99l27M15m86Q2J59l62K13j40J39L2Lpl70K33J93l16M08j23r5
$$ y = [76, -200, -38, -207, -28, -4, -323, 45, 163, 59, 62, -44, 515, -107, -125, 307, -257, 207, -155, -124, 92, -184, 264, 321, -240, -14, -144, -6, 91, -159, 390, -260, -53, 127, -470, 104, 80, 137, -43, -264, 308, -83, 16, 60, -245, 143, -329, -144, 351, -408, 45, -89, 241, 470, -127, 447, -79, -104, 16, 33, 48, 59, -73, 276, -443, 63, -138, -147, 269, -248, 124, -123, -355, 226, -61, 101, -129, -355, 212, -526, 106, 119, -276, 167, -17, 168, 328, -547, 165, -353, 171, -40, -74, 206, -241, 314, 40, -254, 250, -88, -9, 216, -332, 259, 47, -86, 220, -112, 309, -207, -28, 167, -358, 352, -126, -77, -10, -424, 302, -65, -103, 348, -275, 206, 49, -306, 46, -58, 193, 133, 141, 358, -495, 213, -171, -133, 414, -251, -37, 206, -129, 76, -418, 78, 29, -34, 442, -326, 94, 42, -125, 413, 108, -21, 278, -49, 366, -120, -38, 121, -241, -28, -168, -29, 3, 6, -1, -371, -138, 55, -261, 147, 24, -71]
1061g1K79m10N03k33oJ47k63p7J63L3J94k88l6Q2l12L36l13L63j77K7J33mr1J11
1085I0k29M95n67J82J67o4J73o9j43M9k86K19Kk05J56l17O08l05L1k1k82N24k34
1108b6n7q7L7K17K33n98M45l29K41j3k87L20l64L32o7j3J07k47J05N0n2J01k17
1131a69k0M37m94M91n86r3M57o1J11J68j90K04m08L85j51k87K06k16N53k91m8
1152bL13o96N22j86J63J33m84N98k31k36M31p58N71j02k22K79m16K98N4k13J86
1173Bk79K21J38k72M67l63J37o7k14N09l54K56k70j40M72n78L26P3m3K03o09K73
1195a12J39l64N18k42K2j41j93O09l17K37K47o70M76j84j13K89l07J46J20k46
1215h6K88l39K48j54j01L10l29M85j11o41M14rj00J86l81P69m64j07K51p7J54
$$ y = [-71, 208, -202, 301, 68, 62, 209, -54, -131, 32, 65, 259, -29, -65, 17, -295, 41, -272, 91, -86, -59, 74, 70, -21, 90, -139, 356, -211, -29, 138, 74, 247, 178, 35, 84, -202, 17, 19, -186, -30, -347, 261, -44, -13, -34, -316, 208, -26, -83, -170, -133, 84, 317, -281, 164, -165, 76, 63, -224, 96, -268, 64, -3, -16, 91, -156, -51, -1, -53, 48, -169, -189, 248, -246, 245, -341, -434, 23, -38, 73, 241, 51, 255, -153, 232, 81, -206, 0, -216, 337, 46, -2, 311, -385, 137, -49, 114, 247, -237, 361, 130, -106, 325, -433, 138, 36, -186, 93, -323, -25, 29, -184, 2, -277, -56, 82, -190, 277, -86, 51, -16, -230, 279, -75, 181, -89, -229, 243, -335, -9, 64, 21, 224, -385, -112, 27, -337, 181, -61, -39, -180, -373, 236, -81, 156, 403, -267, 209, 25, -88, 201, -106, 40, 160, -86, 202, -137, 111, -43, -144, 166, -163, 322, 211, -430, -16, -25, -125, 61, -320, 449, -15, -122, 129, 52, 206]
1236B06Rk42J05j11Q1pJ12q5l4J64l01k18M90l07K17j13j52K30j66M81k94j40
1258g5J78l38K57J47k36K20j15j78K06j89J56J2l3K09k49L62l77r5L36k83K87
1279B02n35L90K4k16M07l36N3J81m46N97l68l86L53m25O71j09M3j20m9K65k96
1300a00L69l84J30N8j44k06K49j6j21P9r8L05l63L49n9l0M2m2lj5k70M04q2P7
1324A29j3p6k9k25J80K38k24K78l10J04r4j71O35k33j76P8l10J38O3J81l14J21
1346c0N0L7j16J38j66K74j62LJ53m07L23l9m4J62j36q1k1l63O88m14R4j54K42
1369C1m9k50N55k12m31O06k19M8o6k74L77k79J19n2l3R8O1q8J87k07L02k13o5
1392e4K67k86qn6r0J34k23K30M3O9O1j89K20P3j29j00j1K8j1l2P3k34k3l7K79
$$ y = [206, 215, -27, 78, -33, 48, 41, 153, 68, 34, 198, -103, -321, 169, -138, 79, -34, -186, 44, -122, 359, 65, -75, 103, -235, 22, 169, -67, 153, 38, -140, 66, -123, 33, 45, 12, 221, -28, 334, -43, -138, 198, -85, 202, -333, 57, 81, -135, 272, -64, -11, 170, -276, 321, -47, -433, -80, -505, 166, 57, 100, -20, -69, 196, -100, 269, -115, 15, 73, -71, -277, -28, -44, -165, -86, -184, 121, -242, 107, 48, 18, 60, 18, 15, 0, -270, 134, 52, 129, 116, 40, 11, -214, -34, 204, -20, 258, -52, 52, -42, -213, 422, 189, 13, 91, -219, -81, -18, 163, -151, -30, 20, 57, -59, 79, -87, 187, 25, 28, 181, -226, 97, 58, 14, 176, 40, -41, -62, -425, 263, -151, -57, -211, 31, -18, -268, 287, 75, -356, 250, 31, 79, 13, -261, 116, -163, -44, -96, -129, -31, 30, -58, 129, -78, 224, 11, -54, 213, -73, -81, -137, -227, -93, -316, -86, -43, 26, 87, -102, 118, 191, 62, -38, -49, -21, -32, -64, 9, -225, -248, -285, -6]
1417fK95j78j04M3j38J5j82K57pm7J57l40J86J46p0j42j05L55k42j91M63j7k63
1440a15J20j69J91j8o0n3nQ4P2j29L23k47k00K78J59k01j71L03j84R1k46n4K39
1463Hj01m1M74l31O4M0l48J44Ml9K89m43L28k35J71Q8K5R3k45J46k51L8J00k8
1487e0j3J16r4K80J47n27J58l09L59K4j37L08m41J72k40K75Q1k09R9N9m77Q00
1509C81m86L87j12l73Q7j70J55L01k34K11k37p4J76l27L75l74K49M07l63j0J93
1530A62L0k05j53K86k14J50J1j50L24l10n3J43l35K77o9l8K20k41L31j64r8K02
1552A06j63K24l58J94J18j16N7J22l20QN6K47M6k08j09R1K04l37Q0K53l88L83
1574A90l8l07J55j20K32J88m65K15o3L94m17J94P7m60M39p3l52J61M5j37L22j0
$$ y = [-6, 289, 111, 7, 50, -88, -73, -255, 2, -5, -52, 105, -235, -49, 97, 27, -115, -220, 135, -107, -298, 165, 148, -115, 5, -164, 27, 9, -51, -104, -109, -25, 47, -82, 241, -6, -206, 72, 231, 30, -141, 162, -22, 69, -177, -231, 8, -93, -134, 340, 9, 73, 113, -235, -91, -87, -126, 163, -280, 48, -187, -16, 72, 97, 190, -55, 91, -160, -122, -22, -50, -63, 53, -41, 239, 386, -141, 17, -292, 67, 91, -46, 262, -179, -7, -247, 28, 109, -100, -1, 58, -419, 381, -105, 282, 170, -203, -116, -286, -131, 170, -64, 147, -90, -164, 12, -315, 60, -314, -65, 342, -21, -31, 162, 192, -13, -166, 120, -94, 56, 67, -83, 241, -69, -122, 21, -314, -37, -106, -144, 76, -165, 166, 2, -96, 106, -57, 167, -191, 3, 121, 5, 62, 184, -136, -128, -72, 175, 221, 13, -96, -5, 199, -138, -58, 195, -193, 190, 152, -155, 0, -120, 112, 300, -165, 50, -13, 381, -36, 158, 235, -225, 214, 141, -211, -50, -5, -142, 180, 170]
1596A70j11j58J60j05m4M2j3J23n5l9R1k60M5J13J60n4k88P8K08j54L0J85J16
1619B40j46l38M58k35K67P2m60L56l92k70M30r4P5J17j52P8m0N8l4k72L06m0j24
1642a40L11o7N0k15Q3o4J13j6q5P6J62l92K91qj48Q8j27J64j64j40O03m14n9J57
1666E9k02M71n60K08Kj58K28j73j58J46N9L36o38L09l0k01J23N8J99O1k65J40
1688A4j13K36k41J29p5r7K11l1j93K26l9j11K15l71K64J78j64j12j43K18K18k83
1710f4J81k13KP8R7m7j97M53o5k17J13mk76RL3qO9K8l4r2M07k44k9J37j15J08
1736A10j27r8J56J1j38j80M99j23j05K49k21k82J59k77N59p2J76j06j88M1j92
1757a49L23j08J6r1L6o4K07n10J83K56k69L47k18J19j56m8L74k80K40j01l1J55
$$ y = [170, 59, -99, 61, -44, -88, -46, -59, 64, 9, -30, 61, -199, -154, -41, 119, 65, -223, -145, 63, -91, -61, 124, 240, 94, -244, 214, -21, 246, 318, -142, 214, -178, -448, -18, -112, -37, 80, -72, 6, -34, 24, -10, -282, 24, -16, -140, 171, 104, 154, -61, 22, -42, 71, 55, -30, 46, 208, -184, 107, 99, -49, 39, -88, 76, -88, -228, 375, -39, -98, 59, -143, 328, -232, -24, -22, -180, 48, -125, -283, -137, -78, 258, -380, -71, -101, -302, -179, -121, 78, 139, -126, 14, -99, 137, -104, 25, -50, -147, 64, 33, -160, 66, 27, -84, 131, -240, 24, 202, 38, -74, -217, 1, 219, -64, 117, -96, -94, -16, 81, 34, -163, 290, 225, 8, 121, 117, -159, -150, -117, -125, -56, -28, -62, -154, 253, 9, -20, 117, 2, 110, -17, -115, 41, 52, -86, -266, 233, 110, 5, 254, 33, -249, -90, -367, 192, 120, 296, 190, 2, 43, -149, 174, 66, 82, -9, 27, -37, 170, -340, -157, 99, -170, 177, -41, 78, -78, -126, 248, -32, 208, 107, 76, 231]
1779B31m29K84k10J94Q8k39P1J8j54K48l25K31J68j64J03l42L83j30nJ60k6m73
1801c18L28q4J72k66J67J28j71L57l35j87K90k93L79k08K5L58k95Kj95K53Qk53
1823a38J68M7k05K57p8P9k0j62q6j7K70j94mK93k08l2r6k2l5m1L63J27k55j24
1847a13P5J6P3j06j94K74J72k14j9n2J74j81J38J35l12K54m38M41l97K48K5K52
1869B51j39o5n6K2J02L4j71o2J53l47K99j44K74k07r8L60n10L43M4k00K54l98
1891b61N82k84j76M9M6QK69m17K42k23O2M06m60rr3K64l9k2K08j28M15j29n9j61
1915I0J33l43K45k78J82K19k30L5j47R0J77m35K35m9K06j92m3L17n08L34m0N1
1937D9K34m48K71k85Q2L46l49K37k08R1L1J62m2j97k73M44k70o3K34k91J73JQ0
$$ y = [231, -198, 86, -124, 70, 158, -81, -10, 8, -146, 102, -223, 8, 176, 12, 115, -227, 156, 26, 21, 181, 155, -318, 10, -74, 98, -168, -1, 127, -44, 313, -22, -209, 81, -212, 167, -41, -16, 342, 47, 49, -146, 107, 115, -138, 30, 77, -128, 129, 51, 130, 110, -52, -138, -155, 115, -79, -83, 210, 2, -30, -126, -148, -183, -224, 139, 266, 11, -113, -38, -22, 51, -55, -249, 25, 197, -17, -36, -88, 86, -95, 43, 178, -134, 120, -318, 123, -274, -26, -1, 251, 112, 47, -9, 13, 115, 149, -22, -84, 69, -278, 21, -123, 151, -56, -154, 206, -304, 39, 83, -117, 137, -261, 321, 37, -139, -90, -44, -36, 233, -184, 58, -165, -103, 303, -157, -166, -259, 5, -34, -56, 152, 24, 439, 310, 251, 90, 223, -120, 125, -153, 29, 248, 18, 53, -94, -4, 173, -262, -27, -76, 130, -62, -105, 212, -296, 38, -2, 49, 283, -165, 106, -179, -97, 249, -100, 137, -71, 20, 51, 213, 171, -26, -299, 145, -125, -188, 46, -245, -72, -71, 9]
1960IK3j21J29j46M6J59j15K9K46k88M47l75L87l51l94M48k72L18j39k21P1L23
1982B13j05P2o5k50J83Rj50n7K87j13J90j29k35q7K52KN6r7j20j39K95J82j3n4
2006A27j01J22k84K1L30j86j59M60l34n7J40o3j05k4J54K3k05j6O0k61L14K34
2028A90k8l01P7K81n09K64q1J05J82j39J36j51j85K35p1l8lP2j38o5R8r3J13J71
2052A22j13J27k79J94j4j20J1k27L07J34k34m9K95k61L94m22Pj09o4M35l20J42
2074d4K1j00L74l54J17J59l55M8O8n9K37j46K66k46j83K61m53L56K72k82J26l09
2096b26L90k02j12J11l07M58l41K58J32q5j54L26l95O8O1r8J50k43K48N5Q4k98
2118a20K7J66j91J09J7m0M4p5J11N0k10L3n6p8J17J05K6q0j90M42m56J86r0K91
$$ y = [9, 32, -89, 40, -106, -60, 99, -16, 13, 259, -29, 418, 43, 430, 79, -315, 133, -139, 179, 40, -181, -110, 213, 108, 180, 115, -135, 48, 57, -93, -150, 137, 24, 214, 85, -150, -237, 15, 17, 73, -24, -144, -283, 12, 194, 181, 127, 26, 148, -136, -115, 215, 29, -130, 330, -4, -61, 79, 16, -89, -113, 41, 64, -141, -157, -97, -358, -44, 190, 162, -139, -62, 219, -290, -26, -107, -2, 180, 41, 177, 26, -159, 76, 5, -33, -36, 36, -102, -167, -69, -162, -49, 122, 9, 136, -143, 51, 37, -83, -72, -299, 8, 142, -92, -141, 154, -107, 287, -135, -128, -237, -301, 134, -186, -44, -23, -123, 251, -103, 14, 173, -182, -134, -66, -125, 112, -34, 232, -14, -197, 64, -389, -33, 239, -43, 83, -226, 164, -38, -150, -39, -346, 112, -229, 29, 161, 76, -78, 248, -147, -79, -18, -116, 34, -209, 39, 94, 178, -120, -93, 73, -118, -9, 8, -32, 12, -63, 48, 98, -112, -79, -135, -213, -96, 9, 35, -45, -235, 207, -249, -63, -153, 138]
2142A38k28k6j44L36j87K93k6k96R0p6J82j8o4J43P0k98R6K6J48j46n2J19j17
2165c7L8K1L1j7r8N4J95J4l37J43j61J75M7r3j73R8j19J09J73j19Q9k60L19j73
2189h1O9J27q0j1O5K5j04P9j01j3o0qp7O3J78r8J27r0K4j21O6j66N5K79j99J18
2215F6n8n5K19J15m0L3m11J44r7K71n2k20J53l5j62J61M8n2N6k01r9J17Q4J57
2239A42k4l54R7J89J31k76K52k85J20j14J28kj20j7j05J6K27J81j78K86k81J96
2261B09j51l8n3J61j03k9r3L19j42j33k4M0M0m2J78k38q5J60J53j77k28K86J60
2284A70Q9l35Q7j74K81l6k9Q0k16O4n9R5K09k33l8j03O2K1J73j41k22L47k81k8
2308b17K12L10j87R8o19N06k79J22J00K56k95O9j05K72j36J67m13Q1K1m0l7j09
$$ y = [138, -90, -116, -260, 76, -111, 182, 156, -140, -50, -126, 56, 38, -26, 117, 187, -111, -15, 11, 159, 13, -39, 80, -37, 1, 22, 53, 36, -62, -8, 187, 201, -136, 7, -154, 21, 68, -25, -198, -100, -219, -110, 63, -56, 33, -227, 92, -81, -12, 115, 35, 24, 89, 114, 10, 89, -12, -25, -85, -93, -170, -107, 71, -27, 100, 10, 34, -87, -21, -187, -132, 147, -52, 66, 8, -47, 172, 287, 247, 280, -131, 13, -84, 187, 135, -85, 68, 33, -129, 32, 80, 28, 84, -117, -216, -99, -15, 142, 118, -236, -139, 50, 181, -95, 157, -128, -8, -122, 6, 4, -116, -133, -238, -222, 5, 186, 8, 294, 13, 209, 58, 20, -33, 128, 25, -4, -97, 222, 80, -53, -77, -37, 3, -39, 139, -99, -184, -24, 129, -48, -276, 10, 170, 259, -76, 11, -163, 118, 82, 53, 133, -83, -19, -78, 17, 226, -7, -45, -148, -86, -65, 108, -33, -255, 92, -189, -217, -5, 305, 118, 216, -403, 103, -176, -54, 46, 302, 7, 76, -29, 243, 107, 274, -139, -58, -37, -77, -114, -223]
2330b23K95k01K43j86lj05K35k41K48j40K8K70j50O6%m27K91N2J66k40M2j30K64
2353A54j32o4o6J2j19K98k63J60kp9l1M08n20K92Q9n0l9j38K24j31K2N1j63l8
2377a25K31j72M7J57j63M3l58M75r3j65J61j16J56n1j95M4J82j20K60l37L23j77
2399GL46l60j04J90k45L94j97q5jN0j92k00L69K4j31P9J9q8M4R1j56Q6P0p3J67
2424A04k76J70O8j00o1P5K81m64R4m3K26m6J82j77J44K1j86j68J64O3j36J41m89
2447d13M90P2k66P7k64M58k76q7L99l08m6L3K16J71j73n7O6j93M59m23K29k36
2469g2L9J22n2k21K32l5k6o7j28K03R7M4m61N49l05j17L51j73M2k28l1K72n9m1
2493f5j76K3K02P8l3j7Q3Nk46J6K73r2q1M6ml8q4K62k95K3R4J0j18J10k04K48
$$ y = [-223, 72, -129, 114, -72, -75, -180, 55, -186, 62, -78, -50, 220, 70, 136, 136, -291, 0, 52, 218, -22, 20, -110, 154, 22, -42, -108, -96, -215, 83, -180, -20, -22, -101, -132, 276, -244, 48, 137, 87, 48, -90, 134, 3, 25, 76, -87, -125, 106, -66, -19, 138, -25, 18, -340, 135, 42, -123, 38, -78, 78, 27, -168, -124, 58, -62, 198, -139, 184, 7, 353, -7, -111, 79, -166, 228, 31, -54, -55, -5, -197, -397, -28, -4, -135, -56, -37, -125, -81, 10, -146, -60, 10, -63, 104, -172, -2, 66, -34, -95, -20, 261, -203, -109, -152, 74, 28, 210, 33, 177, 198, 12, -156, 8, 71, -65, 76, -413, 77, 149, -117, -40, -304, 154, -122, -209, 190, -118, -164, -131, 85, 256, 83, 26, 92, -101, 358, -65, 164, -72, -33, 89, 37, -184, 48, 13, -13, -80, -208, -5, 92, 136, -325, 224, -81, -198, 153, -20, 22, -206, -237, 35, -24, -65, -241, -218, -16, 62, 29, 12, 95, 100, -146, -130, 143, 51, -30, 16, 12, -26, -110, 152, -143, -120, -26, -16, -134, -24, -228, 20]
2519B0l81K10PJ91P0k96P9K46k41K00j14j50K4O3M1k48J84l9O3r2O6K9J18P4n9
2544F5k44K48J00p3j30j52K67o2j27L0o1Q6L10m35L20j15j97K08J24r7j5J34j84
2567@M3q0J0P7R7k01K8j3K83o4r8j08J16J4P4k66J49j52J90k09j50R7l0P3J84
2592F4n6j28N7P8Q8r0p7N7j25J41k02K92J28k53R8K55m65L12l87J68J3k2K87j06
2616A27J79k72M6j77Q9K8J12k79K17lj01K11k81j05L04j60K61j54J66n69L28J26
2638I3Q1M5l21J10J35j61j42Q0N8rL7J14k0L7j36p2Q7l06K63M5r9L37k69K95m02
2663a20qJ38j11K92k27n1L30l71K67J45l63J87K2j43N2j97M90l50J85k87M4k7
2685a03M5K0r7Q6j04M70j88j76j8J92k15j9J83l84L65O3L3n9R1j72K6J11J2l44
$$ y = [20, -361, -151, -144, 47, 117, -179, -100, 146, -95, 105, -9, -159, -135, -72, -31, -279, -95, -134, -71, -163, -97, -68, 50, 124, 65, -179, 69, 169, 96, -34, -186, 81, 19, -108, -78, -139, -53, 257, -178, 142, 27, -170, 38, 162, 65, 50, 184, 0, 43, -37, -27, 50, 147, -54, -26, -39, 244, 180, 82, -26, 90, 104, 178, -88, 61, -91, 99, -110, -260, -163, -193, -120, 64, 8, -120, -63, 15, 103, 13, -64, -7, -132, 9, -193, 99, 227, -26, 72, 327, -138, 174, -213, -45, -32, -54, 233, 127, 306, 34, 80, -97, -8, 20, 132, -147, 70, 67, -34, 177, -104, -209, 95, -65, 196, 42, 208, -361, -33, 93, 174, 219, -102, 8, 143, -18, -160, -80, -22, -31, 6, 120, 100, 137, 1, -71, 16, -290, -27, 18, -81, 256, -13, 282, -120, -128, 10, -101, 191, -36, -87, 243, -128, 139, 284, -79, 108, 130, -13, 39, -158, 332, -18, 167, -120, -76, -103, -58, -38, -135, -49, -153, 317, 129, -47, -65, 127, -88, -107, 76, -308, 57, 120, 153, 94, 185, 13, 39, 150, 162, -182]
2709a82L18Kk79j01N7J74J8K2l25K39N0J34Np9R1O3j93L6J8k56M03j58K78k97
2733C8j47L9n4M7k2Q1K87k20O2q2j46N3l3K84j24K05k58L79l41r1p4J94j54K06
2757A29j40q0R1l4l5j09j4K21j3r3J10J25l04J60j43J62o1K4Q3J36r0M7j84Ok
2782hl0L01k69r5K54j46L83n34J00J3j52J93k7J97j97k00JQ9K22q8j40K81j9L
2806A32l24R7J08J27M2j08j04K02r1k5j16J18Q3k99L7K31k82L00k66J67o6K58
2828B21k05j1j64J46k04K94k63K79j16j02O2K6J72k65M11o0j83k71L21j8n1L6
2850E5o1K14k34k75M54k20Jj48J15K04j81j24L53j44j4R2k21J40J05R6J2r9j22
2873bL2k48K76j00Q7k47K87l24L53k94p9K86k8m0q2P1J27j07J89p5j11%j69K05
$$ y = [-182, 136, 138, -141, -242, -185, -11, 7, 29, -296, -57, -7, 127, 132, 53, 144, 207, 14, 50, 68, -188, 215, 57, 335, 38, -109, -70, -124, -77, -99, -18, 269, 49, 111, 29, -117, -64, -97, 187, 63, 268, 10, 389, 48, -43, -117, 77, -77, 129, -11, -91, 0, -34, -69, -178, -192, 29, 16, -77, 33, 158, -146, 14, -129, 33, -28, -4, 79, 215, 125, 172, -12, -6, -8, -38, 263, -6, -101, 153, 7, 390, -144, -44, -31, -183, 10, -17, 180, -17, -217, -216, -127, 95, 7, -133, 148, 129, 132, -192, -95, 13, 140, 182, 74, -30, 172, 81, 56, -60, 58, 141, -158, -121, 110, -172, 128, -138, 29, -37, 221, 16, 5, -159, -13, -217, 77, -186, 93, -23, -125, -63, -37, 135, -130, 281, 221, 38, -233, 88, 70, 19, 55, -6, 208, -26, -301, 153, -67, -66, -214, -99, 105, -76, -200, 153, 9, -5, 87, -134, 6, 111, 207, 219, 120, -2, 30, -218, 58, -42, 45, -202, 85, -239, 114, -180, -259, 27, -1, -41, -123, -52, 75, -32, 157, 82, -29, -29, -198, 7]
2897GQ6j74J01M8k4l5n5O3j64J20K78j00j73K11j29J02j41k8P9j27J81j64K68
2920B30n25P3K27K53j45j87J01j20R2l67N31j07n6J28m90L82N2M3l9r2Q4LPl17
2944b39R2J33j74RK51m4k65K03P2Qjp8J32oj28L8k80L85l4j20L5J51j6j88J55
2969I1j98J0J27kK87l27j14L03k78L72k78o0K87k19K73j80J41j14k85R1L6n2J69
2992H0O4l7J6K4m5L3l29L64m6k08J85j27O2j49K41j48o3M4k3J23r2K20r2j29M3
3017A1j92J05J37q2J31j68k51K63L4j37M7qJ34M7p0J20j97N3Q5k56K27J24o6q
3041H3l43L38J28J3k46P0O4r7j43K41N8l12J85r4n6K03j31J36j32J38k58K96k2
3064A19k79J17n5j5O5K62k79j71J93K0k65J92j3J60k69J21J19Nj17J27o3Rj22
$$ y = [7, 93, -81, 20, 68, 44, 9, -46, 17, -147, -27, 251, 151, -22, 189, 60, 162, 21, -7, 72, -55, 126, -38, 230, -295, -222, 5, 258, 113, -74, 27, -93, -1, -368, 163, 56, 0, 128, -362, 20, 72, 115, 76, -16, 68, 71, 78, -239, -147, -14, -188, -179, 72, 28, -237, -34, 38, 46, 45, -33, 99, 93, -35, 3, -277, 108, 74, -46, -11, 140, 124, -64, 91, -107, -97, 30, 28, 315, -12, -126, 177, -101, 271, -7, -67, 220, 1, 274, 94, 235, 121, -164, -73, -37, -89, 80, 144, 107, 123, 147, 102, 135, -194, 170, 124, -84, 101, -26, 36, -113, 128, -20, -83, -39, -62, 61, -31, 189, 97, -32, 11, -181, -76, 61, -21, 110, -58, -309, -46, -12, -149, -102, -110, 24, 71, 1, 121, -76, -23, 62, -194, 33, 157, 91, 83, -260, 78, 206, 219, -27, 43, 107, 10, -133, 108, 166, -146, 39, -55, -111, 92, -39, 97, -35, 103, -155, 141, 119, -160, -43, -98, -113, -48, 214, -65, -236, -43, -23, -288, -96, -109, 51, -218, -97, 22, 27, -90, 37, -26, -17, -139]
3087a39o2N2k2P9j02J88K09j49k81L35k65K7Q3q8k9K3L32p3j1j01l00M46j38k9
3111a5p1P3K28j16j16R5K63l40J95q1J6l05P7P0P4j3J68k96J48j7N5J57l05P2
3135A6L4L8j87K05j61m6R5n4k51M90j57J94m16K68RL1l45R7O4Q2J49O6j33j72
3159h4m4O7M2l07L59lJ9l46K15k3P9P9p4j46J51K51j31r7o9P7K10k50K32j67J37
3184A77m40L76j49k37L78Q8k40N1N0J36j23k15J83j45j04J41J96M9l77Q0R9J12
3206H6k3n7J35j66J40k77P5j06J42J38l37J84j4K83k21j11J13K0k58K84j19Jj0
3229i8J10L6j11K09j76J55O1j58j47J68k60P7J68k37K72j04k26J62J85r2M3k75
3251b38J11L84l23P1j79J24l73M80KJ77l81P4J83K3q0N4j02K17m61L80k72J79
$$ y = [-139, -201, -149, -171, -92, -194, -6, 203, 54, -227, 108, -157, -130, -47, -135, -164, -141, 191, 118, 107, 6, -294, 152, 14, -15, -86, -13, 215, 99, -17, 78, 341, 1, 196, 115, 131, -174, -97, -27, 47, 34, 202, -94, 54, 37, 92, 249, -56, 16, 50, 88, -99, 106, -55, -101, -6, -60, -311, 179, 22, 216, -200, 68, 77, 108, -237, -140, -76, 6, 155, 221, 88, -84, -128, -61, -19, -326, 33, 30, 49, -297, -82, -105, -26, 53, -21, -167, -16, 235, 104, 7, -62, 15, 225, -25, 207, 40, 177, -263, 113, -36, -273, 105, 193, -47, 4, 54, 190, 67, -148, 35, -110, -214, -73, 123, 172, -205, -125, -26, 86, 63, 6, 141, -25, 115, -162, -87, -193, -51, 87, -250, -66, -80, 203, -18, -129, -16, 4, -254, 30, -89, -88, -98, 12, 48, -63, 146, -30, 125, 186, 28, -119, 49, -211, -134, 34, -203, 69, -35, -261, -99, 86, -6, 37, -238, -127, 257, -66, 5, -174, -50, -423, 57, 59, 236, -145, -71, 112, 135, 55, 109, 7, 224, -237, 143, -129, 50]
3273E0M0k46J51N8M6l7l7j12L03j91j29N5j13K69k42j25K25n6K12j68k2R5L1L55
3297D12o02J98k04Q8L5m4K25O2l05K98j46j65K98m8k98n1L55j65J89p9j7L0J19
3320A85l31J08N8J50q4k76R1K98j53j06jj39L70k39n1K52j30j22O5O4k35R8K57
3343A29k69N4J27qj13J47Q8j75j07P0L17l37J03pJ61n16L24k9q6J26l09O11l50
3366d9N7j87J57J39k19N4p0L8J27M0j85j2K31J25j63l96K16j8J86l07P6L02l68
3389b26K10K9PJ26p6r6J46j74J91J25k37j9r6J17j23L6J58l9p8l1r3J84j56r7
3413b12R4O4K09m8k38K4J40J60m90K78K59k70M9P4O5j72N9J56q9J71k30N6r1J1
3437B9Q8m6J22k66L56j73k50J18p5J64p7r0J35j84J05j50M7J11M4O7J17o19M78
$$ y = [50, 90, -156, -5, 53, 99, 62, 25, -87, 216, 25, -104, -49, -162, 107, -135, -260, -35, -91, 121, -47, -69, 26, 57, 412, -190, 8, -196, -108, -73, -117, 108, 170, -135, 163, 17, -148, 150, 102, -196, -247, 108, -57, 132, 53, 36, 66, 185, -146, -38, 20, 170, 86, -190, -99, 199, 46, -60, -61, -200, 170, -69, -120, 132, 2, -120, -55, 9, -226, -128, 129, -140, -86, 41, 33, -80, 67, 155, -20, -127, -57, 260, -77, 26, 19, 180, -336, -12, -41, -127, -1, -310, 301, -49, 8, -179, -22, 117, -102, -48, -118, -80, 47, 87, -98, -110, 121, 246, 83, -313, -97, -115, 71, -236, -160, 142, -226, -16, 13, 20, 146, 70, -26, 120, -54, 137, 262, 25, 6, -90, 27, -96, -60, 98, 59, -19, -50, -143, 41, -115, -212, -118, -54, 155, 107, -131, -107, 33, 193, -297, -19, 240, -30, 19, 93, 158, -14, 45, 201, 112, 283, 53, 109, 18, 29, 117, 71, 193, -73, 283, 110, -140, -22, -97, 67, -10, -100, 35, -149, -44, -194, -147, -36, 8, 75, 192, -427, 51]
3460E1j82RM35j04k31j26j18K42J82j07N4j85J10J37o9k88J33j92K71j50K98M4
3482B14j68o9j13K02j12Q9K86k5j09j62R7k75J37J39n4Q2PK9o2l74K98j91J51
3505A7L6q0N5q9K08k95q9K98r4j22L46j17J22j62n9q2L31j7k39L7l6J73jj36J52
3530A57j0j7k66O3n7J95l6k56K46j13N0J90k56N3K22j84j13K62q6R7R8m66J18
3553a09K71j96j10J89KO5l7p6J06j93Q5M9j22K02m03N16m76J67QP8O2j65K69j71
3577A1j65J44K5J00n8j14K74l58J98o8J09j10J40j20k83K02J81n9kk04J84J7j05
3600f1p6j14J99J30r9j3j25K05k94K28j70K71j46J7K2k53M12j42P5q1J37k11j85
3623b74L13k51L44n2M77n17j11K37k17p8L49r8l13O5K80q8j54k17K78K53k09J19
$$ y = [51, -131, -122, 313, 209, -22, -148, -266, -24, 158, 51, 105, -80, 30, 167, 98, -190, -57, -249, 22, -128, 170, 214, 46, -23, -136, 66, -46, 43, 329, 304, 195, 33, 130, -145, -8, 131, 77, 159, 166, 195, 133, -241, 57, -134, 17, 53, -27, 28, -61, 147, -148, -237, 61, -33, -155, 191, 74, 196, 34, -25, -107, 224, 207, -32, 5, -31, 142, 141, 5, 157, 147, 130, -136, -73, -130, 65, 29, -227, 19, -94, -44, 146, -110, -57, 165, -19, -132, 130, 44, 141, 239, -227, -109, 162, -34, -144, 45, 47, 112, 75, -1, 105, -88, -3, 46, -76, 126, -277, 239, -237, -70, -62, 16, 78, -87, 182, 11, -154, -10, 15, 115, 57, -57, 217, -141, 57, -11, 98, -12, 128, 8, -275, -73, 108, 49, 47, -157, 27, 44, -61, -137, -251, -52, 78, -21, -34, -159, 46, -248, -20, -190, 81, -65, -48, -26, -279, 133, -9, 66, -15, 122, -89, -274, 39, -212, 132, 80, 557, 40, -71, 166, -51, -129, 220, 122, -191, -126, 154, 66, -88, -305, -27, 226, 17, 136]
3645A36k70j0J72j28R8Lk92L13J16j03K6j29K65k34j46L81k25R2k0l41M27j30
3667Al98N02j99k6Mj1J08n2kr6J31J8kQ8Lj42j15K25J87k56j58K42k90J00M6O
3693h6j7L36k32k3QJ28L8k41N1N8Lm6O1R0k06j36L89j92j84K42k41K93l07L9J55
3718b0j60P2J2J43J2l0m4n6p7J86l3J86j02j72J78P4k40N5P3o5L2%j29K39k30
3743i6L91m15J49J83l98K45j9O2k35K38lj5k77P4K66k40J09k5j60K97J42k86K5
3766A2Q0m3j39J80K43m5q0r0k83L64j34N7k47O2k04K31K76j95Q8MJ9nP2k72m2
3791i1J09K38j39n31N83k52K22r5j53j3R4K6J80j75l8K5o3Kn9J63k45J08J93k50
3815a61J66o6p2N2J86m4kj15j24K79l27J11O3j12K05j50K51k74J04K42j56j98
$$ y = [136, -134, -144, 28, -100, -2, 1, -291, 22, 138, 35, 61, -68, 197, -37, -183, 198, -27, 65, 45, -296, 131, 1, -397, 105, -94, -120, -116, -127, -19, -71, -73, -169, -38, -20, -22, 66, 69, -73, -188, 37, 224, -32, -190, 52, -238, -138, -92, -86, -103, 233, 1, -22, -14, 114, 152, -89, -38, 20, 23, -23, 38, 128, -78, -214, 175, -17, -201, 41, -200, 93, -214, -175, -20, -180, -108, -96, 47, 59, 29, -15, -71, -148, 38, 5, 191, 89, -83, 95, 169, -71, -16, 57, -8, 24, 24, -105, 134, -96, 295, -120, 29, 212, -186, 59, 40, 102, -133, 105, 102, 87, -190, -116, 150, -90, 19, -6, -166, 131, 273, -13, 12, 92, 49, -90, 90, 333, 288, 208, 118, -165, 199, 65, 122, -125, -63, -267, -36, 240, 45, 133, 137, 156, 151, 223, -49, -91, 18, 256, 117, -414, 169, -83, 139, 44, -109, -122, -28, -2, 178, 3, -35, -10, -73, -71, -130, 33, -212, -104, 89, -161, 5, -61, -133, -81, 105, 61, 59, -56, -180, 99, -228, -117, -54, -166, 39, -111, 140, -134, -30, 212, 56, -142]
3837a42QL04l20L73l71M2K12l04J2L23k15K56k79j61M8L25p0j9J23l9m5Nj04j9
3861e7m8J0qq6K45q2R9J09m9j91Q3J75j91lO2j75M3LJ60l27R7K87p0j82P1j75
3887b00j25L1M48l21J20J20K1j47k7J34l61L84j65J79k65J49j63o9M02L4k41k46
3909c08M30k80Q2j75L73m9j42K56k62rK4K84J26l08K3l11J31N7k05K31k10K38
3931dq5Q5j8j4J0J79m1k09k3J74K1Om8j67K70l72M57k36M7k17J0R5K8J88p5k10
3957a49L11k65J97K41l99K21k63K59l58K41p2k35J98p2m6k39N62k4N8j26m14N07
3979A33j6k08J24q0N0l3q4O6Q0J17j27K53k30j29k5J20P2l64L92j03l1J6M2PL3
4004G5K3k1l1L7J72k11R3k43m3J40j62L7RK22k3pm9j98O4L69k65j8K75j29pk97
$$ y = [-142, -134, 170, -150, 223, -148, -106, 106, -198, -186, 137, -78, 178, -101, -262, -214, 111, 41, 22, 145, 106, 61, 66, -38, -57, -105, -95, -103, -189, 56, -26, 73, 182, 133, -58, 25, 200, 9, 6, 68, -107, -64, -61, 99, -228, -131, 156, 86, -96, -25, -200, -325, -294, 154, -167, -47, 73, 94, -53, -80, 54, -307, 77, -88, 91, -174, -25, -188, -257, 145, 179, -62, -308, 122, -158, -76, -251, 122, 73, -69, 187, -75, -84, -60, 224, 350, 42, 65, -246, -115, -58, -263, -32, -242, -4, -89, -4, -22, -36, -26, 153, 112, -97, -120, 54, 75, 81, 33, -134, 136, -236, 221, -15, 32, -185, -175, -80, -52, 136, 61, -149, 162, -103, 94, 335, -64, 157, -106, 153, -205, 36, -36, -271, -73, -145, -191, -430, 132, 108, 166, 40, -374, 133, 117, -91, 33, -47, 3, -30, -114, -48, 32, 149, 22, 275, 45, -84, -109, 11, 83, -281, 111, 8, -23, -7, 35, 42, 75, 98, 77, 46, 83, 255, 44, 137, -106, -149, -9, -171, -134, -125, 97, 74, 67, 18, -180, -116, 253, -12, -30, 245, 116, 109, -188]
4030a88J58j4M4K27l18j0J65l67M01l3n2k0r9O7j00N1K60K0l97Q1L56l95J37P4
4054D8j51J28P1k4j44O8J47j0r8MK77l64m5K4P4j68K19J37k38J83j45M9j92M4
4078a06K73k64K91j40r6k62L35j91M60k02j10k0P7o0m7Q4R2J07k63j33J25K27
4100A77j76J0NJ34q6Q9l51J42J56m39J40K37n5l3O6n0j56R8J33R7k75K27m9n1
4124a0jk31J56lK5J67l12K22L4m6n8K27j54o1j16M81k62L3n3j48K30k0j44J02
4148E8j37K93m91L66q4Q9j46L8j36j01K40j28J67K54K0k03j10J4L77m85j52J59
4170i8J69j46Q0M0M2o0q3k18J15L50j75j09J5p0J42P1j4J7m5L7j08r7N9J1M1m4
4196g8J74k00K87k64J9M1J16k26K1K04k01K99k50L1Q2q1o0j38K89k6k1j88q4J31
$$ y = [-188, -30, -44, 0, 227, -91, -101, 64, -303, 98, 65, 13, -7, -106, -39, -139, -88, 172, 192, -205, -124, 232, -163, -26, 48, -103, 25, 96, 72, -72, -4, 143, 133, 35, 39, 316, -48, -93, -69, 5, -163, 56, 193, -45, 138, -7, 42, -150, -106, 167, -97, 194, 54, -42, -304, 31, -160, 300, 98, -12, -32, 45, -15, -62, 22, 114, 221, -42, -175, -50, 177, 1, 11, 16, 150, 64, 153, -198, -56, 100, -339, -199, 38, -17, -50, 16, -34, -190, -92, 41, 138, -137, 90, 41, -10, -11, -242, -86, -89, -64, 103, -209, 13, 47, 1, -57, 170, 16, -45, -161, 320, 58, 91, 38, -110, 120, 100, -44, 58, -79, 214, -277, 89, 5, 94, -52, -14, -150, -251, -11, -139, 28, 282, 302, 99, -11, 3, 380, -105, -257, -98, 71, -75, 5, 45, 87, 27, -56, -274, -159, 191, 16, -93, -78, -148, -6, 65, 51, 68, 23, 60, -48, -145, -86, -75, -34, -78, 96, -104, 183, -81, -62, -21, 95, -131, -110, 94, -107, 192, -58, -27, 55, -26, -86, -224, 65, 39, 18, -170, -254, -123]
4220a23j8N9J38P6n9l5O8l4j00r5J80l77K45J55j25P7k03L2K71k59J03kK3n3J08
4245E2j85K45l36J95J5J1J57k3J9j10J99j97J0l9J44l7k46J50J21l05K32o5P4
4268H1k15J17mn2J11P3j30J01p1m5p6M2j4R2j70K56k20K97k13N2j03rK57r9k17
4293a59K62K1j35K16j10k12K69l01N18m32O4k40P2j6Q0j02Q0Ok00M76l78L43k84
4316a62K41k87K39J17P5j48k54L80j44j13K2l2K19k92R8J65J1j04J99k96J86k48
4338a28O6J59L8k22m3L67n3k04J99k01P1L9N3j92j44J87N0N3Nj53k03L94j09l33
4362c04L23J90j52l40M79m03J8K82M8J61j90m92L17K03k40J70j37KJ65j94o3O5
4384i2K69k67J76k72J73J0M1j11O9J07k30j3L22j67k79K38m8P5K2Qj7J28k16Q1
$$ y = [-123, -141, -82, 56, 132, 73, 38, 106, 72, -28, -123, 57, -320, -75, 80, -45, 32, -171, -139, 132, -127, -24, -26, -3, -56, 52, -133, 112, -224, -29, -14, -3, 154, 131, 150, 40, 239, 42, 52, 13, 157, 120, -126, 24, 145, -160, 72, 7, 81, -134, -17, -21, -73, 38, 111, -19, 82, 11, -34, -110, -68, -82, 10, -160, 96, -124, 173, -40, 12, -91, -100, 157, 58, -159, 103, 124, -11, 205, 95, -117, 152, -149, 369, -63, 1, -239, -167, -183, -103, -205, -125, -119, -319, 157, -221, 122, -162, 79, -208, 31, 148, 223, 75, -179, 201, 57, -56, -34, -66, 153, -139, -41, 124, 135, 31, 230, -66, 120, -128, -62, 97, 135, -87, -130, 237, 184, -20, 179, -22, 49, 88, 141, -51, -195, -8, 42, 95, 100, -53, -256, 138, 29, -304, 19, 209, 57, -283, 196, -207, -189, 93, 141, 302, 112, -380, -63, 140, -100, 70, -67, -65, 100, -94, -157, -92, 177, -90, 86, -186, -13, -3, 38, -73, -4, 103, -127, -140, 182, 15, -264, -26, -74, 1, 23, 31, 14, 142, -74, 7]
4408GN4p4K09n4k26J3L59l34K12j87j46J69o1K93k84j50K15j60J63J11j37J03
4430I5k1m6J08n63K23J02K9Q1P3j96J2N7N5L05p3k82J13l74J11L99k01N1Q0J0
4454A48j98q1J02p7J41Q2o8Q5p3j11kP5j21J64p7M6j7n6K85l27j66K13K4l03L44
4479C2k58JK08n3k21N5mL05j11J51l55P3OK99j87j00lO7J56j21K80l3j61j03k98
4504c75N29j89K76o5p2m0j98J48k44K8K06j10K62O7m12K55O8k5k16J01o8QK07
4527A41l54J79K84k28K07k31j0j04J54j39j12M05n4j09rQ9N6l62K98q6J83n9k11
4550g2N8o0K49k79J99j09q8J43j88K24L3j18j07O2n8K09j82J38k72K25l55K30
4572a18K85j17o8K27j59Nk3J8j22Q7K79j68j93O6j80L46qj54K6k60J60J89J37
$$ y = [7, 61, -13, 196, 142, -84, -71, 288, -46, 166, -21, -167, 2, -59, 234, -50, -200, 15, -145, 18, 129, -8, 95, 74, 28, 136, -427, -204, -102, -73, 8, 81, -115, -103, -46, 9, 314, 241, -41, 72, -302, -191, 208, 7, 58, 138, 148, -50, -131, -29, -106, 35, 117, 49, 134, 61, -50, -52, 23, -98, 66, -11, 35, 18, -38, 247, -80, -246, -33, -9, -312, 32, -226, -225, -17, -70, -291, -236, -240, 65, -46, 105, -250, -177, -171, 128, -59, -159, -162, -95, 61, -60, 220, 187, 26, -77, -375, 154, -35, 241, 176, 104, 64, -134, 14, -230, -202, 4, -106, 156, 223, -189, 66, 134, 109, -107, -6, -74, -66, 141, -213, -34, 250, 22, 229, -2, -12, -116, 38, -101, -213, 192, 138, 29, 20, 109, 165, -197, 101, 15, 198, 139, -72, -14, -74, 175, -104, 95, -14, -102, 41, -147, 77, 110, -8, -115, -53, -111, 98, -84, 54, -218, 7, -348, -118, 167, 50, -18, 209, 50, 55, 32, 50, -72, 15, 294, 126, -67, -1, -181, 165, 157, 3, 29, -231, -71, 118, 255]
4595B55l06r7R8J69j60p5o5J35j14J33j56R5j28K99k7Q7l60L68K19n46P2J58l9
4618A5j65j07K37j73K77k40J27n4J82p1j15K26j99J21k25J10K15j44j06K80k0
4639A71k45O6O0n8l3L1j8jJ48l38K86j40l5K16l1k56L53m35K13J04q6J57J52m45
4663a64L95k88j50L34j46j6l7Q2j78K70J26Ml83J91N8Oq2L5K7pj82O8lL12k25
4688D7j56p2P8R1N0P0J43k80P1J5l0K7k59K22K54k36q1K97k64Q3j13k3P8J33J00
4713B45k12j44M4J59l11K58l25L20K9k22L45p9j20j5mj54J61k02K63OJ74k74J19
4736F1l9l08J51K54M0k64K25k05j49M18J76n62M02l78L4J51k7K7j66K56l7lj46
4759h9J72j04j30J45J63N2k21j8J08j06J26j24j27j7K72k17J43k17K45QLK7j2
$$ y = [255, -51, -148, -50, 119, -41, -116, -181, -46, -160, -27, -183, -88, -216, 83, 56, 143, -217, 151, 370, -176, -104, 54, 15, -150, -257, -20, -193, 84, -156, -29, -83, 99, 28, -87, 139, -60, 61, -164, -54, 161, 17, -89, 191, 171, -74, -8, 52, -6, -39, -8, -26, -27, 121, -217, 69, -71, -106, 110, 79, -177, 176, -259, -46, 58, -28, 129, 281, -164, 231, -57, -207, 127, -19, -35, -72, 10, -168, 102, 228, 232, -151, 40, 98, 104, 22, 57, 84, 77, -105, -37, -40, 272, 47, -109, -181, -103, -12, 38, 108, 251, -29, 42, 57, 27, 54, -205, 17, 271, 35, -46, 251, -13, 70, -43, -66, 12, 145, 245, 33, -111, -67, 92, -219, 39, -286, 34, 63, -159, 186, 107, -13, -28, -32, -186, -25, -227, 36, 42, 216, -58, 61, 22, -286, -135, 119, 159, -105, 120, -85, -234, 184, 360, -202, 200, -178, -144, 7, -20, 7, -159, 97, 60, 57, -89, 83, -21, -151, -6, 157, 209, -12, -30, 78, -28, 98, -26, -153, -170, 102, -115, 28, -189, 56, 64, 67, 94, 82]
4782H2k37K62m9J01j05k66M92l07J54q2j1M0j4j45P0J8p4K0J98k76l1K02k7K0
4806C5j37K78k26J81j96j37L38m7J19k11J16l4l84K56j22L78l05QK36n5k70J72
4828gj8J06l4m2K34l52N5L44j73q5r5m0K05J95m58K77R5l23J62L3P9N6p7k64p2
4853a99L35k43k6K47l43K54O1m7P1j99J34k9J92k51j16J95p5l02N00k39N5%N8
4876C3o2L09j97Q4l03Q0J98o7n2rj00J62j99J86J30k61l7R0j28J83o1J59k69p2
4900b03M81k72j05N9j4j63K01P6J55r9k51j17K79l07M13q7J33O6k05Qr9J75Q0
4923B04j53R0k30j17J04N5jJ86qj33J3j29J90j6k13K28k02PK19O3J85k49Q4K9
4947B06l60J92j75J78j52j63K43Q3L8j91M1K97k15j58K71k54J84pj90L12k10J77
$$ y = [82, -155, 107, 58, 159, 54, -212, 280, -27, 127, 45, 34, 74, 60, -85, -15, 3, -71, -51, 147, -129, -160, 42, 15, 35, -102, 176, -50, 131, -65, -202, 136, 89, 208, -3, 113, 79, -305, -49, -171, 207, -98, -90, 146, 91, -179, -7, -25, 81, 47, 5, 239, -113, -58, 286, 113, 28, -67, -107, 98, 293, -165, 112, 207, -116, 46, 79, 158, 214, 137, -127, -199, 136, -107, -133, 114, -229, 25, 86, 39, 110, -89, 45, 16, 208, -43, -159, 36, -39, -341, 159, -80, -25, -25, 33, -29, 280, 83, 167, -136, -56, 142, 75, 23, 14, -86, 76, -123, 63, 193, -68, -105, -15, -143, 40, -21, 138, -131, -203, 278, 6, -99, -40, -54, -217, -16, 60, 215, 116, -135, -252, 27, -280, 133, 46, 179, 245, 40, 48, -51, 124, 204, 51, 141, -89, -206, -102, -47, -48, 138, 130, -3, 10, -119, 71, 55, -158, 70, -132, -125, 94, 157, 342, 93, 177, 206, -154, 38, -137, 41, -111, -274, -31, 52, 90, -101, -60, 237, 22, -136, 135, -119, 65, 58, -132, 180, -30, 147]
4969A47j9j46q6LL7o6l7K71k30J09r6K72j80j56L19j08p4l9J64K8p3j39j99K20
4993g8K7j5J9J19J3j60K03j89o4K26l74J83Q4N8P1p1n4o6J36j31j3J22O2k73M35
5018B70k13j42J29RJ8l40K72J45q3MJ55M6m39K76m2J52n25O9Q6j7L16Q6q6p3l12
5043b39N3K60l8n3k74J00J54J33j02l41M99j30j41R8K72j50M3P4O3j57k17O6P2
5066D5r2l4J3K06k19n9L97k01j38l3L35k29o8M11l56R6J78k33q6L2K9k0j82K48
5090D0o3K13K3k31l4J30nN4j34k1P2r7J85k33j7J40j6l0n1L25n57L93J50k12M8
5115G2j32j09M14k33q5J76j08L25k42O1k52p9K98k2J69m44J22M1O7Qj17J92l37
5138b15K41nj32J95j42Lj02J58k87K58j57M2K13N0J3R4j72j78K79j53j00P1J26
$$ y = [147, 128, -18, -104, -101, -64, -130, -167, 104, -126, -17, -113, 159, -21, -177, 142, 34, -40, -79, 85, 113, 40, -99, -298, -78, -51, -66, -47, 72, 85, -75, 128, -61, -125, 101, -273, -90, -6, 52, 123, 52, -2, -68, 68, -63, -76, 46, 108, -165, 270, 57, -85, 44, 53, 71, -269, 3, 148, 65, 69, 224, 270, -169, 107, 65, 217, -308, -239, -153, -170, 146, 232, 146, 73, -239, -186, 74, 36, -17, -291, -191, -37, 96, -6, -347, 152, 22, -119, -21, 251, 101, 144, 218, 281, 124, -93, -27, 45, -47, -81, -68, 138, -81, -140, 257, 56, -82, -115, 220, -9, -77, 334, -22, 74, 252, 19, -67, -35, -6, -26, -208, 40, -23, 190, 213, -18, -52, 78, 73, 127, -7, -28, 44, -53, 132, -101, -118, 22, 6, -24, -75, 250, -307, 86, 236, 24, 72, -60, -169, 245, 12, -73, 103, -5, 320, 78, 139, -113, -192, 106, 84, 253, -191, -69, -28, 39, 47, -70, 122, -215, 26, 21, -111, 84, -58, -55, -157, 1, -286, -28, -185, -143, 70, 120, 133, 227, 55, -123, 156, 3, -97, -26, 100]
5161A00j45k7j23K54j8J67k43j80J46q5K34k61J26K1l2j40L26o5j21J78J16l21
5183i3N2k0R8J0j44j45K49k04K97n02N45j15K9o2p8J07j34K05J0j1j50Q7J25l43
5207a87l9J92j93M14n7j96J51k96M37j46J12l12K24J9PJ36k05%j66Q5l9P6k70
5230b53J01P8J39j50K8k01L52k57L04l51Q4J44j79N1J90J77l79q0J44O7k4k71
5252b86N12o9j97Q5J81k27K6J45j50l8K33l05L67m00r5K10P6K12k48J36j29j03
5274f4m2q6o4K09P2P8k39N3J81jk20J70j05J78m5j4j11K4j01kJ33L8k56M04k82
5299i2j15L33m5R1l20J84j23L6J12k15K78j78J51k94J62n9J15j00J73J21j47K49
5321C17l28j7J33k84K57J52l3n2k00j43L95k78K79q7N1j41q3J99qO5j05m2o2J13
$$ y = [100, -45, -72, -195, 59, 41, 208, -35, -215, -69, -154, 80, -181, -55, -34, -66, -206, 120, 55, -66, 112, 228, -93, -41, -61, 37, 47, -97, -242, 7, -197, 100, -402, 143, 28, 57, -5, -83, 24, -110, 95, 105, 94, -56, 31, 156, -187, -226, -34, -227, 187, 130, -66, 85, -211, 226, 80, 192, -120, 104, 123, 130, 266, 61, 61, -105, -20, -59, 17, -253, -152, -74, 65, -85, -57, -258, 94, -163, 141, -210, -126, 18, -161, -110, 80, 257, -122, -202, -58, 9, -15, -286, 226, 157, -40, 45, 226, -1, 25, 170, 20, -18, 215, -90, 277, -123, -218, -8, 68, 280, 32, 168, 39, -64, -106, -192, -256, -47, 25, 103, -136, -83, 98, 97, -123, 47, -58, 120, 75, 61, -50, -26, -127, -129, 4, 42, -214, 190, -92, -207, 126, 81, 172, -148, 36, -87, -51, 61, -154, 124, -54, 97, -197, -35, -94, 21, -79, 94, 215, 68, 317, -11, -28, 105, -179, 78, 230, 197, 145, -55, -198, 197, -81, 198, 111, 162, 21, -62, 137, 129, 194, 89, 47, -15, 98]
5345I8j69N6P2m4j09Q7J94m16J01N32m45M2L4k11K38m9o9j1L6p6kJ27k85J26m
5370a47J50j95K67n1pN1R2p6j09J31J5N0j20l9q5J45k61J21N0K4j41J94J69l44
5394a16K25j53J65l9m45N43l6K04l17n7K7J89l70L93j01o6j35o7J31K8LK6m9r8
5418a15L29j84M5j85J02o3O7J05j6m7j0q5k34K23O2rn7J2q1M7J50Q9N4j58K59
5443C00l51P9k6k7K8k63J99j01K74j45J38j46qK84l49J43j18LQ1j16R5n0j58M5
5467a89K58k72K60k6j30m6J12M7k14M12k6k01J54j55J8J4J21k37J07P4Q0m96K60
5490g5K43k43J11J57l51j05K50K54l34j66L65j15q5R9j83J36k0o0J7K5M5j72K04
5513cJ44j90j36K67N1K9l18J07J03j39J55o2n1J99J04k67R9k06o7J63j38L33j75
$$ y = [98, -71, -15, 57, 13, -96, -9, 185, -231, -130, 402, -43, -1, 33, -178, 60, 11, -58, -69, -33, -109, -111, 16, -269, -143, -147, 3, -192, 75, 24, 17, 68, 160, 84, -25, 106, 121, 171, 51, 12, -73, 72, -189, -68, -18, 6, -135, 59, 228, -116, 109, -44, 121, 82, -363, 180, 144, 348, 31, -26, 1, 190, -180, 213, 112, 46, -89, -156, -25, 3, 6, 32, -17, -115, 214, 30, 75, -110, -8, -71, -4, 101, 85, 38, 28, -57, -291, -68, -6, -15, -72, -60, -141, -94, 56, 145, 199, 41, 300, -51, 28, 2, -25, 3, -260, -61, -162, 112, -33, 105, -41, -49, 235, -114, 29, -89, -86, -5, -121, -26, -76, -234, -189, 69, -203, 57, 31, -99, -145, -33, 14, -200, 212, 186, -15, 139, -16, 2, 16, 137, -100, 7, 81, 161, -335, -75, 168, -75, 36, 193, -158, -263, -13, 241, -93, -259, 106, -9, -94, 5, -178, -42, -62, -122, -105, -80, -35, -207, -3, 141, -49, -185, 82, 133, 162, -156, -49, 54, -85, 70, 8, -43, 156, 260, -7, 92, -114, -181, -18, -156, 177, 2]
5536Bj30Q6J57J08k17P3m03K09O3j12M83l18K26k40J24k06L8L31l80K39k17Q5
5558Akj20J64o5Q2P8r2L87m76J02k55L89l35K56l36J51J29J40l9r6K43Rm45J55
5582B5j3R0l5j16r6J69l4o9kJ41J86m39K52j36q4J51k36M73l18K01k60PK16j37
5606f4J45k55k8J71j40K82k19K42L0j94p1P8K28k02J95j77m6O5k3N2l68j69N22
5629E4l7j07P0r4J99R9r1L1k58P5r7L94j78k23R3Q8j15L13k47J55k33J75K20l61
5653g5L3J44j56K5P2N3l19L40J6n5K2k09J02k02K59Lj8j20J23l6K03j68k40L6
5677a67K35n7J08r7j38K4J41J4n6j38J79l08L08j68NL21j9k18J20j7j55J6L39
5700B72k25j36J82o4J8l5k8j42K03n3j03K01Q7j57j27N9n8L87l44k47N10J3k53
$$ y = [2, -128, -42, 115, 223, 6, 79, -324, -115, -52, -164, 319, 1, 227, -13, 111, -95, -57, 274, -106, 133, -84, 1, -1, -121, 43, -22, 60, 138, 46, 433, -43, 59, -196, 193, -142, 114, -222, -71, 58, 198, 159, 63, 306, 315, -130, 25, 12, 102, 67, -49, -145, 24, -10, -79, -81, 60, 246, -193, 59, -77, -161, -10, -246, 227, -91, 110, -150, -143, 73, -64, 81, -174, -202, -31, -171, 111, -108, 134, 164, -30, -101, -23, 205, 3, 198, 21, -25, 40, 17, 69, -299, -468, 54, 17, -90, -20, -114, 85, 184, 93, 124, -134, -59, -156, 238, 60, -163, -70, 18, -97, 216, -31, 124, -109, 66, 286, -75, -42, 102, -54, -29, 43, 96, -223, 117, 133, 78, 100, -109, -7, -209, 50, 53, 35, -85, 38, 2, 205, 37, -203, -167, 68, 11, 119, 22, -116, -92, 49, 63, 7, -131, 48, -260, 48, -120, -115, 206, 187, -31, 89, 72, -83, -67, 272, 47, -89, 93, 29, 47, 12, -16, -158, 45, -8, -111, 90, 177, 20, -107, -48, -106, 281, -63, -310, 200, 213, -40]
5723d0j07O0r3L08m2K07q1l18J83J5j87Q6O2p8K32k81n1k4qJ1J12k30J24J05J36
5748A01j70J57k18M34n20m6L39k09j77M98J32l39K12k36L18k36k20pJ30K8K94
5769B65j23K71k56k7j53N4J53l71K04j67J15K4K9j6J24r0k55J00j7M3J60m6J84
5792B05n3J9j47o6k17N00k95P7j47P6J16r6J2o6J63Q5j28p7J5M9o8J21j34l06
5816c62M15k3J7r1j6O3k87M88p6J01Q2m94K00j02%K21K3l50R4K02q4K9n1j6k3
5841d0p1O1J36p0J52j31K0k33K22j95L09k29k3K38q7kj09j67K60O1j0j77k8J28
5865A5K41k04Q8oJ63k31p7P5Nl09J78N6k31M31j93P4P6k4J58l85M7p8K11J13k16
5890b3r8j5J44K38k70L2q1L06l59M7K20q7R8L8K3k27j20M13k19p0Kj83k2K91R4
$$ y = [-40, -147, -87, -180, 128, 86, 293, 212, -106, 77, 92, -95, -9, 53, -25, 207, -74, -125, -149, -157, -146, -34, -264, -140, -35, 101, -69, 88, -130, 304, -216, -262, 77, -132, -309, 189, 321, -18, 194, -42, 276, 40, -180, -187, -57, -29, 265, 142, 413, 157, 130, -23, 31, 184, -187, 17, -150, -35, -11, 18, 2, 126, 36, -219, -119, -136, -93, 67, 21, 205, 152, 171, 24, -42, -259, 241, -54, 23, -124, -48, 68, -28, -16, -82, 81, 166, 38, -39, -24, 25, -43, 78, -56, -362, 53, 30, 47, -44, -60, 3, -284, 204, 128, 229, 311, -183, 17, -85, -85, 136, 159, -191, -97, 105, 21, 50, -1, -17, -40, -111, -50, 86, 16, 168, 37, 57, -176, 46, -149, 160, -69, -92, 146, 59, 57, -52, -219, 41, 102, 92, -85, -113, 15, 256, 52, 140, 134, 297, 66, -11, 64, 69, -240, -62, -6, -237, 194, 1, 75, 151, 127, 285, -100, -53, -131, 80, 193, -23, -121, -136, 8, 246, -24, 8, -73, 233, -126, -79, 141, 54, 152, 190, 213, -14, -134, 279, 60, -10, -8, -191, -213, 78, 172]
5915A72j87j2K5J78o4n2k23J14P8L9L7j65K79k94J44q1P9oo9oj92K41p2n8L4L2
5941b9J02k09Q6R8j79k61N35k5n2j76K47j58p4J4P9r7Q2m0l1P2J01j44j34K32
5965C9j25J58m6n1m3J10j14K58j89j9j3k77L78j62J05k88L22r9j0m1J55j12J03
5988C9j0l21L42P6j81k08J29J88l7j36M64k44J1l4K49l04j1j72R2J0R3J32l0k15
6012g8J07L9k42K71M4J9k08k6jp0Q9Kj85L49l38J16J17j64K71k80K29k01m4K83
6036I9j18j56J52L9k4Q7j61J91k29m8K83l73L56J00k00l2J38n2j91k3J97k58R4
6059a29k7K34N0j10r8M00m22L65k87Q1j6j05r8L7K54o4j77J65q6P9K8n9j30M1
6083g4J01j69N8J41K75m78K71j18RN3k23J38R4j85mK3Lq8L39j52QL8k35K0J50
$$ y = [172, -15, -27, -2, 176, 112, 60, -163, -49, 29, 68, 105, -60, 219, -75, 69, -12, 67, 61, -8, -14, -206, 35, -37, -95, -61, -29, 73, -136, -50, 48, -131, -392, 143, 118, 66, -110, 137, -21, -95, -81, -2, -99, -17, -57, -88, -16, 85, -59, -193, 39, -86, 72, 26, -25, -68, 42, -72, 186, -3, -22, -35, -312, 66, -96, 9, -279, 43, -56, -66, -107, 48, -64, 39, 29, -292, 50, 126, -55, -263, -134, 54, 17, -119, 345, 101, 112, 78, 327, 23, 12, -160, -68, -58, 35, 167, 137, -78, 29, 68, -174, 97, 141, 160, -48, -74, -75, -145, -56, -54, -239, 110, -228, -112, 5, -159, 112, -168, 61, -140, -184, 99, -19, -175, -23, 16, -8, 79, -82, 109, -120, -168, 115, -258, 98, 198, -2, -34, 104, 52, -139, -162, 35, -223, -129, -156, 78, 128, 18, -80, 320, -102, 263, -24, 57, 41, -64, -162, -125, 129, 65, -112, 53, -33, 46, 74, 15, -115, -74, 27, -142, -84, 57, 332, -146, 125, 7, 16, 69, -154, -16, 78, -107, -111, -88, -85, -173, 166, 14, 22, 60, -175, -155, -5]
6108emK19j88L7LQ2j48o1J5l7R2J16k54K30l2j41J54l4J19m03L73j1k58L10j03
6133G1J53k53L0m1j9P8j74L54k85L8q7K57j00MJ91k96j17K65k99L51l8j92k22
6156c31M83q9j45p4K50j73K02k16J11j35O8K25j38k13K76q1M2L7k44M8L54k98
6178d1j45Q7P3K9N0M5o6L5J3J93l20Q1O3J15l18J85k94J89K5R9j91R0J47j91J00
6203E3m7P8p4J72k14J30M3q5p3j00L23l00K82j02j52j27L80k65J31j18P6l0q5
6226a04J63k00J47j27K07pj97K3J59m4l5j73J49l74N23l4j43M39n04J0M5J4K4
6249c9p2O1L27o5j87r1n9j69M71j41m3J57J82j87k32K03q0J8J54k79j69L64%M2
$$ y = [-5, -9, 210, 22, 59, 62, 144, -4, -65, -50, -87, 5, 121, -133, 97, 65, -76, 78, 44, 163, -240, 133, 122, -136, 174, 71, 224, -29, 1, -40, -59, 19, -155, 199, -86, -48, -135, 122, 22, 26, 217, -79, -196, 69, -230, 121, 83, -109, -331, 152, 63, -82, -156, 94, -79, 123, -93, 18, -117, -49, 176, 38, -175, 101, 20, 62, 99, -145, -97, 257, -41, -186, -99, -26, 3, 53, 98, 32, 67, 80, 273, -47, 34, 97, 212, -106, 79, -215, -26, -1, 98, -93, -3, 144, -47, 53, 6, 84, 10, 182, -32, 98, 141, 56, -17, -117, 206, -94, 188, 86, -66, -193, 187, -78, 53, -65, 11, -19, -104, 59, -141, 6, -121, 86, 79, -118, -95, 64, 20, -15, -188, -39, -413, 110, 76, -67, 372, -132, -122, -77, -63, -39, -111, -50, 277, 212, 25, -66, -125, -294, 177, 36, -7, 150, 332, 145, -87, 116, 36, 54, 208, -71, -240, 124, 124, 166]
$$ [...]
8191f4
##END NTUPLES=NMR FID
##END=
