##TITLE=1H_UK-21
 DMSO,72 sc, 
 28.9.2021
##JCAMPDX= 6.0         $$ Bruker NMR JCAMP-DX V2.0
##DATA TYPE= NMR FID
##DATA CLASS= NTUPLES
##ORIGIN= UXNMR, Bruker Analytische Messtechnik GmbH
##OWNER= root
$$ XWIN-NMR		Version 3.5
$$ Tue Sep 28 13:30:28 2021 Russian Standard Time (UT+4h)  she@DPX200
##.OBSERVE FREQUENCY= 200.13
##.OBSERVE NUCLEUS= ^1H
##.DELAY= (6, 6)
##.ACQUISITION MODE= SIMULTANEOUS
##.ACQUISITION SCHEME= undefined
##.AVERAGES= 72
##.DIGITISER RES= 18
##SPECTROMETER/DATA SYSTEM= spect
##.PULSE SEQUENCE= zg30
##.SOLVENT NAME= DMSO
##.SHIFT REFERENCE= (INTERNAL, DMSO, 0, 15.7039)
##AUDIT TRAIL= $$ (NUMBER, WHEN, WHO, WHERE, WHAT)
$$ ##TITLE= Audit trail, XWIN-NMR		Version 3.5
$$ ##JCAMPDX= 5.01
$$ ##ORIGIN= Bruker BioSpin GmbH
$$ ##OWNER= she
$$ F:/spectra/data/she/nmr/H-F/1/audita.txt
$$ ##AUDIT TRAIL=  $$ (NUMBER, WHEN, WHO, WHERE, WHAT)
(   1,<2021-09-28 13:28:12.03 +0400>,<she>,<DPX200>,
      <continue with go, POWCHK disabled, PULCHK disabled
       configuration hash MD5:
       00 E9 B6 7A A2 85 ED C7 34 08 36 98 17 FE 4E 26
       data hash MD5: 16K
       06 30 29 09 71 60 49 D6 4E C4 E8 AF EE A7 F4 C6>)
$$ ##END=
$$ 
$$ hash MD5
$$ 17 30 53 C6 85 4E A1 3A D1 A7 21 C5 1A E8 EF 46
##$RELAX= 
##$RELAX= 
##$RELAX= 
##$RELAX= 
##$RELAX= 
##$RELAX= 
$$ Bruker specific parameters
$$ --------------------------
##$DU= <F:/spectra>
##$EXPNO= 1
##$NAME= <H-F>
##$PROCNO= 1
##$TYPE= <nmr>
##$USER= <she>
##$AMP= (0..31)
100 100 100 100 100 100 100 100 100 100 100 100 100 100 100 100 100 100 
100 100 100 100 100 100 100 100 100 100 100 100 100 100 
##$AQSEQ= 0
##$AQ_mod= 1
##$AUNM= <au_zg>
##$AUTOPOS= <>
##$BF1= 200.13
##$BF2= 200.13
##$BF3= 200.13
##$BF4= 200.13
##$BF5= 200.13
##$BF6= 200.13
##$BF7= 200.13
##$BF8= 200.13
##$BYTORDA= 1
##$CFDGTYP= 0
##$CFRGTYP= 5
##$CHEMSTR= <none>
##$CNST= (0..31)
1 1 145 1 1 1 1 1 1 1 1 1 1 1 1 1 1 1 1 1 1 1 1 1 1 1 1 1 1 1 1 1 
##$CPDPRG= <>
##$CPDPRG1= <>
##$CPDPRG2= <>
##$CPDPRG3= <>
##$CPDPRG4= <mlev>
##$CPDPRG5= <mlev>
##$CPDPRG6= <mlev>
##$CPDPRG7= <mlev>
##$CPDPRG8= <mlev>
##$CPDPRGB= <>
##$CPDPRGT= <>
##$D= (0..31)
0 1.2 0 0 0 0 0 0 0 0.06 0 0.03 0 0 0 0 0.0002 0 0 0 0 0 0 0 0 0 0 0 0 
0 0 0 
##$DATE= 1632821027
##$DBL= (0..7)
120 120 120 120 120 120 120 120 
##$DBP= (0..7)
150 150 150 150 150 150 150 150 
##$DBP07= 0
##$DBPNAM0= <>
##$DBPNAM1= <>
##$DBPNAM2= <>
##$DBPNAM3= <>
##$DBPNAM4= <>
##$DBPNAM5= <>
##$DBPNAM6= <>
##$DBPNAM7= <>
##$DBPOAL= (0..7)
0.5 0.5 0.5 0.5 0.5 0.5 0.5 0.5 
##$DBPOFFS= (0..7)
0 0 0 0 0 0 0 0 
##$DE= 6
##$DECBNUC= <off>
##$DECIM= 32
##$DECNUC= <off>
##$DECSTAT= 4
##$DIGMOD= 1
##$DIGTYP= 9
##$DL= (0..7)
0 120 120 120 120 120 120 120 
##$DP= (0..7)
150 150 150 150 150 150 150 150 
##$DP07= 0
##$DPNAME0= <>
##$DPNAME1= <>
##$DPNAME2= <>
##$DPNAME3= <>
##$DPNAME4= <>
##$DPNAME5= <>
##$DPNAME6= <>
##$DPNAME7= <>
##$DPOAL= (0..7)
0.5 0.5 0.5 0.5 0.5 0.5 0.5 0.5 
##$DPOFFS= (0..7)
0 0 0 0 0 0 0 0 
##$DQDMODE= 0
##$DR= 18
##$DS= 0
##$DSLIST= <SSSSSSSSSSSSSSS>
##$DSPFIRM= 0
$$ [...]
##$SUBNAM2= <"">
##$SUBNAM3= <"">
##$SUBNAM4= <"">
##$SUBNAM5= <"">
##$SUBNAM6= <"">
##$SUBNAM7= <"">
##$SUBNAM8= <"">
##$SUBNAM9= <"">
##$SW= 22.9630152165798
##$SWIBOX= (0..15)
0 0 2 0 0 0 0 0 0 0 0 0 0 0 0 0 
##$SW_h= 4595.58823529412
##$TD= 16384
##$TD0= 1
##$TE= 0
##$TE2= 300
##$TE3= 300
##$TEG= 300
##$TL= (0..7)
0 120 120 120 120 120 120 120 
##$TP= (0..7)
150 150 150 150 150 150 150 150 
##$TP07= 0
##$TPNAME0= <>
##$TPNAME1= <>
##$TPNAME2= <>
##$TPNAME3= <>
##$TPNAME4= <>
##$TPNAME5= <>
##$TPNAME6= <>
##$TPNAME7= <>
##$TPOAL= (0..7)
0.5 0.5 0.5 0.5 0.5 0.5 0.5 0.5 
##$TPOFFS= (0..7)
0 0 0 0 0 0 0 0 
##$TUNHIN= 0
##$TUNHOUT= 0
##$TUNXOUT= 0
##$USERA1= <user>
##$USERA2= <user>
##$USERA3= <user>
##$USERA4= <user>
##$USERA5= <user>
##$V9= 5
##$VALIST= <valist>
##$VCLIST= <CCCCCCCCCCCCCCC>
##$VD= 0
##$VDLIST= <DDDDDDDDDDDDDDD>
##$VPLIST= <PPPPPPPPPPPPPPP>
##$VTLIST= <TTTTTTTTTTTTTTT>
##$WBST= 1024
##$WBSW= 4
##$XGAIN= (0..3)
0 0 0 0 
##$XL= 0
##$YL= 0
##$YMAX_a= 1151868
##$YMIN_a= -924702
##$ZGOPTNS= <>
##$ZL1= 120
##$ZL2= 120
##$ZL3= 120
##$ZL4= 120
##$ABSF1= 10
##$ABSF2= 0
##$ABSG= 5
##$ABSL= 3
##$ALPHA= 0
##$AQORDER= 0
##$ASSFAC= 0
##$ASSFACI= 0
##$ASSFACX= 0
##$ASSWID= 0
##$AUNMP= <proc_1d>
##$AZFE= 0.1
##$AZFW= 0.1
##$BCFW= 1
##$BC_mod= 2
##$BYTORDP= 1
##$COROFFS= 0
##$CY= 11.3945322036743
##$DATMOD= 1
##$DC= 2
##$DFILT= <>
##$DTYPP= 0
##$F1P= 2.36226072786647
##$F2P= -0.459571619588291
##$FCOR= 0.5
##$FTSIZE= 0
##$FT_mod= 4
##$GAMMA= 1
##$GB= 0.15
##$INTBC= 1
##$INTSCL= 1
##$ISEN= 128
##$LB= 0.24
##$LEV0= 0
##$LPBIN= 0
##$MAXI= 10000
##$MC2= 0
##$MEAN= 0
##$ME_mod= 0
##$MI= 1.114404
##$NCOEF= 0
##$NC_proc= 0
##$NLEV= 6
##$NOISF1= 3.799351
##$NOISF2= 2.8
##$NSP= 1
##$NTH_PI= 0
##$NZP= 0
##$OFFSET= 15.70392
##$PC= 1
##$PHC0= -14078.07
##$PHC1= 12.80089
##$PH_mod= 1
##$PKNL= yes
##$PPARMOD= 0
##$PSCAL= 0
##$PSIGN= 0
##$REVERSE= no
##$SF= 200.130013532006
##$SI= 16384
##$SIGF1= 3
##$SIGF2= 2
##$SINO= 400
##$SIOLD= 16384
##$SREGLST= <1H.CDCl3>
##$SSB= 0
##$STSI= 0
##$STSR= 0
##$SW_p= 3612.71676300578
##$SYMM= 0
##$S_DEV= 0
##$TDeff= 0
##$TDoff= 0
##$TI= <>
##$TILT= no
##$TM1= 0
##$TM2= 0
##$TOPLEV= 0
##$USERP1= <user>
##$USERP2= <user>
##$USERP3= <user>
##$USERP4= <user>
##$USERP5= <user>
##$WDW= 1
##$XDIM= 8192
##$YMAX_p= 0
##$YMIN_p= 0
$$ End of Bruker specific parameters
$$ ---------------------------------
##NTUPLES= NMR FID
##VAR_NAME=  TIME,          FID/REAL,        FID/IMAG
##SYMBOL=    X,             R,               I
##VAR_TYPE=  INDEPENDENT,   DEPENDENT,       DEPENDENT
##VAR_FORM=  AFFN,          ASDF,            ASDF
##VAR_DIM=   8192,          8192,            8192
##UNITS=     SECONDS,       ARBITRARY UNITS, ARBITRARY UNITS
##FACTOR=    0.0002176,     1,               1
##FIRST=     0,             0,               0
##LAST=      1.7823616,     0,               0
##MIN=       0,             -924702,         0
##MAX=       1.7823616,     1151868,         0
$$ Real data points
##PAGE= N=1
##DATA TABLE= (X++(R..R)), XYDATA
0@%%%%%%%%%%%%%%oP8j44J44j44J44k16K88k88L60m32M94n68O50p72Q65r65J102
32E90j271J454j644J852k076K328k608K907l247L611m001M442m912N424n993O611
48C467p288Q034q850R745j0741J1849j3090J4481j6057J7870j9968K2427k5369
61a3490K8952l3430L9221m7031N8230p5740J07199j81647P23263N46341q86116
72B65752o43576n46878K52901P45649O18467l3303l97820o61826k96708L62431
82c34911O27044K48519j56275n54855m91696R7601N98900N54092K18346m10709
92C96056q13285m97053K16383O75820P31869K26931m98386p68153m43958R0483
102f83293N93168O49802J26948m26792n42848k86329K17336N52569L35070j57918
$$ plain form
0 0 0 0 0 0 0 0 0 0 0 0 0 0 0 0 -6 72 -72 72 -72 72 -144 144 -144 216 -216 278 -290 360 -412 453 -512 590
32 590 -681 773 -871 981 -1095 1233 -1375 1532 -1715 1896 -2105 2337 -2575 2849 -3144 3467
48 3467 -3821 4213 -4637 5108 -5633 6216 -6874 7607 -8450 9420 -10548 11879 -13490
61 -13490 15462 -17968 21253 -25778 32452 -43288 63911 -117736 605527 1151868 265752
72 265752 -377824 -924702 -671801 73848 692315 659012 261192 -400634 -697342 -334911
82 -334911 292133 540652 384377 -170478 -662174 -564573 34327 588419 806765 396056
92 396056 -417229 -914282 -697899 -22079 709790 936721 438335 -329818 -773776 -683293
102 -683293 -90125 559677 686625 259833 -283015 -569344 -352008 200561 535631 377713
112C77713m64514m57431n1177M98178O16667K22879l14735o80559n43335P8657
122g17657O04299O56599K92811l07178o97704n08460L5838M79609N68951K08970
132F16078l25709n11680k65941J36520M41929L77375o5552m36386m30819r1703
142e55888L82908N90695K87290k44123n82471n24579o1816M82730O35356L19572
152G29674j99145n83846n15992m1449M05260N02464K34272k08279m58058k96056
162d31155R6306L86065L58659N534l81375m36454j26594K98423N19620L34884
172F23913j37787n14864n09653j28348L64333N88942L59639j21407m85356m80735
182d41323j16238L13729M63126K46682j41959l95277l07276M3526L44052L40529
$$ plain form
112 377713 -86801 -544232 -595409 -97231 519436 742315 427580 -252979 -796314 -717657
122 -717657 -113358 543241 836052 528874 -168830 -677290 -641452 -161843 407108 616078
132 616078 290369 -221311 -487252 -350732 91197 468572 403020 -33366 -464185 -555888
142 -555888 -172980 417715 705005 460882 -121589 -646168 -707984 -225254 410102 729674
152 729674 530529 -53317 -569309 -610758 -205498 296966 531238 322959 -135099 -431155
162 -431155 -334849 51216 409875 415409 34034 -402420 -529014 -230591 289029 623913
172 623913 486126 -28738 -538391 -666739 -302406 286536 646175 524768 39412 -441323
182 -441323 -557561 -243832 219294 465976 324017 -71260 -378536 -335010 9042 349571
192C49571M4032l07223m15149j72086K30920M71895L53700n0957m40350n01715
202d37362j81719K72288N18705L79926l8171m07965m52236j62003K33421M18540
212A43424K63615q9743l41397k95966J152K91786L30602Q0478k51630l91398k09611
223d68688J58595M24758L63721J4427l61336m70056k25313J89891M58010L80707
233D64716K7542l29509m22593j90255J69748L68609K64470m3785k99909k88727
243b79693l3420K44755L18246J17561k01258l64747k32856J00302L74797L70097
253D13784O9985k92445m36532k58835J12955L98438L77117P7908k62918l88487
263a89030k12323J12599L25180K61901k704k52050k78870o3747K08393L02285
$$ plain form
192 349571 393603 86380 -328769 -500855 -269935 201960 555660 504703 64353 -437362
202 -437362 -619081 -346793 171912 551838 513667 105702 -346534 -508537 -275116 143424
212 143424 407039 317296 -24101 -320067 -318915 -27129 303473 383951 132321 -259077 -468688
223 -468688 -310093 114665 478386 492813 131477 -338579 -563892 -374001 84009 464716
233 464716 492258 162749 -259844 -450099 -280351 88258 352728 308943 9034 -279693
243 -279693 -313113 -68358 249888 367449 166191 -198556 -431412 -331110 43687 413784
253 413784 483769 191324 -245208 -504043 -391088 7350 384467 462375 199457 -189030
263 -189030 -401353 -288754 36426 298327 295623 43573 -235297 -299044 -90651 211634
273B11634J40019j53877l39114k52947M8825L24833L60932J18057k25664m03346
283a70648k77077N3373L39203L66730J18285k03516l49599k23864O4978K82774
293F39K58687K4440k17159k68356r2010J70748K89713J63020j10820l05532k63872
304c50502q85K78376L49357J55834j62767l65342k89304J547K82208L44076J47544
315C90142j50644l17229k29314K7314K44297K52366N2472j83227k55231j06510
325b75564J34913K72854J78768p0595k76394k71316m1962K29696L35466J82320
335C98186j12651l24621k93687m2249K33811L23515J69846j02985k81640k29837
345b62312l509K11340K40499P1455j52637k44894j23452J03476K51311J92810
$$ plain form
273 211634 351653 197776 -141338 -394285 -345460 -20627 340305 458362 232698 -170648
283 -170648 -447725 -394352 -55149 311581 429866 226350 -123249 -347113 -282135 639
293 639 259326 283766 66607 -201749 -293759 -123011 166702 329722 218902 -86630 -350502
304 -350502 -351387 -73011 276346 432180 269413 -95929 -385233 -383686 -101478 242598 390142
315 390142 239498 -77731 -307045 -279731 -35434 216932 269404 86177 -169054 -275564
325 -275564 -140651 132203 310971 240376 -36018 -307334 -349296 -119600 215866 398186
335 398186 285535 -39086 -332773 -375022 -141211 182304 352150 249165 -32475 -262312
345 -262312 -265821 -54481 186018 257473 104836 -140058 -263510 -160034 91277 284087
355B84087l3524k46562k69764p5656J85834L13624K04455o5374k82537k87469
365b72886p7982J86036K99119J80629o8475k49152k26908k7241J82526K29448
375A55114Q6459j24559k29878j37214P6952K33466K01101p09k14915k65923j04875
386c24981J44028K88347K13822k4429k45129k79395j02427J44938K74273J88606
396B77653l6494k16836k17347m6831J52750K18031R9601j02717k14880j47075
406b34145N1361K12628K04604K3004j83756k56047j25640J07138K63075K19024
416B81246R918k07124k64625j19805J08729K46960J89251j0666j89995k10232
426a66343o2228J29693K05942J09552q0256k01645j53963K6869J92721K05163
$$ plain form
355 284087 250563 4001 -265763 -341419 -155585 158039 362494 297120 14583 -272886
365 -272886 -350868 -164832 134287 314916 246441 -2711 -229619 -256860 -74334 155114
375 155114 241573 117014 -112864 -250078 -173126 60340 261441 260732 45817 -220106 -324981
386 -324981 -180953 107394 321216 296787 51658 -227737 -330164 -185226 89047 277653
396 277653 241159 24323 -193024 -239855 -87105 130926 230527 127810 -87070 -234145
406 -234145 -182784 29844 234448 257452 73696 -182351 -307991 -200853 62222 281246
416 281246 291164 84040 -180585 -300390 -191661 55299 244550 233884 43889 -166343
426 -166343 -228571 -98878 107064 216616 136360 -65285 -219248 -192379 342 205505
436B05505N0241j53226k42571j43525P1557K36454K19075L6702j74354k47355
446a41497j34112P9249K21224J86476J1236j63162k00251p3428J09832J93711
456H9278J15819n9277j88609j58507M679J70036K04423P0307j25694k28723j55503
467b61771M1833K09633K17565N9993j42048k29867j42714N1902J97239J83379
477A85144K8512j42465j90307q3844Q8682J82641J22586l9274j73273j61950j7235
488b00783J51103J99825Q9298r7882k12897j63254J5483J81539K11513P7140j13371
499A37714k12998j48093K7841J75934J79783M3518j22041j81952r2013P2601J70539
510E0833J28712k0044j58316j65399l6555J28822J94244J04576p2474j95155j68751
$$ plain form
436 205505 255746 102520 -140051 -283576 -212019 24435 243510 280212 105858 -141497
446 -141497 -275609 -196360 24864 211340 222576 59414 -140837 -214265 -104433 89278
456 89278 205097 145820 -42789 -201296 -196617 -26581 177842 248149 122455 -106268 -261771
467 -261771 -219938 -10305 207260 267253 125205 -104662 -247376 -195474 1765 185144
477 185144 213656 71191 -119116 -202960 -114278 68363 190949 151675 -21598 -183548 -200783
488 -200783 -49680 150145 239443 141561 -71336 -234590 -219107 -37568 173945 251085 137714
499 137714 -75284 -223377 -195536 -19602 160181 203699 81658 -100294 -192307 -119706 50833
510 50833 179545 159501 1185 -164214 -200769 -71947 122297 226873 154399 -40756 -209507
521b09507j0519J58140K03574R3228q7314j95626j50429Q697J55329J73519N4852
532A93944j03927j71979j00173N3506J60961J35331m812j43441j65250n1893J07426
543i0307J85488J18213m7153j77915j70900l1455J33945J92690J04808o4454j79347
554b6387j52045q714J36590J68087O6026q4754j64797j06687L8641J49944J39466
565A55370J1844j26522j65254o7834Q5650J75469J26488k4814j58712j70220m9641
576b08176J10667J81991J13757m2439j60411j52561k3458J19131J64014P5228
586A77743o9918j56817j13476K2646J37953J42004K9082j12331j61581q3195O6059
597a21831J65653J34161l536j40157j67514o4060Q7508J71334J20404k4060j44787
$$ plain form
521 -209507 -220026 -61886 141688 234916 147602 -48024 -198453 -189756 -34427 139092 193944
532 193944 90017 -81962 -182135 -128629 32332 167663 162851 19410 -145840 -197733 -90307
543 -90307 95181 213394 166241 -11674 -182574 -214029 -80084 112606 217414 152960 -26387
554 -26387 -178432 -187146 -50556 117531 183557 98803 -65994 -172681 -134040 15904 155370
565 155370 167214 40692 -124562 -192396 -106746 68723 195211 170397 11685 -158535 -208176
576 -208176 -97509 84482 198239 155800 -4611 -157172 -180630 -61499 102515 177743
586 177743 107825 -48992 -162468 -139822 -1869 140135 169217 56886 -104695 -187890 -121831
597 -121831 43822 177983 174447 34290 -133224 -197284 -109776 61558 181962 157902 13115
608A3115j51524l7917J02040J56780Q4134n2897j46451j19242O968J26555J43870
619A25431M3462r4672j55270r6641M6232J51875J39423J5045j22970j62055p9104
630a89244O9298J58755J24850n760j29411j48856m9676Q7571J49902R3506l9846
641A21089j36504j23252r491J13467J42587N8112p8157j50277j06038K8326J37811
652b327J41387L3401j03179j56576q9523N0492J46340J28202J0359j15764j45999
663a03187o0087P1274J43128R8633k4582j26008j26216k3988J00727J41437O9206
674A60337n9348j42784j12080R450J23787J41145M7619q5952j49437r7070L2651
685a31682J34088J29268K2629r9850j40905o9089N5356J36240J05204r603j16821
$$ plain form
608 13115 -138409 -176326 -74286 82494 166628 113731 -32720 -151962 -144994 -18439 125431
619 125431 168893 74221 -81049 -177690 -131458 20417 159840 174885 51915 -110140 -189244
630 -189244 -119946 38809 163659 157899 28488 -120368 -170044 -82473 67429 160935 121089
641 121089 -15415 -138667 -148158 -34691 107896 166008 87851 -62426 -168464 -140138 -2327
652 -2327 139060 172461 69282 -87294 -176817 -126325 20015 148217 158576 42812 -103187
663 -103187 -163274 -92000 51128 149761 125179 -829 -127045 -151033 -50306 91131 160337
674 160337 100989 -41795 -153875 -144425 -20638 120507 168126 82174 -67263 -164333 -131682
685 -131682 2406 131674 154303 54453 -86452 -155541 -100185 36055 141259 131656 14835
696A4835j28670l6251Q6372J37369P9514m3521j33384j16399p815J10593J39100
707A01743N9414o7833j41494j01783J5634J22833J28027L5720q6920j36269p7533
718a48461M1416J27310J08809L430j04904j28372m8463P1334J33676Q9625k7321
729A18079j22024j20659k2637R4534J36374P0511n1941j31078j08716K545J06210
740b8802J29200M6546p1094j30573q6816K8160J17417J13029J7910r1945j26903
751h3871o0566N6134J26146R6945j0936j11004j22569l6682Q0031J31359P9040
762A44027l4802j20998j10850j3806R4447J26916N6726n6476j24422r2666J3600
773a18304J07379J15697K9060p8060j24283p0644M0536J19725J02397M100r7718
$$ plain form
696 14835 -113835 -150086 -63714 73655 153169 109648 -23736 -140135 -147950 -37357 101743
707 101743 161157 93324 -48170 -149953 -134319 -11486 116541 152261 65341 -70928 -148461
718 -148461 -107045 20265 129074 132504 27600 -100772 -149235 -77901 55775 145400 118079
729 118079 -3945 -124604 -147241 -52707 83667 154178 102237 -28841 -137557 -135012 -28802
740 -28802 100398 146944 75850 -54723 -141539 -113379 4038 117067 134977 43032 -83871
751 -83871 -144437 -88303 37843 134788 123852 12848 -109721 -146403 -66372 64987 144027
762 144027 109225 -11773 -122623 -136429 -41982 84934 141660 85184 -39238 -131904 -118304
773 -118304 -10925 104772 133832 55772 -68511 -139155 -98619 21106 123503 127603 29885
784B9885j21466m9439O3627J24751Q6527j9984j09696j12839k6895Q1303J22428
795F8202O6800m2022j16475r7475p68R6381J16352M1994o4443j18948p9509K5806
807a04105J09150J04826J8602q4752j19552n9533M8094J16929R3176n048r8563
818A9224j13917l8105O7131J18185P5317k7134j09474j00924j3607Q4449J14229
829G5374N3573n0250j14888q6242J0559J00306J07811L1311p0158j16604o8042
840a27250L2811J08912R6572R402q8011j12101m8856N3248J12457Q2357j4679
851A04862r8433j04753k5014P2574J12128O3641l7043j06559r2004l280Q7704
862b6177J08087M3612n7624j11885p6101J8029R9575J00080K1012p3396j10500
$$ plain form
784 29885 -91581 -141020 -77393 47358 133885 113901 4205 -108634 -135529 -54226 68202
795 68202 135002 92980 -23495 -120970 -121738 -25357 90995 132989 68546 -50402 -129911 -104105
807 -104105 5045 109871 128473 43721 -75831 -135364 -87270 29659 122835 117787 19224
818 19224 -94693 -132798 -65667 52518 127835 100701 -8773 -109697 -123304 -38855 75374
829 75374 128947 78697 -36191 -122433 -111874 -11568 96243 127554 57396 -59208 -127250
840 -127250 -94439 14473 111045 120447 32436 -79665 -128521 -75273 37184 119541 104862
851 104862 6429 -98324 -123338 -50764 61364 125005 87962 -18597 -110601 -113881 -26177
862 -26177 81910 125522 67898 -43987 -120088 -102059 -2484 97596 118608 45212 -65288
873f5288n8957M0365J05953Q8653r90q8543j04485l7937N9289J08342P2308k3990
885I4720r8551r6234j5473P5944J07212N1878m3249j04837q2128N755Q8688J01174
897H4899L3300o1720j06344o7010K6773R7832R2069J1218p7891j03915m7124M5574
909g2339J03001P8382q260r0308r7220k7425O3463J04655O0455l0317r6383q8072
921a00368o270P8146J00345M2366m9197j01723p1775J2916R0259R2113K4083o5096
933D5799j01422n6325L2919R6173Q1863J848p7693r6985l8573N1861R7495O9019
945A05979j6550q8344q9593j9004O7791R8431N0976l5816r4906p8589J869P9150
957a8606R3728L3176n3564r6177o4075K0609Q8470Q4033J4790o7397r5929m6810
$$ plain form
873 -65288 -124245 -83880 22073 110726 109736 21193 -83292 -121229 -61940 46402 118710 94720
885 94720 -3831 -100065 -115538 -39594 67618 119496 76247 -28590 -110718 -104963 -16275 84899
897 84899 118199 56479 -49865 -116875 -90102 7730 99799 111017 33126 -70789 -117913 -72339
909 -72339 30662 109044 100784 10476 -86744 -114169 -50706 53949 114404 84087 -12296 -100368
921 -100368 -106638 -28492 71853 114219 65022 -36701 -108476 -95560 -5301 86812 110895 45799
933 45799 -55623 -111948 -79029 17144 99007 100855 23162 -73823 -112396 -60535 36960 105979
945 105979 89429 1085 -88508 -107512 -39721 58710 109686 73870 -21036 -99625 -97756 -18606
957 -18606 75122 108298 54734 -41443 -105518 -84909 3561 87594 102384 34987 -60942 -107752
969a07752L9128R3902P3423n198q0282r0572k7856N5181R5082N8943k4436q7876
981h313q1291r891P0188R2141M2105m1068r3179o8098Q861P8885Q7777K3219n6470
994D4866r2953n4670K7987Q6580P7229O096p0985q9221l7463M3746R1030O4730
1006I6972j2850p8833q3497j9727N8601R0100M9290k9850q6605p2372k197P0629
1018b0339Q6042L3702m6057q8286o0294J5739P9672P9684J6002o1330q6407m6122
1030i7994L2132Q5354O9233k113o9129q4168l0066M6988Q6558N7189j9524p7681
1042c221p5141j2684O0158Q4729M1450l4150q3421o5704N049P1381P9568K6325
1054I4339n0027q4079n3059K1200P8267P3105R638o2687q2301l7718L6899Q1518
$$ plain form
969 -107752 -68624 25278 98701 93503 13221 -77351 -105207 -50026 45056 103999 79563 -8313
981 -8313 -89604 -99495 -29307 62834 104939 63871 -29308 -97406 -88545 -9660 78117 101336 44866
994 44866 -48087 -102757 -74770 11810 89039 95135 24150 -65071 -102534 -58788 32242 96972
1006 96972 84122 5289 -78208 -97935 -39334 50766 100056 70206 -16399 -88771 -90968 -20339
1018 -20339 65703 99405 53348 -34938 -95232 -79493 179 79863 95865 34535 -51872 -97994
1030 -97994 -65862 19492 88725 86612 17483 -66685 -96751 -49763 36795 93984 74460 -3221
1042 -3221 -78362 -91046 -30888 53841 95291 61141 -22280 -87984 -82935 -11554 68014 94339
1054 94339 44312 -39767 -92826 -71626 6641 79746 89384 26697 -55604 -93322 -56423 25095
1066B5095O1222p732p0154p7987k0731N1169Q2120M7222k3682p7214o8327n905
1078h4904O2005Q0503L4141l8783q0599n9098J1025P1276P4057J7523n1286p9457
1090d3597m5102K5670P6303O5359J895o1595p6533k9476L9909P7292N4661j4313
1102G0473p0342p0155j5491N3313P8984M1440k9694p4521o1678N4O1927P4453
1114E8763K7176m1913p5696n0122J5691O8154O6746J1997n3185p4807l7279L0351
1126e4124P3976N9086n922o2802p0624k2852M3776P4537M7913j8678o9449o3912
1138f9075r003N3808P3253L2701l1418p1557n3890N990O1072O7954J9034m3525
1150C5344p1738m2639K0125O7873O1057M928n4722p1184k9919L3780P1667N1702
$$ plain form
1066 25095 86317 78585 8431 -69556 -90287 -39118 43002 90224 66542 -10672 -78999 -84904
1078 -84904 -22899 57604 91745 52962 -27637 -86735 -75710 -4434 69623 87146 35860 -43597
1090 -43597 -88699 -63029 13274 78633 80528 18933 -57600 -87076 -47167 30125 84786 70473
1102 70473 131 -70024 -85515 -32202 46782 88222 58528 -15993 -77671 -77617 -15690 58763
1114 58763 85939 44026 -31670 -81792 -66101 2053 68799 80796 27611 -47196 -84475 -54124
1126 -54124 19852 78938 73016 10214 -60410 -83262 -39486 35051 82964 64286 -5163 -69075
1138 -69075 -78078 -24270 48983 81684 50266 -21291 -75181 -69191 -8119 59835 78869 35344
1150 35344 -36394 -79033 -58908 8965 70022 74950 20228 -50956 -80875 -47095 24572 76274
1162G6274r146o1774o6471j7063M5260P0392M0653k2282o5227n8030k658N2788
1174a7284O7851K6909l4905o9233m7393J2326O1485O2426J2463m7021o8115l7138
1186g7629K5217O7170N4568N66n4833o6340k4984L6215O7589M4855j2327o0856
1198g89n9552j0987M6727O6270L2524k7057o4354n0939M737N3771O3287K0448
1210G4086l8933o5688m2354J6625O0344N8344P622m7308o4641l0680K6666O3496
1222A7579M8782m136n4020o0958j7397L8914O4221L6194j6898o0460n3321l365
1234f4865M7535O2634K6672l0264o3994m4594P556N5441N8890J4566m0074o2851
1246c3348l5336J9468N7127N2335K907m7420n9106k4156K9870O2156M0351j0089
$$ plain form
1162 76274 67128 5354 -61117 -78180 -32920 37472 78125 55843 -9384 -67414 -70072 -17284
1174 -17284 50567 77476 42571 -26662 -74055 -61729 -244 62182 74645 27624 -40491 -77629
1186 -77629 -52412 14758 69326 69892 15059 -51281 -76265 -40050 27539 72394 60067 -789
1198 -789 -60341 -71328 -24601 41669 74193 47136 -17218 -68157 -63420 -9649 53638 74086
1210 74086 35153 -30535 -72889 -56264 4080 62424 70046 22738 -41903 -72583 -45917 17579
1222 17579 66361 62225 8205 -52753 -70150 -31236 32985 69179 52281 -8179 -61500 -64865
1234 -64865 -17330 45304 71976 41712 -22282 -66876 -59320 -3879 55011 69577 29503 -33348
1246 -33348 -68684 -49216 7911 60246 63153 15733 -43373 -67529 -37659 24497 64848 54759
1258E4759n4754n3549j1954M1564O1337L1969k3500n8733m7931r18M8348N8945
1270D5583K3040l3580n9669l9773J0963N3618N2734R927l9926n8342k9528K3664
1282d1289N6622M4065k729m8069n4497j8957L4752N8745L5580j5271n2876n1285
1294e5209p357M2750N7219K7930k4894n6594m2086L177M8139N3447J5791l2806
1306B9507n7085l3934J6413N1453M6666M988m2338n4493k4255K7127N6294M0249
1318F0592q756m8315n1961j2663L5059N6017L1367j6498n2706m5228k938M0949
1330a5081N4972K1007k6784n3365l6887Q547M7957M8104R519l6240n3086k8983
1342f0320K0041N2128M3277r58m3491n1955j9308K9482N3040L5904r334m8312
$$ plain form
1258 54759 5 -53544 -65498 -23934 37403 69372 45872 -12861 -60792 -61710 -13362 45583
1270 45583 68623 35043 -24626 -64399 -53436 182 52916 62843 22917 -35425 -64953 -41289
1282 -41289 15333 59398 56669 8600 -45897 -64854 -30102 28643 64223 48952 -3924 -55209
1294 -55209 -62566 -19816 37403 65333 40439 -16155 -58241 -55064 -6925 46522 62313 29507
1306 29507 -27578 -61512 -45099 6354 53020 58008 15670 -38823 -63078 -35951 20343 60592
1318 60592 51836 3521 -48440 -61103 -26044 29973 61340 44842 -7864 -53092 -56030 -15081
1330 -15081 39891 60898 34114 -19251 -56138 -47591 366 48470 57989 21749 -31337 -60320
1342 -60320 -40279 11849 55126 54168 10677 -41278 -60586 -31104 21936 57840 48506 194
1354A94m7210q630L6472N1372K5045j9402n0289m0353K059M3461M8373J5595k9887
1367B6800n1335l1701J2285M9270M3882N597l7971n1387k2976K1924N0703L8329
1379E3420m167m2418m6731j5239K9874M9835L0032j3905m6114m1775k819L7236
1391a2771M8637J9499k3617m9065l6131Q748M2950M5569J0517l1112n1172k7078
1403e5026J6060M7048M0166K165l7911m6138j8914K3175M8141L2675q115m2694
1415F32m2586r183L1591M8820K3359j7070m6747l6886P80L8752M5057J7644k6198
1428B7965m7946l1124R657M2324M1668P686l3122m5628k3471J7587M4972L6777
1440D7345k835l8192m3648j2456K6891M5692K7539j1425m2689l9854m520L4172
$$ plain form
1354 194 -47016 -55646 -19174 32198 57243 37841 -12448 -52801 -50742 -7281 41092 56687 26800
1367 26800 -24535 -56236 -43951 5319 49201 54798 16827 -34560 -57536 -35612 15091 53420
1379 53420 49253 6835 -39896 -55135 -25261 24574 54606 40701 -5413 -47188 -50007 -12771
1391 -12771 35866 55365 31748 -17317 -53448 -44700 -1750 43819 54336 23224 -27948 -55026
1403 -55026 -38966 8082 48248 50413 12502 -33636 -52550 -29375 18766 51441 43326 632
1415 632 -41954 -51137 -19546 29274 52633 35563 -11184 -48070 -47290 -8538 36519 54163 27965
1428 27965 -19981 -51105 -41448 876 42544 50230 17108 -28520 -51991 -34404 10568 47345
1440 47345 44510 6318 -37330 -49786 -22895 22797 50336 38911 -3778 -43632 -48152 -13980
1452a3980M5904J9752j9738m5710l3181L825L8182M2126J2946k7343m4991k6280
1464d8488J3373M0863L7249K376l3424m2250j9035K2620M2827L1862o998l9501
1476A474m0449r341K8866M4393K4104j3346m3048l5784j699L4853M1657J6618
1488D8298k1377m3513k9675P721L9411L7460P651k9442m2160k1443J6390M1826
1500A1147L2322o33l5375m0996j3197K3158M3307K6994r218l8981l7537n418K8986
1513a5441M1092K1335j7690m0027l2146K870L5470L8431J1371k4807l9978k5649
1525d5169J0735L9079L4969K908l0612l9693j7913J8204M0868K9753m270l4920
1537C939l8413r322K4109M0364K3605j1155l8556l3531j858L1853L7707J6660
$$ plain form
1452 -13980 31924 51676 31938 -13772 -46953 -43128 -4946 37180 50126 22783 -22208 -48488
1464 -48488 -35115 5748 42997 45373 11949 -30301 -49336 -26716 16111 47973 40975 1474
1476 1474 -38975 -48316 -19450 24943 49047 35701 -7347 -43131 -44830 -9977 31680 48298
1488 48298 26921 -16592 -46267 -38546 865 38325 45976 16534 -25626 -47069 -30679 11147
1500 11147 43469 42836 7461 -33535 -46732 -23574 19733 46727 37509 -1472 -39009 -44427 -15441
1513 -15441 25651 46986 29296 -10731 -42877 -40007 -4537 33894 45265 20458 -19520 -45169
1525 -45169 -34434 4645 39614 42522 11910 -27783 -45696 -27492 13376 43129 38859 3939
1537 3939 -34474 -43796 -19687 20677 44282 33127 -5429 -38960 -40818 -8965 28742 45402
1549D5402k0181m0390k6674O018L4636L6401Q494k6460m0764j9999J3485L7372
1561G340L2356L46l1306l7853j5110K1383L9842K5140p317l6591l3254o261K7364
1574a3921L8381J9324j4769l8392l0305J455L2328L7272J2167k3158l8984k3988
1586d2590R381L5878L3640L816k7007l7894j7842J6559L7310K8463l087l2048
1598D579l4791j1109K2719L8241K0776r050l5554l1448l610K8547L6219J5837
1610D1356j7596l6255k6442L494L3151L4343Q145k3535l6954k0534J1942L4557
1622E672L0230J507k8323l5484j4055J8873L5735K5389o446l2995l2524o426K4097
1635a4750L5954J8744j3545l4548k8845J001K8605L4713J2689j9312l5923k3104
$$ plain form
1549 45402 25221 -15169 -41843 -35825 -1189 35212 43706 17246 -23518 -43517 -30032 7340
1561 7340 39696 40042 8736 -29117 -44227 -22844 16998 42138 34821 -1770 -35024 -41285 -13921
1574 -13921 24460 43784 29015 -9377 -39682 -38227 -5899 31373 43540 20382 -18602 -42590
1586 -42590 -33209 2669 36309 40125 13118 -24776 -42618 -26059 11251 39714 36627 4579
1598 4579 -30212 -41321 -18602 19639 40415 31365 -4189 -35637 -39247 -10700 25519 41356
1610 41356 23760 -12495 -38937 -35443 -2292 32051 40196 16661 -20293 -40827 -28885 5672
1622 5672 35902 37409 9086 -26398 -40453 -21580 14155 39544 33098 103 -32421 -38847 -14750
1635 -14750 21204 39948 26403 -8145 -36990 -35989 -7384 27329 40018 20706 -15217 -38321
1647c8321O190L2845L2117N462k4694l5547j7012J2872L4758K7410j023k9047
1659F010l4351j0585J9674L6209K1158r559l1035l0307m569K6285L3966J5275
1671C8171j4511l4060k5774L403K9583L1563J0458k2259l3819k0920R209L3343
1683D387K7888L574k7341l3055j2623J4886L3625K4793m949k9193l0881p825K1840
1696a4874L3271J8910j0193l2032k8008j530K7037L1798J3026j7184l3691k2298
1708c5768N786K9086K9690O859k2351l3087j6963J1683L1902K6722M9k8447l0643
1721b5482j0597J8293L2137K1181p414k9362k8129n321K2343L2043J5939j2904
1733B2727l0796k4759J879K5440L1473Q412j8464l1610j9311P996K9568K8348
$$ plain form
1647 -38321 -32131 714 32831 38293 13599 -21948 -38960 -26088 8670 36080 35057 6010
1659 6010 -28341 -38926 -19252 16957 38115 28556 -2479 -32786 -37355 -11070 22896 38171
1671 38171 23660 -10400 -36174 -32771 -3188 28375 38833 16574 -17245 -38165 -28956 4387
1683 4387 32275 35849 8508 -24547 -37170 -22284 11341 36134 31185 1992 -28889 -36714 -14874
1696 -14874 18397 37307 27114 -4918 -32926 -34456 -7419 24379 37405 20221 -13470 -35768
1708 -35768 -29982 -896 28794 35653 13302 -19785 -36748 -25065 6837 33559 33608 5161 -25482
1721 -25482 -36079 -17786 14351 35532 28118 -1244 -29373 -34694 -12351 19692 35631 22727
1733 22727 -8069 -32828 -30949 -5509 25964 34376 15912 -15698 -35009 -27013 2555 30903
1745C0903J938k3344l0948j3821J4673L0570K2586k875k6437k9174q725J8770
1757a5884L1722J9045r381k9828k6041j369K3266K9781J2935j4495l0754k1229
1769c2232L999K6742K8063O979j9683l1348j6644R624L0206K4523R32k4264k9078
1782b2181j1526J5135L0617K1075o001k7091k7180n422K0156L0485J4931j0021
1794B2977l0612k3551J129K3976K8974J0277j5979l0413j9162N892K7533K6189
1806B7230M163k0402k9936j4032J2401K7241K3754k535k3885k7974q425J7476
1818a4924K8442J8174p620k7243k4562k894K2363K7473J3446j2837k9553k1099
1830c0834L835K4923K6054P065j7076k9038j5633Q195K6485K4151k7k1174k7861
$$ plain form
1745 30903 32841 9497 -21451 -35272 -20599 9971 32557 29682 3245 -25929 -34654 -15884
1757 -15884 15838 34883 25502 -4326 -30367 -31736 -8470 21311 34246 19751 -11003 -32232
1769 -32232 -28233 -1491 26572 33551 13868 -17480 -34124 -24500 5706 30229 31161 6897 -22181
1782 -22181 -33707 -18572 12045 33120 27119 28 -27152 -32574 -12418 18067 32998 22977
1794 22977 -7635 -31186 -30057 -6081 22893 33170 17191 -13222 -32384 -26492 1041 27230
1806 27230 31393 10991 -18945 -32977 -20576 6665 30419 27884 3999 -23975 -32400 -14924
1818 -14924 13518 31692 24072 -3171 -27733 -30627 -8264 19209 32655 19818 -9735 -30834
1830 -30834 -26999 -2076 23978 31043 13967 -15071 -30704 -22509 3976 28127 28100 6926 -20935
1843b0935j0237J3914K6929K0155m383k5085k5913m741J7706K8590J5633j0156
1855B1477k6593k3053O90K0427K7282J1108j4041k8490j8302M853K4435K4258
1867B4051N417j8320k7689j3257J0515K6546K0664p13k3255k6251o973J3821K8547
1880A3103J6915o703k4615k3525l898J8825K6894J2549j0563k6006j9929J213
1892b5740K2741K3692P460j5381k6343j5120O441K5059K2738K598k1661k5920
1904a9436j0666J2629K5580K1074m560k2697k3419q119J6141K6446J5800p505
1916B1268k4701k1101k430J9608K4955J0624j3678k4769j6231K954K3607K3138
1928B3244M959j7817k5369j4326R132K4702K1524l41j9765k4710j0437J2982K5457
$$ plain form
1843 -20935 -31172 -17258 9671 29826 25443 358 -25555 -30296 -12590 16000 31633 21477
1855 21477 -5116 -28169 -27479 -7052 20230 31338 17297 -11193 -29495 -24642 -207 24051
1867 24051 29468 11148 -16541 -29798 -19283 7263 27927 27214 3959 -22292 -29265 -15444 13103
1880 13103 30018 23315 -1300 -24825 -28723 -9898 16996 29545 18982 -7024 -26953 -25740
1892 -25740 -2999 20693 28153 12772 -13571 -28691 -22250 2809 25547 28145 6484 -19436
1904 -19436 -30102 -17473 8107 29181 24621 1924 -21495 -29614 -13473 12973 28773 21268
1916 21268 -3433 -24534 -26964 -7356 17599 28223 14545 -10224 -26455 -23501 106 23244
1928 23244 28203 10386 -14983 -29309 -20177 4525 26049 25708 5943 -18767 -29204 -16222 9235
1941I235J7478n333k1206k2149l761J6308K4341J2040r268k4402j8609K079J9328
1954c919K4010P294j4715k4500j6445O269K3514K0880M479j7528k4840j1415R140
1967a7776K3939J7430j133j9006k2617n875J2722K4401J3419o101k3686j8097
1979b2380k073J8770K3369R677j1869k4551j7762L649K0343K3591O090j4571k4467
1992a2184j2867N866K1400J9334J013j6903k1992q150J0725K1846J5625l689k0299
2005b75k1287l712J5865K4647J1872r044k3416j8738q20J8838K3477Q821j0618
2018A5610k3653j5642K250K0432J9840M491j4891k1012j1468R601K1185J6251
2030B2994l186j7287k2141n731J4249K2812J3819n937k1752j9982l522J6827K3088
$$ plain form
1941 9235 26713 21380 174 -21975 -25736 -9428 14913 26953 17685 -6717 -25326 -23247 -3919
1954 -3919 20091 27385 12670 -11830 -28275 -22006 1508 22388 26867 9339 -15501 -26916 -17776
1967 -17776 6163 23593 22460 3454 -19163 -25038 -12316 12085 25504 19403 -4283 -22380
1979 -22380 -24453 -5683 17686 27363 15494 -9057 -26819 -23170 -2827 20764 26854 12283 -12184
1992 -12184 -25051 -19185 2215 21549 22562 5659 -16333 -24483 -13758 8088 23713 20024 -275
2005 -275 -21562 -25274 -9409 15238 27110 18066 -5350 -24088 -24908 -6070 17407 26228 15610
2018 15610 -8043 -23685 -21435 -1003 18837 23328 8437 -12575 -24043 -14442 6743 22994
2030 22994 19808 2521 -19620 -25351 -11102 11710 25529 19592 -2160 -22142 -25664 -8837 14251
2043A4251J1688r592k1699j7033R79J7895K0706N962j2917k0530j2676N853K0202
2056C089J7538P07j7185k0793q319J1337K2605J5685l206k0263k0666n603J3682
2069a1392K2553J2831n230k0125j8493k086J4709K0496Q476r140k0022j3869L704
2082a7588J7961J8293K206j4948k0433j0744R342K2112J7758p74j8043k1683q722
2095b5263J1687K0882J4724j623j9139j8287n053J4261J8569R845o746j8445j5604
2108b0192K169J6390J7953N408j2976k0449j2031O016K0551J8918J477j5443k1008
2121a3217j1380Q267K1240J5919j8j6016j9346o388J1157J8113J2392p020j6164
2134b461j6026J94J4464J9253N614j0673j8822j4517M046J8901J9560L745j2850
$$ plain form
2043 14251 25939 16347 -5352 -22385 -21406 -3511 17195 23157 10240 -10290 -22966 -17113 3089
2056 3089 20627 21334 4149 -16644 -24963 -13626 8979 24664 21458 1195 -19471 -25074 -11392
2069 -11392 11161 23992 18762 -1363 -19856 -21942 -7233 13263 21739 12599 -7423 -21292 -17588
2082 -17588 373 18666 20872 5924 -14509 -25253 -15911 6201 23959 23185 5142 -16541 -25263
2095 -25263 -13576 7306 22030 20407 1268 -17019 -22072 -7811 10758 20603 13857 -4588 -20192
2108 -20192 -18023 -1633 16320 21728 8752 -11697 -23728 -17712 2839 21757 23234 7791 -13217
2121 -13217 -24597 -16330 4910 20829 20811 4795 -14551 -20939 -9782 8331 20723 13703 -2461
2134 -2461 -18487 -18293 -3829 15424 21038 10365 -8457 -22974 -18928 -27 19533 23278 10428
2147A0428k1761j2630O150J8862J6909K439j3878j8740q000Q558J7054J2393k623
2160A5161j5756j6061k358J3221J8718Q819r333j8973j5703K334J7270J8503P276
2173B3118j0566k0481j3560K816J6544J8309N300j1986j8846r674N584J7509J3253
2186A7320k471j2958j6924m445J2258J8352R417o593j7238j7161j436J5872K0268
2199A4261R537q531j9952j5347J67J5384J7661O992j0590j6131j0241K622J5564
2212A396J3325R10j3358j4957n953R617J7942J2346n697j7055j5987m914J4090
2225h295J9955J0842o023j8322j5825k682J2627J7895Q797o313j6382j1815K040
2238a3501J2950J3611K645j1418j4869p554Q563J5623J2425j062j5862j8409m665
$$ plain form
2147 10428 -11333 -23963 -17813 1049 17958 20397 6519 -12221 -20221 -11663 5391 17784 15161
2160 15161 -595 -16656 -19014 -5793 12925 21744 12411 -6562 -22265 -19931 -2661 15842 23118
2173 23118 12552 -7929 -21489 -18673 -2129 16180 21480 9494 -9352 -19026 -13442 4067 17320
2186 17320 14849 1891 -15033 -19478 -7220 11132 20549 13956 -3282 -20443 -21879 -6007 14261
2199 14261 23798 15267 -4685 -20032 -19865 -4481 13180 20172 9582 -6549 -16790 -14168 1396
2212 1396 14721 15631 2273 -12684 -18637 -9020 8922 21268 15571 -1484 -17471 -22385 -8295
2225 -8295 11660 22502 16479 -1843 -17668 -20350 -7723 10172 18969 12656 -3726 -15541 -13501
2238 -13501 -551 13060 15705 4287 -10582 -18136 -9573 6050 18475 17413 1551 -16858 -21523
2251b1523J0206J9568J3295k892j8077j5847m949J0403J7779R691m867j4340j2549
2264a4102O51J1541J3177N315j0202j5381r225O251J6917J3277p11j3863j7766
2277a4121p487P769J8591J5639j965j3949j7824n334Q084J5714J1586k773j4182
2290b52j2317k276J1402J3372N258p721j6040r195M789J4521J5564K269j3559
2303E815j6817j0174O250J7007J5670J199j2048j7591q182O597J5062J1851j573
2316A3066j1584j2382l269R305J4088N485o371j4588j0773L229J4089J5134M274
2329A9703j1089j8117j1215M619J5542J5883M373j1140j7039p872L002J4617J1604
2342A2871L18j1022j2019m287R226J2383P935n911j4112j1287J045J3137J4711
$$ plain form
2251 -21523 -11317 8251 21546 18654 577 -15270 -20219 -9816 7963 17654 12787 -1553 -14102
2264 -14102 -13451 -1910 11267 16582 6380 -9001 -18226 -11975 4942 18219 17508 3645 -14121
2277 -14121 -21608 -13839 4752 20391 18426 4477 -13347 -18681 -10597 5117 16703 13930 -252
2290 -252 -12569 -14845 -3443 9929 15187 7466 -8574 -17769 -12980 1541 17105 19374 5815
2303 5815 -11002 -21176 -14926 2081 17751 18950 6902 -10689 -18871 -12274 2788 14639 13066
2316 13066 1482 -10900 -14169 -4864 9224 14709 8338 -6250 -17023 -13794 295 15429 19703
2329 19703 8614 -9503 -20718 -16099 -557 15326 19699 8559 -8480 -16352 -13350 1267 12871
2342 12871 13189 2167 -9852 -14139 -4913 7470 15405 9494 -4618 -15905 -14860 -1723 12988
2355A2988O312r190j6819j2235J337J4322J6593N611p420j5881j1851J846J3119
2368a268J2929J700r555j2353m045O840J2346Q348l987j3647j2401k89J0787J6805
2382A2210O676o532j5753j3917m53J1282J6636Q218n634j4852j2283k19J2187
2395b434J1515L528p206j1953n908N372J1955Q601k509j2062j3524j613R995J5935
2409I692Q664m291j3833j5955l251J1079J5572R428m501j3204j1906j260R682
2422d084J1924M659o845j1517o203M033J1208R728j016j1339j2313n062Q176J6171
2436G520J0444k794j3308j5475m575Q534J5751R442j546j2374j2574k675Q503
2449e127J1161N531n020j1125p055K422J1384J1136K59j0729j4087n376O929J4489
$$ plain form
2355 12988 19300 10110 -6709 -18944 -17607 -3285 13308 18919 11499 -4382 -16233 -14387 -1268
2368 -1268 11661 13361 3806 -8547 -12592 -5752 6594 14942 10955 -2692 -15093 -15382 -4595 12210
2382 12210 18886 12354 -3399 -17316 -17769 -6487 10149 18367 12733 -2119 -14402 -14621 -2434
2395 -2434 9081 12609 5403 -6550 -12458 -7086 4869 13470 10961 -1101 -14625 -16238 -6243 9692
2409 9692 18356 14065 232 -15723 -18974 -7895 7677 17105 12604 -600 -12506 -13766 -4084
2422 -4084 7840 12499 5654 -5863 -12066 -8033 3175 12903 11887 548 -11765 -16827 -8651 7520
2436 7520 17964 15170 1862 -13613 -18188 -9654 6097 15539 13993 1619 -10955 -13630 -5127
2449 -5127 6034 11565 6545 -4580 -11635 -9213 2171 13307 13566 2837 -11250 -16626 -9697 4792
2463D792J2287n66j1968j6942n182P132J3222J1634m55j0751j1807l965O786J0705
2477D922N930l269j0962p358P06J1026J0640K837j0203j3524o909N246J3824J1337
2491A4243K413j0520j5317p284M800J2204J1965J049r470j1563m371M792J0193
2504C134P118k857q867q293N97Q408J1310M196q532j3325p719K664J1955J3495
2518A3284L074q554j4259r711L397J2018J0923M114q368j2108n389M660R560P384
2532A0025j521q253j0310r13Q535J1448N116o794j2367r039N92J1889J2336M975
2546A5719o015j3488j0877J711R915J2088L843p044j0234n638K120R975P305o71
2560H709q457r051j660O661J1237N810l967j2280j1809M14J0068J3749O175m199
$$ plain form
2463 4792 17079 16513 4545 -12397 -17579 -10447 2775 14409 13954 3203 -8604 -12569 -5783 4922
2477 4922 10852 7583 -3379 -10737 -10031 995 11635 14472 4269 -9255 -16164 -10918 2906 14243
2491 14243 16656 6136 -9181 -16465 -11665 539 12504 13553 4083 -7480 -11851 -7059 3134
2504 3134 10252 7395 -1472 -9765 -9168 -760 10550 14746 6214 -7111 -14830 -12166 -211 13284
2518 13284 16358 7804 -6455 -16166 -12769 -751 10172 14286 5918 -6190 -11579 -6919 2641 10025
2532 10025 8504 251 -10059 -10972 -2437 9011 14127 7333 -5034 -14073 -13481 -1592 10744 15719
2546 15719 9704 -3784 -14661 -12950 -3035 9053 12896 5852 -4382 -10020 -7900 2075 9380 8709
2560 8709 252 -8799 -10459 -3798 7439 13249 9282 -2998 -14807 -14393 -4325 9424 15599 11400
2574A1400j3584j0543p13R611J1328N037m732j0927o676J285R155Q523J00q360
2588I04q990k683N734J2173O510m343j0708j1115j799P750J3441Q465m252j1000
2602H7j1252j931P516J1242O060l912r048q256J015R090Q235P93p681r574l005
2617a0621N033J0021Q759j753j1403j0310m064P204J2162R351k349r753j1211
2630h934l849N619J2067N471k422q473p301j76O773R300J433o237r857n682N276
2645f992J0300R228M05j0006j1967n249N859J1464R073J32q198j1766l965M141
2659g541J0156O676k91r012p706k61O189Q182L247n374r244n921K720J0205R351
2674A1376J117p915j1304o947L159J1066R740K009p209j0217n942K911R765P611
$$ plain form
2574 11400 -2184 -12727 -13440 -3829 7499 12536 7804 -3123 -9799 -8514 641 9164 9264 904
2588 904 -8086 -10769 -5035 7138 13648 9305 -1403 -12518 -14317 -6567 6874 15339 11087 87
2602 87 -11165 -13096 -5580 5662 11722 7810 -1238 -9494 -8479 611 8846 9639 1958 -7616 -10621
2617 -10621 -5588 4433 13192 11439 36 -10274 -14338 -7134 5028 14379 12030 2277 -8934
2630 -8934 -12783 -7164 4903 10374 7952 -521 -7822 -7998 -1225 8075 9508 3271 -6586 -12268 -6992
2645 -6992 3308 12536 12941 2935 -9032 -14281 -8422 3042 12115 12247 4049 -7717 -11682 -7541
2659 -7541 2615 9291 9000 -12 -7718 -7979 -1790 6392 9639 4265 -4979 -10900 -8180 2025 11376
2674 11376 12493 4578 -6726 -13673 -10514 552 10292 12301 5092 -5125 -11067 -8156 1609 9220
2688I220j481o859p390j744N901Q237L842m741q776o563J131R504J0465J594o968
2703E372j1242p448K600J0461R882K628n830j0714p055L375Q113Q233M8o428p398
2718e403k905M884P784N115l675q594p926R44Q077J0114M485o231j0351p713O11
2733a0784Q611R902M020m689q477q412J790P220P757J800o513o935l852L794Q596
2748C828N348j887q304q629J85N935J0610M427m193r260q069j446P804J0018N028
2763A1395l326r228p794l52P962P129J560m136o968l918K447Q579N135o11p741
2778A33q408j900O420R308O397k969r029q679k314N854R974M419j026p262q913
2793g995K77N127P422L948l790q772n446L783P325N851R21q050q406k433M669
$$ plain form
2688 9220 7739 880 -6510 -8254 -2353 5884 9726 4985 -3791 -10354 -9223 281 10746 12340 5372
2703 5372 -5870 -13318 -10718 -257 9625 12253 6423 -4291 -11346 -7971 142 8375 8423 1995 -5403
2718 -5403 -8308 -3424 4360 9475 5800 -2794 -10720 -9776 -1699 8415 12900 6669 -3682 -11395 -10784
2733 -10784 -2173 7729 11749 7060 -1417 -9829 -8039 -819 6938 8738 2225 -4710 -8562 -4768 3828
2748 3828 9176 7289 -1015 -9644 -9459 -3524 7086 11513 7320 -1940 -10009 -11455 -3651 6367 11395
2763 11395 8069 -1159 -8953 -9305 -1343 5786 7346 3210 -3758 -7676 -5229 3350 8485 7874 133
2778 133 -8275 -10175 -3755 5553 11950 8981 -48 -8727 -11041 -5187 4787 9206 8180 918 -7995
2793 -7995 -7718 -2591 4831 8779 4989 -3783 -9229 -5446 1879 7730 8651 601 -7805 -10238 -5569
2808e569R232O327j26q867r023k940M689J0172N704k166o648p546j779N592P101
2823D153M227l473q267m431J127P420P143J184o654q063l493K490Q726P632P23
2838A0444q141q838k979L028R432N431J73p076p688k052M639O815M630k955o871
2853b008m905K2O991O186J895m956p896m863K670P934P451J556o178q485n242
2868i828K551Q522O247P98o352p550k505L587P828M444j270p878n010j052O315
2883a153O390L719m533p361o711J922P580O429L914n328r437m079J520O695P207
2898F774J533m888o871m135K546P478M534r75o801o036l82M036R126K730l389
2913E280q368n589J437N706P511L568m124q161n767o4P109P260K198m873o637
$$ plain form
2808 -5569 3663 9990 9864 997 -8026 -10966 -6277 3895 9599 7433 785 -6761 -8540 -2948 4153
2823 4153 8380 4907 -3360 -7791 -6664 756 7899 9083 2429 -5634 -9127 -6637 2089 9721 10444
2838 10444 2303 -6535 -9514 -6486 2946 8377 8550 1474 -6214 -8266 -3627 3188 7818 4863 -2008
2853 -2008 -6913 -6891 100 6286 8181 3225 -4671 -9534 -6864 1070 8521 10077 3899 -4586 -9828
2868 -9828 -7277 1245 7492 8290 1938 -5612 -8117 -4530 3298 7742 6472 -1406 -6416 -7468 -1153
2883 -1153 5237 8956 4423 -2938 -9649 -7727 -147 6282 10196 4868 -4569 -8648 -7128 -433 6774
2898 6774 8307 3419 -3452 -7587 -5041 2437 6971 5996 -805 -6841 -7223 -3187 5939 8669 5280
2913 5280 -3088 -8677 -7240 -1534 5977 9545 5421 -2740 -8507 -8571 -1462 5798 7996 3123 -3514
2928c514m915L029P156M262L90n138p472r46M115P276M791k748o614o772j489
2943h589N776O884M065k112p862o228L70N467P958K247m656n502m401R16O566
2958H99M401J568n036p379k111L432P761M699j742o487p241p39L791P716N590
2973I122l433o247o146j107N491O957K226l095n241n011l2O586N846J508n438
2988A986n752m714K723Q293M277J67o327o220k870M126Q020M676j426n648o580
3003e269k276M294O185M061j522p266m590n53O188N421K456m125o146m344K408
3018e078N295O579p14l693p054l233K582P042N366J66n490p363j248K838O828
3033B823L398q48n619n704q14N146N415L996l787o472n220K358M774O159K164
$$ plain form
2928 -3514 -8429 -5400 1756 6018 6408 1270 -6202 -7148 -3033 4243 9034 6286 -328 -7100 -8589
2943 -8589 -2813 4071 8136 6024 -1838 -8066 -7696 -2229 5729 7976 3320 -2182 -6583 -5667 899
2958 899 5300 6868 1832 -5547 -7658 -4226 3535 8234 6492 5 -7236 -7975 -4184 3532 9122
2973 9122 5689 -558 -6704 -7811 -2320 4637 6863 3768 -1473 -6484 -6516 70 5916 7424 1986
2988 1986 -3766 -8480 -5757 2536 6813 6980 653 -5567 -8437 -4311 3709 8385 6959 1311 -5269
3003 -5269 -7545 -3251 2934 6995 5473 -1793 -6383 -6936 -748 4673 7129 3004 -3142 -7486 -5078
3018 -5078 217 6796 6082 2389 -4665 -7898 -5316 1726 7092 7258 1768 -5595 -6843 -4005 2823
3033 2823 6221 5373 -246 -5950 -6764 -1618 3797 7793 4006 -2466 -7686 -5328 -554 5605 7769
3048G769n101p215k843K986N433N005M60m345n606l288K495O532L918j485l634
3063A081o061j743L980O788K633k192o307n137M24N535O419J089k874o564m454
3078g383R33O161N900J097l347o851l118K695M575N586q34m947m652k613M144
3093b654N719K861p86o147n156k51M103O785K285l032n951m375N47N076N645K107
3109F776l853n965l868J257O049M281J543m915n221k875K092O494M717j502n650
3124f40n192o85L618N553L660j760o026l990n80L812O391K108k496o125l761J078
3140e035N118M298J330l502n340l356K857M114M895M56m580o234q94L313M338
3155A778M491j744m557n445o05K209P158L222k241o095l732l3M728N628J167k686
$$ plain form
3048 7769 2668 -4547 -7390 -4404 1029 6034 6494 2149 -3457 -6745 -4250 2282 6200 4715 1081
3063 1081 -4980 -6723 -2743 4045 6678 4486 -1821 -6958 -6534 -999 5420 6509 3635 -2929 -7383
3078 -7383 -6450 -289 5611 6708 3361 -3490 -6608 -3913 662 6248 5414 467 -4185 -6798 -2654
3093 -2654 3065 5926 5140 -1007 -6163 -6414 -2311 4474 6759 3727 -2224 -6599 -6052 -976 4669 6776
3109 6776 2923 -3042 -6910 -5653 396 4677 6220 1305 -3916 -6791 -4699 1795 6512 5010 -640
3124 -640 -5832 -6517 -2899 2654 6314 4554 -1472 -5462 -6042 -2230 4161 6269 3773 -2352 -6113 -5035
3140 -5035 83 4381 5711 2209 -3131 -6487 -3630 484 5379 5835 1255 -4979 -5873 -2560 1778
3155 1778 6269 4525 -32 -5477 -6082 -3873 3285 6507 4266 -1829 -5561 -5594 -866 4762 5929 3243
3171C243n419m359K121M992M823j1m075n579k599K919N734L543o21l845o166j090
3187f389L563N303L660j372m906n202p04M377N589J878k588m632l768k33N010
3202d14M810P60k994n969j905K403N343K688K23l901m741k271K579M763M099j764
3218C709l152m767j233L088N125K770j396n366m402Q36M142M464P37k011m716
3233b172l723J023N040M824M67m419m657j788J623M591M646m59m481m659j025
3248e169K207N168K830j125m903m153k86L538N048J728j368n219l824K53M961
3263c14M434R82k890n122l000J612M839L774J19k999n239k221K722M528M422j475
3279D172m380m625j626M723L554L523j975m277l659N12K054N854J477l127m314
$$ plain form
3171 3243 -2176 -6535 -4414 578 5401 5390 1315 -4264 -6863 -3944 1790 5333 4712 867 -5299 -6389
3187 -6389 -2826 2477 6137 4765 -141 -5343 -6047 -1670 3919 5797 3209 -1423 -5191 -5424 -414
3202 -414 4396 5156 2162 -3807 -5712 -3309 2034 4722 4945 1044 -3697 -5968 -3389 1374 5473 3709
3218 3709 557 -4210 -5443 -2355 2770 5540 4144 -1222 -5624 -4788 -646 3818 4555 2544 -2172
3233 -2172 -5895 -4872 168 4992 5459 1040 -3617 -5405 -3782 809 5455 4996 515 -4144 -5169
3248 -5169 -2962 2206 5036 3911 -992 -5145 -5431 -1893 3155 4883 3515 -1704 -5528 -5275 -314
3263 -314 4120 5102 2212 -2910 -5910 -4298 541 4315 4434 1435 -3804 -6025 -3303 1225 5647 4172
3279 4172 -208 -4833 -6459 -1736 1818 5341 3366 -911 -4570 -4058 -2004 3850 5327 2200 -2114
3294b114l058J586L122M065J584l346n291j489J717L656L514N23l095m706j760
3309e092K599M177L321j156l597n045p56M604L758J626j234l376n215O81L848
3324h57L891J518k241m834k710J501L017N710k31l705l722k390J116N187L277
3339D527j28m400l457j885L449M043L042j625n272k944m16L633M664J579k663
3354B147l700k592O45K969M316Q30k710l687k838J628L662L989j39m773k973j329
3370d555K293L922L321k154l374m046k71K267L933L331k530l760k779K31L630
3385e41L486J624k846m380k135J254L665L358J140m012k856k707K601K839K607
3400C097Q48l440l943j466K848L921J313L10l910l818k9K342M134J359j682m293
$$ plain form
3294 -2114 -5172 -3586 -464 3601 5185 1839 -3452 -4941 -3224 432 3946 4469 1374 -3332 -5092
3309 -5092 -2493 1684 5005 3849 252 -4793 -5549 -945 2813 4439 3205 -171 -5386 -4705 -857
3324 -857 3034 4552 2311 -2523 -5233 -3732 -715 4995 4764 1059 -2663 -5053 -3937 1250 4527
3339 4527 4399 -1 -3458 -5343 -1894 2149 5191 3566 -1706 -4650 -5066 -1433 3231 4810 2147
3354 2147 -1553 -4145 -3500 -531 3785 4615 1905 -1782 -4620 -2992 670 4659 4520 -253 -3226 -4555
3370 -4555 -2262 1660 4981 2827 -547 -4593 -4864 -2597 1336 4667 2137 -1623 -4402 -4171 -541
3385 -541 2945 4569 1723 -2657 -4792 -3538 127 3485 4625 613 -2243 -4950 -2349 490 3097
3400 3097 3945 505 -3438 -4904 -2056 1865 3178 3488 -422 -4240 -4269 -1927 2207 3566 1884 -2409
3416b409k498J195K790N119J076m159l398k960K004L775L228M52k886l844k431
3431d946K632L713M055j879l748k999j186L308L325J996r87m512k199J98K650
3446e79K991J711j698m229k520J675K252L618J393l307m106j719J162L764L725
3461D133k10k744l592j376J523M259K423j464l222l483K80J335N072J088j132
3476B890m348k497M33K855M660m17j550l476k778N38M256L550j005k318l431j461
3492d099J925L207K393k02l676k305j578K851L928J817j098m163k793o62L737
3507g18L018J800k065l642k522L14L852L403J193k365m585j376R50L426L746r10
3523C519k450m174p55J309L527L637j788k925l684n28K578L952K018j771l728
$$ plain form
3416 -2409 -4907 -3712 -922 4197 5273 1114 -2284 -5244 -3240 535 3763 4215 1329 -2515 -4946
3431 -4946 -2314 1399 5454 3575 -173 -3172 -4358 -1050 2275 4271 3284 -1228 -3427 -3229 -579
3446 -579 2412 4123 2425 -1804 -4324 -2649 -397 3221 4614 1307 -2799 -4518 -3356 408 4133
3461 4133 3923 1179 -2413 -3789 -2266 1993 4416 2952 -270 -3753 -3473 -2138 2934 4022 2890
3476 2890 -1458 -3955 -3522 -667 3993 3576 2026 -1450 -4228 -3690 566 4116 3111 793 -2638 -4099
3492 -4099 -2174 1033 3426 3224 -452 -2757 -4335 -1484 2444 4261 3163 -1000 -3793 -4455 -718
3507 -718 2300 4100 2035 -1607 -4129 -3815 37 3440 4633 2268 -2317 -3693 -2743 683 4429 3519
3523 3519 1069 -3105 -3860 -2551 976 4613 2825 -100 -3784 -4312 -1734 2218 4236 2465 -1263
3538a263k614M16K771L269J444k278l561j692O68L259K916j5k023l631j527K084
3554a777K976K802Pl401l364q36J964L550J499n22m281j954q0K170L635J230j004
3571B614l262k732L93J370M390J243l003k914j156J89K675L354L22l082l714j376
3587d689L027K627L993j993k322m480J085J566L070J281j284k528l408K64K950
3602h41L346P47r55k921l016O28K811L778l69k423k322k200J305L681J377K11
3618B837l312j809q40K151K874J299n30l316j668j315K188L724R52j254k131l753
3634c903J337K381K269N98j525k539j424K73L540J665M84k147l163l80N55L147
3650A168K998j433k606l100R4R47M158R86m43k948k701k75K444K708J086j074
$$ plain form
3538 -1263 -3877 -3461 -690 2579 4023 1745 -1816 -3508 -2840 419 3335 3320 1297 -2334 -3861 -1777
3554 -1777 1199 4001 4008 607 -2757 -3593 -1629 1921 3420 2898 -1383 -3337 -3417 -1247 2388 3618 2614
3571 2614 -648 -3380 -2987 -1617 2773 4016 1013 -1901 -3057 -2868 -193 3161 3483 401 -3313 -4689
3587 -4689 -1662 965 4958 2965 643 -3837 -2752 -1186 1884 3165 1881 -647 -4055 -3791 -841
3602 -841 2505 3252 2297 -624 -3640 -3012 -201 3577 3208 785 -1537 -3737 -2432 1249 2626 2837
3618 2837 -475 -2284 -3124 -973 1901 3200 2670 -646 -2314 -3629 -1441 2283 3235 1981 -150 -3903
3634 -3903 -2566 -185 2084 2682 1157 -1382 -2806 -2533 1007 2672 3156 1009 -2154 -2534 -1979 1168
3650 1168 4166 2733 127 -2973 -2879 -1932 2226 3212 2769 -179 -2880 -3155 -711 1997 3083 2009
3666B009l214j026j11K526K426J063k871k683j109Q87L321J689n48k219k210o33
3682b703J110L005K026k18l797j474j498K209M262Jj078k377k671Q64J931L462
3698C054O19j346m562j066K93L167K898L59j340m111r44J460K995J114J11k854
3714a53j918j396K406K090K248j202k430k316M10J945J422J969j553j227l488
3729c193R37J781L501l1j899k395j860M48K753K619o59j859k150n92J187K441
3745A029J012M65k557l116J88J897K894J074k260j605j606M92K037J085J735r66
3761A798l059j369J99K657K844r30j323k487n81M25L374J143l70j996k446p73
3777b894Q33L293N67N39k100k673p89K258K934J119q09k725j857o8K924J782O90
$$ plain form
3666 2009 -1205 -2231 -2342 184 2610 3673 802 -1881 -2990 -2103 1218 2907 2359 140 -2070 -2703
3682 -2703 -1593 1412 3438 3220 -577 -2051 -3549 -1340 2922 2923 1845 -532 -3203 -2339 -408 3054
3698 3054 3673 2327 -2235 -3301 -3008 159 3057 3416 2076 -2035 -2979 -1519 1476 2590 2701 -153
3714 -153 -2071 -3467 -1061 1029 3277 2075 -355 -2671 -2261 -316 1106 3075 1522 295 -3193
3729 -3193 -2256 -475 3026 2995 1096 -1299 -3159 -2711 42 2661 2002 143 -2007 -2599 -1412 1029
3745 1029 2041 2506 -51 -3167 -2979 -1082 1812 2886 626 -979 -2585 -2093 -56 1029 2764 1798
3761 1798 -1261 -2630 -2431 226 3070 2140 817 -1670 -2251 -1826 1548 2691 2321 325 -2121 -2894
3777 -2894 -2061 1232 1799 2338 238 -2435 -3224 -966 1968 3087 2278 -447 -2304 -2372 552 2334 3024
3794C024j623l528p52J176J766J702J499k720k939K42N34K643K202j252k436j538
3810b000n76J613L211q7R9k604k219j90K597J954J206j500l289j005J416J613
3826B39R60J343j429j887j115M99K088J989l24j805k082j512J776K288K185k36
3842B977l099k099L92J042K186J360o47k042k498J013J305J758J184j216k978
3857a362j431J010K521K355q13j832j422j919J221J717J987p06r14k479j065J770
3873a362K664O79m96k372j632k23K506J330J159j323j637j479RJ416L114M3j656
3890G40l207N1Q24K135J375Q75k379k160j180J553J989J062J221l529j590J84
3906b036J201K458O27l64k266k060R33N23K325J008j336j602k259Q97J956K124
$$ plain form
3794 3024 1401 -2127 -2879 -1703 63 1765 3264 544 -2395 -2153 -1619 1024 3226 1974 -462 -2000
3810 -2000 -2576 -963 2248 2161 2260 -344 -2563 -2753 -156 1798 3004 1504 -1785 -2790 -1374 239
3826 239 1199 2542 1113 -774 -1889 -1390 698 2687 2363 558 -1524 -3036 -1260 1028 3213 2977
3842 2977 -122 -2221 -1829 -787 1399 2759 2112 70 -2428 -1415 -110 1648 2832 1616 -1362
3857 -1362 -2793 -1783 738 3093 2280 448 -974 -2893 -1672 45 2032 1326 412 -2067 -3132 -1362
3873 -1362 1302 1981 1485 -887 -2519 -2742 -236 1094 2253 930 -707 -2186 -2177 -761 2353 2396 740
3890 740 -2467 -2416 -1592 543 1918 2793 414 -1746 -2926 -1373 616 1678 2899 -630 -2220 -2036
3906 -2036 -835 1623 2250 1886 -380 -2440 -1507 -984 1341 2349 1013 -589 -2848 -1951 5 2129
3922B129k70j150k008l70Q56J285J724R5j900j983q10J474K231l59P52j911j669
3939a884R4Q53K801O72j494j870j616N02K364J799k64j600k077K29J46J977J469
3956B101k02q88k761m71M94K491K011r64j922j944m80J478K165R56q60j479j546
3973a821J5J027K716M23j665j213j280K19K394Q26J70p84j973l90j59J880J945
3990B330rk162j186j996K446R81J995l35j729j666p77J541J971M01q57j059k016
4007b127m68K476J305J123j249j540k080J557K127Q45p20k04k186j441J549J798
4023G65K044j179j426j895k38R02K236O48j23k583j300J20K370R02J314j921j859
4040a223o19q5J884J667J083j411j480k370K096J020J308n64r49j368j464J332
$$ plain form
3922 2129 1859 709 -1299 -1669 -813 472 2196 2291 391 -1592 -2402 -928 1303 944 1696 -215 -1884
3939 -1884 -1790 -937 1864 2536 1042 -828 -2444 -1942 422 2221 1957 357 -1720 -1491 -1345 632 2101
3956 2101 1899 1011 -1750 -2221 -1727 764 2775 1811 -111 -2055 -2535 -1057 1108 2064 1204 -275 -1821
3973 -1821 -1806 -779 1937 2360 695 -518 -1798 -1579 815 1641 1811 1027 -946 -1336 -1495 385 2330
3990 2330 2321 159 -1027 -3023 -577 404 2399 2064 335 -1331 -2108 -567 1404 1805 948 -111 -2127
4007 -2127 -2595 -119 1186 2309 1060 -480 -2560 -1003 1124 1969 1249 1045 -1141 -2582 -1033 765
4023 765 2809 1630 204 -1691 -1929 -1027 1209 1857 1734 -849 -2149 -2029 341 1243 2557 636 -1223
4040 -1223 -1842 -1927 -43 1624 2707 1296 -184 -2554 -458 562 1870 1306 357 -1011 -2475 -1143
4056a143K322Q69r5j754k482M04J82K709N46n07j726q16m32J451J636J270j522
4073I12j360j658q8K285N07Q70k7k396j776Q88K286J884j112j073j328m14J009
4090e91J343N91K19j652n45k014K479J619K81q02j559j092L29J942J565p20L9
4107A432k336q75R87J657K114j392j513j809j15MK427J345j051p44k055O74J376
4124A26J695N95j302j758j471L57K124K70Q29l19j476j149q11K900J507q57j485
4141b25q41J02l80J663N23M6O56k621o96O31J493K065j444j784m42l92J495J730
4159A579P1k71k311n40N12Q71J327O3l87j459j446J68K453K84J50j87j938K92
4177g69N14O54J027q53n71j297O37m20K547L42p47j788j547K182k59J921K95o94
$$ plain form
4056 -1143 1179 2048 1953 199 -2283 -1879 -1697 1012 1558 1051 -675 -1491 -1923 -472 1164 2434 912
4073 912 -448 -2106 -2194 91 598 1468 1441 -955 -2731 -1843 443 2327 1215 142 -1186 -1600 -591
4090 -591 752 1343 1562 -90 -635 -2649 -170 1449 1730 928 -631 -1723 -1394 548 2113 1393 1432
4107 1432 -904 -1779 -792 865 2979 1587 74 -1735 -1850 -1846 581 1926 875 131 -1924 -1250 126
4124 126 1821 2416 1114 -644 -2115 -1758 366 636 1465 1146 -330 -1479 -2290 610 2117 1260 -225
4141 -225 -1066 -964 -1344 319 842 888 1544 -1077 -1773 -1142 351 2416 972 -812 -1254 -1646 -151 1579
4159 1579 1650 1379 -932 -1472 -960 -89 1238 1301 914 -545 -1991 -1823 630 914 1064 877 -1061 -769
4177 -769 -255 399 1426 573 2 -1295 -658 -1078 1469 1811 1064 -724 -2271 -89 -348 1573 1868 1174
4195A174r55k069j64K594P40R27j510j758j6q40K399J127l60j390j010p36P63
4212a084K188N26q73o92k010Q31K89J450L79n01n82j565K02R54J391k4J83k417
4230a355p44R68J073J409m71r25j231k08O11J718L54P23j673j225k22L86J394
4247E82P94N41j716j397l15O11J681Q60m85j296j594P52J450P80j29k8k285j91
4265a385O89J189M15O27k189N52p89k4P70J505k37j577p55p33J264J298L60J41
4283A121j376j326R9J597J235j24j084o78K79j068J044J971m07j654o72J23N80
4300c40R55P39N72j658o16q19J91J861O51m05j177j295P6J093J180P6m36j053
4318d05n21K33J054R51O19j219j115j502J48J750J529k06j117r57p72J424J010
$$ plain form
4195 1174 219 -1850 -2014 580 1320 2247 737 -1021 -1037 -1877 522 1649 1289 -101 -1111 -1847 -1084
4212 -1084 1104 1630 757 65 -1945 -1114 -825 625 1004 503 -79 -1644 -1442 -488 903 879 1062 -1355
4230 -1355 -2099 -1131 -58 1351 880 -45 -1276 -1484 -873 845 1199 1922 249 -976 -1198 -812 582
4247 582 1376 1917 201 -1196 -1511 -900 781 1641 1156 -140 -1734 -982 468 1248 1119 1091 -1194 -1385
4265 -1385 -696 493 908 1535 -654 -102 -891 -915 -145 1360 1123 -454 -1209 -1942 -678 620 980 1121
4283 1121 -255 -1581 -1482 115 1350 1226 142 -536 -257 -1325 -281 1690 1283 -371 -1043 -920 -340
4300 -340 615 1354 1926 268 -348 -1167 -976 885 1536 1131 -46 -1341 -1265 -172 1008 1084 648 -405
4318 -405 -926 -693 361 1312 1931 712 -403 -1905 -1757 -7 1522 1316 199 -758 -1530 -106 904
4335I04l38O78m48k031P5Q9J704L60M79j561j052L16j20K316j6o89k485M57J138
4354b24l38K339r10r9j991J05J91R82J494j269K91j531n35R97J397J476j627j968
4372a220M24k46P82Q66N01J81j223j534R75K45J321J041j601j633l48O10J394
4389E35P90l71r01n29k54K58J408L05j279O25k221J246N54Q18n19J221j431r25
4407f70r08J397R15K93J3j319j422R82J561L75J69j389n5q10P70K07N41O38p55
4426E33j333l72M49P90J053p28k28j521k33J580P76P39o41j350n12j073J996M13
4444C38N63l60j015L88o35J143O94m48o85m32m64R53O90R3Q4j279j657R78P59
4463b92J206m91P22o75j264p08J043J460M20j080o04J27q25O36J103m17m36r34
$$ plain form
4335 904 566 1244 796 -1235 -1160 -1071 633 993 1472 -89 -1141 -825 -945 1371 1355 666 -1819 -1362 -224
4354 -224 -562 1777 867 768 -1223 -1118 -927 55 1549 280 571 -960 -1495 -498 899 2375 748 -1220
4372 -1220 -796 -1042 -260 606 1107 1288 65 -1469 -494 -249 1072 2113 512 -1121 -1469 -859 535
4389 535 1325 954 53 -476 -730 -472 936 1241 -38 587 -1634 -388 166 984 465 1686 255 -670
4407 -670 -1578 -181 734 1027 1040 -279 -1701 -719 842 1217 1386 -3 -58 -868 -98 109 650 1288 533
4426 533 -800 -1172 -723 67 1120 392 164 -1357 -1590 -10 766 1505 864 -486 -998 -2071 -75 338
4444 338 901 541 -474 -86 -721 422 1116 668 -17 -449 -913 40 730 823 907 -372 -2029 -1051 -292
4463 -292 914 423 1145 470 -794 -1502 -459 1001 1421 341 -263 -136 -961 -325 778 361 -75 -1009
4481a009j88P59K13J398j7o46j575n40J356P27M18k1l24j419j17O09P33R15j524
4500b52O44j321Q6N12M59J517j207p8j463m36J449R33J50m29l20j072l44J145
4518b7Q58J019j011j883m14P60J661k34j23l82p37q51N92J653L65k33j434r72
4536a393Q64l56J513N08J70j739k96o73J807J03R30j083l38j152L73R63l13N94
4554D82r76J4M34j15N89O26j124N46j974K54M07J975J70p51o04K08j375L95J196
4573C77J16q48j68p59R40O93P90j81j357o04K08J283j075J921p08m42j054M3p3
4592h98J539K7L62j358j382O32J081O04K74o11j131N91J53KJ54k12k19J02k00
4611d90j11J074l2P95o45n76j226K87J057J50r45P73r6p01O94N51P07j123N81
$$ plain form
4481 -1009 -1197 -438 -225 1173 1156 510 -1065 -1605 -249 478 896 875 551 -868 -985 -376 357 1272 -252
4500 -252 392 -929 -843 -331 128 1645 438 360 -1103 -1539 -90 843 993 564 244 -828 -1172 -27
4518 -27 831 1850 839 -1044 -1458 -698 963 729 606 224 -513 -1364 -772 881 1246 1013 -421 -1393
4536 -1393 -529 -885 628 1136 1306 -433 -729 -1402 405 508 1438 355 17 -1135 -762 201 -112 482
4554 482 -494 -480 -46 -161 428 1054 -70 476 -1498 -1244 -837 1138 1308 557 -47 161 -1214 -819 377
4573 377 493 -355 -523 -1282 -342 351 1141 960 -397 -1001 -793 490 -585 1336 628 186 -868 -825 -898
4592 -898 641 668 1030 -328 -1710 -1078 3 607 881 270 -861 -270 -117 -115 39 -173 -392 -290 -490
4611 -490 -601 473 441 1236 591 15 -1211 -924 133 283 -662 111 15 -686 8 559 1266 143 724
4630G24j223k86J136m33R50K45k597R25m15N62l38J408j151K63q92N71J409L93
4648A251n31r85l56k83K12J136J28k48q92k91Q62N84p63J376j820k46j98K28O45
4667a91J245p37j62j643R07J096n2J328j147o20J98j329J120K25N67q05J12j105
4685i93l63J500L75j77o44R76j036m21P18J050k41o70r68K96K33N38L58J03m41
4704A93j155o4P48O19k93Q08p37q90p66K066L77J70n63j992J557l80P4J255p51
4723B76p78k36q56Q19Q97P46J83o24p75q22O26N72P48m57k3j059L25P86m27N50
4743D71R9o80j570O32J000J48M23k02j340M5k71K056j65K95p87J81j721J295m22
4762e13P70J203p38j874j99N43J229p71O65m97p49p3O08J393P1l82q26n65q54
$$ plain form
4630 724 -499 -785 351 -82 868 1113 -1484 -559 -974 -412 -750 658 -493 -230 -1122 -551 858 1251
4648 1251 720 -265 -621 -904 -692 444 572 324 -568 -859 3 587 -176 1200 -620 -866 -1064 -836 -191
4667 -191 1054 317 155 -1488 -581 515 463 1791 644 24 222 -1107 13 238 805 0 112 -993
4685 -993 -1356 144 519 342 -302 674 -362 -783 -65 985 744 74 -894 -598 -365 173 531 634 193
4704 193 -962 -1026 -278 341 48 856 119 -771 -1537 529 906 1076 513 -1479 78 -302 -228 1027 276
4723 276 -502 -738 -1594 -775 122 868 1051 427 -348 -1170 -544 28 776 319 296 -763 -438 348 -79 471
4743 471 570 -110 -1680 -1048 -48 100 523 321 -1019 -974 -1245 811 646 941 154 335 -1386 -91 -513
4762 -513 257 1460 722 -1152 -1351 -808 421 -350 315 -182 -931 -1004 -396 997 1068 686 -140 -705 -1559
4781a559P43J443m04O3k41m42r9L05O04J04n44j59J07n81Q95N74Q5m03j450m30
4801a389J255j15J296q8j123J84p50M05M26Q56M24j633k35K87K49N47J222j515
4819C03l15K36q44J202J88N34k536J550m63k65M83Q4k16l26N1q67J57R92J500
4838A448r24o78l01J42N41n0L44l75q26R0K21N15J719j602J28l76p14J64O29J012
4858A107q56K71p74l59J54J572j242M77j91R4j011M39M62n9j00j78p38R48M69
4877D85j09P18j657L10j00O19o37J691o50j170P42q90K4J773p3p44p19O16l98
4896a69j3j74J330j035O54r30PJ490p69k83K6n93P33m78J5N07Q04j654K31p71
4916a072N03M15Q04l27j97O07j470j18M07R56m67K06l26o03m81J730o38Lq6k49
$$ plain form
4781 -1559 -816 627 223 286 45 -397 -496 -191 413 517 -27 -186 -79 -660 235 809 894 491 -959 -1389
4801 -1389 -134 -249 1047 959 -164 20 -730 -325 101 957 1381 -252 -487 -200 49 596 1818 303
4819 303 -12 224 -620 582 770 1304 -1232 318 -145 -410 73 157 -59 -385 -334 -1201 -1044 -52 1448
4838 1448 524 -154 -455 -313 228 178 522 147 -679 -589 -368 147 1866 264 392 16 -698 -534 95 1107
4858 1107 251 522 -252 -611 -457 1115 -127 350 159 253 -758 -319 143 84 -16 -194 -932 16 485
4877 485 376 1094 -563 -253 -353 266 -371 1320 670 -500 242 -648 -624 1149 1076 332 -387 229 -169
4896 -169 -182 -356 974 -61 593 -337 -330 1160 391 108 134 -459 274 -204 -189 318 1122 -532 -301 -1072
4916 -1072 -569 -154 650 323 126 733 -737 -855 -448 508 41 247 -79 -682 -1163 567 -71 -68 -154 -403
4936d03j58R11N56j190M95k08m28J10Q11n08O22l87m70l89Q15o26O04k44K4K28
4956A65j003J025K76j94j20p46l81M55Q6J406J95k270K97m0M63k69J020j7K53
4975F01p10j003J543n47N98n3o24M91r09J46M00K43O98q63p29L2Q36P38n80M31
4995G39m19q9j021P44nM07J18r66N10m38R2Q45P1n11L2l12L48lO54o40q9j014
5017i47l55N09P99k41K93M68j836Q34J039j65Q71j427K45M81j022J484j4l63o26
5036B7p1J58m52j01P23J46K48o63j49L20p17J428r93p56N36K6q27J630J39M03
5056A055j275r16J660k49N61q61l2J7k62o68J366M1M44n73j137j38P62P69N72
5075A136q44N69j042j08L21n2k4Q50L77j732m78J017K58k40j43K38r0q22J282
$$ plain form
4936 -403 -561 350 906 -284 211 3 -425 -315 496 -12 610 223 -247 -636 179 -447 157 -87 -63 165
4956 165 -838 187 463 269 149 -597 -978 -523 -437 969 1164 -1106 -809 -849 -386 -655 365 348 601
4975 601 -109 -1112 431 -116 482 429 -195 296 -613 -467 -67 176 874 11 -718 -686 150 888 308 739
4995 739 320 231 -790 -46 -51 356 474 -492 18 -420 -328 517 588 77 109 -203 145 142 796 156 67 -947
5017 -947 -1302 -793 6 -235 58 526 -1310 -476 563 398 1269 -158 87 568 -454 1030 1016 653 27
5036 27 -44 114 -338 -439 284 430 678 15 -134 186 -531 897 -96 -852 -316 -290 -1117 513 652 1055
5056 1055 -220 -1136 524 275 836 -25 -57 -40 -302 -970 396 437 881 308 -829 -967 -205 564 1136
5075 1136 292 861 -181 -289 32 -20 -44 806 1183 -549 -1027 -10 248 8 -135 103 13 -809 473
5094D73L04k71Q4j108P0k72Q67M41k15j95j30n48K70J038l45n15L02j50o22j79
5114g01R43L1m10P8l65l40N63M82j65N23k39j290K70O73Q33J56k7j312j206O18
5134h85J792j124J139r44p23P1M63J446j475L20%l84m18Q48m60K001j368L03j018
5153d16q0J024k58N31p59J08l69J34m2k02N59m24O48k17L36n14O35l70J6r95R53
5174B98K64K53q28J25k7j13j030M44N77n39J392J1p26j042J068J33O68o82m29
5193a83K70p44K22J163o32J020j745No9K176j118k49l97M54r83J60M56L54L47
5212E07q30j70l91J426p52M87P29k78j003m7O37o18L0L28j48j069J005J003k99
5231E47o0k99k17P09r98M84k68O42m68o3o47M62n40Q00J77n3p02M95k30k15M13
$$ plain form
5094 473 777 506 590 -518 -448 -720 147 588 373 178 48 -500 -230 808 463 -52 250 100 -522 -701
5114 -701 242 273 -137 -59 -424 -764 -201 281 116 639 400 -890 -620 53 886 1042 1015 -297 -1503 -885
5134 -885 907 -217 922 -22 -745 -674 -211 1235 -240 80 80 -304 -722 126 -334 1667 299 602 -416
5153 -416 -496 528 270 801 42 150 -219 -85 -127 -329 230 -194 454 237 573 59 694 324 340 -655 298
5174 298 562 815 -13 112 85 -28 -1058 -614 -37 -576 816 827 101 -941 127 260 928 246 -183
5193 -183 87 -657 -435 728 96 1116 -629 -624 -693 1483 365 116 -281 173 -810 -650 -194 160 507
5212 507 -323 -493 -884 542 -210 277 1006 728 -275 -322 315 -303 -273 55 -93 -1162 -157 846 547
5231 547 487 188 -29 680 -318 166 -102 540 72 9 -638 -176 -716 84 261 208 -494 1 -229 -444 -31
5252c1n73j70M72L16J25Q80o58J07q3k60N08n94j61J84k04L32M5K30l32o83M14
5273a36m66P97j531P98Q63j62N2rj012P04K21K90L05r30m19J225j257p6Q99N58
5293G14m86j439J527k06M16q49P80L79q91k99J19N80O01j281j73J041j187O64
5311A0Q56o15j49L66q87N65J21M24m49M12j695Q19L17o38J443m86o70j24P06j239
5331i13J172n25R98j131n24J636n64R21l8j064j49J79k74P12p04Q46r61r2M6P8
5351c51Q58O8l12n35J35J75n5O9l6Q0Q2q55J17O93l71O3K30J85m15l11L51J6M88
5374C69m53Q74r65J126j199L73K88p88o58J136J43j63O89j196j36R04r29M69j22
5393b38J76P0m09K25n40R15M2K22K9k31m25N55o96O04K63k16k21j47J03q6M66
$$ plain form
5252 -31 -604 -774 -302 14 139 1019 361 468 385 125 633 39 -122 62 -142 190 235 465 133 -550 -136
5273 -136 -602 195 -1336 -538 325 163 215 206 -806 -102 119 409 714 -216 -635 590 -667 -743 156 714
5293 714 228 -1211 316 110 526 -323 457 836 -55 -354 -235 345 946 -335 -508 533 -654 10
5311 10 866 251 102 468 -419 146 267 691 242 654 -1041 -222 95 -543 900 414 -256 -380 326 -913
5331 -913 259 -266 732 -399 -923 713 149 1070 1032 -32 -181 -2 -276 436 -268 578 -383 -475 -429 -351
5351 -351 507 575 263 -272 -137 38 -17 52 16 96 178 -677 -560 133 -238 -175 55 240 -175 -486 -135 -119 369
5374 369 -84 790 -175 951 -248 125 413 -375 -1033 103 246 83 772 -424 -560 344 -585 -116 -238
5393 -238 -62 8 -401 -176 -716 199 241 463 492 261 -164 391 -305 299 562 346 125 -22 81 -5 461
5414D61j73o86J41n93J646l6k03p60N13q10k21Q89m96Q20l73L98l36M79l12K55
5434F03K44l58j925J346n33Q98j84k79n88J428k88k39K82O90n69l59j28J01R57
5453A099q55L60j067p5R44p68J4M39Q03j395J05N17rJ076j053M35j066M97k73
5472b72O04r66J500r86m03n37R52L87m78P19j333J633m24j46o80L62N37N11r30
5491E0o42L04m56J182k30r47N75O64n0ok18n6k02k13J93l54P44m37Q71o73j626
5512a527J889o63q7K67J027l05j342P6O15P82p00k28P5p99J321n51L07j76n25
5531e44J165j151J175j24j87l29n01R06p7j158J515n52Q7K32j491R86N6L69n06
5550a29O5J86l81K95l09L00O67Q6j026M49r03M17M15J09m42M5p18O83L82k26J81
$$ plain form
5414 461 288 -398 -257 -850 796 760 557 -203 310 -500 -721 168 -328 492 119 517 181 660 348 603
5434 603 847 489 -1436 -90 -623 275 91 -188 -776 652 364 125 407 1097 528 169 41 142 1099
5453 1099 244 604 -463 -538 406 -362 -348 91 894 -501 -396 121 112 1188 135 570 -496 1 -272
5472 -272 332 -634 866 -120 -523 -1060 -108 279 -199 520 -813 820 396 250 -430 -68 469 980 50
5491 50 -592 -288 -744 438 208 -739 -164 500 450 444 226 170 -32 -245 -52 -406 338 -99 772 99 -1527
5512 -1527 362 -301 -388 -121 906 601 -741 -665 -50 732 32 -196 -121 -920 401 -150 157 -19 -544
5531 -544 621 -530 645 521 334 5 -496 410 333 -825 690 138 225 457 -1034 -48 8 377 -129
5550 -129 -64 122 -259 36 -273 27 694 780 -246 203 -700 -283 132 241 -201 -156 -874 -191 191 -35 146
5571A46J25q16l62P66n74J147Q27j009m69N34j32qj94K21J25n73Q8j40M82j390
5591a206P23m1j83l56J127j2q11J068m72o47K57N49L70m63J0MN5L83o96L63M03
5612D25p05O59p2l00o33J5L19J33p91R34M95J07j278N75N70q16J235j118K53N91
5632E98k14K21j462N57P09P88j079p9m06K47p9jK04m61M20m52J005m62J19J94
5652C67l48m53R19o94J12OP22j131j80L33m39Q72j55N28j094K52k80N20M14o36
5672c65M38o45Q49j07q12O98k3J92l88lK79J011j060k33J91n74J088q00K14K14
5692A64p2p17O88m21O06o58N50J52O9j48k99J32M23k92n54k44R60n79O41p26L56
5713C1M64r37L27k57L82J510j310m80J87Q52n98m38M86k56l48q18J666J09l94
$$ plain form
5571 146 271 -545 -907 -141 -715 432 1259 250 -219 315 183 175 -19 202 327 -246 -158 -298 184 -1206
5591 -1206 -483 -524 -707 -1063 64 52 -759 309 -163 -810 -553 -4 366 -97 -87 -83 -28 355 -341 22 425
5612 425 -280 379 307 7 -626 -611 -292 -159 -950 -16 479 586 -692 -117 453 -363 872 -246 7 598
5632 598 384 605 -857 -300 409 1197 118 39 -367 -120 -199 -200 4 -457 -37 -489 516 54 173 367
5652 367 19 -434 485 -209 -97 -91 631 -500 -680 -347 -786 86 -69 459 -635 -383 -663 -143 271 -365
5672 -365 73 -572 277 170 -642 56 33 225 -163 -166 113 1124 64 -169 22 -552 536 -264 -50 164
5692 164 92 -625 63 -358 248 -410 140 292 361 213 -86 46 469 177 -377 -621 339 -240 401 -325 31
5713 31 495 -442 -115 -372 10 1520 210 -270 -83 769 171 -267 219 -37 -385 -1203 463 572 178
5732A78m45k04J2K21l9K62M49P7pK85j502K31O86q49J21J534p57K80o30n73O78
5753HR64r82P5o45J063j124Q61J91q15K46m62P39N4Q0rk5l57q77J398Q47m79k59
5775D92q24j73P63q68M49J69q3L24p05J187j348L77N60q40Q20r31R23P73p17q
5795C40p49K41n7K00L34M74l0j047n00P65j14M2L85k31l81O41n98K12L07J72j095
5816f89R27N60m23L08q75N48O00j296O03j66M52k77n51O13p96N0J235o43K77K46
5836G03m99P25n33k91j36P61j28j088J29K36N24N4p67L37j07k00N16j54K8N46
5856F56o12L99j244R34R3m42J355n74n47J79m25R83k06l93m82K75J73K88k28l82
5876b00M45r66J081M03j430P11O03n22N42j166Q88k56K67K5o49N00k00n56N77
$$ plain form
5732 178 -267 -471 -459 -238 -277 -15 434 511 504 789 -713 -482 204 -645 -524 1010 253 533 -97 -670 8
5753 8 972 -10 65 -580 483 -641 220 411 -404 -158 -620 119 173 253 244 219 -138 -1015 383 1230 751 492
5775 492 -332 -505 258 -610 -161 8 -75 249 -456 731 -617 -240 320 -520 300 -631 292 1065 348 340
5795 340 -409 -168 -225 -25 309 783 753 -294 -794 -29 -143 -101 284 53 -328 313 -285 -73 234 406 -689
5816 -689 238 798 375 683 -192 356 956 -340 263 97 549 272 -279 334 -462 -412 823 180 457 703
5836 703 204 929 396 105 -31 730 602 -486 -357 -121 403 457 -310 27 -80 -280 236 82 110 656
5856 656 44 443 -801 133 226 -216 1139 565 18 197 -228 755 549 156 -326 -51 122 410 182 -200
5876 -200 245 -721 360 763 -667 44 647 125 667 -499 389 133 400 425 -224 276 76 -480 97
5895I7q13K86L63L3J55r5N23o85M62m05n6l13P92j75R4J02p03k20K17N40n72J139
5917G66o43J74k94n41O56K33m52J26M22R8m73l53j6P69p42m48M81J120j599L18
5937c98J07k96P57n48J140o49N74k48p39K48o27J541n47J23o40M62o8q64J502
5956H30q25L69n49K41m95K10K93Km15O13o64J158j014K62M81k18r62O3l01P06
5976b15L20j95J11L62o82L2J372k49n11K43o27K1O62J25m74l28p93q5L52l38R99
5997A02l38N09j273P87K41K23P25q54o16O93m54K74N30k28J092j397r2M48L34
6016G06j243J32J026k85m68lP42k90l63O60n05m90l39M27N82n9J93n35K60K90
6036D38q08L14N4L25N21n53n54l84R04J1n26r78Q38P22J88n43l75M67k30m02Q59
$$ plain form
5895 97 -716 -430 -67 -34 121 26 549 -136 326 -79 -135 -448 344 169 263 365 -338 -558 -341 199 -373 766
5917 766 123 297 3 -538 118 351 -101 25 447 545 72 -281 -297 472 -270 -718 -237 883 -716 -398
5937 -398 -291 -587 170 -378 762 113 687 439 -300 -52 -679 862 315 438 -202 260 192 -672 830
5956 830 5 374 -175 66 -429 -219 74 76 -339 274 -390 768 -246 16 497 279 -683 -620 -921 -215
5976 -215 105 -90 21 383 -299 -267 1105 856 345 588 -39 -18 644 769 295 -33 -826 -911 -559 -897 102
5997 102 -236 273 -1000 -213 28 251 976 122 -494 199 -255 19 549 321 1413 16 -76 372 706
6016 706 -537 -405 621 336 -132 -135 607 317 -46 614 109 -381 -720 -293 289 230 423 -112 148 438
6036 438 -370 -56 -2 323 844 291 -263 -647 257 268 -258 -1236 -398 324 512 -31 -406 61 -169 -571 288
6057B88n20J39M31n67M04p17Q36J6M8m72L22j73j43N93l0q46J21r4q00J652n4
6078D34K0O14p12L08o58k00P63o75M32l71j45O98p12O83r21J36n9N39M61q56k74
6099d95P63p95K59N22L16k42o80O93n22O3N31m81J040p69r38M57J51M3K8M11l95
6120d0N91r16M61m73K66P60n4j77q55Q34l55l78J250j079j03J11j41J80N9J72
6140A13M34r46K31L02p02J4J130j026Q96q2p38M44p28K57K86m52K13M84M40j020
6160d50O22M63j634J726o40m49M02k8k07L48J1l46J89M50q61K27P22j393J414
6179E66l78l05l52R59q57N01J18P4n40J63j74L72J071j522O87q49K31L06j66J43
6199D8O08j015m70J408k20o35M10p02M63J5j02J96o52J195m12k34o17L70O19o16
$$ plain form
6057 288 -232 -93 338 -229 175 -542 294 310 358 -114 208 35 -108 485 455 -391 -270 -364 -1164 488 434
6078 434 454 1068 356 664 6 -194 569 -106 326 -45 -190 508 -204 479 -442 -306 -365 174 635 -221 -495
6099 -495 268 -527 -268 254 570 328 -352 341 -181 -118 413 -68 972 203 -735 -278 -127 -84 -56 355 -40
6120 -40 551 -365 96 -377 -111 649 595 418 -437 397 42 -336 914 -165 -268 -157 -298 -118 -59 113
6140 113 547 -399 -168 134 -568 -554 576 -450 446 364 -374 70 -658 -401 -115 -567 -354 130 570 -450
6160 -450 172 635 -999 727 87 -362 40 12 -195 153 164 -182 7 457 -404 -177 545 -848 566
6179 566 188 -117 -469 490 -367 134 252 326 -214 -51 -225 147 1218 -304 383 -466 -235 71 -95 48
6199 48 656 -359 -829 579 359 -276 134 -568 -105 -90 -192 4 -648 547 135 -99 -716 -346 273 -343
6219c43O73k05M38m1k85l00n6O22m65N17o89J13n07K66K55L47q69M86o98O76M28
6240C63p9j27q9k49N3j17N02k93l76R54l80l00J63q32J050l51N21r02P48J38o59
6261b62J79m57J10M05N86q22O4M69l26j48K87m5M7p74J087n78L19o34Q38k47n10
6282d12K67r8L56K5R1j618J312N04k27l07M55m0L56r02k39j77P48k85m29L30L79
6303H9O8K66j26p75L61PN99l4K4o19M07K81m69M82j440O85O01q45O01m17L18k73
6325b09l60R45p30K32O85r51J011j394O93N15o81J32O23m16m46j62N40m49l3l2
6345d87J141o21P86n42k43K41k36l83j05R3O84q7n40K67J3M68k77m80j47N64q36
6366g27K70M00o36J368o14L7L12J9p92L33N18n09J49o73O93m61J100j38M08j361
$$ plain form
6219 -343 330 125 563 522 237 -63 -119 503 38 555 -134 -21 -528 -262 -7 340 -529 -43 -741 -65 363
6240 363 284 157 68 -181 -128 -245 257 -36 -412 542 162 -138 25 -807 243 -108 413 -489 259 397 -262
6261 -262 -83 -540 -430 -25 561 -261 -197 272 -54 -202 85 40 87 -687 400 -178 141 -493 345 98 -412
6282 -412 -145 -243 113 138 229 -1389 -77 427 200 -107 348 308 664 -238 -477 -654 94 -191 -620 -290 89
6303 89 157 423 297 -478 -117 -110 489 455 479 -140 267 548 79 561 -879 -194 407 -438 163 -254 64 -209
6325 -209 -569 376 -354 -122 563 -388 623 -771 -78 437 -244 -112 511 95 -351 -513 27 -422 -455 -487
6345 -487 654 33 819 277 34 275 39 -344 -449 -356 328 241 -299 -32 -19 449 172 -308 -455 109 -727
6366 -727 -457 -57 -693 675 61 98 410 429 -363 -30 488 -21 128 -545 148 -313 787 649 1057 -304
6386c04N70k54O09m56L16j221P20J70j7n74J041j37r02k92R66j00r82P90L22N24
6406G89q47L77n36N54j145J477p14R11j574J115q11P0j32R7J048k67j20l36l3
6425g7p6l89N03o16K68R47j055Q70j269J593q57O02n31k86R00n10l38k32R95M36
6445H78j355Q73N14r83O64n27k22J56l36j67O55J67J20j128J326j026M39M24M09
6464H81j029k58l99P28O21q36P99M91j281Q94p90l03L41N95m43K65l94m42O46
6483H6m16O75j8N7r33M99m2j0q8J60m36K81P19j299R83q63O0O36n65P62l88K23
6505H3J42m5M46n07l11M15J45n30K01l77Q92r44K39K77L00J03p20R48j104j86
6525e33R9j21J412j226j55J011p16O26r09J299o91n3j52j26j16P86k96L08N5k96
$$ plain form
6386 -304 266 12 621 165 481 -740 -20 150 133 -441 600 463 -439 -731 235 135 -847 -57 265 789
6406 789 -58 319 -217 337 -808 669 -45 866 -708 407 -404 -334 -466 -369 679 412 292 -44 -77
6425 -77 -153 -542 -39 -655 -387 560 -495 375 -894 699 -158 444 -87 -373 527 17 -321 -553 442 878
6445 878 -477 396 910 -73 591 64 -158 -2 -338 -505 150 317 437 -691 635 -391 48 472 881
6464 881 -148 -406 -805 -77 544 -292 507 998 -283 611 -179 -482 -141 454 11 276 -118 -560 86
6483 86 -330 345 327 384 -549 -50 -92 -102 -190 -30 -466 -185 534 -765 218 -645 -585 51 -514 248 -140 83
6505 83 225 180 626 119 -192 223 368 -162 39 -338 554 -390 -151 126 426 529 -191 757 -347 -533
6525 -533 -434 -555 857 -369 -524 487 -229 397 -512 787 96 43 -109 -235 -351 435 139 447 502 206
6545B06l79m40K42K00J43N50j002L44L9m0n23P39M06j92n06N1lj89P25j23k79
6566c1M35o39k51L58L86O1n4M0n79L29k70M48j018N50P31n62J55J67l71l41M97
6587D1n98N6K6M98m7M67q02J258o84q86r14K006k49m88K77l93R94j168Q15M85
6607F94k44n92L84p4P00o74M22j072J336q22L1J35q13O99j151K73P54o61J89J112
6627F26m8p34m18n8J445j14p75m37J042J31j504K9J381l70j45j13p56N12J158
6646H52K48q01J58n14j46j078J903n73O84q68L64k02L29n70K63N90m94N53n99
6665I9J5K49N57j274N36j34K13n82J78j36L60J12j20K7k32Q68p84l89M26K28n68
6686c51K47j70O93q81J310j178P10j036N80P86r78M08J24L12J02m08j80j24n78
$$ plain form
6545 206 -173 -613 -371 -171 -28 522 -480 -136 -97 -137 -660 79 485 293 -213 -162 -165 -354 371 248 -31
6566 -31 404 -235 -486 -128 258 319 265 305 -274 55 -215 233 -785 -235 496 -66 89 256 -115 -456 41
6587 41 -557 -501 -475 23 -24 443 -359 899 215 -671 -1585 421 172 -316 -39 -432 562 -606 209 694
6607 694 450 -142 242 168 868 194 616 -456 880 58 89 224 -589 110 -1041 -768 -14 -675 -486 626
6627 626 578 -156 -574 -632 813 699 -76 -513 529 660 -844 -815 566 196 51 -62 -818 -306 852
6646 852 1100 299 457 -57 -203 -1281 622 49 733 -135 229 27 356 -214 49 639 145 698 99
6665 99 114 363 920 -354 182 48 261 -321 -143 -279 81 193 73 100 -132 736 -48 -437 -11 217 -351
6686 -351 -104 -274 419 -462 848 -330 380 -656 -76 710 -268 140 264 576 678 270 90 -34 -612
6705f12K55K28j2l22J029o53J18k6J46m54K55N80r55n21O24K68J32L89P8k50K2
6726C19j167Q05k64L20R0l49Q94o94L58r68o7P97J34O1m84L33j001J762j099Q84
6746F64j01m15l26M74l60M01K95j36p23K25m48P93k16l12P25l79L59r99R37o78
6766b20j68Q77Q7r48O52k60Q51r62M85n09K02l15K93J68l72O81k13P33j195M69
6786C36n85n86J180n27k37M95J80n93k54N70l4p21M86J78l45L97N01K62q03j75
6806b75L39P9K74m42p6P22p13k94N30j40j03l0K86q42P65K61k49K60J91k88k74
6827a9nJ67m39L70O48p13p60K24J562m08j590J179l32n13N93o19J038q94O11k27
6847a27J10Q73o36l98K04K78n82J006j003p5J86M36q5l75J1M08o70Q90r42M69
$$ plain form
6705 -612 -357 -129 -141 -463 566 -87 31 5 151 -303 -48 532 -423 -944 -320 -52 80 469 547 297 319
6726 319 -848 -43 -307 13 103 -246 648 -46 312 -656 -723 74 208 269 -215 118 -883 879 -220 664
6746 664 563 148 -178 296 -64 337 632 496 -227 -2 -450 343 127 -185 540 161 520 -479 458 -220
6766 -220 -388 489 576 -372 280 20 871 -91 394 -115 87 -228 65 233 -139 542 329 1062 -133 336
6786 336 -249 -835 345 -182 -419 76 256 -337 -591 -21 -55 -776 -290 -112 -457 -60 441 703 -100 -275
6806 -275 64 143 417 -25 -101 621 -92 -386 144 4 -99 -129 157 -685 80 341 92 352 543 255 -19
6827 -19 -24 143 -296 74 722 9 -751 -527 1035 627 -963 216 -116 -629 -36 -655 383 -511 100 -127
6847 -127 -17 856 220 -178 26 304 -278 728 -275 -350 -164 272 187 -188 -177 231 -439 451 -491 -22
6867b2k20M01n0j069J116p29J2J002n04j18l2m60J80j32M1J82P61m1n12j89L99
6888A6R37j367J84J011l98L25j486J215J05N1j77n79J58J34Q4j85M69j96p57L20
6908a36j40K79j2k26L42l44K16j15K57j22O4q05L98O75l98J87k50O04j123J288
6928F39k25n27j71j83Q77n73j21P18k40j142J395K88k35q70k15L20K87j19L89
6947B92k35l85R87l49P1j15l72Kj71J016p75M79o45L25p42k49P04j39M94n65Q66
6968D94l79K23N28j049j95M55q6l88L88j93P65n05l35m1P46j246J048M28O94j523
6988a71m01j1L31K84p55O64l65Q7j80K17M67n60P23j005Q35J02k82j65M28q60
7008f17K7Q6P54k01n8k31Q65l20J01J04o27J52j44J61k80j24L30L56n35J55l92
$$ plain form
6867 -22 -242 159 109 -960 156 -573 -561 441 -63 -181 -213 -673 -493 -625 -584 -402 359 318 -194 -383 16
6888 16 953 -414 -230 781 383 708 -778 437 542 593 416 -163 -5 129 213 28 497 301 -456 -136
6908 -136 -276 3 -9 -235 107 -237 -21 -136 121 -1 63 -742 -344 331 -67 120 -130 474 -649 639
6928 639 414 -113 -284 -467 410 -163 -284 434 194 -948 447 735 500 -370 -585 -265 22 -97 292
6947 292 57 -328 659 310 381 266 -106 -104 -275 741 -34 445 -200 125 -617 -866 -162 -301 193 -372 494
6968 494 115 338 866 -183 -378 77 -9 -397 -9 -202 563 58 -277 -318 428 -818 230 658 1352 -171
6988 -171 -572 -583 -252 32 -723 -59 -424 -337 -517 -300 167 -393 330 -675 160 262 -20 -185 243 -617
7008 -617 -590 -504 250 49 -9 -240 625 305 406 510 -117 35 -109 52 -228 -352 -22 334 -201 -46 -438
7029d38P50j064J003QM09j164J324j551J208o27K53l62L03J89m06J88j36N14p56
7048c55Q5M35o21L84Q09j091R61p22N67r60O05l52m30Q9N70m25P17l96j94Q49
7068E25q85M17r54J810m71j198Q78Q6p70m17J244P93j211j12k01j0J95k19p2R96
7088D24o96Q36m54o29J9P60O16m01q20J092j174M55O06j21r6p88P50o16p3K86
7108b4j61M93m16m59Q86k5N48r42O94j111J82j34L53M46n21%l05p72P46m15J142
7129B05p61Q66o97Q63r24l06L31M31M99p73J13N42k46n30l35Q36k93P35o1n29
7149c4l90M07k70L33K78l63P31j810J554o38K17P09p30r80P60K93j69o15N76M51
7169C10m1o68j41Q05r62P41l33k47k19R44o16K18J399j401O40o72Q14l33o43N25
$$ plain form
7029 -438 312 -752 251 259 668 -496 828 -723 485 -142 111 -251 52 241 -165 23 -113 401 -355
7048 -355 -270 165 -456 -72 737 -354 607 -115 452 -508 97 -255 -685 -596 -26 -451 266 -130 -324 525
7068 525 -360 57 -897 913 442 -756 122 208 -562 -979 265 1058 -153 -265 -466 -476 -281 -500 -572 424
7088 424 -272 564 110 -519 -500 260 876 475 -345 747 -427 28 634 513 417 -371 379 -237 -310 -24
7108 -24 -185 308 -108 -567 319 294 842 -100 594 -517 -335 -469 -116 330 -191 -191 -496 -1268 -522 -937 205
7129 205 -556 310 -387 476 -448 -754 -423 8 507 -266 -153 389 143 -387 -722 114 -179 556 495 -34
7149 -34 -424 -17 -287 46 324 -39 692 -1118 436 -202 15 724 -6 -986 -226 67 -102 -717 -141 310
7169 310 269 -399 -540 265 -697 44 -289 -536 -755 189 -427 -209 1190 -211 429 -243 571 238 -405 120
7189A20l55R65o04m13j2J88K51L98k90l69Q6j26J48o3k91n68L89n03J462l66O24
7210F71j228j55O09J28j167J037r1P43j297J090m37Q4J61m45Q8L6l45O9k46K51
7230d44P49L9l94p02O87N82l68M65K32j212m87Q23l25L30J32l67M72K50q1j211
7250h30J337j236M60J65O14k63l07N59m79M42P2m11o83J275q94K47k10n1k94l44
7270h31N01O10p01j85L83n89J570j81m43m84m09P24j81N25r05O50N3Oj32j15N84
7291D50l59K26m29l14N59L83o97M88r93N23K73M06m12J229j063m08n44m0R26K81
7311D85j75m27O63p88M13n78O09p7q4N19j037Q88o73k53M43n55P77K2q44P59j312
7332a225J321q04Q04o9r11M58K85L94L64m08m54O01o37J210q12r0J55j05n28N02
$$ plain form
7189 120 -235 730 126 -287 -299 -111 140 538 248 -121 -35 -161 -13 -76 -367 -935 -546 -1049 413 47 671
7210 671 -557 -712 -103 25 -1142 -105 -196 547 -750 340 -97 -13 148 -297 -209 -173 -518 -449 -695 -444
7230 -444 305 344 -50 -752 -65 517 149 614 846 -366 -853 -30 -355 -25 107 -260 212 462 381 -830
7250 -830 507 -729 -269 -104 510 247 -60 499 20 462 534 123 -560 715 -179 68 -142 -193 -487 -831
7270 -831 -330 280 -421 -606 -223 -812 758 577 134 -350 -759 -35 -216 309 -596 54 107 113 -19 -134 450
7291 450 91 317 -112 -426 133 516 -181 307 -686 -163 110 516 104 1333 270 -138 -682 -722 204 485
7311 485 310 -117 546 -242 171 -407 202 125 41 560 -477 411 -262 -515 -72 -627 150 172 -672 87 -1225
7332 -1225 96 -708 96 27 -884 -426 -141 253 617 209 -245 356 -281 929 117 27 182 77 -451 51
7352E1l6q32Q85o86P53p99N19J029n90j03j048K72J020r79Q27p70O44k71L23M77
7372F86L43j623M02n13N5N66J06l47L32m75K72K6k07K68K73O49o45j49j54J69
7392C4M22k56Q08j052j8k10O85q08R0k08l7K02J084j145P95j144N06K73P7P05
7412H03j321Q40k95M47l47l41j99N97K30l08L48k42K3N13j293O56L6L99J37k3
7432F60j223Q29j72n92o70J123l33k65N09K67L30o50N4J32N07j311Q81r46P30
7451a40O23n74R04j343l71O80p61N86O93M92j045P68q57l30O69l6N20q23N38q50
7471f57M13M36O37j01j524P67J66k82k59M45p57J052K31Nj126R46l36L55q64L77
7491g6j6J378j113n87J096k31m78j029J483L15j25o47L13K26k67K73j143Q7J474
$$ plain form
7352 51 15 -817 68 -618 135 -664 -145 884 294 191 -857 -585 435 -544 283 -487 157 -114 209 686
7372 686 1029 -594 -192 -705 -650 -84 22 -325 7 -468 -196 -170 -377 -109 164 813 168 19 -135 34
7392 34 456 200 1008 -44 -62 -272 413 -395 -305 -513 -550 -348 736 -409 386 -758 -252 21 98 803
7412 803 -518 322 27 474 127 -214 -413 184 414 106 454 212 235 748 -545 111 147 546 683 660
7432 660 -563 266 94 -498 -1168 -45 -378 -643 -134 133 463 -187 -133 -1 506 -805 76 -870 -140
7451 -140 483 -91 813 -530 -901 -221 -982 -396 297 789 -256 512 -345 -675 -6 -42 478 -345 193 -657
7471 -657 -244 192 829 728 -796 -29 137 -145 -404 41 -716 336 567 572 -554 392 56 411 -453 -76
7491 -76 -92 1286 173 -414 682 451 -27 -1056 427 742 617 -30 283 509 242 515 -628 -541 933
7510I33n38j108J191r60l17O48P22l30j185P65J53N72l17j95P6M80m05j293J263
7529A55o49M38n73M68Q11o02l13k76N29j058Q56M43n71M24j15n09N29L95j70l26
7549a14o24J16P67j288Q12L95m7p16N24K46l68M26n88K02K06j78L21J189p58m76
7569D7L45n62p8J047j244pJ255q39m38K58k08L17j09P45j231N38j10N49J10j061
7589f76L25N68p55K73j12L37m3R92j065J116r26k94J218j158Q16l51K29o91j12
7608c09p07O77L5k17j3Q9R32J99k19J80n1j242J7P52p15J26O19J70j052J172p45
7629c02n87Q77N69m53m82J60k47K00L92m51l3j06L47L11J02L76q12M51r52P29
7649H9n59K2R66j472L59K63J018r72K50l4m30N11M23m90k87M63k61K50m50P50
$$ plain form
7510 933 395 -713 478 -482 -799 -151 571 241 -944 -179 -26 546 229 34 110 590 185 -1108 155
7529 155 -494 -56 -629 -161 650 48 -265 -541 -12 -1070 -214 229 -342 82 -33 -542 -13 382 212 -114
7549 -114 -738 -622 145 -1143 -331 64 17 -699 -175 71 -297 129 -459 -257 -51 -229 92 1281 523 47
7569 47 392 -170 -248 799 -445 -452 803 -36 -474 -216 -424 -107 -216 529 -702 -164 -274 275 385 -676
7589 -676 -351 217 -538 -265 -377 -40 -83 909 -156 960 34 -260 958 -200 616 265 494 -197 -309
7608 -309 -1016 -339 -304 -521 -534 -445 487 686 467 647 596 -646 -629 123 -592 -466 153 323 -729 443 -302
7629 -302 -889 -12 557 104 -378 -218 -465 -265 127 -324 -357 -463 -116 195 297 673 -139 312 -640 89
7649 89 -470 -448 518 -954 -595 -332 686 -286 -36 -70 -500 11 434 -56 -343 120 -141 109 -341 409
7669D09r31R24k063J206K19N89q9n02M95k67K3l12Q17j331N48L64J36j53m42M74
7689A14Q04j041j30J93M88q68j15K42P98m62L79p98q3n16J73J471n58j22K36j206
7709a001O6P61N52L6k84N10o03K71K15j3m39j01N73l01q07L19l33N38k94k99R99
7730C65q38J143n27l36j01L56M56p52R04p86R29j562Q38K05Q2K31M75j132J37
7749H7M3Kl12J14M65m10j32m24J89Q19o11o53Q85K90m82o82R87j25L91l90p74
7770g23J427l29p18l47J382j036k4P75n17j5p03J075j108P21J01P46j245L72O6
7789a00R8J67o15P95n32m9K9O83j07j149O25R14m04m01j32p2O84j608J050N82
7809D58q06j3M84j51L04L16j213Q36jl2l58J58R93j132j26k52J51J38l99K22Q6
$$ plain form
7669 409 -522 402 -1661 -455 -236 353 264 -238 257 -10 13 -299 518 -813 -265 99 235 82 -360 114
7689 114 918 -123 -253 -60 428 -440 -555 -313 485 23 402 -396 -479 -995 -822 649 91 -31 205 -1001
7709 -1001 -935 -174 378 414 130 640 37 308 523 510 71 -30 543 242 -565 -246 -579 -41 -335 -634 365
7730 365 -473 670 143 -193 -294 62 518 -234 670 -116 813 -749 89 294 376 607 1082 -50 87
7749 87 130 132 -180 -66 399 -11 -143 -567 -378 441 -170 -823 62 352 -130 -812 175 50 441 51 -723
7770 -723 704 375 -343 -690 692 -344 -368 407 -110 -125 -828 247 -861 -140 -39 707 -538 -166 -100
7789 -100 -2 165 -450 345 -187 -236 -207 476 369 -780 -155 759 355 -46 -178 -250 434 -1174 -124 458
7809 458 -348 -361 123 -28 276 592 -621 215 214 182 -176 -18 975 -157 -283 -535 -384 -246 -645 -423 -337
7830c37OO31K61n40M20j52p50O25L18k27K15q60P97k98M1N51j086M15k86l45K91
7851c10J26K56o01O38p6Q45r92M53r7K61m79p52Q49L64K29j336N49R19J87r51
7871H2J039j287P42k96q00p63J573K19p18O20o69N1N98n04N66k66q7l8n37j27
7891f02L51M83O31j351o5L81M95j308J529m10j2l66J058j180L70k87L43j17j161
7910a218J38R90K81p3L52n38O0R32q74k13K1M65K0j439P55J168p7l85m76K26j00
7931A5n50J049q7N50o82j56K40j06O14m15m49P03j125M73J42j366J734j724J345
7950B05M75n14J59j98N37p57O08q59Q7L75O85j076N97o1q24l91J040K42N50j009
7970a29l81N73K13m39j27K4L82O21o95k16o03P63K85N58j554L94n7Q10l22q4K81
$$ plain form
7830 -337 -331 300 561 21 441 289 -461 164 482 255 470 -390 407 109 150 701 -385 30 -256 -601 -310
7851 -310 -184 72 -529 109 33 878 -114 339 242 503 24 -728 121 485 714 -622 -73 846 1033 82
7871 82 1121 -166 576 280 -520 -1283 290 509 -209 411 -258 -207 391 -113 453 187 100 62 -475 -602
7891 -602 -251 232 863 -488 -553 -172 323 -985 544 134 122 -244 814 -366 4 -283 60 -57 -1218
7910 -1218 -1080 -90 191 118 470 -68 -8 924 50 -163 -142 323 343 -1096 -341 827 750 365 -111 115 15
7931 15 -535 514 427 977 295 139 379 273 887 472 23 726 -399 74 216 -1150 584 -1140 205
7950 205 680 166 325 127 664 -93 515 -344 -257 118 803 -273 324 263 -561 -952 88 330 880 -129
7970 -129 -510 63 276 -163 -290 -266 116 737 42 -174 -777 -14 271 829 -725 -331 -388 422 100 16 297
7991B97j68l37J74n76M10O30L3p30k9K25p27N86N58p02l48M25P8K85J101p90k04
8012A91m53J65O04p96J457j36j194L46o96P95L1o79N97M90q19q14J150k82L92
8031C49j087J101o14P70m81m19Q0M57m74L49K33k55Q57j474O51o02O95n29J022
8050F29j145LO1L68L23j039R77Jm65O61l35M60L05L22q52K40j014k97L67R50j261
8071g41J52R11k39l76N15M73j355O26Q60o76m39J143m18J77p77L30K84n37N32
8090D45k02n15O08m15j94Q59q16k31L9j78J473j517M53l13M30J90o07J60N37k47
8110d1J6M3K75n77L9L44O18q96k14J417j228j1M00p83K24J393j839J208q35k35
8130f82M56M63k9M39K63j395M57j55j93M65RL48j030N74J72Q20j457O85o14L57
$$ plain form
7991 297 129 -208 -34 -610 -200 430 463 -267 -296 -71 -798 -212 346 -356 -704 -279 -201 84 1185 395 191
8012 191 -262 -97 507 -289 1168 1032 -162 184 -512 283 314 -365 232 722 -97 -911 239 -43 349
8031 349 -738 363 -251 519 38 -381 -301 156 -318 31 264 9 866 -608 43 -559 136 -393 629
8050 629 -516 -513 -452 -84 239 -800 177 178 -287 374 39 499 804 1126 274 514 -500 -797 -430 520 -741
8071 -741 -589 322 83 -293 222 695 -660 -34 826 150 -289 854 436 613 -164 166 450 -87 445
8090 445 243 -272 336 -79 -273 586 -230 -461 -422 -600 873 -644 -191 -504 -74 116 -491 -331 206 -41
8110 -41 -25 18 293 -284 -245 99 717 -179 -393 1024 -204 -215 185 -598 -374 1019 -820 388 -447 -682
8130 -682 -226 237 208 647 910 -485 -28 -183 -376 89 98 446 -584 -10 162 982 -475 210 -404 -47
8150d7J9L71k40j118J162l26j01j56Q7R64q49N03O01o90M40q2p52m8Q78m15N52
8171G53q96o36O41P63n92l0j30P20N0r46Q53l90j81n8O73q02L30o46P58P7
$$ plain form
8150 -47 -28 343 103 -1015 147 -179 -280 -436 -349 615 -234 269 870 180 620 538 -214 -262 616 201 753
8171 753 -143 -779 -138 625 33 3 -127 593 643 -303 550 160 -21 -79 594 -208 122 -524 234 311
8191C11
$$ Imaginary data points
##PAGE= N=2
##DATA TABLE= (X++(I..I)), XYDATA
0@%%%%%%%%%%%%%%%%%%P2j44J44j44J44j44K10k82K88l14L86m35N02n74O48p46
34c89Q26r41J071j199J340j494J663j856K058k285K538k796L086l416L760m142
50b176M568n027N542o112O744p450Q247r162J0222j1445J2897j4653J6804j9548
64a0549K3167k8187L5684m8277P4712k35916N27278O34832j77731n57205q45011
75f07203k37205M45826O52286L99700m2335o22295n53290M3195M70303M74735
85D23717J93903m18147o60072k74032K67796O23568O39140K8255o56333p56476
95e88681l31849K92438P90970O46126r938n42970o70760l70869K72928O60233
105A47628M31787o3605m51146n08499p6605M24081M80140J70801k72005n90834
$$ plain form
0 0 0 0 0 0 0 0 0 0 0 0 0 0 0 0 0 0 0 0 72 -72 72 -72 72 -72 138 -144 144 -170 216 -219 283 -291 357 -389
34 -389 437 -504 567 -632 708 -786 877 -979 1079 -1206 1332 -1464 1622 -1794 1966 -2176
50 -2176 2392 -2635 2907 -3205 3539 -3911 4336 -4826 5396 -6049 6848 -7805 8999 -10549
64 -10549 12618 -15569 20115 -28162 46550 -189366 337912 972744 795013 237808 -607203
75 -607203 -844408 -398582 253704 653404 611069 -11226 -564516 -521321 -51018 423717
85 423717 617620 199473 -460599 -734631 -466835 156733 795873 824128 167795 -588681
95 -588681 -920530 -628092 162878 809004 799066 256096 -414664 -785533 -512605 147628
105 147628 579415 515810 64664 -443835 -520440 -96359 383781 554582 282577 -308257
115c08257l95792J91217N94638N68525J29013m93261p36266l77468K02203O25897
125D49O41918J45375m53386o29375l56087J47364N46281M53666j6258l85575m31046
136c36674j48041L06743M85676K10967k26456n06104m10997P9727N38075N52512
146E45428J71881l44628o47966m49816J00559N36408N85361K14663l30180n82354
156b00644l63358Q5821M32981M32568O8905l28023m10083j56003K32580M45619
166B40363K59839j69989m61702l94672p230M25997N40550K29930k56818n63213
176a56945m62573j304M52100N45889K44119k20560m97644l77598K2727L65051
186h6738L97956J11652k58485l89111j78667J84752L92051K71370r7618m08697
$$ plain form
115 -308257 -704049 -512832 81806 650331 779344 286083 -450183 -827651 -625448 449
125 449 642367 787742 334356 -295019 -651106 -503742 42539 496205 479947 94372 -336674
136 -336674 -484715 -177972 307704 518671 292215 -213889 -624886 -545159 -7084 545428
146 545428 717309 372681 -275285 -725101 -624542 -88134 497227 711890 381710 -200644
156 -200644 -564002 -478181 -45200 387368 456273 128250 -281833 -437836 -205256 240363
166 240363 500202 330213 -131489 -526161 -533391 -107394 433156 663086 406268 -156945
176 -156945 -619518 -620822 -168722 377167 621286 400726 -96918 -474516 -451789 -86738
186 -86738 311218 422870 164385 -224726 -403393 -218641 173410 444780 347162 -61535
196f1535l96578o3237L44031N08602K81105j71462m97888m53607p5749L52659
206b33659N06503K76549j43520m27139l73237l6385L03387L71184J35620j99271
216A80032l53169j95264J33091L56668K82419l9493l51299l94794j17698K70100
226b29407M64322L04524q9673m26452m41925j29753K71381M55467K97601p4328
236D01757l66362l55125p2530K44258L44186J56323j57298l21303k09232Q2632
246b52694L19733K90364O177k99696l80183j59860K03253M24170L23862k4142
256D50984l53953m23599j74793J99315M07055L03082j8148l07262l39633j04810
266c61762J91695L12221J71759j10968k91908k17343M8199K82992K91075N0213
$$ plain form
196 -61535 -458113 -521350 -177319 331283 612388 440926 -56962 -510569 -586318 -233659
206 -233659 272844 549393 405873 -21266 -394503 -430888 -127501 243683 379303 180032
216 180032 -173137 -368401 -235310 121358 403777 364284 12985 -381809 -499507 -229407
226 -229407 234915 539439 449766 23314 -418611 -548364 -276983 178484 476085 401757
236 401757 35395 -319730 -392260 -148002 196184 352507 195209 -126094 -335326 -252694
246 -252694 67039 357403 363580 63884 -316299 -476159 -272906 151264 475126 450984
256 450984 97031 -326568 -501361 -302046 105009 408091 389943 82681 -256952 -361762
266 -361762 -170067 142154 313913 202945 -88963 -306306 -258107 24885 315960 366173
276C66173k51665l64040j91451J40997L76749L32856L1838k94058l97409k05467
286d55477J32764L60981L04393K5775k51495l16376j28534J49387K88323J80316
296B90057p5233k64448k28405J0749K49163K86350Q6248j99739l43739k18369
306d07366Q5475L31077L33658Q2040k34294l66745k24099P9232L11660K98389
316B89027N9490k06269k95695j47271J11092K61668J87089m4741k37535k28136
326b51281j8877K17290K80506J18276j55307l19503k36721L7167K88716L25020
336B85286J16893j80353l38052k38714L1583K67350K87962Q9464j65030k71283
346a14894j55892P9841K38031J90550j8616k12570k26591m7663J81980K72184
$$ plain form
276 366173 114508 -249532 -440983 -299986 76763 409619 441457 147399 -250010 -455477
286 -455477 -322713 38268 342661 368436 116941 -199435 -327969 -178582 109741 290057
296 290057 214824 -49624 -278029 -267280 -18117 268233 354481 154742 -188997 -407366
306 -407366 -321891 9186 342844 424884 190590 -176155 -400254 -321022 -9362 289027
316 289027 348517 142248 -153447 -300718 -189626 72042 259131 214390 -23145 -251281
326 -251281 -270158 -52868 227638 345914 190607 -128896 -365617 -328450 -39734 285286
336 285286 402179 221826 -116226 -354940 -323357 -56007 231955 321419 156389 -114894
346 -114894 -270786 -190945 47086 237636 219020 6450 -220141 -267804 -85824 186360
356A86360J40191j14609k91109k46872n386K44278L12062J44737j29511l01571
366f1430k43429m007K27916K71912J08187j31520k51437j62365N3735K14028J90925
377B12515N338j88285k23766p2269J51759K60299J61180p6066k61820k48550m0487
388c20152K01403K93805J63540q8487k68307k43528l4761J90295K55577J20357
398B69742r9572k27138j64155K9573J93771J89704K6043j64839k19095r0345J23514
409a32797K42800J72269m2656k33945k46200p1492J63916K73866J77270n2576
419B50455k36654k34962n6051J57722K37339J29107p2862k06711j67237R391J73884
430a6579J87232M3124j41715k12265j07029R4343K25960J81603j0876k01660k39959
$$ plain form
356 186360 326551 211942 -79167 -326039 -331425 -87147 224915 369652 240141 -61430
366 -61430 -304859 -308866 -80950 190962 299149 167629 -83808 -246173 -192438 21590 212515
377 212515 217853 29568 -194198 -266467 -114708 145591 306771 230705 -31115 -279665 -320152
388 -320152 -118749 175056 338596 250109 -18198 -261726 -296487 -106192 149385 269742
398 269742 170170 -56968 -221123 -191550 2221 191925 217968 53129 -165966 -256311 -132797
409 -132797 110003 282272 239616 5671 -240529 -312021 -148105 125761 303031 250455
419 250455 13801 -221161 -277212 -119490 117849 246956 174094 -32617 -199854 -190463 -16579
430 -16579 170653 213777 72062 -140203 -247232 -152889 73071 254674 243798 42138 -197821
441a97821r4088J28174K51497J83517k3678k05489k25824p3707J26711K18944
451H8236J35004n1962j87480j63946o438J54693J84464N9182j20815k03732j19187
462b31981O5790K08851J86998J3623j73470k31323j13400R5705K29397J85657
472B35847L699j75561k15375q7819J01800K02558J38705l1946j69906j63502k2497
483a83997J36857J79910P3245j00904j93390j31751M1712J89232J89699L8558
493B39171j45294k19192j25954O7333K05144J85859K5369j50794k04574r9423
503b22355Q0459J84823J41239j5487j53723j61684l5790J19468J76715Q6265p8179
514A21751j83130j41122J8675J67867J89074N8996j18094k07738j35862L9535
$$ plain form
441 -197821 -291909 -163735 87762 271279 247601 42112 -183712 -257419 -130708 88236
451 88236 223240 171278 -16202 -180148 -186586 -31893 152571 211753 90938 -112794 -231981
462 -231981 -166191 42660 229658 243281 69811 -161512 -274912 -179207 50190 235847
472 235847 239546 63985 -151390 -239209 -137409 65149 203854 171908 2002 -161500 -183997
483 -183997 -47140 132770 206015 105111 -88279 -220030 -178318 10914 200613 239171
493 239171 93877 -125315 -251269 -183936 21208 207067 232436 81642 -122932 -222355
503 -222355 -141896 42927 184166 168679 14956 -146728 -182518 -63050 113665 199930 121751
514 121751 -61379 -202501 -183826 -15959 173115 232111 114017 -93721 -229583 -190048
524a90048J83852J83623M3796j27545j91178j05806N8530J71152J43185r38j37923
535C0700j60542m9543J03218J70431R6545n8827j71008j47988k454J49223J84815
546A44570P7267r2544j92987j42897J6675J62578J79956N8922j05191j80834j13678
557a88163M0487J55615J44449J4717j24770j58279o3167Q8156J64651J08722l8855
568A43563j57602j51140k3394J26868J80569R2476p0766j78053j47572l695J41369
579d7377J73598P1720q5470j68801j17476K4260J43915J43066K8431j08177j54800
590i7111p4426O8450J57110J16922j9841j43008j54763m1087J07639J72826J03916
601A96627m7722j61899j50330k1622J22603J66875Q2421o5957j57737j21909Q515
$$ plain form
524 -190048 -6196 177427 221223 93678 -97500 -203306 -144776 26376 169561 168623 30700
535 30700 -129842 -179385 -76167 94264 190809 131982 -39026 -187014 -189468 -40245 144570
546 144570 221837 129293 -63694 -206591 -189916 -27338 152618 211540 106349 -74485 -188163
557 -188163 -147676 7939 152388 167105 42335 -115944 -179111 -90955 73696 182418 143563
568 143563 -14039 -165179 -188573 -61705 118864 211340 140574 -37479 -185051 -188746 -47377
579 -47377 126221 197941 112471 -56330 -173806 -149546 -5631 137435 165866 57689 -97111
590 -97111 -171537 -103087 54023 170945 151104 8096 -146667 -187754 -80115 92711 196627
601 196627 148905 -12994 -163324 -184946 -62343 104532 186953 120996 -36741 -158650 -150135
612a50135J29589J43396M0152r4844j50870q4497N1991J49169J23846r63j28144
623B8690j53619n7323Q6655J64802J12054k6870j47962j47907l8859J04275J58618
634H2554R0358m7584j46013j25876m549J16886J42035N3888p9722j45987r3580
645a57590L4704J37671J29484J5273j12015j52452p1333O7247J53740J18515q046
656A55198j30089j47465n1982Q6328J53663R7243l2431j34096j28243j7840J02184
667d7530J40913O4324o4212j41884j01724J9651J26160J32178L0989r5772j46973
678h3880q3595M9113J43310J23986P524j15019j44624o2178O8607J43237J03269
$$ plain form
612 -150135 -20546 122850 163002 68158 -82712 -167209 -115218 33951 157797 156834 28690
623 28690 -124929 -182252 -95597 69205 181259 154389 6427 -141480 -180339 -76064 82554
634 82554 172912 125328 -20685 -146561 -151110 -34224 107811 161699 81977 -64010 -157590
645 -157590 -122886 14785 144269 159542 47527 -104925 -176258 -109011 44729 163244 155198
656 155198 25109 -122356 -174338 -88010 65653 162896 130465 -3631 -131874 -149714 -47530
667 -47530 93383 157707 93495 -48389 -150113 -130462 -4302 127876 158865 63093 -83880
678 -83880 -167475 -118362 24948 148934 156458 41439 -103185 -165363 -96756 46481 149750
$$ [...]
8191c3
##END NTUPLES=NMR FID
##END=
