##TITLE=1H_UK-21-1
 DMSO,72 sc, 
 29.9.2021
##JCAMPDX= 6.0         $$ Bruker NMR JCAMP-DX V2.0
##DATA TYPE= NMR FID
##DATA CLASS= NTUPLES
##ORIGIN= UXNMR, Bruker Analytische Messtechnik GmbH
##OWNER= root
$$ XWIN-NMR		Version 3.5
$$ Wed Sep 29 11:33:17 2021 Russian Standard Time (UT+4h)  she@DPX200
##.OBSERVE FREQUENCY= 200.13
##.OBSERVE NUCLEUS= ^1H
##.DELAY= (6, 6)
##.ACQUISITION MODE= SIMULTANEOUS
##.ACQUISITION SCHEME= undefined
##.AVERAGES= 72
##.DIGITISER RES= 18
##SPECTROMETER/DATA SYSTEM= spect
##.PULSE SEQUENCE= zg30
##.SOLVENT NAME= CDCl3
##.SHIFT REFERENCE= (INTERNAL, CDCl3, 0, 15.7039)
##AUDIT TRAIL= $$ (NUMBER, WHEN, WHO, WHERE, WHAT)
$$ ##TITLE= Audit trail, XWIN-NMR		Version 3.5
$$ ##JCAMPDX= 5.01
$$ ##ORIGIN= Bruker BioSpin GmbH
$$ ##OWNER= she
$$ F:/spectra/data/she/nmr/H-F/1/audita.txt
$$ ##AUDIT TRAIL=  $$ (NUMBER, WHEN, WHO, WHERE, WHAT)
(   1,<2021-09-29 11:31:24.48 +0400>,<she>,<DPX200>,
      <continue with go, POWCHK disabled, PULCHK disabled
       configuration hash MD5:
       00 E9 B6 7A A2 85 ED C7 34 08 36 98 17 FE 4E 26
       data hash MD5: 16K
       7F 3E F1 D8 D0 9D D7 77 35 8F B6 16 33 1E D5 C5>)
$$ ##END=
$$ 
$$ hash MD5
$$ D5 22 E7 D1 D4 AF 31 74 A4 4D 1A 1E 56 79 53 4A
##$RELAX= 
##$RELAX= 
##$RELAX= 
##$RELAX= 
##$RELAX= 
##$RELAX= 
$$ Bruker specific parameters
$$ --------------------------
##$DU= <F:/spectra>
##$EXPNO= 1
##$NAME= <H-F>
##$PROCNO= 1
##$TYPE= <nmr>
##$USER= <she>
##$AMP= (0..31)
100 100 100 100 100 100 100 100 100 100 100 100 100 100 100 100 100 100 
100 100 100 100 100 100 100 100 100 100 100 100 100 100 
##$AQSEQ= 0
##$AQ_mod= 1
##$AUNM= <au_zg>
##$AUTOPOS= <>
##$BF1= 200.13
##$BF2= 200.13
##$BF3= 200.13
##$BF4= 200.13
##$BF5= 200.13
##$BF6= 200.13
##$BF7= 200.13
##$BF8= 200.13
##$BYTORDA= 1
##$CFDGTYP= 0
##$CFRGTYP= 5
##$CHEMSTR= <none>
##$CNST= (0..31)
1 1 145 1 1 1 1 1 1 1 1 1 1 1 1 1 1 1 1 1 1 1 1 1 1 1 1 1 1 1 1 1 
##$CPDPRG= <>
##$CPDPRG1= <>
##$CPDPRG2= <>
##$CPDPRG3= <>
##$CPDPRG4= <mlev>
##$CPDPRG5= <mlev>
##$CPDPRG6= <mlev>
##$CPDPRG7= <mlev>
##$CPDPRG8= <mlev>
##$CPDPRGB= <>
##$CPDPRGT= <>
##$D= (0..31)
0 1.2 0 0 0 0 0 0 0 0.06 0 0.03 0 0 0 0 0.0002 0 0 0 0 0 0 0 0 0 0 0 0 
0 0 0 
##$DATE= 1632900417
##$DBL= (0..7)
120 120 120 120 120 120 120 120 
##$DBP= (0..7)
150 150 150 150 150 150 150 150 
##$DBP07= 0
##$DBPNAM0= <>
##$DBPNAM1= <>
##$DBPNAM2= <>
##$DBPNAM3= <>
##$DBPNAM4= <>
##$DBPNAM5= <>
##$DBPNAM6= <>
##$DBPNAM7= <>
##$DBPOAL= (0..7)
0.5 0.5 0.5 0.5 0.5 0.5 0.5 0.5 
##$DBPOFFS= (0..7)
0 0 0 0 0 0 0 0 
##$DE= 6
##$DECBNUC= <off>
##$DECIM= 32
##$DECNUC= <off>
##$DECSTAT= 4
##$DIGMOD= 1
##$DIGTYP= 9
##$DL= (0..7)
0 120 120 120 120 120 120 120 
##$DP= (0..7)
150 150 150 150 150 150 150 150 
##$DP07= 0
##$DPNAME0= <>
##$DPNAME1= <>
##$DPNAME2= <>
##$DPNAME3= <>
##$DPNAME4= <>
##$DPNAME5= <>
##$DPNAME6= <>
##$DPNAME7= <>
##$DPOAL= (0..7)
0.5 0.5 0.5 0.5 0.5 0.5 0.5 0.5 
##$DPOFFS= (0..7)
0 0 0 0 0 0 0 0 
##$DQDMODE= 0
##$DR= 18
##$DS= 0
##$DSLIST= <SSSSSSSSSSSSSSS>
$$ [...]
##$SUBNAM2= <"">
##$SUBNAM3= <"">
##$SUBNAM4= <"">
##$SUBNAM5= <"">
##$SUBNAM6= <"">
##$SUBNAM7= <"">
##$SUBNAM8= <"">
##$SUBNAM9= <"">
##$SW= 22.9630152165798
##$SWIBOX= (0..15)
0 0 2 0 0 0 0 0 0 0 0 0 0 0 0 0 
##$SW_h= 4595.58823529412
##$TD= 16384
##$TD0= 1
##$TE= 0
##$TE2= 300
##$TE3= 300
##$TEG= 300
##$TL= (0..7)
0 120 120 120 120 120 120 120 
##$TP= (0..7)
150 150 150 150 150 150 150 150 
##$TP07= 0
##$TPNAME0= <>
##$TPNAME1= <>
##$TPNAME2= <>
##$TPNAME3= <>
##$TPNAME4= <>
##$TPNAME5= <>
##$TPNAME6= <>
##$TPNAME7= <>
##$TPOAL= (0..7)
0.5 0.5 0.5 0.5 0.5 0.5 0.5 0.5 
##$TPOFFS= (0..7)
0 0 0 0 0 0 0 0 
##$TUNHIN= 0
##$TUNHOUT= 0
##$TUNXOUT= 0
##$USERA1= <user>
##$USERA2= <user>
##$USERA3= <user>
##$USERA4= <user>
##$USERA5= <user>
##$V9= 5
##$VALIST= <valist>
##$VCLIST= <CCCCCCCCCCCCCCC>
##$VD= 0
##$VDLIST= <DDDDDDDDDDDDDDD>
##$VPLIST= <PPPPPPPPPPPPPPP>
##$VTLIST= <TTTTTTTTTTTTTTT>
##$WBST= 1024
##$WBSW= 4
##$XGAIN= (0..3)
0 0 0 0 
##$XL= 0
##$YL= 0
##$YMAX_a= 1143294
##$YMIN_a= -925580
##$ZGOPTNS= <>
##$ZL1= 120
##$ZL2= 120
##$ZL3= 120
##$ZL4= 120
##$ABSF1= 10
##$ABSF2= 0
##$ABSG= 5
##$ABSL= 3
##$ALPHA= 0
##$AQORDER= 0
##$ASSFAC= 0
##$ASSFACI= 0
##$ASSFACX= 0
##$ASSWID= 0
##$AUNMP= <proc_1d>
##$AZFE= 0.1
##$AZFW= 0.1
##$BCFW= 1
##$BC_mod= 2
##$BYTORDP= 1
##$COROFFS= 0
##$CY= 11.3945322036743
##$DATMOD= 1
##$DC= 2
##$DFILT= <>
##$DTYPP= 0
##$F1P= 2.36226072786647
##$F2P= -0.459571619588291
##$FCOR= 0.5
##$FTSIZE= 0
##$FT_mod= 4
##$GAMMA= 1
##$GB= 0.15
##$INTBC= 1
##$INTSCL= 1
##$ISEN= 128
##$LB= 0.24
##$LEV0= 0
##$LPBIN= 0
##$MAXI= 10000
##$MC2= 0
##$MEAN= 0
##$ME_mod= 0
##$MI= 1.114404
##$NCOEF= 0
##$NC_proc= 0
##$NLEV= 6
##$NOISF1= 3.799351
##$NOISF2= 2.8
##$NSP= 1
##$NTH_PI= 0
##$NZP= 0
##$OFFSET= 15.70392
##$PC= 1
##$PHC0= -14075.37
##$PHC1= 6.600885
##$PH_mod= 1
##$PKNL= yes
##$PPARMOD= 0
##$PSCAL= 0
##$PSIGN= 0
##$REVERSE= no
##$SF= 200.130013532006
##$SI= 16384
##$SIGF1= 3
##$SIGF2= 2
##$SINO= 400
##$SIOLD= 16384
##$SREGLST= <1H.CDCl3>
##$SSB= 0
##$STSI= 0
##$STSR= 0
##$SW_p= 3612.71676300578
##$SYMM= 0
##$S_DEV= 0
##$TDeff= 0
##$TDoff= 0
##$TI= <>
##$TILT= no
##$TM1= 0
##$TM2= 0
##$TOPLEV= 0
##$USERP1= <user>
##$USERP2= <user>
##$USERP3= <user>
##$USERP4= <user>
##$USERP5= <user>
##$WDW= 1
##$XDIM= 8192
##$YMAX_p= 0
##$YMIN_p= 0
$$ End of Bruker specific parameters
$$ ---------------------------------
##NTUPLES= NMR FID
##VAR_NAME=  TIME,          FID/REAL,        FID/IMAG
##SYMBOL=    X,             R,               I
##VAR_TYPE=  INDEPENDENT,   DEPENDENT,       DEPENDENT
##VAR_FORM=  AFFN,          ASDF,            ASDF
##VAR_DIM=   8192,          8192,            8192
##UNITS=     SECONDS,       ARBITRARY UNITS, ARBITRARY UNITS
##FACTOR=    0.0002176,     1,               1
##FIRST=     0,             0,               0
##LAST=      1.7823616,     0,               0
##MIN=       0,             -925580,         0
##MAX=       1.7823616,     1143294,         0
$$ Real data points
##PAGE= N=1
##DATA TABLE= (X++(R..R)), XYDATA
$$ [...]
2695d983k211P47L954N211L503Q45l116m031m487k897M39M872M435M043J775k949
$$ -4983 -7194 -6447 -2493 2718 6221 7066 3950 -81 -4568 -7465 -7026 -2154 2281 6324 8099 5150
2711E150m799m838k835J069L476M341M865O0j773l570n105j938l93L229L649M792
$$ 5150 351 -4487 -7322 -6253 -2777 1564 6429 6489 4716 1146 -3959 -5897 -6290 -3061 588 5380
2727E380J085q55l961n474k187r4K839M160L864J568m3l843m955l077l19K241
$$ 5380 6465 5610 1649 -3825 -6012 -6106 -3267 893 4757 6325 6282 2439 -2516 -5593 -5912 -3671
2743c671M629M255J187q43l504m026l687j434K401N085L212K334o08l160m148
$$ -3671 958 5213 6400 5557 2053 -1973 -5660 -7094 -4693 392 3604 5938 5330 2170 -1978
2758a978l064r44J691L493M399K937j278k310m026l156j546K084L350L842K703
$$ -1978 -5042 -5986 -4295 -802 3597 6534 5256 2946 -1080 -4236 -5782 -3698 -348 3494 6197
2773F197j274k610l646l356q04J173L756K427K932L35j509m120k909j689K13L196
$$ 6197 4923 2313 -1333 -4689 -5493 -4320 -564 1863 4795 5130 3621 -499 -3408 -5097 -4884 -1688
2789a688L836K903O22j967l978m050j292J542K415L911J880R16q93l581l455k459
$$ -1688 2148 5051 5673 3706 -272 -4322 -5614 -4072 -1657 2254 4134 5050 4157 576 -2879 -5338
2805e338O36K541L367K153K592l058j617l852k646N43L053K790K615J904k120
$$ -5338 -4702 -2161 1206 3359 5951 2893 1276 -2576 -5222 -4679 -1626 1164 3779 5683 3563
2820C563k416m194j080n61L176K638L151L21q71k692l105j726m93J275L649L212
$$ 3563 1147 -3047 -4127 -4688 -1512 1126 4277 4598 3727 1035 -2070 -3796 -4289 -3014 635 3847
2836C847N40j123r83m026k213K04J175L272K022K635j816k506j992k329n61J296
$$ 3847 4387 3264 2281 -1745 -3958 -3754 -2579 693 2715 5350 3534 1028 -964 -3293 -3854 -2558
2852b558K136L437J521n04k243k807j683j075Q41J825L882J419n35j580k338k192
$$ -2558 -422 3015 4536 4032 1789 -1018 -2701 -3776 -2935 -1110 2772 4191 3656 2076 -262 -2454
2868b454J08o76K521K343J950o64j309k315j992j096N24K085L538M73O16k009
$$ -2454 -2346 -3022 -501 1842 3792 3128 1819 -496 -2488 -3584 -3060 -975 2563 3036 3652 1643
2884A643k575j717p20r0K953L004N09N65o81k434l427l92o1J837K986J200M83
$$ 1643 -932 -2649 -3369 -3459 -506 2498 3007 3572 2891 457 -2970 -3362 -3423 -1586 1400 2600 3083
2901C083j034j759k972K42q73J659K590K264L3j452k012j751q14L6J395K112K194
$$ 3083 2049 290 -2682 -2440 -3313 -1654 936 3200 3233 1781 -231 -1982 -2796 -2760 -1365 747 2941
2918B941m36J37j811j813k652K83J801J728J984J093o54p75k573k240Q56J27K092
$$ 2941 2505 2642 831 -982 -3634 -3351 -1550 178 2162 3255 2601 1826 -747 -2987 -2131 -2004 88
2935H8J373J262Q5k628j954q86n56J166K756N94J296k99j688j150j227j346J382
$$ 88 1461 2723 2808 180 -1774 -2660 -3216 -2050 706 1300 2596 2297 609 -541 -1768 -3114 -1732
2952a732J526J548O13N71j293k206r94k81M35K653K83R57K66j539j134j617j84
$$ -1732 -206 1342 1955 2526 1233 -973 -1967 -2248 -1813 840 1123 2080 2346 807 -327 -1944 -2128
2969b128K9J715J658M64J07j37j303j926n84L2J965O88J305P04j151k448r52J507
$$ -2128 -2099 -384 1274 1738 1845 1708 405 -1521 -2105 -2073 -108 580 1885 2589 1438 -1010 -1962 -455
2987d55j630J798O32J709O2j225j234p20k73l95Q83J556j1O28l55p22j453N40
$$ -455 -2085 -287 345 2054 2116 891 -343 -1063 -1336 -1731 -848 708 697 1325 970 248 -1205 -665
3005f65k23K49O94L71K228j844j399j024K56J81j83J096P12K51K13n51j197K27
$$ -665 -888 -639 55 426 2654 810 -589 -1613 -1357 -1176 -1359 -263 449 700 913 362 -835 -608
3023f08r34O89P00J376J87N9j176n75K18j873J250M71J672n7q70L87j046q70l32
$$ -608 -1542 -853 -153 1223 1410 1469 293 -282 -64 -1937 -687 -216 1456 1399 529 916 -130 -1000 -1332
3042a332M6R58J183N31r56k26o45L77j465l5J708J003l7N2j68q71j358o52O31
$$ -1332 -1286 -328 855 1386 430 204 -441 -64 -1529 -1564 144 1147 1110 1162 994 123 -1235 -1887 -1256
3061a256N78J660k88K63o56o26q06j20j34J519R03l90N24q10m79m08p29m01J476
$$ -1256 -678 982 694 957 301 -325 -1131 -1251 -1385 134 1037 647 1171 361 -118 -526 -1255 -1656 -180
3080a80m37K150m94k34k46m31j560N40J031M14N14m08o26Q86j461p21P49J057
$$ -180 -617 1533 1039 805 559 128 -1432 -892 139 553 1067 659 33 919 -542 -1263 -514 543
3098E43j023J127J29M30j517j86j680J062J151l80J468m56N01q37j117J72N45
$$ 543 -480 647 776 1206 -311 -497 -2177 -1115 36 -344 1124 668 1169 332 -785 -613 -68
3115f8p4K18K68L80M5J57j10j072L8r45J325K08Q68p92p20j77m92Q44m73M39Q53
$$ -68 -142 76 344 724 769 926 816 -256 -218 -1163 162 370 1238 446 -274 -451 -943 -99 -572 -133 720
3136G20P43j268j96j21o75l99O73R41k36R69m86m56l20J117j548J05M13j64m98
$$ 720 1463 195 -1 -122 -797 -1196 -523 418 182 1151 665 209 -111 1006 -542 -437 -24 -188 -686
3155f86J537J06j38n46o72p2o29J473J45j51o13K7o76r3l3J246O43n69K96L77
$$ -686 851 957 819 273 -399 -471 -1100 373 518 367 -246 -219 -895 -988 -1021 225 868 299 595 972
3175I72l88j311K14m0N6L83R5L25r92J428j022K71M76k64K20O32j067M81p16q1
$$ 972 584 -727 -513 -553 -497 -114 -19 306 -686 742 -280 -9 467 203 423 1055 -12 469 -247 -328
3195c28l92P4J152o43l82R26m28k62m06Q5N94q12R81j32k27Q3J085j835K4K51
$$ -328 -720 -646 506 -137 -519 407 -21 -283 -689 -604 -10 -822 159 27 -200 -117 968 -867 -843 -592
3215e92k1R08l87P01l80n7k75m01k16j13J206o1j90n2N6Q2L76j108l7J71R1K66
$$ -592 -613 295 -92 609 229 172 -103 -504 -720 -833 373 312 122 70 126 208 584 -524 -561 -390 -299 -33
3237c3J380q83n07L35k30p46P88j53R00m15p39O8K4N09r63R12n00L34N80j350
$$ -33 1347 464 -43 292 62 -684 104 -49 851 436 -303 -235 -211 298 -665 247 -253 81 661 -689
3257f89O92q86L69P7n72J690o29M2M99p14O52j586J58O81L74l52K65L73q5L54
$$ -689 3 -883 -514 -437 -1009 681 52 94 593 -121 531 -1055 -897 -216 158 -194 71 444 359 713
3277G13r29j02P06q89R44Q51r06K67J48j624K81P18P77j88n77K57n45q45P76k18
$$ 713 -216 -318 388 -501 443 1294 388 655 803 -821 -540 178 955 767 190 447 -98 -943 -167 -385
3297c85P65k71N99r56P43o33o33O2M87L66j3j6o2M03r22j41M60Q23o18N31q31
$$ -385 380 109 708 -248 495 -138 -771 -709 -222 144 131 115 53 456 -466 -607 -147 676 58 589 -242
3318b42N0n54R65k78J076j021o8K14o84P33J5N57m17L17p58q7j30M62R80j470
$$ -242 -192 -746 219 -59 1017 -4 -72 142 -542 191 206 763 346 663 -95 -182 -312 150 1130 -340
3338c40K97n31j7O74l80P83l83O81o71K84l72k78p1O00K36P2M02o81j101M06L87
$$ -340 -43 -574 -591 83 -297 486 103 784 113 397 25 -253 -324 276 512 584 986 305 -796 -390 -3
3359co20Q54o44N2K22J1J18M8P65k150J441P08m15k91M84j083M80M61l79R83j456
$$ -3 -623 231 -413 -361 -139 -128 -10 38 803 -1347 94 802 387 96 580 -503 -23 438 59 1042 -414
3380d14R24j012O07r90J62Q54L53m15J11L63k90L32r9o88L29o64N51q7o1P19k
$$ -414 510 -502 105 -885 -723 131 484 69 180 543 253 585 486 -202 127 -537 14 -73 -134 585 583
3401E83K31j14j889J434K37j049J412p69L6K82p25j91M40n49P82K05p70M53j38
$$ 583 814 700 -1189 245 482 -567 845 76 112 394 -331 -522 -82 -631 151 356 -414 39 -99
3420i9O28n97r7l90P08J14p99N80n9P38m24j3K90r87M62L47q10O53Kj1j34k2j201
$$ -99 529 -68 -165 -555 153 267 -532 48 -11 727 303 290 580 -407 55 402 -408 245 247 236 102 80 -1121
3443a121J013O15L72r79m46Q14l34P43j626J441n52J14k14L34j051L63Q04J39
$$ -1121 -108 507 879 -100 -546 268 -66 677 -949 492 -60 54 -160 174 -877 -514 290 429
3461D29l33p7j54k26K81J62J67q70O18K10R0m21j1K09l88k75J94J219j259R04
$$ 429 96 19 -135 -361 -80 82 249 -621 -3 207 297 -124 -135 74 -314 -589 -395 824 -435 469
3481D69q41Q40k23q25Q74p27O51m21l3Q87r42P02L09r28k03R8M93M01qj229R19
$$ 469 -372 468 245 -580 294 -433 218 -203 -236 651 -291 411 720 -208 -411 -313 180 581 573 -656 263
3502B63j94o79O55L02OL5j222J845L02j698m1J575j398N09q1l18k68Q65O40j086
$$ 263 69 -610 45 347 353 388 -834 1011 1313 -385 -426 1149 -249 260 179 -139 -407 458 1098 12
3522A2K37n79J142o74O2M38l34k67l80j27m35Q84K79l30K21N1K6o3l09P18q23
$$ 12 249 -330 812 138 200 638 304 37 -343 -470 -905 -21 258 -72 149 200 226 163 -146 572 -251
3543b51m21R17J30J37o14l6K06j513K109l74q83p2M95O05j416K98R43r51Q31p3
$$ -251 -672 245 375 512 -102 -138 68 -1445 664 290 -593 -665 -170 435 -981 -683 260 -691 140 67
3563F7mN84K00j0j196K99J79K98J69j425J152j70j38N55j491J046o30J213q45
$$ 67 63 647 847 837 -359 -60 119 417 586 -839 313 143 5 560 -931 115 -515 698 -147
3582a47L60J57j67J91l22M88n9L86m42j83N00o38K7L68j207J141R7k28O1j007
$$ -147 213 370 203 394 72 560 501 887 445 262 762 124 151 519 -688 453 550 322 383 -624
3602f24J057m92M70q31K91L05L06q03Q3Q48j124M36k42O82n24q86J816q50k3l07
$$ -624 433 -59 411 -420 -129 176 482 -321 -238 610 -514 -78 -320 362 -162 -1048 768 -82 -105 -412
3622d12N20l34K12p07J291j120Q25k22p58K40l69O83M26k62k79R72L06o8j246
$$ -412 108 -226 -14 -721 570 -550 275 53 -705 -465 -834 -151 275 13 -266 706 1012 944 -302
3641c02K93M94J76p72n04P92o76M51L29p76l02J95N07P8k62J67J90K43j32o70
$$ -302 -9 485 661 -111 -615 177 -499 -48 281 -495 -797 -602 -95 -17 -279 -112 78 321 189 -481
3661d81P74j20K53N1n97M89p13o5L31o48j46R52k12k62Q24p57N20m17L6J661k133
$$ -481 293 173 426 477 -120 369 -344 -409 -78 -726 -872 80 -132 -394 430 -327 193 -224 -188 1473 -660
3682f60M17J260j036j11m6M60j260R78n04O03k63l75k92Q52o79P32m63J490j268
$$ -660 -243 1017 -19 -130 -176 284 -976 2 -502 101 -162 -537 -829 23 -656 76 -387 1103 -165
3701a65L97K33k65P0j187O32j35M43l22J010j35n58N84o05k45K60K83r29R45R34
$$ -165 232 465 200 270 -917 -285 -420 23 -299 711 576 18 602 -3 -248 12 295 -634 311 1245
3721A245j636k76J021o59n5M73P6J16p7j42m48M11l31J283j091L50k67kJ241j163
$$ 1245 -391 -667 354 -305 -360 113 189 305 228 86 -362 49 -282 1001 -90 260 -7 -9 1232 69
3741F9O72p14k53N2o02N16j28J82r6N6M24J03n25J57L56p0R8p76J13N06l25J191
$$ 69 741 27 -226 -174 -776 -260 -388 -206 -302 -246 178 281 -244 -87 269 199 297 -479 -366 140 -185 1006
3763A006l68q50M32L11p76j00L32L97M26k87j374j52J167o82P29N1o80n41J685
$$ 1006 638 -212 220 531 -245 -345 -13 384 810 523 -851 -1003 164 -518 211 262 -418 -959 726
3782G26j765J003p13J71J589j406R80K5n29q9Q1q8m1j69j05J59M4J27K52L5L26
$$ 726 -1039 -36 -749 -578 1011 -395 585 610 81 -8 73 -15 -56 -225 -330 -171 -127 0 252 287 613
3803F13n33N73J69o02l79J038m41n54M29o93j8J026j035K49J015k44M3nl96p32
$$ 613 80 653 822 220 -159 879 438 -116 313 -380 -398 628 -407 -158 857 613 656 651 255 -477
3823d77J055o28R02p20n89K71q88Q80J55m69J9J573j693J076k88j69N88o83k1
$$ -477 578 -50 852 132 -457 -186 -1074 -194 -39 -508 -489 1084 -609 467 179 10 598 -85 -106
3842a06l73P96o71l06P77K63n15n03J66j77P99j13J12M55n21J84N97j229O20m61
$$ -106 -479 317 -354 -660 117 380 -135 -638 -472 -649 150 37 149 604 83 267 864 -365 255 -206
3862b06j21J06L6L91o38J127j284N50m27O96p47M25k07J23K50K75K37r47M30Q37
$$ -206 -327 -221 -185 206 -432 695 -589 -39 -466 230 -517 -92 -299 -176 74 349 586 -361 69 906
3882I06j467O44J47m64p14P23M28m97O15J01p32N24l3j06L63q84R34p72P31o07
$$ 906 -561 83 230 -234 -948 -225 203 -294 321 422 -310 214 181 75 438 -446 488 -284 447 -160
3902a60o6r88M64J525J74j061O88k51o78P12k64L90m21P11k14o05j78J12J012
$$ -160 -226 -1214 -750 775 949 -112 576 325 -353 359 95 485 64 775 561 -44 -222 -110 902
3921I02j030j60N32Q2r3k24l64Q07j019J24j26Q15J07L28p21O9P5L6o43Q63j24
$$ 902 -128 -288 244 326 233 9 -355 452 -567 -443 -569 246 353 681 -40 29 104 140 -503 360 236
3942B36P05r74K83K33K62j45J24j158N39J76n46P8L13j93J88M83j369J119l84
$$ 236 941 -33 250 483 745 600 724 -434 105 281 -265 -187 126 -67 121 604 -765 354 -30
3961c0K7L15q70k15Q89o2K38m94O16q5M91k66n39n89LJ105L72n69q19l25K87P43
$$ -30 -3 312 -558 -773 116 54 292 -202 414 329 820 554 15 -574 -571 534 906 337 -482 -807 -520 223
3983B23l3o87J29M19O6L86j91l10M62O8m74m73O04n8k83J17K02O42q35r1l30J29
$$ 223 190 -497 -368 51 117 503 312 2 464 532 58 -415 189 131 -152 -35 167 809 -26 -117 -447 -318
4005c18l36K7N98O40j062M44n23J316m49j231J127j95j72J304j625O51p54M81
$$ -318 -654 -627 -29 611 -451 -7 -530 786 337 -894 233 38 -134 1170 -455 196 -558 -77
4023g7l29q09J728p04L88l30L35p71K25K96N90m5L03q42j89J39N92Q0n44K00m28
$$ -77 -406 -1215 513 -191 197 -133 202 -569 -344 -48 542 497 800 -42 -231 -92 500 580 36 236 -192
4044a92L56K95Q6m62R6p0J57J00n61k55N23j43r2l11N27J64j074O05N7K70o51
$$ -192 164 459 545 83 179 109 266 366 -195 -450 73 -70 -162 -473 54 218 -856 -251 -194 76 -575
4065e75M50J084q76j01q85J298J46m09k69r0R08J04J46n44o93j67P89j296R84
$$ -575 -125 959 83 -18 -903 395 541 132 -137 -227 681 785 931 387 -306 -473 316 -980 4
4084Dk59K41R52j948K144j024m88L98M14q68J9K05O74k79q7O98o42K92l60k76
$$ 4 -255 -14 938 -1010 1134 110 -378 20 434 -434 -415 -210 464 185 98 796 154 446 86 -190
4104a90M50l58K28j014Q03J17P58m30J58q98J2P09n35K47m2j10l55R82n66L52
$$ -190 260 -98 130 -884 -81 36 794 364 522 -376 -364 345 -190 57 15 -95 -450 532 -34 318
4124C18j95J89J63k42l80L06m27P2K56q31P50l26O9O71M07j050N87j030J80j51
$$ 318 123 312 475 233 -147 159 -268 -196 60 -771 -21 -347 -278 393 800 -250 337 -693 -513 -664
4144f64K44R67j47j56m13K32L04M35j271O92o88L01M60o43k38Q48j105r6J132
$$ -664 -420 547 400 244 -169 63 367 802 -469 223 -465 -164 296 -347 -585 263 -842 -938 194
4163A94l83j56J44O33p37J54r43J307o80l0j95J40Q78l77j77J92J44j13L66K5
$$ 194 -189 -345 -201 432 -305 -151 -1094 213 -467 -497 -692 -552 326 -51 -228 -36 108 -5 361 386
4183C86J3p81O42l84J39K39j96r62P97nK29Q9r74J007o10J59K83o88m4M13M59
$$ 386 399 -382 260 -124 15 254 58 -904 -107 -112 117 206 -768 239 -371 -212 71 -617 -661 -248 211
4204B11R31j126j51n09q3M23M16O0m06J63L26Q3n8k56jm77P15l01k02j74R41n23
$$ 211 1142 16 -135 -644 -727 -304 112 172 -234 -71 255 338 280 24 23 -454 261 -40 -242 -416 525 2
4226BP29n82L58Pn53J97Q07j092J37l36M23L04l75M4j76n39N56J53n07N63m49
$$ 2 731 149 507 514 -39 158 965 -127 10 -326 97 401 26 70 -106 -645 -89 64 -443 120 -329
4247c29L58q5L21K0j52K32r79J82O46n47Q92n62O02M96j165L29j68L70p58L0R90
$$ -329 29 -56 265 285 133 365 -614 -432 214 -333 559 -3 599 1095 -70 259 91 461 -297 -267 723
4268G23j391Q72q1n75Q67o20j39L30J46ll70k35P36q22r8J043K79o84k43L88O8
$$ 723 -668 204 123 -452 415 -205 -344 -14 132 129 -241 -476 260 -562 -660 383 662 -22 -265 123 191
4289A91L87N27n47j95k34n90R75j85j29N8j51m51L67OM95k54o99N35J5O31r15
$$ 191 578 1105 558 363 129 -461 514 329 200 258 107 -344 23 29 524 270 -429 106 121 752 -163
4310a63M88l15Q23j141O71j361J413n50J97l03l0MM07l92k91J004k99k78j66J104
$$ -163 325 10 833 -308 363 -998 415 -135 62 -241 -271 -267 140 -252 -543 461 162 -116 -282 822
4330H22k80j071N94L89k83K77N19j074M26L13j194n0K78R72j409J285j066j09
$$ 822 542 -529 65 454 171 448 967 -107 319 632 -562 -612 -334 638 -771 514 -552 -661
4348f61J061n43q6K20q15R03l67N91Q96j627L83k25L46k86J137n68L79r16l7J
$$ -661 400 -143 -229 -9 -824 79 -288 303 1199 -428 -45 -270 76 -210 927 359 738 -178 -215 -214
4368b14r53J319j165J198p17N59j70M45p64K81L44q2N19n14n42J270r21K08l22
$$ -214 -1167 152 -1013 185 -532 27 -143 302 -462 -181 163 81 600 86 -456 814 -107 101 -221
4387b21N44l96K57M78o87N44r03M97L40n72O18j023N85QP01m67K96j287j49P75
$$ -221 323 -73 184 662 -25 519 -384 113 453 -119 499 -524 61 69 770 303 599 -688 -837 -62
4407f2k05N43M7r45M63J12K94m22K72M80o45R14o35M23Q7j628J024k08k53M2L16
$$ -62 -267 276 323 -622 -159 -47 247 -175 97 577 -68 846 211 634 721 -907 117 -91 -344 -302 14
4428A4N24j025N00l57k3N54n80P14K8J9n15P3p84J157q0j94N92r49K78n55R0M29
$$ 14 538 -487 13 -344 -367 187 -393 321 349 368 -147 -74 -858 299 219 25 617 -332 -54 -609 -519 -90
4450i0j18J25k09M02p42R53N91k042N98P37n12m51J127l01n41J154M3k98j528
$$ -90 -208 -83 -292 110 -632 321 912 -1130 -532 205 -307 -758 369 68 -473 681 724 426 -1102
4469a102J425M71l79K27j082N30j91M52q44J24J35J33M3M62k34m40N86j466J101
$$ -1102 323 794 415 642 -440 90 -101 351 -493 -369 -234 -101 -58 404 170 -270 316 -1150 -49
4488d9J45K6N96l55L37q25M8q03L07Q86k59K28q61O83q0R1j408R22J48M61K36
$$ -49 96 122 718 363 700 -125 -77 -880 -573 313 54 282 -579 104 24 115 -1293 -371 -223 238 474
4509D74M37j428O16o32P90J50q13n15Q41j5p3l06L24k25j77r1M70K33R7p49l13
$$ 474 911 -517 99 -533 257 407 -406 -921 -80 -95 -168 -474 -150 -375 -552 -643 -173 60 157 -592 -905
4530i05N71P15q75J2N71K61k18K86j26j88n59J25J83j74N04K51O16j824J198n69
$$ -905 -334 381 -494 -482 89 350 132 418 292 104 -455 -330 -147 -321 183 434 1050 -774 424 -145
4550a45n84M40o11J182K32N50o31l04k93Lo30J536n23M86o44k43M09n94K31K1
$$ -145 -729 -289 -900 282 514 1064 433 129 -164 -161 -791 745 222 708 64 -179 230 -364 -133 -112
4570a12n11R15k47n50P53p02P87j213R40l67M26R06j5j221m77N71p33P62j128
$$ -112 -623 292 45 -505 248 -454 333 -880 60 -307 119 1025 1010 -211 -688 -117 -850 -88 -1216
4589a216J435P07m46L0l53q66l96P60%M91J35J172j315j27P7M60j317O05k75J160
$$ -1216 219 926 480 510 157 -709 -1105 -345 -345 146 281 1453 138 11 88 548 -769 -164 -439 721
4609G21o21J50o74J19N57r03m11R96O62M29j624P90L16m41n58L72J27L57mr91
$$ 721 100 250 -424 -305 252 -651 -1062 -66 596 1025 -599 191 507 66 -492 -120 7 364 360 -631
4629f31J70J05N08q30N07K04l13K27k7K12p17j61J83P59m54R06O72j2j925N43
$$ -631 -461 -356 152 -678 -171 33 -280 -53 -80 132 -585 -746 -563 196 -258 648 1320 1308 -617 -74
4649g4L70P6j258P22N66o52J008l93j785J321l71n8O23O15l02Q7L25j9j416J248
$$ -74 296 372 -886 -164 402 -250 758 365 -1420 -99 -470 -528 95 710 408 495 820 801 -615 633
4669F33j657R32J21J28P79p68l91L65j183P73P68j306P49K87m6N41k77j592R05
$$ 633 -1024 -92 29 157 936 168 -223 142 -1041 -268 500 -806 -57 230 184 725 448 -1144 -239
4688b39m48n8J164K42m89K29J1p74n14N96K01P85M3p92J374q40o42q15K66N90
$$ -239 -687 -745 419 661 172 401 412 -362 -876 -280 -79 706 749 -43 1331 491 -151 -966 -700 -110
4708a10M01O42p78L67q55r62J523r49L92R80m73N65j63m34j151P90N66j535J284
$$ -110 291 933 155 522 -333 -1295 228 -721 -329 651 178 743 580 146 -1005 -215 351 -1184 100
4727A00N64j66K31n89j156j36R38N11K01k48j039R32j31p2r44Q50N71j86J76K70
$$ 100 664 498 729 140 -1016 -1152 -214 297 498 250 -789 143 12 -60 -1004 -154 417 231 407 677
4747F77j422M09M28n99l34N33J075m13J20M10j173L54j27p34M55R98J46k02n1
$$ 677 -745 -336 92 -507 -841 -308 767 354 474 884 -289 65 -62 -796 -341 657 803 601 550
4766E50R00j246r62l49J53J565J88K48Rq92m71J0j262J003N97J76J093j495J62
$$ 550 1450 204 -758 -1107 -954 611 799 1047 1056 164 -307 -297 -1559 -556 41 217 1310 -185 -23
4785b3l74m62K60Q76J47J23R67r30J06r11P0m24n93J614K84K11n51J60r95P33
$$ -23 -397 -859 -599 277 424 547 1514 584 690 -221 -151 -575 -1168 446 730 941 390 550 -445 288
4805B88q00j10O50J205o59l49N97l43o85m0j89O20j193J946Q67j414n9k248M82
$$ 288 -512 -622 28 1233 574 225 822 479 -206 -246 -435 185 -1008 938 1805 391 332 -1916 -1434
4824a434P47o92R87R24o37P89k24j243n7L73R34j51R12n37J37P8j935J241j858
$$ -1434 -687 -1379 -392 532 -105 684 460 -783 -840 -467 467 316 1228 691 828 906 -1029 212 -1646
4843a646J035M11N00KJ074p32j018l19J28J80L40M28J051j69j127q81o46l71K37
$$ -1646 -611 -200 300 302 1376 644 -374 -693 -565 -385 -45 383 1434 1265 138 -743 -1389 -1760 -1523
4862a523R45P86m90P87j95L78p14j470R74j76J290l98P85M9j327P2n57M83L83
$$ -1523 -578 208 -282 505 310 688 -26 -1496 -522 -698 592 194 979 1028 -299 -227 -784 -301 82
4881H2J34Q19n30n53m33m68N6J18O42N49O83M08n03j283l2k31j315J663L79M17
$$ 82 216 1035 505 -48 -481 -949 -893 -775 -133 416 1099 1507 1004 -279 -311 -542 -1857 -194 185 602
4901F02J021j264l73r75J1Q67l7Q46K60j009L51l95j500O31N66Q5J007k07J76
$$ 602 1623 359 -14 -989 -978 -111 -148 698 958 -51 300 -95 -1595 -964 -398 -313 694 487 663
4920F63P4q16J8n53m20P98N73J204j737J034o77j380J07L0K06R03O50NK9r46p55
$$ 663 737 -79 -61 -614 -1034 -236 337 1541 -196 838 161 -1219 -1112 -1082 -876 27 677 682 711 -235 -990
4941i90K0Q30j30K12L68P36l87q11m17K14n43Q70J429m96l94Q71j716L47j214
$$ -990 -970 -140 -270 -58 310 1046 659 -152 -569 -355 -898 -28 1401 905 511 1382 -334 13 -1201
4960a201J233k09O50K0K79M00m17j330r23J150o21N05O18n83Q04N51j212j76n48
$$ -1201 32 -177 473 493 772 1172 755 -575 -1498 -348 -969 -464 154 -429 375 926 -286 -462 -1010
4979a010M57P36J240j497R17o34%j067J16P16j406K243l42P02j507j15n17l08
$$ -1010 -553 183 1423 -74 843 209 209 -858 -742 -26 -1432 811 469 1171 -336 -451 -968 -1276
4997a276K68R60j00R15M88q63n29j082J459j257K71J029n63P04J61j034j35Q7
$$ -1276 -1008 -48 -148 767 1255 392 -137 -1219 240 -1017 -746 283 -280 424 585 -449 -584 -497
5015d97m46N46P87J72N46j128M52q5q69n28J429k50O78n33L35o20k46m18Q6K53
$$ -497 -943 -397 390 562 1108 -20 432 347 -522 -1050 379 129 807 274 609 -11 -257 -675 -589 -336
5035c36J056R0m15M1l67p36q1Q52q03P89P11K31j123M02q41Q5l11K70M37K06P69
$$ -336 720 810 395 436 69 -667 -748 104 -699 90 801 1032 -91 311 -530 -445 -756 -486 -49 157 926
5056I26j33r12l00l27K57m5R38O3Q26j55j675m62K78L71R97m51Q72j091L55o17
$$ 926 793 -119 -419 -746 -489 -534 404 467 1293 1138 -537 -999 -721 -350 647 196 1068 -23 332 -285
5076b85L72o58m43R42R3K88J4m06K5J78n13n73k23J260O52kq33N35l15j190K35
$$ -285 87 -571 -1014 -72 21 309 323 -83 -58 120 -393 -966 -1189 71 723 721 -112 423 108 -1082 -847
5097h47O06l66J38J69R52l95J05j168O86r43N26M69M57l61J63j77j344K15N16
$$ -847 -241 -607 -469 -300 652 257 362 -806 -120 -1063 -537 -68 389 28 191 14 -1330 -1115 -599
5116e99R3J907p11j36J31p50n71p04k03J363l14J148L10M7n32j063k1N5O05l01
$$ -599 -506 1401 690 554 685 -65 -636 -1340 -1543 -180 -494 654 964 1011 479 -584 -605 -550 55 -246
5136b46O33M38m67m72j74K78j020Q12O33m0J56M47k042Q24q84O54J62P22m29J548
$$ -246 387 825 358 -114 -288 -10 -1030 -218 415 375 531 978 -1064 -240 -1124 -470 -308 414 -15 1533
5156A533j145n2m48n12o71J145k42J098l62L22n29j279K50M64O86j113J031j60
$$ 1533 388 336 -112 -624 -1295 -150 -392 706 344 666 137 -1142 -892 -428 258 -855 176 16
5174A6M54j305K98K82K59L02l90J249m83m05o16O07n60n35M89j94N67q4L57l74
$$ 16 470 -835 -537 -255 4 306 -84 1165 682 277 -339 268 -292 -827 -338 -532 35 -49 308 -66
5194f6M47k84j083M29J089k47M8J7p15P53j39p69r23Q36N01J073j05m83L26j67
$$ -66 381 97 -986 -557 532 285 333 350 -365 388 249 -520 -1443 -607 -106 967 862 379 705 538
5214E38j849l7J032K21OK28j01L81m28r56J9P48j39R98K47r51j24K86J01j708
$$ 538 -1311 -1348 -316 -95 -89 139 38 419 -9 -965 -946 -198 -337 661 908 -43 -167 119 220 -1488
5234a488J505M03M40J90r44J7k36j92K06N1L58P16q43j87L79q92l16l64L28J81
$$ -1488 17 420 860 1050 106 123 -113 -305 -99 -48 310 1026 183 -4 375 -517 -833 -1197 -869 -688
5254f88O65k15M90o2q8o81M45J84l00R16o85R54q24j026M13q61Q31Q95J9n46K3
$$ -688 -23 -238 252 190 102 -579 -134 50 -250 666 -19 935 111 -915 -502 -1363 -532 363 382 -164 -141
5275a41Q11p85J28n95l28K232j008L51m8J94k30r32l50N89K18j53O80k17n11r2
$$ -141 670 -115 13 -582 -910 1322 314 665 617 811 581 -351 -701 -112 106 -47 633 416 -95 -187
5295a87Q97j014l7l00J230j141K93M59j147N65QK24J19L2P77j32m82J9p7j314
$$ -187 710 -304 -341 -641 589 -552 -259 200 -947 -382 -374 -150 -31 1 778 646 164 183 106 -1208
5315a208P15j13N78o5Q66m29L85r92n59O14J57N40j12J46j40o47n54M95k41L83
$$ -1208 -493 -606 -28 -93 773 344 729 -263 -822 -208 -51 489 377 523 383 -264 -818 -323 -564 -181
5335a81J110n56M93o4j349m04J558l97j31L11l66N38o84M41j168N99q30J42J226
$$ -181 929 373 866 802 -547 -951 607 210 79 390 24 562 -122 319 -849 -250 -1080 -938 288
5354B88J2R28p30m48M58j830O12N18K6N96q70P17l31K99j181K8P90k3M82O48q47
$$ 288 300 1228 498 50 508 -1322 -710 -192 -166 430 -440 277 -54 245 -936 -908 -118 -141 341 989 142
5375A42p36Q20M62j611J395p51M71L63r4m03l2L23j048O68J78M37j36J56j68q04
$$ 142 -594 226 688 -923 472 -279 192 555 461 58 26 349 -699 -31 147 584 448 604 436 -368
5395c68J19k46P34J84j3K06j29q48R09o83K17N53l89l82J54K18N80k13r96o5Q27
$$ -368 -249 -495 239 423 410 616 487 -361 548 -135 82 635 246 -136 18 236 816 603 -393 -458 369
5416C69k22k08J70j66K57M0p16j55j57R76j05N29q07J030r8l80p93k1K78k87J89
$$ 369 147 -61 109 -57 200 240 -476 -631 -788 188 83 612 -195 835 737 357 -436 -457 -179 -466 -277
5437b77L64q55P01j74L34m14L40R11J22j479J007P20j654k47P64M76J52p02k60
$$ -277 87 -768 -67 -241 93 -321 19 930 1052 -427 580 1300 -354 -601 163 639 791 89 -171
5456a71M22K97p54j416J999j14q81Q56O87k94l45k88P52r90m91J22R43l41L33
$$ -171 251 548 -206 -1622 377 263 -618 238 925 631 286 -2 750 -240 -731 -609 334 -7 326
5475C26j62j19l54N76m81P8Q78q58m55J056k19Q4m84j22N9M88j00M60J75o74j45
$$ 326 164 45 -309 267 -214 -136 742 -116 -571 485 266 350 -134 -256 -197 291 191 651 826 152 7
5496Gl64K34j50Q77j118K50L5M77J97j535P25P79j06k7k26j66M54J61j215O11
$$ 7 -357 -123 -273 604 -514 -264 -229 248 445 -1090 -365 414 308 281 55 -111 343 504 -711 -100
5516a00k40L00P7O65K15j020J355j335Q5K96j069J059j27j46j62L41p40O88O4
$$ -100 -340 -40 37 702 917 -103 1252 -83 2 298 -771 288 161 15 -147 194 -546 142 206
5535B06M3m59N52P4n37o9J74q71Q81O56j04m06J474j085n9m19LJ52r4M57o74O19
$$ 206 249 -210 342 416 -121 -190 -16 -887 -6 650 546 140 1614 529 470 51 54 206 112 569 -105 514
5557E14j20j91l96M83M9k64r62N22R5J80L38m75J08J113p75o13N15Ll74J69j0
$$ 514 394 203 -193 290 339 75 -887 -365 -270 -90 248 -227 -119 994 219 -394 121 124 -250 -81 -91
5578i1n3k07M73N9M42j65q42O71q12O64l03m76O47j66J85J39K77l15l60N42j44
$$ -91 -144 -351 122 181 623 458 -384 287 -525 139 -164 -640 7 -159 26 165 442 127 -233 309 165
5599A65K14J42j368Q67R9K16j57M16j391M32P13n50P34n44J93l92J008j275L74
$$ 165 379 521 -847 20 119 335 178 594 -797 -365 348 -202 532 -12 181 -211 797 -478 -104
5618a04k00j59k16N38o80K29J761k183J837q30K1L07k19n65N74P25j160P43j50
$$ -104 -304 -463 -679 -141 -821 -592 1169 -1014 823 -7 14 321 102 -463 111 836 -324 419 269
5637B69j64K32M71p41l24N50n16l5O09p69j52O67K64k83m02O33j29j60N93p03
$$ 269 105 337 808 67 -257 293 -223 -258 351 -418 -570 97 361 78 -324 309 180 20 613 -90
5657i0P77p12P42m27o02L24r90J603k69j37o1p02N89o49N10l3P81j178Q43m71
$$ -90 687 -25 717 290 -312 12 -978 625 356 219 158 -544 45 -604 -94 -127 654 -524 319 -152
5677a52L64l57P18m09l52K90m80l79N74K27N99m74l93Q96j130L95j1n01J29O94
$$ -152 212 -145 573 164 -188 102 -378 -757 -183 44 643 169 -224 672 -458 -63 -74 -575 -446 248
5697B48m50L55l77Q6J06O68p49Q59j036L87j51K90P5m51m55l4M58o3L22k85l91
$$ 248 -202 153 -224 -138 -32 636 -113 746 -290 97 -54 236 311 -140 -595 -629 -171 -234 88 -197 -588
5718e88m41N97l89R33m77J42O58j9j071J012k01J40L37j179R16j066Q63J64j079
$$ -588 -1029 -432 -821 112 -365 -223 435 416 -655 357 156 296 633 -546 370 -696 167 331 -748
5737g48N58K21O67j005L89q89J198q66J387p86l70R43m77j070P08M68p75P63k49
$$ -748 -190 31 698 -307 82 -807 391 -475 912 126 -244 699 222 -848 -140 328 -447 316 67
5756F7n0M90r50K22l36P55L28m91Jk3j46J90k34L81l24k31R13k48m20M0l26j14
$$ 67 17 507 -443 -221 -557 198 526 35 36 13 -133 57 -177 204 -120 -351 562 314 -106 -66 -392 -506
5778e06Q77p04k65P02k81O23r97L89m48P94R6q40J23j13Q16L43r86P93p98K57
$$ -506 371 -333 -598 104 -177 446 -551 -162 -610 184 280 -560 -437 -550 266 609 -377 416 -382 -125
5798a25P3K35n42P82j89o10q5R71j483L57R16L97j014n8J229j643N55n23K08O88
$$ -125 -52 183 -359 423 234 -376 -461 510 -973 -616 300 697 -317 -375 854 -789 -234 -757 -549 139
5818A39L85k87m04J096j328R98o29p40J744m01o37l40P07q9r5k80Q66Qj308J249
$$ 139 524 237 -167 929 -399 599 -30 -770 974 573 -64 -404 303 214 119 -161 705 713 -595 654
5838F54o69m19L61j53k44O37n96O71q22J344r86l59j77L91k08J90R45p6r30M79
$$ 654 -15 -434 -73 -226 -470 167 -429 242 -580 764 -222 -581 -758 -367 -575 -385 560 484 -446 33
5858C3J54Q5k67p66Q51q43J027n45N84n84P63o97M20L01l04K83j017P36o85P73
$$ 33 187 272 5 -761 90 -753 274 -271 313 -271 492 -205 215 516 212 495 -522 214 -471 302
5878C02o21O7R14o51K63j04p97q4O46N70N2L76j007J44M58k29k52l18N4K1N13
$$ 302 -319 -252 662 11 274 170 -627 -711 -65 505 557 933 -74 70 528 299 47 -271 -217 -196 317
5899C17L6o15O87l04mJ09l87J74j7M25n32n11J003p86P90p58M06M97ko99l66N83
$$ 317 353 -262 425 121 117 226 -161 13 -4 421 -111 -622 381 -405 385 -373 33 530 528 -171 -537 46
5921D6o2L07m45m64J045m04n5j70k42Q25r10M87l08M73M77n67j77o6L8N10n13
$$ 46 -16 291 -154 -618 427 23 -32 -202 -444 381 -529 -42 -350 123 600 33 -144 -210 -172 338 -175
5942a75J096j876N92J62O92q97O13p01P22m49K54j555O64J442l42P52m35k00o18
$$ -175 921 -955 -363 -201 491 -406 207 -494 228 -221 33 -1522 -858 584 242 994 559 359 -259
5961b59R25o29m86J212o65l19O60q14R00m74m75N33n4J8j95M0j312J407R1j43
$$ -259 666 37 -449 763 98 -221 439 -375 525 51 -424 109 55 73 -122 -82 -1394 13 104 -39
5981c9j28K89R6o8o48O58K49j046J90J535j272N2R30l71Km64m78K53N24q45oL98
$$ -39 -167 122 218 150 -498 160 409 -637 -447 1088 -184 -132 798 427 429 -35 -513 -260 264 -581 -587 -189
6003a89j32L47R40j209n4Q75q50J68q98J143k5j15NP56o45L7j32m67O36k52j115
$$ -189 -321 26 966 -243 -297 578 -272 -104 -1002 141 116 1 6 762 117 154 22 -445 191 -61 -1176
6024a176R78n9O46m9j037R47N09q47Q99j223K66j10L98L53q72M19M89p59O51j95
$$ -1176 -198 -257 389 340 -697 250 759 -88 811 -412 -146 -256 142 495 -377 42 531 -228 423 228
6044B28n77N70o96Q37n01N50k01P18p0oK46j085O6K24K07K34M4n62m24k67K77
$$ 228 -349 221 -475 362 -139 411 210 928 858 852 1098 13 79 303 510 744 788 226 -198 -465 -188
6065a88K18j43Qrl27L33M0L73n8JN3r00Q28o0K34n78l87O24L83n70K71pk78Q17
$$ -188 30 -113 -105 -114 -441 -108 -68 305 247 248 301 -599 229 169 403 -175 -562 62 445 -125 146 139 -139 678
6089F78j048P77j127N92J28J93o71l01P52M52M00L57j480J264j282R88r20p6N79
$$ 678 -370 407 -720 -128 0 193 -478 -779 -27 425 825 1182 -298 966 -316 672 -248 -324 255
6108B55l19l38L01m26N53j95O86K0n64k00Q92r99k87Q00K4k9R34j322J91l06K80
$$ 255 -64 -402 -101 -527 26 -169 517 537 -27 -227 665 -334 -621 179 203 174 1108 -214 -23 -329 -49
6129d9N08r40P52l97k00k39Q57j32n72J262r05L65n18j00J92L01m82o43J412j093
$$ -49 459 -481 271 -126 -326 -565 292 160 -412 850 -55 310 -208 -308 -116 185 -297 -940 472 -621
6149f21Q73J7M28p07L15p28J235q35l18J61O78p59l28J041m78M76L16j84p79L49
$$ -621 252 269 697 -10 305 -423 812 -23 -341 -180 498 -261 -589 452 -26 450 766 582 -197 152
6169A52j43p99K50N17n30K19P09K64j289L75M81K46n37m68R21m93J66r71J70J114
$$ 152 9 -790 -540 -23 -553 -334 375 639 -650 -275 206 452 -85 -553 368 -125 41 -930 -760 354
6189C54n94p9p30J132L74j24j95O22j038k36j45J6J366o39j17r91L52R42J92K3
$$ 354 -240 -319 -1049 83 457 333 138 760 -278 -514 -659 -643 723 84 -33 -1024 -672 270 462 485
6209D85n92j5p59N62R9l24L45n93Q81O30j231L76J2p49J452j359M78N16m7L25
$$ 485 -107 -122 -881 -319 -220 -544 -199 -792 89 719 -512 -136 -124 -873 579 -780 -302 214 167 492
6229D92M07n88n23N69l2q15J71N96M66K59m88p1l27p75oJ863m66q91K95q22R13
$$ 492 899 311 -212 357 325 -490 -319 277 743 1002 514 443 116 -659 -665 1198 732 -159 136 -686 227
6250B27J061q66J48j023J088j194M46N55l53N70o14n50K4L60O6K6j89N61q56R98
$$ 227 1288 422 570 -453 635 -559 -113 442 89 659 45 -505 -481 -121 -55 -29 -218 343 -513 485
6270D85k44O3J0O99q87m80k07J8N95N40p47L57M76k36q06K62Q97j593P03P63o21
$$ 485 241 304 314 1013 126 -354 -561 -543 52 592 -155 202 678 442 -364 -102 795 -798 -95 668 47
6291D7p06J436j097J6P82j222M04O49m4k76L08j26l15K69l55n46k73J361l89P70
$$ 47 -659 777 -320 -304 478 -744 -340 309 265 -11 297 171 -144 125 -230 -776 -1049 312 -77 693
6311F93j602N50Q25j046J029l0Nk89j50L87o64J329o14o37N58L6m63j62J349m01
$$ 693 -909 -359 466 -580 449 419 424 135 -15 372 -292 1037 423 -214 344 380 -83 -245 1104 703
6331G03m59K46r68m8q1Q92o67M10k89m44M41j66n02M69l22J417l11j6m97O48q28
$$ 703 244 490 -478 -526 -607 285 -382 28 -261 -705 -264 -430 -932 -463 -785 632 321 305 -192 456 -372
6352c72k20M76J070r45k27j58J97J5O75m72O94q66o28J213k10q02Q37m37j62J71
$$ -372 -592 -116 954 9 -218 -376 -179 -164 511 39 733 -133 -761 452 242 -560 277 -160 -322 -151
6372a51q94J566j129JN74L64o07J65R69j096j44J04L63K97n68n37J149q28M89
$$ -151 -1045 521 -608 -607 -33 331 -276 -111 858 -238 -382 -278 85 382 -186 -723 426 -402 87
6391H7n05J189o03k44N45p54N60k39K69r0J36k47m11O5O50l97M51j060R70j08
$$ 87 -418 771 168 -76 469 -285 275 36 305 215 351 104 -307 -242 408 11 462 -598 372 264
6411B64j15l23j199J115k59L34M09O8o37O19j58M1o94K90j95K64n34Q03k75j40
$$ 264 149 -174 -1373 -258 -517 -183 226 294 -343 276 118 159 -535 -245 -440 -176 -710 93 -182 -322
6431c22M37K99m97Q98p85m1k35K19Q35R9o11n77j81k45M00K1L75J47p2K2j16m95
$$ -322 115 414 -83 815 30 -11 -246 -27 808 907 296 -281 -462 -707 -307 -286 89 236 164 186 70 -425
6453d25N62K79j13p02L42J40l65M73L3n44n46Q75n56N4l1N32K39o99K23L35J13
$$ -425 137 416 303 -399 -57 83 -282 191 224 -320 -866 9 -547 -493 -524 8 247 -452 -229 106 219
6474B19M18p14k60J72q64J323l9M64o57n62M83K87o61J58L65K10M93j462J016
$$ 219 637 -77 -337 -165 -1029 294 255 719 62 -500 -17 270 -391 -233 132 342 835 -627 389
6493C89J26q45M1j21J6N46j70K61o33M13l92j16K53k04J042j91l17l42p7l19O09
$$ 389 515 -330 -289 -410 -394 152 -18 243 -390 23 -369 -485 -232 -436 606 415 98 -244 -321 -640 -31
6514c1n59L56M91m5r44k5N25JP93k90M24j002N16%N25j071L41k40o3P50p58O74
$$ -31 -590 -234 257 212 -732 -757 -232 -231 562 272 696 -306 210 210 735 -336 5 -235 -298 452 -306 368
6536C68n99j74K27L74L44l24P4J73K17q1n61M36m77J03k79N50q90J279l92j053
$$ 368 -231 -405 -178 196 540 216 290 463 680 599 38 474 -3 100 -179 371 -519 760 368 -685
6556f85R72o76N35m3J66n08j09k15J166p29k07J538j587J17J58l17j90K25J275
$$ -685 287 -389 146 103 269 -239 -348 -563 603 -126 -333 1205 -382 -265 -107 -424 -614 -389 886
6575H86r32l70Q2J229j787O99N11j124J78L4R27l22j84j86N63j116Q06N72L5j051
$$ 886 -46 -416 -334 895 -892 -193 318 -806 -628 -594 333 11 -173 -359 204 -912 -106 466 501 -550
6595e50L38k1K57k33M90n05m3M2J194j363O43j491J557l38p65J445k95p34K70
$$ -550 -212 -233 24 -209 281 -224 -267 -225 969 -394 249 -1242 315 -23 -788 657 362 -372 -102
6614a02m9o82J281k90j6n90Q65J4J54p85J41M60p0j55J6J41n93l49N11L2r60R02
$$ -102 -151 -833 448 158 142 -448 417 431 585 -200 -59 401 331 176 192 333 -260 -609 -98 -66 -1026 -124
6636a24L77p82n63J516J61o06M51l94k6j21oO08o37n91k56J880q88m2J29Q3K1
$$ -124 253 -529 -1092 424 585 -21 430 36 10 -111 -117 491 -146 -737 -993 887 -1 -43 86 169 190
6657A90K89m18R4j47p01J212o49N77k28L69K7n13M5M07j013P41q39p0R92O5k38
$$ 190 479 61 155 8 -693 519 -130 447 219 588 615 102 147 554 -459 282 -557 -627 365 430 192
6678A92j137J194k6j70o59N43J53R4l43Q45l40n11K13m02O84p37J025r49n44J514
$$ 192 -945 249 223 53 -606 -63 90 184 -159 686 346 -165 48 -354 330 -407 618 -331 -875 639
6698F39n94lk82O35q61J22l7R1l75R78M54j011o92O50L51l43K42J81M25l78J78
$$ 639 45 42 -240 395 -466 -344 -381 -290 -665 313 767 -244 -936 -286 65 -278 -36 145 570 192 370
6719C70j45O43j487K18j23L97N72j507O90M39q50J222k46j50l59M67N68o88J80
$$ 370 225 868 -619 -401 -524 -127 445 -1062 -372 67 -783 439 193 43 -316 151 719 31 211
6738B11O1o60O42l53n3P73j238N01O41k83M16j696J187o77J483m46r55J25J859
$$ 211 272 -388 254 -99 -152 621 -617 -116 525 242 658 -1038 149 -528 955 509 -446 -321 1538
6757A538j595J19N25l67N64o08k58J65O96p37l9N3n35O34M06j42l76k13q9J08
$$ 1538 -57 62 587 220 784 176 -82 83 779 42 3 56 -479 155 561 419 43 -170 -259 -151
6777a51K92P0r81P27m83N41k85P92R0n47n76J262j541P16k33N46j69m21J095j052
$$ -151 141 211 -770 -43 -526 15 -270 522 612 65 -511 751 -790 -74 -307 239 70 -351 744 -308
6797c08K39o83Q44m09O76l53J76k61j60N4L91J78P4o5k36n51n2m9P89l91P10j207
$$ -308 -69 -752 92 -317 359 6 182 -79 -239 -185 206 384 458 393 157 -394 -446 -495 294 -97 613 -594
6819e94L7J91K28N37J43l10K9l64J5m96PJ053o72L42O07p69l19p59J455m93P97
$$ -594 -557 -366 -138 399 542 232 261 -103 -88 -584 -577 476 -196 146 753 -16 -335 -1094 361 -132 665
6840F65K59k01p89K73L07o72l14J4P45n31L77J17j310N02R27k73p00O95J56L81
$$ 665 924 723 -66 207 514 -158 -472 -458 287 -244 133 250 -1060 -558 369 96 -604 91 247 628
6860F28m40k56m30j40N68q4J78k45L48m98K68K74n35j25M82M49l2n71K34o30J069
$$ 628 188 -68 -498 -638 -70 -154 24 -221 127 -371 -103 171 -364 -489 -7 442 410 -161 73 -557 512
6881E12p85L56m18L69O86q98R83k87n71r2M45r59J694m15m25l51K39L0K10l35
$$ 512 -273 83 -335 34 720 -178 805 518 -53 -145 300 -659 1035 620 195 -156 83 113 323 -12
6901a2k13O72o23Q55j111N44O5J80n77K57K83r3q29O29K36j65m62k79M81O56j255
$$ -12 -225 447 -176 679 -432 112 177 357 -220 37 320 227 -602 27 263 98 -364 -643 -162 494 -761
6922g61q8J192M61q76K44l09O36m2n7L13j567K01P4O62n68M99n77L27j68O17o7
$$ -761 -849 343 804 -72 172 -137 499 457 400 713 -854 -653 -579 83 -485 14 -563 -236 -404 213 146
6943A46l78J78k5L12k50O48n5m45J45m91L09M59m99l59J033r5o20j52K1M85nk54
$$ 146 -232 -54 -79 233 -17 631 576 131 276 -215 94 553 54 -305 728 633 13 -139 -118 367 362 108
6965A08L38o29M68n31K96l2r78m29K041r70J294p60M44m98n27N94j271J254q8
$$ 108 446 -183 285 -246 50 18 -960 -1389 652 -318 976 216 660 162 -365 229 -1042 212 124
6984A24L3M57j56k09j25j1K28o36J24j74J0O30k12O5j83K89j174M33M48L40l25
$$ 124 157 614 458 249 124 113 341 -295 -171 -345 -335 295 83 148 -35 254 -920 -487 -39 301 -24
7005b4K60j64r4J68j22o71P16l88K3J522r79l77M7l22J58N63o77M90n73O61j6
$$ -24 236 72 -22 146 24 -647 69 -319 -296 1226 247 -130 -83 -405 -247 316 -361 129 -444 217 201
7026B01N37m44J89m22J00J3N10l53L61p63J16J82k99j76L14j08l78k73J152p96
$$ 201 738 294 483 61 161 174 684 331 692 -71 45 227 -72 -248 66 -42 -420 -693 459 -337
7046c37O90l28K93J76r03l87N23J22k67N84k33N09k26k42L4o67J263J83n91R77
$$ -337 353 25 318 494 -409 -796 -273 -151 -418 166 -67 442 216 -26 8 -659 604 787 196 1173
7066A173p62o57j85L91N56n07o43L70K59O04j091J655m01j416O98k47K57M57r76
$$ 1173 411 -246 -431 -40 516 9 -634 -264 -5 599 -492 1163 762 -654 44 -203 54 511 -465
7085d65P00k00L96J2p45j57R45l98J21L74k00n22l14n41R02J27o39O82n7J041
$$ -465 235 35 431 443 -302 -459 486 88 209 583 383 -139 -453 -994 -92 35 -604 78 21 1062
7105A062j338J43k7n82J090J31J42p48R24o58n11n06O77M55m34J40K21M93N6j752
$$ 1062 -276 -133 -160 -742 348 479 621 -127 797 139 -372 -878 -201 254 -180 -40 181 674 730 -1022
7125a022J059j57N59o42R95j052M00J89K14l58K73l31l66N0O9L56j1J18M73j180
$$ -1022 37 -120 439 -203 792 -260 140 329 543 185 458 127 -239 -189 -120 236 225 343 816 -364
7145c64L20j66O1O72k45L82p53k10N93r92N73j8k01O11K80k55k44N63j86p41P47
$$ -364 -44 -210 -149 523 278 660 -93 -303 290 -702 -129 -147 -348 263 543 288 44 607 421 -320 427
7166D27j8j2p9o29J077j026k56J020o58J325j060k40L49j122R80k53R28r3q83
$$ 427 409 397 318 -311 766 -260 -516 504 -154 1171 111 -129 220 -902 78 -175 753 660 -223
7185b23J063KK44j804M15J50j24P58np84n12J289q59O31j62k5l89J676r82m75
$$ -223 840 842 1086 -718 -303 -153 -277 481 476 -308 -820 469 -390 241 79 54 -335 1341 359 -116
7205a16K73l49m01J16Q33l3k39k20J015r01N49j111J20q0Q04r01J106k51L65j065
$$ -116 157 -192 -593 -477 356 323 84 -136 879 -22 527 -584 -464 -544 260 -641 465 214 579 -486
7225d86L69j78J02o24O76r8O64o52M28j63q54P08k77J143k23l72o6k31j11Q33
$$ -486 -117 -295 -193 -817 -141 -239 425 -227 201 38 -816 -108 -385 758 535 163 97 -134 -245 588
7245E88p61K93M26o32k77J187j335J073o83n37M63p66J548p05P3K48r49O25J70
$$ 588 -173 120 546 -86 -363 824 -511 562 -121 -658 -195 -961 587 -118 -45 203 -746 -121 49
7264D9K08j180J165j99J013j304L83r00R14o17k64R57M23q44l87M06Q46n11L29
$$ 49 257 -923 242 43 1056 -248 135 -765 149 -468 -732 225 648 -196 -583 -177 669 158 487
7283D87j95r77Q94pM38p94L84M62o39j7L22j14O29j34l35o58Q62m56j92L69J167
$$ 487 292 -685 209 202 640 -154 230 692 53 36 358 244 873 739 404 -254 608 152 -40 329 1496
7304A496j232m8j60j103N19J272j304M56M33p38M14j03K89j271Q7N74N88Q6p87
$$ 1496 264 216 56 -1047 -528 744 -560 -104 329 -409 5 -98 191 -1080 -993 -419 169 255 -532
7323e32Q53J88j021L2L51L1j79P04m73l44O26o00N27L49k04o32P06m54m65N21
$$ -532 321 509 -512 -480 -129 -98 -277 427 -46 -390 236 -364 163 512 308 -324 382 -72 -537 -16
7343a6J39o77N01K70l32J71K8o40M67L05n1o30N33K12j63O7K61o46L20m06L71
$$ -16 123 -554 -53 217 -115 56 84 -556 -89 216 165 -465 68 280 117 184 445 -201 119 -287 84
7364H4l38k27N61J07n76M18l96r7K50k67J37P73L17q7q18m2L19j468J329M3K34
$$ 84 -254 -481 80 187 -389 29 -367 -464 -214 -481 -344 429 746 659 -159 -201 118 -1350 -21 22 256
7385B56K47K8J03m91j6k93L61q20k75R15J85N9L35r76j34M34n1M52l61p5K73o73
$$ 256 503 531 634 143 127 -166 195 -625 -900 15 200 259 594 -382 -516 -82 -133 319 -42 -117 156 -517
7407e17K90N19k79K45j4k75k12L97m59q51P77J08L98l06O03l10j81J95j14m28
$$ -517 -227 292 13 258 244 -31 -243 154 -305 -1156 -379 -271 127 -179 424 114 -67 128 14 -414
7427d14k76P68j0J83q2L32q7q7j055O72L7j26J3J88k12J213q11q34N76O68J69
$$ -414 -690 78 68 251 169 501 414 327 -728 -56 -19 -145 -132 56 -156 1057 246 -588 -12 656 825
7448H25j214J315n48m56L89o58k66R66m05m8J059j681P20q67M8J6L89J34J079
$$ 825 -389 926 378 -78 311 -347 -613 353 -52 -100 959 -722 -2 -869 -821 -805 -416 -282 797
7467G97k59p75L66n21j29l26J403n79M32J08J64o27o51P62j04r3o39R65o92R50
$$ 797 538 -237 129 -392 -521 -847 556 -23 409 517 681 54 -597 165 61 -32 -671 294 -398 552
7487E52l25q06M55k68P1m66J523n32k75Mp95N11N75J34L09o59O61l95K01k58j071
$$ 552 227 -579 -124 -392 -321 -787 736 204 -71 -67 -862 -351 224 358 667 8 669 274 475 217 -854
7508h54R06r26K510j721M40j11j49O41jj435L0K82m6J110j08L0o9q51N25K00n66
$$ -854 52 -874 1636 -85 355 244 95 736 735 -700 -670 -388 -434 676 568 598 529 -322 203 403 -163
7529a63L43K41j99L94p61L88q34P79J60Q18r35m01J41J65k28M74n42o28J903j873
$$ -163 180 421 222 616 -145 243 -591 188 348 1166 231 -170 -29 136 -92 382 -160 -788 1115 -758
7549g58Q45n3L83k85Q3k21J65N07q49J484r96R7r54K00j01O87M13n72L88r38N11
$$ -758 87 34 417 132 215 -6 159 666 -183 1301 305 402 -552 -352 -453 234 647 75 463 -475 36
7570C6m99J12L76l50K88L80NP74k192J313J71n64p3K63j00O89o06O9N69j212o09
$$ 36 -463 -351 25 -325 -37 343 348 1122 -1070 243 414 -150 -223 40 -60 629 23 92 661 -551 -1160
7591a160J277M37j004J312j221J124k89n19j5j37P8J41m80O21k39n26N2J34N97
$$ -1160 117 554 -450 862 -359 765 476 -43 -58 -195 -117 24 -456 165 -74 -600 -548 -414 183
7610A83o67J060m81L11j78J25q60OK43J77L29n18j71L00K37j93m27L6L95Q39j027
$$ 183 -484 576 95 406 228 353 -507 -501 -258 -81 248 -270 -441 -141 96 -97 -524 -488 -93 746 -281
7631b81P93Q4j094K80j93N27M42om58q4J84j3Pm43N61l51q06N26J142j023L08
$$ -281 512 596 -498 -218 -411 116 558 552 94 10 194 181 188 -255 306 -45 -851 -325 817 -206 102
7652A02M90n24p02l18R19n99J082j53L6n12l01Q09j87l5k13K29l45O8r3M75p41
$$ 102 592 68 -634 -952 -33 -632 450 297 333 -179 -480 329 142 107 -106 123 -222 -154 -247 228 -513
7673e13J35J087l76L4M25j611M23J48k2J83L27Q61k70r01J93k98K9m96N53P01
$$ -513 -378 709 333 367 792 -819 -396 -248 -270 -87 240 1101 831 -70 123 -175 -146 -642 -89 612
7693F12m96j05M48l54n25J232p47L31l54k02j67N94l0L74k93O5l50l42j43K68
$$ 612 116 11 459 105 -420 812 65 396 42 -160 -327 267 237 611 318 383 33 -309 -452 -184
7713a84O88q50J84j57j01Q18k87p15L96J70J97q46J230j19q12J44J41N87r98M97
$$ -184 504 -346 -162 -319 -420 398 111 -604 -208 -38 159 -687 543 424 -388 -244 -103 484 -514 -17
7733a7L87n23J84l32L37n45J455q99K23K56N88r3j583L83Q61j83n91O84o69l1
$$ -17 370 -153 31 -301 36 -509 946 47 270 526 1114 1021 -562 -179 682 499 -92 592 -77 -108
7753a08l65Q73k94J07m18P98n29n71J639j090Q60j52j209Q71o07M79J74n55p76
$$ -108 -473 400 106 213 -205 593 64 -507 1132 42 902 750 -459 412 -195 284 458 -97 -873
7772h73N42N82j4j55O63m20n35l71J015n74L27J49j031J457J37j215J55j55N39
$$ -873 -331 251 237 82 745 325 -210 -581 434 -140 187 336 -695 762 899 -316 -161 -316 223
7791B23K31k33n61M49l14J165j449K72n33R07q4n43K55O13l11m2k49M91p75M99
$$ 223 454 221 -340 109 -205 960 -489 -217 -750 157 73 -470 -215 398 87 45 -204 287 -488 11
7811A1p57R30J22o81J173j590M53K22l52M48ql82K14J51N37j52k83n09L88k28
$$ 11 -746 184 306 -375 798 -792 -339 -117 -469 -21 -29 -411 -197 -46 491 339 56 -453 -65 -293
7831b93L09m16k10n83P43M86n09L16N3nK60K85j052J033r25L11J131m45k24O28
$$ -293 16 -400 -610 -1193 -450 36 -473 -157 -104 -109 151 436 -616 417 -508 -197 934 489 265 893
7851H93p61o71M38q15P31O70m21N61p77q3R6m08J277q70O52j063L58K43K83l83
$$ 893 132 -539 -101 -916 -185 485 64 625 -152 -235 -139 -547 730 -140 512 -551 -193 50 333 -50
7871e0l44R70l61k03n3m31O82k2j53j70k05N43r2R91j055n18R48l95l9M21p26
$$ -50 -394 576 215 12 -41 -472 210 188 35 -135 -340 203 111 1102 47 -471 477 82 43 464 -262
7892b62L21M17l13N02k51j62p14O15l16N80m46r0R71j472Q30K97l72j15J57m97
$$ -262 59 476 163 665 414 252 -462 153 -163 417 -29 -119 852 -620 210 507 135 20 177 -320
7912c20M55l07L54l78K33n57K35M90j42P02j199j55k54P23L32q22J304j088O87
$$ -320 135 -172 182 -196 37 -520 -285 205 63 765 -434 -589 -843 -120 212 -610 694 -394 293
7931B93m97Q73p26P8k41j02L05M65M72p27J18K5n18O0n03N54j88Q98j168P14L91
$$ 293 -204 669 -57 21 -220 -322 -17 448 920 193 311 336 -182 -122 -625 -71 -259 639 -529 185 576
7952E76q88l18M77m6Q55n81m02J42Q6O16q35Q23n35L20M77L04j042Qp05J360j036
$$ 576 -312 -630 -153 -199 656 75 -327 -185 -99 517 -318 505 -30 290 767 1071 29 37 -668 692 -344
7973c44j3K82J58L90k76m35L03j96J27N9j39j077J357n17J08j4M42k09j086M55
$$ -344 -357 -75 83 473 197 -238 65 -131 -4 55 -84 -1161 196 -321 -213 -227 215 6 -1080 -625
7993f25Q32m90O96J57m7j155N18l63M82O09p8q5R4p53p41M64J46L65Q28n18n98
$$ -625 207 -283 413 570 523 -632 -114 -477 5 614 536 451 545 -208 -949 -485 -339 26 854 336 -262
8014b62J142r03R78n31m19j38L92L0P15j660J373o34o8J95oJ09k2R3l93K36k72
$$ -262 880 -23 955 424 5 -133 259 289 1004 -656 717 83 15 210 204 313 291 384 -9 227 -45
8035d5j6k98J200j028M8J18m75P69o1m92j74J54m36J569n57q52M97m65R68n84
$$ -45 -61 -359 841 -187 -139 -21 -496 273 212 -280 -454 -300 -736 833 276 -576 -79 -544 424 -160
8055a60J83O9K58k69N29o13J44L9N1l33k95J75k11M93L12l67Q6N58L52p26l50
$$ -160 23 92 350 81 610 -3 141 180 231 -102 -397 -222 -433 60 372 5 91 649 1001 275 -75
8076g5J18m74K96K95k07K07m19Q86j657L70J255O2p79K0P2K37n67j55O01l58M6
$$ -75 43 -431 -135 160 -47 160 -259 627 -1030 -660 595 657 -122 -102 -30 207 -360 -515 86 -272 -226
8097b26K84j89j07o67J976o54m86L29M57J3p87l2K57q41R06l54L3q0p8N98j73
$$ -226 58 -131 -238 -905 1071 417 -69 260 717 730 -57 -89 168 -673 233 -121 -88 -168 -246 352 179
8118A79m41p13L98M20R12j101O93l00J54j91L59K9p17N57J67m46q73K8J095k18
$$ 179 -262 -975 -577 -157 755 -346 347 47 201 10 369 398 -319 238 405 -41 -914 -886 209 -9
8138iJ47m8k09L96j31M71p50N79p44J411j065r01J041j02J50k92p04J151n00K73
$$ -9 138 90 -119 277 146 617 -133 446 -298 1113 48 -853 188 86 236 -56 -760 391 -109 164
8158A64p87J129q79K62q43J830k08p17M73p99Q91n39q08R77m57N47N13k92p59
$$ 164 -623 506 -373 -111 -954 876 668 -49 424 -375 516 -23 -831 146 -311 236 749 457 -302
8177c02o53O50K84J45k73N79p73j9L87N04p41K30Q1k05
$$ -302 -955 -305 -21 124 -149 430 -343 -362 25 529 -212 18 99 -106
8191a06
$$ Imaginary data points
##PAGE= N=2
##DATA TABLE= (X++(I..I)), XYDATA
0@%%%%%%%%%%%%%%%%%pL1r6J44j44J45j50J84k51K93l08L75m39N02n75O51p36
$$ 0 0 0 0 0 0 0 0 0 0 0 0 0 0 0 0 0 0 -7 24 -72 72 -72 73 -77 107 -144 149 -159 216 -223 279 -296 355 -381
34c81Q25r47J058j181J324j479J656j839K039k265K509k782L070l385L733m111
$$ -381 444 -503 555 -626 698 -781 875 -964 1075 -1190 1319 -1463 1607 -1778 1955 -2156
50b156M531m988N492o056O684p392Q193r096J0138j1354J2794j4526J6652j9367
$$ -2156 2375 -2613 2879 -3177 3507 -3885 4308 -4788 5350 -6004 6790 -7736 8916 -10451
64a0451K2938k7886L5274m7699P4029k40021M20890N29805J13017n2182o85648
$$ -10451 12487 -15399 19875 -27824 46205 -193816 227074 756879 869896 817714 132066
75A32066n83376l06400o3342L31356O92822L97741J37426p034m59941o37615l00730
$$ 132066 -451310 -757710 -821052 -489696 203126 600867 738293 731259 271318 -366297 -667027
86f67027j55871K18418N96826M93059K86821K7014m34987o33083m41856j39894
$$ -667027 -822898 -604480 -7654 485405 772226 799240 364253 -268830 -710686 -850580
96h50580K12848O04329N76519K57232n2689m22250n87796l89388j11352K19572
$$ -850580 -637732 -33403 543116 800348 747659 325409 -262387 -651775 -763127 -543555
106e43555M93804M85319K44462r719k73600m97645m56473j76139J33747M00846
$$ -543555 -49751 435568 680030 670311 396711 -100934 -557407 -733546 -599799 -198953
116a98953N13579L55850N4220k51454n35812n32840j80805J54181M00385N50400
$$ -198953 314626 670476 724696 473242 -62570 -595410 -776215 -622034 -221649 328751
126C28751L87484J7099l03864m89587m66143j62672J54511L14501M68471L66013
$$ 328751 716235 733334 429470 -60117 -526260 -688932 -534421 -219920 248551 614564
136F14564J8592k01084l87135m50207k40783L1681K92404M71164M11809J18917
$$ 614564 633156 432072 44937 -405270 -646053 -614372 -321968 149196 561005 679922
146F79922j81592l90432n00746k94376O9976L04520M81644L94481R0120j69651
$$ 679922 498330 107898 -392848 -687224 -617248 -312728 168916 563397 653517 483866
156D83866m10681m41632k23048M5930K66254L80366L49177J33117j27190l09790
$$ 483866 73185 -368447 -591495 -545565 -279311 101055 450232 583349 456159 146369
166A46369l98550k61084m5799J68915M03285L93781J88530p3987l37240m14572
$$ 146369 -252181 -513265 -559064 -390149 13136 406917 595447 521460 184220 -230352
176b30352l07868o9705K29142M16399L86006J57376r1807l07367l98477k68905
$$ -230352 -538220 -607925 -378783 37616 423622 580998 489191 181824 -216653 -485558
186d85558m9286J90346L56243L13652J73771j9691k52207l58271k89487j12788
$$ -485558 -534844 -344498 11745 325397 499168 479477 227270 -131001 -420488 -533276
196e33276J19929L17679L64384K48447J8050k57780l89610l15410j26250J29118
$$ -533276 -413347 -95668 268716 517163 535213 277433 -112177 -427587 -553837 -424719
206d24719L43785L73873K20844j9346k48244l42870k79554j17941J08353K91931
$$ -424719 -80934 292939 513783 494437 246193 -96677 -376231 -494172 -385819 -93888
216i3888L13187K05351K1629j66484k89194l01820j60132N6579K46912L23200
$$ -93888 219299 424650 446279 279795 -9399 -311219 -471351 -414772 -167860 155340
226A55340K51727P7619j55970l24775l23746j67756P4101K53363L21568K55755
$$ 155340 407067 484686 328716 3941 -319805 -487561 -413460 -160097 161471 417226
236D17226M2101j66968k89945k82670j32395M0886J98846K86710K28116O9942
$$ 417226 459327 292359 2414 -280256 -412651 -371765 -172919 113791 341907 411849
246D11849j10916k35801k71014j91061r580J69429K96494K68653J03780p7920
$$ 411849 300933 65132 -205882 -396943 -406523 -237094 59400 328053 431833 353913
256C53913k50013l16976k01037m344J96215K99094K47477R4752q9141k42218k83278
$$ 353913 103900 -213076 -414113 -418457 -222242 76852 324329 419081 329940 87722 -195556
267a95556j69905r61J45589K46146K31139J15975l9297k00578k59016j89533o5277
$$ -195556 -365461 -366422 -220833 25313 256452 372427 333130 132552 -126464 -315997 -381274
278c81274J05945K48441K63359J49155k7186j99898k74069k13443o5036J23356
$$ -381274 -275329 -26888 236471 385626 358440 158542 -115527 -328970 -394006 -270650
288b70650K61660K49518J20781l4569j80367k45148j85753n6181J00136K06028
$$ -270650 -8990 240528 361309 326740 146373 -98775 -284528 -340709 -240573 -34545
298c4545K04493J33951J0675j35685k24480k00874r1612N8730J86392K32864J76228
$$ -34545 169948 303899 314574 178889 -45591 -246465 -338077 -279347 -92955 139909 316137
309C16137L1189j42824k39642k11209r7374O3508J99612K32991J58998P134j39004
$$ 316137 347326 204502 -35140 -246349 -343723 -280215 -80603 152388 311386 318520 179516
320A79516k07037j87051r2869M5851J62570K02521J50682L9602q5136j78461k00881
$$ 179516 -27521 -214572 -307441 -261590 -99020 103501 254183 293785 208649 30188 -170693
331a70693j28728J5168J45456K08671J82414O9906q3727k00384k19874j23711
$$ -170693 -299421 -284253 -138797 69874 252288 322194 238467 38083 -181791 -305502
341c05502K2753J49388K06098J73562N3852r0788j79400j80365j06120P139J13641
$$ -305502 -282749 -133361 72737 246299 300151 209363 29963 -150402 -256522 -249383 -135742
352a35742J73443J60598O6646n2250j37977j75026j36774l2610R5786J81478J78081
$$ -135742 37701 198299 264945 212695 74718 -100308 -237082 -269692 -173906 7572 185653
363A85653Q8351l7546j46554j92435j43647j9269J09156J74881J61797P4513m2200
$$ 185653 274004 236458 89904 -102531 -246178 -265447 -156291 18590 180387 254900 212700
374B12700j36494j67468j19549j8743P6989J37164J47464R2542j1765j06324j51952
$$ 212700 76206 -91262 -210811 -229554 -152565 -15401 132063 224605 212840 106516 -45436
385d5436j35095n6327N0219J41123J71886J12117m910j12548j64014j46206n7470
$$ -45436 -180531 -236858 -186639 -45516 126370 238487 233577 121029 -42985 -189191 -246661
396b46661O4995J48670J58724R2602j1741r6775j43577j28919m8051M6866J15234
$$ -246661 -181666 -32996 125728 218330 206589 109814 -33763 -162682 -210733 -163867 -48633
407d8633J32710R6733K2174o7283j31384j37550p3880K1639J03143J46688J22615
$$ -48633 84077 180810 202984 135701 4317 -133233 -207113 -185474 -82331 64357 186972
418A86972L0234p3356j43045j37780o7562K5264J10938J42143J01630J4993o9697
$$ 186972 217206 143850 805 -136975 -204537 -179273 -68335 73808 175438 190431 120734
429A20734j16146j13997o4064J3527Q3458J18653R3546L3874l0895r9662j20595
$$ 120734 4588 -109409 -173473 -159946 -76488 42165 135711 169585 138690 39028 -81567
440h1567q3675r358P6936J21643J09187N4342l5339j11468j31279q0368L246P6991
$$ -81567 -165242 -174600 -97664 23979 133166 187508 152169 40701 -90578 -170946 -167700 -90709
452i0709J18600J02171L9723l8464r8101j05105o5552r814N5143R5584R6004N1441
$$ -90709 27891 130062 169785 131321 33220 -71885 -137437 -147251 -92108 3476 99480 150921
464A50921j5188p3824j02073q7716l1707M3195J04055J08233O0644q577q0146
$$ 150921 135733 61909 -40164 -127880 -159587 -116392 -12337 95896 156540 147963 67817
475F7817j13725q8766k3244N6590R7879R3920N3270j6260p0095r4220p1900j8014
$$ 67817 -45908 -134674 -157918 -101328 -3449 90471 143741 127481 57386 -36834 -108734 -126748
487a26748L2039P1261Q3995N8109O624n1496q3747p8640m1666J8453P0666R6729
$$ -126748 -94709 -23448 60547 118656 125280 73784 -9963 -88603 -130269 -111816 -41150 55579
499E5579P1472L949n4523q7417q6242l3970K6433P6177Q9165N0972o6m4378p3179
$$ 55579 127051 131000 76477 -10940 -97182 -131152 -104719 -28542 60623 111595 111529 67151 -6028
512f028o9561l1097J7009N3203O8823N6345J7505k3855o4757p9637m3179r83M6239
$$ -6028 -75589 -106686 -89677 -36474 32349 88694 106199 82344 17587 -62050 -105229 -106212 -59973
525e9973Q2919O8435K7255l0314p6134p7053m2304P207N2834P7468N9767J0279
$$ -59973 22946 91381 118636 88322 12188 -64865 -107169 -99962 -47128 30340 90107 100386
537A00386k9339n6452o2938l4238l537L5074O1528M9714K6151o854m5523o2565
$$ 100386 71047 14595 -48343 -82581 -86118 -51044 10484 60198 86349 79495 33972 -28593
549b8593n2620j4407L1411O3226O3014L4373r359n5112p1797m3665m223L4415
$$ -28593 -81213 -95620 -64209 -983 62031 96404 87045 31933 -39864 -83529 -87752 -53337
561e3337O0774N0525K6630j6194m6712m5960l5753r165K0231M0038M8646K8437
$$ -53337 7437 57962 84592 68398 21686 -24274 -60027 -69192 -48961 -8923 39723 68160
573F8160L36k8530m6557m7787k7139J5470M8356N2786M0339j415l4414n0500n1664
$$ 68160 68496 39966 -6591 -54378 -81517 -66047 -17691 35095 75434 74019 39605 -10895 -62559
586f2559j4878K6620M3423M5888K7589l415k9667l9034l8579j3739J2223K4316
$$ -62559 -77437 -50817 -7394 38494 66083 62668 33001 -6033 -44612 -58351 -46128 -21812
598b1812L6205L7279P862j6984l2668m6016k6182L030K5104N0056M3135O004k0660
$$ -21812 14393 51672 59534 42550 9882 -36134 -62316 -59286 -34182 15874 59009 65013 44353
611D4353l9431m7107j9387J0484L1540M1218K8543j151j4376k7038l5611j5443
$$ 44353 4922 -42185 -61572 -51088 -19548 21670 50213 49062 34686 7648 -27963 -43406
623d3406N605J2383L0037K8676R744R29k4899m1520k2026o298J3163L6885L8391
$$ -43406 -37801 -25418 4619 33295 43039 43968 19069 -22451 -44477 -50775 -37612 -727 37664
636C7664J5189r876k8441m2406j6973M702J3143L9493K5576n74l955k3229k5571
$$ 37664 52853 42977 14536 -27870 -44843 -40141 -26998 12495 38071 37497 33542 10313 -15258
649a5258j3277m800O686K2808K1722J1363N895r597l3295k2154j0197J329L1873
$$ -15258 -28535 -33335 -26649 -3841 17881 29244 35139 25542 -7753 -29907 -40104 -38775 -6902
662f902K8872J7440M275k4010l4281j8585k487J1784K4385K3358P549k590j5554
$$ -6902 21970 39410 43685 19675 -14606 -33191 -35678 -23894 491 23849 31398 28808 13254
675A3254k0785j0606n358j303J5351J6420J4771O201o571j5698k3556j4929R58
$$ 13254 -7531 -18137 -23495 -24798 -9447 6973 21744 27945 21374 5676 -17880 -32809 -31851
688c1851J7054K5430J8454M691j2053k1113k2902p889J1407J5717J6399J0300
$$ -31851 -14797 10633 29087 33778 21725 612 -22290 -30179 -18772 -3055 13344 23644
700B3644k885q716j1767j3046m735K374K459R229J8431M515k695n386k0888j4187
$$ 23644 20759 12043 276 -12770 -17505 -15131 -12672 -3443 14988 19503 16808 11422 -9466 -23653
714b3653j46M272K0395K1664K971q059j2035j7829j2186J0520Q469J1333J2825
$$ -23653 -23799 -19527 868 22532 25503 17444 5409 -12420 -24606 -14086 -5617 5716 18541
727A8541n981l365k522j3885m544Q52p9M240J1112Q449Q94o47j3380j7533J326
$$ 18541 12560 9195 6673 -7212 -11756 -10904 -10983 -6743 4369 12818 13712 13065 -315 -17848 -16522
742a6522j03R694K2827M453m036r473j3763p856K725N997P799R532N25q070r0
$$ -16522 -16625 -6931 15896 20349 16313 6840 -6923 -14779 -12054 -6057 1742 11274 11799 3729 3639
757C639l777o871P64k379K322P360M395M108J152o178j3614n688J351O660J2460
$$ 3639 -138 -7009 -6245 -8624 -6302 1058 5453 9561 10713 4535 -9079 -14767 -13416 -6756 5704
772E704Q451R60o906j1754o810N06N496O632L393K828m305m198q28q00k222j588
$$ 5704 14155 15115 8209 -3545 -10355 -9849 -4353 2279 5672 8500 4195 -3 -831 -1631 -3853 -5441
788e441r26K264M671O185j16J58p562j0211m11N237P669Q014K464n720n888o583
$$ -5441 -6367 -4103 568 6753 6637 6795 -767 -10978 -11389 -6152 1517 9531 11995 6275 387 -6196
804f196l237N867P281q03O26k55m181M41o37l98Q73m345k020M268N748J841L25
$$ -6196 -9433 -3566 3715 2912 3538 3283 -898 -457 -1094 -1492 -619 -4964 -6984 -2716 3032 4873 5198
821E198k576r841j543K140M925Q531K720n146l007n507k480L927L977K822j960
$$ 5198 2622 -7219 -8762 -6622 -1697 6834 9554 4408 1401 -4106 -6586 -2659 1318 4140 2180
836B180k340k225J259P50J54Q01l001k750J807L248N900K56k379m871m068q59
$$ 2180 -160 -2385 -1126 -376 -222 579 -2422 -5172 -3365 -117 5783 6039 3660 -1211 -5279 -6138
852f138L658N572K864k133l849m224j54L407K063J907K51l642l232J313K223L229
$$ -6138 -2480 3092 5956 3823 -26 -4250 -4404 -997 1066 2973 3224 -418 -3650 -2337 -114 3115
868C115j970l768j175r94R18N235L713j826m123k103j933L224L646K595P89l879
$$ 3115 1145 -2623 -3798 -4792 -3874 1361 5074 3248 -875 -2978 -4911 -1687 1959 4554 5343 1464
884A464m971r53L572K505N07o01l274k147m32K724M019O39l510k927m37P14L268
$$ 1464 -3507 -4460 -888 1617 2124 1523 -1751 -3898 -4330 -1606 2413 3052 -458 -3385 -3822 -3108 160
901A60K261K323j834o022j485J777M387K567L38k800m152j498J343M252K085j480
$$ 160 2421 4744 2910 -3112 -4597 -2820 1567 4134 4472 1672 -2480 -3978 -2635 1617 3702 2222
917B222l837j999q4J625M020J515j876l271k884Q95L732J908J561q27m041k513
$$ 2222 -1615 -3614 -3698 -2073 1947 3462 1586 -1685 -4569 -3674 58 1966 3527 2700 -1341 -3854
933c854R85K762M161o98j879l755r44q7K165M716j352k122l936j917L778K461
$$ -3854 -2869 -107 4054 3356 1477 -2278 -3222 -3309 -1144 3572 2220 98 -3838 -5755 -1977 484
949D84J898J08k610l761K54L396K437J263j212k813j809j05K236L470N74k207
$$ 484 2382 2490 -120 -3881 -3627 -231 2206 3469 2257 -556 -2365 -2470 -234 3236 3810 1603
965A603l817j481k04L567K573K21k706k458j685N47N195J828q70k737k846JJ623
$$ 1603 -2214 -3695 -3899 -332 2241 2462 -244 -2702 -4387 -3840 1355 3183 2313 -424 -3270 -3269 -1646
982a646K534K983j580l240l422K61L926K085K390j856l501l377J82L802J405J169
$$ -1646 888 3871 2291 -949 -4371 -4110 -184 1901 4291 2435 -1066 -4443 -4261 -459 946 2115
998B115j020k263k149k25L320J640P78k465k472k6J096K811K181m67l600k498
$$ 2115 1095 -1168 -3317 -3542 -222 1418 2196 -269 -2741 -2767 -1671 1140 3321 2854 -746 -3244
1014c244j261J439M967J001J81k793l544n59R59L845J064j26l073r17J544q09
$$ -3244 -4505 -3066 1901 2902 3083 290 -3254 -3813 -2854 991 2055 1929 -1144 -2061 -517 -1326
1030a326K797o89j733j223k49J103K547J926L43l408l298j72N88L573K629R41
$$ -1326 1471 782 -951 -2174 -2423 -1320 1227 3153 3496 88 -3210 -3382 -2794 779 3408 4349
1046D349l650k652p33m73J215K828J120j812o96L0N04p27N56j073M86j998M55
$$ 4349 699 -1953 -2686 -3159 -1944 884 2004 192 -504 -474 30 -697 -141 -1214 -728 -2726 -2271
1063b271M853J222m55l440k556j868Q60L240K563J187r33l534k139m50J744J968
$$ -2271 2582 3804 3349 -91 -2647 -4515 -3655 -415 2148 3335 2402 -1132 -3271 -3721 -1977 -9
1079iJ60Q60k54p78K4k09pj007j032J91n11L667K121J221k504m454k773J415J480
$$ -9 151 1011 757 -21 3 -206 -213 -1220 -2252 -2061 -2572 1095 3216 4437 1933 -2521 -5294 -3879 -2399
1098b399M573K123m5l011l441j574J669Q43J302N01J066r69M18O14j709o81k189
$$ -2399 2174 4297 4252 1241 -2200 -3774 -2105 -1262 40 541 1607 638 1056 1670 -39 -720 -2909
1115b909j247K689J849L712l08r13m121l652m27J197N155K797K02k302l025j667
$$ -2909 -4156 -1467 382 4094 3786 2873 -1248 -4900 -5327 -4130 1025 3822 4024 1722 -1303 -2970
1131b970L24m06K954J38J101q1k93N30n96j577k521j312J890L716K561J977k697
$$ -2970 -2646 -3052 -98 40 1141 1060 767 1297 701 -876 -3397 -4709 -2819 897 3458 5435 2738
1148B738k469m736j666J590L882M092J492j404k309m164k21j53J461L080j323
$$ 2738 269 -4467 -6133 -4543 -661 3431 4923 3519 1210 -2954 -3175 -3328 -1867 1213 -110
1163a10J526O32o47r65k228j136j462N56K558M367J670k300j605l643l413J436
$$ -110 1416 2048 1401 436 -1792 -2928 -4390 -3834 -1276 3091 4761 2461 856 -2787 -6200 -4764
1179d764L825L419K490n43l303k543q70o60m96K212K434J194P54O3j486j598l952
$$ -4764 -939 2480 4970 4427 1124 -1419 -2289 -2949 -3445 -1233 1201 2395 3149 3212 1726 128 -3824
1196c824k004J293M809K300L149l68j961o140k761J18K453M797K138kK32l738
$$ -3824 -5828 -4535 274 2574 5723 5355 3394 -2746 -5507 -5389 -2936 1861 3999 3997 4229 491
1212D91l365L53o22L14K821Q85K363m20L73k549l377j760l99K492M267K307J437
$$ 491 -2874 -2521 -3143 -2829 -8 877 3240 2820 3193 644 -2733 -4493 -4892 -2400 1867 4174 5611
1229E611k154m998k869j468J680L386L480K013l42k709k696k065m82P78J772K485
$$ 5611 3457 -1541 -4410 -5878 -4198 -812 2668 4681 4339 1630 -1066 -3131 -3613 -2835 -1063 1422
1245A422J630P33j016j703l477k225m43J575L448M293Q26k31n091l291k548J427
$$ 1422 3052 3785 2769 1066 -2411 -4636 -5079 -3504 -56 4237 5063 4832 -259 -3550 -6098 -4671
1261d671L868L632J944k46j119l618l445J94O5J690J585J928J178J306k192l998
$$ -4671 -803 2829 4773 4527 3408 -210 -3655 -3461 -3396 -1706 -121 1807 2985 4291 2099 -1899
1277a899j838j593J578K300L430L271n88l663l258l734J628J888M384K013J371
$$ -1899 -3737 -5330 -3752 -1452 1978 5249 4661 998 -2260 -5994 -4366 -2478 1906 3919 5290
1292E290k052j845l138j985m72N60K397K661Q11Q83r98k052l342k238J837K165
$$ 5290 3238 1393 -1745 -3730 -4202 -3642 -1245 1416 2227 3110 2112 60 -3282 -5520 -3683 -1518
1308a518L481K846K68j827l709l306n93J297L059L547J456j123j767k197k674
$$ -1518 1963 4809 5077 3250 -459 -3765 -4358 -3061 -2 3545 5001 3878 2111 -86 -2760
1323b760j24k84J067K392K774J0L14l315k353k268r14L253L027M037k66n22l318
$$ -2760 -2884 -3168 -2101 291 3065 3075 3389 74 -2279 -4547 -5461 -2208 819 4856 4590 4068 750
1340G50l811k083J441K122L822J580R67k204k399k087k372R48O35J493K680K159
$$ 750 -3061 -5144 -3703 -1581 2241 3821 4788 2584 185 -1902 -4274 -3326 -2691 -1198 1482 3641
1356C641l48k692j130k174j555R19K692L458K311p37l694j311l447qJ721K776
$$ 3641 3293 601 -529 -2703 -4258 -3339 -647 2811 5122 4385 691 -620 -4067 -4075 -2354 422
1372D22K926R29q03l009j265k760p2J951j09L214R24J427k728j918j498j847N26
$$ 422 3348 4277 3474 465 -800 -3560 -3632 -1681 -1790 1424 2348 3775 1047 -871 -2369 -4216 -3690
1389c690K888K190L006J40j868j937l255k004K405J624K486J442p9k245j750k199
$$ -3690 -802 1388 4394 4534 2666 729 -2526 -4530 -2125 -501 1985 3427 3348 1103 -647 -2846
1405b846j316J102K093J455J119J364o29j823k409j955p2K043K666J977J494j167
$$ -2846 -4162 -3060 -967 488 1607 2971 2342 519 -1890 -3845 -3917 -1874 792 2769 4263 3096
1421C096k459k658r99n05K461K185J769M5o41j627k692p38L05K51J957J336J097
$$ 3096 637 -2021 -3020 -3525 -1064 1121 2890 2935 2294 667 -2025 -2763 -2458 -2207 -250 1086 2183
1438B183L58j363j618j366j328J013K194K657O41n25j65l852m92j166P27K637
$$ 2183 2541 1178 -440 -1806 -3134 -2121 73 2730 3371 2846 2681 -1171 -1663 -2829 -2102 535
1454E35J555O9p47j153j128j493M9N65J898L41J667L7J20j409k748q83M46J217
$$ 535 2090 2159 1412 259 -869 -2362 -2313 -1748 150 491 2158 2195 2315 906 -1842 -2725 -2279 -1062
1472a062L391J179k23n98l526m46n38K31J595K040O74j511K56k342o87r31O35
$$ -1062 2329 3508 3285 2687 -839 -1285 -1823 -1592 3 2043 2717 1206 1462 -880 -1567 -2498 -1863
1489a863J58K169N80R18K90j466j424p10lQK600J886k52r61j239j297j592Q8J675
$$ -1863 -1705 464 1044 1962 2252 786 -638 -1348 -1351 -1343 1257 3143 2891 1930 691 -606 -2198 -2110 -435
1508d35J362N15l19N51k166j58k42k41L05J243l58J044R88r10r16j523k24O50
$$ -435 927 1442 1123 1674 -492 -650 -892 -1133 -828 415 57 1101 2089 1179 263 -1260 -1484 -834
1526h34J610J93J681q37j61l170m11L37J172N54J602P04k286N83j072j294N51
$$ -834 776 969 2650 1813 1652 -1518 -1929 -1592 -420 134 1736 2440 154 737 -335 -1629 -1078
1543a078K83m6P44P94J53Q01n90k540K46J82J016J760o89J375o87j812j408K61
$$ -1078 -795 -841 -97 697 850 1651 1061 -1479 -1233 -1051 -35 1725 1036 2411 1724 -88 -1496 -1235
1561a235N05J352J27l69n96J31N32j293J88n96N13J102m25Q15K12N71j355q70
$$ -1235 -730 622 749 380 -216 -85 447 -846 -658 -1254 -741 361 -64 751 963 1534 179 -691
1579f91J04J291r48J315N88l99j108j467M82L5J374m02o63R61j143M69J4n57P41
$$ -691 -587 704 -244 1071 1659 1260 152 -1315 -833 -798 576 174 -489 472 -671 -202 -188 -745 -4
1598do13L01m64J257J162LR5j321j553J209N04Q26N6j57r76p16m87l3K069j041
$$ -4 -617 -316 -780 477 1639 1642 1737 416 -1137 72 576 1402 1458 1301 325 -391 -878 -911 1158 117
1618A17q7M97p87M69O86o60m74K10k94O01L02N88k19r5O99k046l90N11J173P94
$$ 117 30 527 -260 209 895 235 -239 -29 -323 278 580 1168 949 854 1553 -493 -883 -372 801 1595
1638A595j002p61k94l86K95J265lK76j705P63l09K01K41n61J525j219o09J567
$$ 1595 593 -168 -462 -848 -553 712 709 985 -720 43 -266 -65 176 -385 1140 -79 -688 879
1656H79J29J30l39j98p8j431P87M17n21J019j82j001J95j64R08l69M39j22r87
$$ 879 1008 1138 799 601 523 -908 -121 296 -225 794 612 -389 -194 -358 550 181 620 498 -489
1675d89K82J64J5N72M63j707n14J296P89K53J04j072o75Q04j27L63N30l87q29
$$ -489 -207 -43 -28 544 1007 -700 -1214 82 871 1124 1228 156 -519 285 158 521 1051 664 -165
1694a65l3n8N25J60n0O99j138L02r84K59J911r01n72O48r83P25o78O50Q70j610
$$ -165 -198 -256 269 429 379 1078 -60 242 -742 -483 1428 527 -45 603 -380 345 -333 317 1187 -423
1714d23N81N30r13l71J872p14L19j192l28j8Q54J034q58N05q01M91l16j153R79
$$ -423 158 688 -225 -596 1276 562 881 -311 -639 -657 197 1231 373 878 77 568 252 -901 78
1733G8L17m82N76r52P90M10N1j026J083q75K52N36j064K110q44j770m0K13M77
$$ 78 395 -87 489 -463 327 737 788 -238 845 -30 222 758 -306 1804 960 -810 -850 -637 -160
1752a60L1R30q69J05o29P56j25J52N44j34p84P86l91L9q3K05J21j209l99N63J003
$$ -160 -129 801 -68 37 -592 164 39 191 735 601 -183 603 212 251 168 373 494 -715 -1114 -551 452
1773D52m08Q55p73o73M81n78J566j62q50J211j327Q27k30K94l97j28r66Q35N6
$$ 452 44 899 126 -547 -66 -644 922 760 -90 1121 -206 621 391 685 288 160 -806 29 85
1792H5R65j164N20j5j335P18o26K123K92q81m21j315L13L51P59R83j430M77m54
$$ 85 1050 -114 406 391 -944 -226 -852 1271 1563 682 261 -1054 -741 -390 369 1352 -78 399 -55
1811e5N0J01K01p45J074j747M27J505K27M9m13l32k404J210l67J465J281n48K60
$$ -55 -5 96 297 -448 626 -1121 -694 811 1038 1087 674 342 -2062 -852 -1219 246 1527 979 1239
1830A239n85j565N30l14k45J560L74j89K25m03j42p35n62L95J78R84L8L68p84
$$ 1239 654 -911 -381 -695 -940 620 994 805 1030 627 485 -250 -812 -417 -239 745 783 1151 367
1849C67p87j171L32K2J058J196L5K68j6j428r87K84j41R23O64Q0m14P3L9j509
$$ 367 -420 -1591 -1259 -1237 -179 1017 1052 1320 1304 -124 -1111 -827 -968 -45 619 699 285 358 397 -1112
1869a112N81o58L03J128K02R84m09j381l44j491J71R59K133N53j93j47r38j430
$$ -1112 -531 -1189 -886 242 444 1428 1019 -362 -706 -2197 -2026 -1067 1066 1619 1426 1279 341 -1089
1887a089p32n13J544J131M21N53j06q22n53j764L93k66J448J831Q80P59j675j869
$$ -1089 -1821 -2334 -790 341 762 1315 1209 387 -166 -1930 -1537 -1803 -355 1476 2356 3115 1440 -429
1905d29j505q16P71K104K178J37m23j942j118j485K57L53J854J478R62o00k83
$$ -429 -1934 -2750 -1979 125 2303 2440 2017 75 -1043 -2528 -2271 -1918 -64 1414 2376 1776 1493
1922A493j812j764n29k43J676J589K233k93p68j936j723m48N98J254K168J313
$$ 1493 -319 -2083 -2612 -2855 -1179 410 2643 2350 1582 -354 -2077 -2525 -1927 -673 1495 2808
1938B808j42o7l291j993k4N03J211J602J571J087j768j516j818j696N16Q32L438
$$ 2808 2666 2599 -692 -2685 -2709 -2206 -995 607 2178 3265 1497 -19 -1837 -3533 -3017 -2185 1253
1955A253K042K12M8l662j550k410J38K684K012K487p14M18k141l079q01l22J959
$$ 1253 3295 3507 3555 -107 -1657 -4067 -3929 -1245 767 3254 2540 2958 817 -2262 -3063 -3385 -1426
1972a426J469K724P87r62k004k564j514j220J715L107K923J548r55j849l385k432
$$ -1426 43 2767 3554 2592 588 -1976 -3490 -4710 -2995 112 3035 4583 3628 1779 -1606 -4038
1988d038oJ275L847K519J064k19l453j678k875j431J396K253L202K578p22k178
$$ -4038 -4044 -2769 1078 3597 4661 4442 989 -689 -3564 -4995 -3599 -1346 1856 4434 3712 1534
2004A534l083k860p63Q18L951L472K332m29k048l774l413m05J471K381L520J645
$$ 1534 -1549 -4409 -5172 -4354 -403 3069 5401 4972 2924 -850 -4263 -4668 -3197 -816 2704 4349
2020D349K85j999l858k119k277J079L642K736L211M2j147m190l002j525n03L480
$$ 4349 4634 2635 -1223 -3342 -5619 -4540 -898 1838 5049 5091 3944 -246 -3248 -4773 -5276 -1796
2036a796L749L861p69p69m662l216k488R78M239K604K915J122j930l311l835k153
$$ -1796 1953 5814 5045 4276 -386 -3602 -6090 -5112 -873 1731 4646 5768 3838 527 -3308 -5461
2052e461k86K952L501L413J847j326l100n071k834P96K010M502M157J487r78m430
$$ -5461 -5747 -2795 706 4119 5966 4640 1540 -3531 -6365 -5569 -3559 943 5100 6587 5609 1179
2068A179m770k308n02K061M872L964J040K71m541l724l761p22K268M433M519L068
$$ 1179 -3591 -5899 -6401 -4340 532 4496 5536 5807 1266 -2458 -6219 -6941 -4673 -240 4279 7347
2084G347j033m115l335m971j022J318N110N127K367J66l070n834m334r23J490
$$ 7347 6314 2199 -1136 -6107 -7129 -5811 -701 4426 6793 6959 3889 -1945 -6279 -7202 -5712
2099e712M714N146K671k66k834n635m057j264J071L785M914M055K37j755n983
$$ -5712 -998 4148 6819 6553 3719 -1916 -5973 -7237 -6166 -2381 2533 6588 6825 5070 -913
2114i13m279k430J373M116N265L618J010j875o195m938k331k57M702N095M313
$$ -913 -5192 -7622 -6249 -2133 3132 6750 7760 5885 -310 -5248 -7579 -7836 -3134 1961 6274
2129F274K750l356n360n143l742J497L648N117N276J483k299m039o673l675J50
$$ 6274 9024 5668 308 -4835 -8577 -7080 -3432 1685 6961 8444 6145 2106 -4567 -8242 -8092
2144h092L741N971M798K731j666n736n714l945m19L793N366M449L636j611n205
$$ -8092 -4351 1620 6418 9149 7483 1747 -3967 -7912 -8331 -4538 828 5277 8913 7302 2097
2159B097m991n063m19L000N120O247K947l77n126o380n371r32L382N294O744K147
$$ 2097 -2894 -7957 -8376 -5376 -256 5991 8938 8561 3435 -2945 -8316 -9248 -5866 -572 6172 8319
2175H319m76m634m864o111k069L524N032O182M713j357n273n703m437k638J630
$$ 8319 7843 3209 -1655 -7766 -9835 -6311 -1279 4903 9616 8259 2986 -2717 -7154 -9792 -8162
2190h162O371O215M391Q59m225o779o584j675J374O122O288N081N9k888o763o662
$$ -8162 -1791 4424 8815 9674 5449 -1330 -7914 -9589 -8215 -2093 4195 9276 9335 6447 -316 -6978
2206f978l459J445N799O014M853J375k354p666n351l760J224N121P379N613Q47
$$ -6978 -10437 -8992 -3193 2821 7674 9049 6695 -971 -6322 -10082 -8858 -3737 3642 9255 10102
2221A0102k091p655o067m390J180M450P241N970J701k802o421p292l890q33N682
$$ 10102 8011 356 -5711 -10101 -8921 -4471 2770 8740 10441 7639 1218 -6074 -9964 -10797 -5115
2236e115N932P084K332k848n850o506m713n04L515P046P208L069l89q032o627
$$ -5115 817 7901 10233 7385 1535 -4971 -9684 -10188 -6673 373 7581 10650 10261 2229 -4398
2251d398n497n07L764P518O846L204j687n885o368o536k013L682O913P496L706
$$ -4398 -9895 -10402 -6638 880 7726 10930 9243 3358 -3010 -9546 -11559 -7877 -964 6532 10238
2266A0238j033n168o504o600k023L138O622P624M534l14n546p622o469l077L744
$$ 10238 9205 4037 -2467 -9067 -11090 -7952 -1330 6294 10828 10514 4968 -2654 -9123 -12200 -8456
2281h456O626O658N623ql788q756o682l240K375O556P785N928K94m541p101o846
$$ -8456 -1830 4828 10451 10443 6655 -2101 -8783 -12023 -9648 -3092 4693 10621 10915 6374 -727 -7573
2297g573m055K651O192P920N168N15l864o772p603l365J911L964R255N692J604
$$ -7573 -11628 -8977 -2785 5135 10303 10818 6954 182 -7421 -10786 -8875 -4911 4344 10036 11640
2312A1640m532o427p646n083J595M746P862O769J317j187q114p927m902R58M529
$$ 11640 7108 681 -6965 -12048 -10453 -5707 2155 8924 10241 9054 940 -6987 -11889 -10931 -6402
2327f402P500Q217K517l126n426q310n239r34N536O725P403L583k412n920q123
$$ -6402 1098 9315 11832 8706 3280 -5030 -10269 -11203 -5667 1058 8461 12044 9632 3712 -4411
2342d411o287j775M848O917R275L107n72p226p688o087j883L396Q162P581L794
$$ -4411 -10698 -12473 -7625 -708 8567 11674 11102 3876 -3812 -9899 -11782 -8386 -224 7357 11151
2357A1151n20m949q809o068l013L258P800P715M379N03o256p607p228k462K865
$$ 11151 10631 5682 -3127 -9195 -12208 -8950 -1150 6565 10944 11447 5191 -2416 -9644 -12106 -9241
2372i241O731P733O088kn034q339o869l731L647O663P676N661N73l958q440q043
$$ -9241 -2510 5223 11311 11309 6275 -2064 -8933 -12664 -9017 -2354 5322 10983 11556 7598 -842 -8885
2388h885l271J565O724P935N754J699l737p573q382l943J710N545O992Q562M14
$$ -8885 -12156 -10591 -3867 4068 9822 11521 7784 211 -8171 -12114 -10404 -4859 2133 10695 11109
2403A1109l054p033q253m671J294M820Q162P504J956k804p911p540m963L60N157
$$ 11109 8055 1022 -7231 -11902 -10608 -5788 2374 9878 11834 9030 1119 -6421 -11384 -11024 -5867
2418e867Q166N996L100j911o501r632m304o25N143P708P607L405k444p189p140
$$ -5867 2299 8295 11395 9484 2983 -6649 -10953 -11578 -6435 1273 8880 12285 9841 2652 -4488
2433d488n934l12M073P338P070L623r17o519q528n942r47M717O911P401N208k205
$$ -4488 -10422 -10734 -6661 677 7747 11370 10453 3934 -4594 -10536 -11483 -6766 145 7546 12754 10549
2449A0549n518q237p409q66L077O878Q044N092j496m795q384o207k464K909O884
$$ 10549 5031 -3206 -10615 -11481 -8404 -1526 6518 11610 10114 5319 -3065 -9272 -11736 -8827 -1943
2464a943Q983L668J26m898p347o540l828K319O717P559O047j30m304p095p649
$$ -1943 7040 10708 10834 5936 -1411 -7951 -11779 -9460 -2743 4816 10863 10733 6429 -666 -8315
2479h315l656J940P458O845N296K142m710o817q146k798P23N209Q158O618J545
$$ -8315 -11971 -10031 -2573 4272 9568 11710 7000 183 -7963 -10761 -10038 -4829 3329 9947 11492
2494A1492m337n539q930m572J691N816O352P038K332l387o485q584m119J159M588
$$ 11492 7155 1616 -7314 -11886 -10195 -4379 1973 9011 11343 7956 1471 -7113 -11232 -10073 -5485
2509e485P966N988K656l186o211p553m140m22M393O909P030L075k372o326p099
$$ -5485 2481 8469 11125 7939 1728 -5825 -9965 -10387 -5994 915 7945 11020 8648 2322 -4777
2524d777m563k093M911O521P320L562k342n351p481n140j032L939N608Q340L171
$$ -4777 -9340 -11433 -6522 -1 7319 10881 8539 3188 -4293 -9433 -10465 -6526 -918 7422 10593
2539A0593j500m902p792n322k463L874N934P061N425j579m121q063o012j408L255
$$ 10593 9093 4191 -3601 -8923 -11386 -7512 -1578 5483 10908 9329 5208 -2855 -8867 -10275 -7020
2554g020O084O197M950j12m452p250o162k580K619N208P219M813j22l640o739
$$ -7020 -936 5261 10211 10099 5647 -1603 -7765 -10345 -7726 -2518 4701 9514 9392 5752 -987
2569i87o318k715J515O437O675M582N17l863o774n660l798K049O061N743O122
$$ -987 -7305 -10020 -8505 -2068 4607 9189 9706 5843 -931 -6591 -10389 -8340 -2279 3464 9586
2584I586N60k904p270o207l291R88N060O317N816J295l047n897n560m966N40N394
$$ 9586 10146 7242 -28 -6235 -9526 -8538 -3478 2839 8655 9950 6903 1006 -4554 -9520 -8980 -3586
2600c586N769N261K281k876n214o720l894p44N027P417M226K373k371m887n844
$$ -3586 2183 7444 9725 6849 1635 -5085 -8979 -9723 -4696 2721 6947 9320 6949 2062 -3782
2615c782n279K16M050N795N581K267p55n443n552n022j038K662O608N763K438
$$ -3782 -9061 -8845 -4795 1000 6581 8848 8093 2650 -2902 -7924 -8962 -6300 308 6071 8509
2630H509j326l565p007m414r71K749N794O189L037q91n620m737m820j684L161
$$ 8509 7183 3618 -3389 -7803 -8774 -6025 -231 5958 8995 8104 2484 -2253 -7073 -8757 -5596
2645e596N072O223K784r12m672m947m397k195J429O633N166L878k66l323o270
$$ -5596 -524 5699 8483 7571 2899 -2048 -6445 -8640 -7211 -578 4588 8466 8200 4877 -1393
2660a393m901k359J611N759M648M638o30k625m730n623j925R90M510N298L933
$$ -1393 -6294 -8653 -7042 -1283 3365 8003 7373 4748 18 -5605 -7530 -6540 -2030 3268 7201
2675G201J286l263m891m943l824J206M263N665M081J552k404o010m969l095J409
$$ 7201 8487 5224 333 -4610 -8434 -7228 -2965 2700 6781 8333 5929 -81 -5050 -8145 -6736
2690f736L184N703M331J086k220n620m226l102J296K567N281M754N35j630m496
$$ -6736 -3552 2151 6482 7568 5348 -272 -4498 -7600 -6304 -3737 1544 6298 6833 5203 707
2705G07l842l919L21K570N188M515J550j639l589n117k431k49K309M035M858L016
$$ 707 -3135 -7054 -6733 -4163 1025 5540 7090 5451 1862 -3255 -5686 -5935 -3626 409 5267 8283
2721H283k270l509o093l321k67K896M104M304K804j402l015m298l732q56J236
$$ 8283 6013 2504 -3589 -6910 -7177 -4281 -177 4127 6931 5529 2514 -1784 -5516 -6372 -5136
2736e136M719L884L290p60l006m092m041j853L024L269M180L216m13l866l505
$$ -5136 -417 3467 6757 5997 2991 -1101 -5142 -6995 -3971 -702 3478 6694 6281 2415 -1090
2751a090l184k510K322L003M257K840Q88l261l775l801j710J681K368M379L088
$$ -1090 -4274 -6784 -4462 -1459 2798 5638 6526 3265 -510 -4311 -6021 -4340 -1972 2407 5495
2766E495M11k424m096l674k069J725L406L245K596J518j910l993m244j976R59
$$ 5495 5906 3482 -614 -4288 -6357 -4632 -1226 2019 4615 6133 4223 230 -4014 -5990 -5031
2781e031K684L248L786P68j745k710m868j393J132K435K989K489J560j285l011
$$ -5031 -2347 901 4687 5455 3710 1000 -3868 -5261 -4129 -1694 1295 3784 5344 4059 1048
2796A048l781j946k79K787L454L027Q32j139l653l464j693l35K306L549L089M53
$$ 1048 -2733 -4679 -4958 -2171 1283 4310 5142 4003 350 -3114 -4807 -5142 -2836 713 3802 4255
2812D255J40l483l007k042o72J862L365L951O40j082j545l380l504J72J113K298
$$ 4255 4395 912 -2095 -4137 -4809 -2947 418 4369 5009 3927 2382 -998 -4502 -4330 -3217 -919
2828i19K560K913Q7k936k883j912j107K076K559J846K280q14j549l231k521n14
$$ -919 1641 4554 4641 1705 -1178 -3090 -4197 -2121 438 2284 4564 3750 2201 -1030 -3551 -4065
2844d065P29L059L202K240j434k228j624l408l12l07L082K576K319m82p85k792
$$ -4065 -3336 -277 2925 5165 3731 1503 -121 -3529 -3841 -4148 -1066 1510 3829 3347 2562 -230
2860b30l351j46N57J807K434K372Q45k037k462j980j844P42K659J640J699K254
$$ -230 -3581 -3727 -3170 -1363 1071 3443 4288 2251 -211 -2191 -4035 -3293 -634 1006 2705 4959
2876D959j742k929j978j993n11L101K060K302m01P5l764l9k743J73K286J321K226
$$ 4959 3217 288 -1690 -3683 -4194 -1093 967 3269 2868 2943 -821 -860 -3603 -3430 -1144 177 2403
2893B403J288o68j338k583k893J574K43K296K276P99m99k419k573n27q16J886
$$ 2403 3691 3023 1685 -898 -3791 -2217 -1974 322 2598 3397 2898 479 -2094 -2621 -3437 -1551
2909a551J518K318L96o91o01k997j105K50J039J734J597P27O03k342j572j536
$$ -1551 -33 2285 2681 1990 1389 -1608 -2713 -2463 -1424 310 1907 2634 3237 895 -677 -2213
2925b213k90M51J981P35K386j117m59j527k939O24J398p5K306J843o92j324j708
$$ -2213 -2503 -2052 -71 664 3050 1933 1474 -53 -2992 -2368 -970 -1045 1261 3104 2412 1088 -620
2942f20k020l03J690J151N82R11J272p44k799r60n17P00J441K019J101q12m17
$$ -620 -2640 -2943 -1253 -102 480 1391 2663 1919 -880 -1840 -2357 -1657 -216 1803 2904 2092 1675
2959A675j218k485j84K89J090R96K086R98j949n70j897m56j8J094J971K78K99
$$ 1675 457 -2028 -2212 -1923 -833 163 2249 3247 1298 728 -1169 -1625 -1643 -549 1422 1700 1999
2976A999O0j931j198q92Q0J189J352J073J4j092o61o69j323P46O03K16K706P9
$$ 1999 2059 128 -1070 -1962 -1882 -693 659 1732 1746 654 -7 -676 -1999 -1253 -650 -434 2272 2351
2994B351j029j373M37j912p18J113J273J334k65P4j066j335r98J281J31Q02K006
$$ 2351 1322 -51 386 -1526 -2244 -1131 142 1476 1211 1285 219 -1116 -2114 -833 -702 100 2106
3011B106n38l11j330m8j586K29J17J160Q11J597p32n10j297j343M09K53J086O84
$$ 2106 1568 1257 -73 -121 -1707 -1478 -1361 -201 610 2207 1475 965 -332 -1675 -1266 -1013 73 757
3029G57J688o26k95k170j86r01L61J149O87P30r5o99o08j145K93J65J51J765q17
$$ 757 2445 1819 1524 -646 -832 -1733 -1372 -223 464 1194 1099 400 -208 -1353 -1060 -895 -744 1021 204
3048B04P69n45r6j141j37j205K258J6J439l06j359J74l56l26K00L11J261l19M54
$$ 204 973 428 332 -809 -946 -2151 107 123 1562 1256 -103 71 -285 -611 -411 -100 1161 842 1296
3067A296n29k45j067j122J025M74K36N20M48j510L73l22l81j95M46L14J463q52
$$ 1296 767 522 -545 -1667 -642 -168 68 588 1036 -474 -101 -423 -804 -999 -553 -239 1224 372
3085C72P6p32l6j495J050R86m76J040O98j628r6p52n49J177n91J533o35K99P92
$$ 372 448 -284 -320 -1815 -765 221 -255 785 1483 -145 -241 -993 -1542 -365 -956 577 -58 241 1033
3104A033o21M5n96m53K13M36K52Q78k51j40p32o35k66K07P70R00K99p82l10o08
$$ 1033 412 457 -139 -592 -379 57 309 1187 936 796 64 -571 -837 -630 140 1040 1339 557 247 -361
3124c61Q4q06N80J036J61M35j93l25j753Q84l12J6R73l80N16n16R25j409k07L07
$$ -361 -277 -1083 -503 533 694 1129 936 611 -1142 -258 -570 -554 419 39 555 39 964 -445 -652 -345
3144c45q81J658K5j90J53N4Q3q85j71k67N06L1L34L56p4j082Q55q91J059o84L8
$$ -345 -1226 432 457 267 420 474 557 -328 -499 -766 -260 -229 105 461 387 -695 160 -731 328 -356 -318
3165c18Q39j62o86J104p33p13M12K10j25O51K43q74L41p00l95Q70p29R10K43J26
$$ -318 521 359 -327 777 44 -669 -257 -47 -172 479 722 -152 189 -511 -906 -36 -765 145 388 514
3185E14j113L40L2j90L5K51Q66j56m52M56l31N1o01K99k53M73k1r33R23r98p3
$$ 514 -599 -259 -227 -417 -382 -131 735 579 127 583 252 303 -298 1 -252 221 200 -733 190 -808 -881
3206h81O42j31L96LK79k19J01k36o06N26N7k76jo17J766m42r28J148k86k48n58
$$ -881 -239 -370 26 29 308 89 190 -46 -652 -126 -69 -345 -346 -963 803 361 -567 581 295 47 -511
3227e11O42J357j455r5L31j28o22m98J341P66j839N08k47J060k017p1J948J42
$$ -511 131 1488 33 -62 269 141 -481 -979 362 1128 -711 -203 -450 610 -1407 -1478 470 612
3245F12o56q41J876j601M01k07Q44p30j10J202j080O92J31n10j189J061l57R24
$$ 612 -44 -885 991 -610 -209 -416 428 -302 -412 790 -290 402 533 23 -1166 -105 -462 462
3263D62p71M85p35Q74n21k32J171j152J66L83L67n30Q97j016P07m77m59l87J432
$$ 462 -309 176 -559 315 -206 -438 733 -419 -253 130 497 -33 864 -152 555 78 -381 -768 664
3282F64p12M76J6p87M38o27L83m72M24L00j08J95m70M28j67j027J167q99J115
$$ 664 -48 428 444 -343 95 -532 -149 -621 -197 103 -5 190 -280 148 -19 -1046 121 -778 337
3301C37m05K99o6O63k002J481m32j07J75m05P65q16J069l66p49N59m1m82R0l3
$$ 337 -68 231 165 828 -1174 307 -125 -232 -57 -462 303 -513 556 190 -559 0 -41 -523 -433 -466
3321d66O25M83q37P56j162O5L32N6K40K03n12O22j086J144m6p96N33m54O99p82
$$ -466 159 642 -195 561 -601 -536 -204 -148 92 295 -217 405 -681 463 417 -379 154 -300 399 -383
3341c83k85O29n01K50R77m71L26j250J442j886J476p7n38Ql43J709q13l59J98
$$ -383 -668 -39 -540 -290 687 216 542 -708 734 -1152 324 247 -291 -283 -626 1083 270 -89 109
3360A09n73R84l25o67J96k87N21n28M11j97k88P13j013J072r32R15Q7M11o26m28
$$ 109 -464 520 195 -472 -276 -563 -42 -570 -159 -356 -644 69 -944 128 -804 111 198 609 -17 -445
3380d45N31m98J23K90m96O05O48n50J53j53n84O03j546N70O96j183J516q04J050
$$ -445 86 -412 -289 1 -495 110 758 208 361 208 -376 227 -1319 -749 -53 -1236 280 -524 526
3399E26o49m64N89o04N09N83o80P25J46m12R1o75N7n57P81N2j31k6O80j249N05
$$ 526 -123 -587 2 -602 -93 490 -190 535 681 269 360 -315 -258 -815 -34 18 -113 -139 541 -708 -203
3420b03m80P53m57Q41j480k70J675m75K25o21M51k35K01n22R53l70p11J018M46
$$ -203 -683 70 -387 454 -1026 -1296 379 -96 129 -492 -41 -276 -75 -597 356 -14 -725 293 739
3439G39l68j13J43r99P33M6m38L93m61J38L95k25J03L43o55%J96J021n75o02n98
$$ 739 371 258 401 -598 135 181 -257 136 -325 -187 208 -17 86 429 -226 -226 -30 991 416 -186 -784
3460g84Q57L5n76n1K88J196j614J25R77m86j37N50O8n2p79L84n57L97r50P29K88
$$ -784 73 108 -468 -519 -231 965 -649 -524 453 -33 -170 380 448 396 -383 1 -556 -159 -1109 -380 -92
3481i2pL67l6K84q11k27M29K32K21o27j10k85M3K69K99m08J004n50J48p77N35
$$ -92 -99 268 232 516 -295 -522 -93 139 360 -267 -377 -662 -619 -350 -51 -459 545 -5 143 -634 -99
3502i9n1o6L53k72K27n63L08M55k69j14N72n34p6p4N75k62m27m55M07k58Q56r35
$$ -99 -150 -216 137 -135 92 -471 -163 292 23 -91 481 -53 -129 -203 372 110 -317 -772 -365 -623 233 -702
3524g02P09j0K00n62L28q4Q31j97k27p84M56o49J158m28o96M98j17J33l85P72
$$ -702 7 -3 197 -365 -37 -121 710 513 286 -498 -42 -691 467 39 -657 -159 -276 -143 -528 244
3544B44m79M95lL8q72J027m17P2m07O01r94j86O61m84Q15m13l5l23n41J038m55
$$ 244 -235 260 257 295 -577 450 33 105 -302 299 -695 -881 -220 -704 111 -302 -337 -660 -1201 -163 -618
3565f18R92K18q12O12j461J072M37o01l3P81q61k78K0M10L58n35K26L92j07j091
$$ -618 374 592 -220 392 -1069 3 440 -161 -194 587 -274 -552 -532 -122 236 -299 -73 319 212 -879
3585h79N05O62j30o90P30k88M1L96J88m00K48j153n1J178p15L82M81j61m81K53
$$ -879 -374 288 158 -532 198 -90 -49 347 535 135 383 -770 -821 357 -358 24 505 344 -137 116
3605A16k99M2n66O53O53o94m86L60J029q51O1n66P96n7L01j93j25o63J17O88r69
$$ 116 -183 -141 -707 -54 599 -95 -581 -221 808 -43 18 -548 248 191 492 299 174 -489 -372 316 -653
3626f53M70l01J206p39m85J048o12K04l16L23K62l09j94Q85p59j81P80l7k24q85
$$ -653 -183 -484 722 -17 -502 546 -66 138 -178 145 407 98 -96 789 30 -151 629 592 368 -517
3646e17L61l2j16J599j289m48P42p85J131l20K69j111Q95j99m70P15k68k86%Q95
$$ -517 -156 -188 -304 1295 6 -442 300 -485 646 326 595 -516 379 180 -290 425 157 -129 -129 766
3666G66m59L10o49j01k83J419n64k44l03K04j259J238k62O22l53j46J67pK55p7
$$ 766 307 617 -32 -133 -416 1003 439 195 -108 96 -1163 75 -187 435 82 -64 103 96 351 274
3686B74j78k65J057j64j174N29o5j73k12K10r60P69R11p55j30N42M23j065N09
$$ 274 96 -169 888 724 -450 79 14 -159 -371 -161 -1121 -352 559 -196 -326 216 639 -426 83
3705H3n19J328o93j39R6r9m24N9K26mM42k6J55l54j84Q4k62Q0O59j008o05M34
$$ 83 -436 892 199 60 156 57 -367 -308 -82 -86 356 330 485 131 -53 31 -231 -151 508 -500 -1105 -671
3727f71N65m60P81o51O43q01K15K31o41J073m94l46k03O18m38J149l96p93Q06
$$ -671 -106 -566 215 -436 207 -594 -379 -148 -789 284 -210 -556 -759 -141 -579 570 174 -619 187
3746A87N4K07l88q12J274m52k49k72K04J80m5K79o97K59j28K00O62P5l47o51K92
$$ 187 241 448 60 -752 522 70 -179 -451 -247 -67 -112 167 -530 -271 -399 -199 463 538 191 -460 -168
3767a68M1P15n53R0o71J290r20O32j017J330n70j01o12Q09n75k0Q98j281R48J68
$$ -168 -127 588 35 125 -546 744 -176 456 -561 769 199 98 -514 295 -280 -300 598 -683 265 433
3787D33n52l94J438o15l54M4k60L56j74o4K55M10j033R01o09n11O57K79l29K40
$$ 433 -119 -513 925 310 -44 0 -260 96 -78 -142 113 523 -510 391 -218 -729 -72 207 -122 118
3807A18j64o92J307N9p45J130m37k48M3j35k70K98n25m95N90R79n56J04M58j016
$$ 118 -46 -738 569 628 -117 1013 576 328 371 236 -34 264 -261 -756 -166 813 257 361 819 -197
3827a97J0P86p33O90o23k13k14N60j93j49M65m74L19M16r99J321j045m10Q03K18
$$ -197 -187 599 -134 556 -67 -280 -494 66 -127 -276 189 -285 34 450 -549 772 -273 -683 120 338
3847C38r82P34o36J025m98q55N61O37r53K04J067M6l07o35K33q22j7K087j981
$$ 338 -644 90 -546 479 -19 -874 -313 324 -629 -425 642 688 381 -254 -21 -843 -860 1227 -754
3866g54N47l96Q50M97j069O79J61n88m62J77mJ220j399L41M45j35k44L79p63P82
$$ -754 -207 -603 247 744 -325 354 515 -73 -535 -358 -362 858 -541 -200 245 110 -134 245 -518 264
3886B64n3q74R4O55k33R52j199L88L97j00N02l36L36q20l68M47J96k50l75K49
$$ 264 211 -663 -569 86 -147 805 -394 -6 391 291 793 457 793 -27 -395 52 248 -2 -377 -128
3906a28l68N01J56l96O39j065J788j064N91n18n28N55l48Q51j347O75m54N06J78
$$ -128 -496 5 161 -235 404 -661 1127 63 654 136 -392 163 -185 666 -681 -6 -460 46 224
3925B24J27n27K91K27k56P62r82Q23p49K72k72q1L47l7Q29j348N11J54j026N61
$$ 224 351 -176 115 342 86 848 -134 689 -60 212 -60 -141 206 169 998 -350 161 315 -711 -150
3945a50L21pR67p69o2o04M24L48j202R52l19k84L41m42J163q98Q22Rm79O24j61
$$ -150 171 164 1131 362 300 -304 120 468 -734 218 -101 -385 -44 -486 677 -221 601 610 131 755 594
3966E94p52L48m96L92k37J31N16n99K32l54n4K87k27L08o22J05R80k9j59J56o26
$$ 594 -158 190 -306 86 -151 -20 496 -103 129 -225 -279 8 -219 89 -533 -428 552 523 364 520 -106
3987a06M36J75r74J3Q8K11P80m16k07J3j9p7n51J88o5J090j61K5j104P32o4L1
$$ -106 330 505 -469 -456 -368 -157 623 207 0 13 -6 -83 -634 -446 -511 579 418 443 -661 71 7 38
4009C8K42K04n92K36p49j30L56M94L30j84j75m83N21p00N35N4N43J64l90j33K34
$$ 38 280 484 -108 128 -621 -751 -395 99 429 245 70 -413 108 -592 -57 -3 540 704 314 181 415
4030D15m00r27N42Q26m01j026J734p79J19P7j83N49j38n09k80j35J517o05J69
$$ 415 15 -912 -370 456 55 -971 763 -16 103 180 -3 546 408 -101 -381 -516 1001 396 565
4049E65k7r28L82p95M90mK36L11n40j62L86p9q6Q01r29M62K34m62l16Q12k03l62
$$ 565 538 -390 -8 -803 -313 -317 -81 230 -310 -472 -86 -165 -251 550 -379 83 317 -145 -461 351 148 -214
4071b14k0j83K02M52N2L94l50n88R94o01j36O7M96J51j408J455k99p42q2R1m76
$$ -214 -234 -417 -215 237 289 683 333 -255 739 138 2 69 565 716 -692 763 464 -278 -360 -269 -745
4092g45K65K70N64k5J43k76O26q86K87q99J216o81J50L13j09k8j64KR8K39J42
$$ -745 -480 -210 354 329 472 196 822 -64 223 -676 540 -141 9 322 213 185 21 23 121 360 502
4113E02j130K9N85m91J276m63L7j042J046N36q82j67p82J120k12j128J223M1j08
$$ 502 -628 -599 -14 -505 771 308 345 -697 349 885 3 -164 -946 174 -38 -1166 57 98 -10
4132a0o18Q19M71l76n36k90N70q12J055L53q7r35K38m2R3k41J23O43j71p59P16
$$ -10 -628 191 662 286 -250 -540 30 -782 273 626 539 -396 -158 -200 -107 -348 -225 418 247 -512 204
4153B04o53M88L76n87m05J410j50l1j287L4P61N40n62n75R70j093J124n55p67
$$ 204 -449 39 415 -172 -577 833 683 652 -635 -601 160 700 138 -437 533 -560 564 9 -758
4172g58R23p43R32Kr57L69k00N45m79N17M03k30p76P32p8j56J11m84L34M56l51
$$ -758 165 -578 354 356 -601 -232 -432 113 -366 151 554 324 -452 280 202 46 157 -327 7 463 112
4193A12M68q54j93M20M15k44k87M76p30K55O93l0m82N40p79O11Q2Nn29K87k32
$$ 112 580 -274 -467 -47 368 124 -163 313 -417 -162 531 501 19 559 -220 391 473 478 -51 236 4
4214DJ110j282j14L25j80j58K04J91o94N03k79Q84k89l33O56m61j02N3l03L71
$$ 4 1114 -168 -282 43 -137 -295 -91 100 -594 -91 -370 514 225 -108 548 87 -15 38 -265 106
4234A06l23N1k83N36r54O85L38j31l76k2Q41k40q09N73N35o33K0m58J31q3J603
$$ 106 -217 -166 -449 87 -867 -182 156 25 -351 -373 468 228 -581 -8 527 -106 -86 -544 -413 -496 1107
4255A107j769J297k39m06q8Q1P0L77J55p11O43K64q11L77k33j139O88r5Q17p53
$$ 1107 -662 635 396 -10 -98 -17 53 430 585 -126 517 781 -30 347 114 -1025 -337 -432 385 -368
4275c68J126r9o39N06p37k09P07o23r9J463j371l0M95L84q73K33J79N33q41k06
$$ -368 758 659 20 526 -211 -420 287 -336 -435 1028 -343 -373 122 506 -367 -134 45 578 -263 -469
4295d69Q46o29N3k00J355j330O37m47m36J41j0L00Q04n47j83N91n37M10J10n7
$$ -469 377 -252 -199 -399 956 -374 263 -184 -620 -479 -489 -189 615 68 -115 476 -61 349 459 402
4315D02j190J005o24K08O37k91n22O87N8q29L91k25N79q74j62K15K16M09k1J8
$$ 402 -788 217 -407 -199 438 147 -375 312 370 -459 -68 -293 286 -588 -750 -535 -319 90 69 87
4335H7m92k89J113J08k86j74m61KM0K54J76Q29n56K36l69m37n08l68K57L8M60
$$ 87 -405 -694 419 527 241 67 -394 -392 -352 -98 78 907 351 587 218 -219 -727 -1095 -838 -800 -340
4356c40Q77p70j83P67r12N42K44m53j68J60N92o6j70mk79l56M89n07O04m54n3
$$ -340 537 -233 -416 351 -561 -19 225 -228 -396 -236 356 290 120 116 -163 -519 -30 -537 67 -387 -440
4377d40L37m37O77j069J525q3k89q63J395n58n0r60J8J595o39q15J136M5M74j107
$$ -440 -103 -540 137 -932 593 510 221 -642 753 195 145 -815 -797 798 159 -656 480 525 999 -108
4397a08o1j76QQ4L51j77K93M5N83j130O66J44r46L33m25R08m91q38J86J290j767
$$ -108 -169 -345 -337 -253 98 -79 214 259 842 -288 378 522 -424 -91 -516 392 -99 -937 -751 539 -1228
4418a228J577j29K72k55o24j24Q68k03j35P3j60M1J306q09J09j511P52r67R82
$$ -1228 349 220 492 237 -387 -511 357 154 19 92 -68 -27 1279 470 579 -932 -180 -1147 -165
4437a65L78m2M40p22j17K27K2j84n06J021N6p62P62L74j237P30m32j81M61n8j32
$$ -165 213 171 611 -111 -228 -1 21 -163 -669 352 408 -354 408 782 -455 275 -157 -338 123 65 -67
4458f7n25R70n87p6P5L73k3k89Q11m39j51K52p74N29o70Q74k9o1kJ45o45k67N96
$$ -67 -592 378 -209 -285 -210 163 140 -149 662 223 72 324 -450 79 -591 283 254 193 191 336 -309 -576 20
4481B0m55J000l5J11J89o71n57j07P06k48l11J285j051J009r75j93K24l98M15
$$ 20 -435 565 530 641 830 159 -398 -505 201 -47 -358 927 -124 885 -90 -283 -59 -457 -42
4500d2K76L36r19J90L77J67k71n05J006j111L5K22R59m07k11q47M26L7q3P48N1
$$ -42 234 570 -349 -159 218 385 114 -391 615 -496 -461 -239 720 313 102 -745 -319 -282 -365 383 434
4521D34J01O70o09j181j2P54j130J073p14Q85o27M32o05O6L0P3P94L80o27j03
$$ 434 535 1205 596 -585 -597 157 -973 100 -614 271 -356 76 -529 -463 -433 -360 434 814 187 84
4541H4O0n08n31N56Q37o25J077k32q69l95J723j530k5M73N82r82J378q16N8j22
$$ 84 144 -364 -895 -339 498 -127 950 718 -151 -546 1177 -353 -378 95 677 -305 1073 257 315 193
4561A93j52k32N89k55K93L64n64r35n20J267L68p39L23l05L68J123o37k79k80
$$ 193 41 -191 398 143 436 800 236 -699 -1219 48 416 -323 0 -305 63 1186 549 270 -10
4580a0o08K21J25J342J71q94J77n38q3l03Q3L86J21N92m07N89j116M07p20n65
$$ -10 -618 -397 -272 1070 1241 347 524 -14 -97 -400 -317 69 190 782 375 964 -152 255 -465 -1030
4600a030Q88J43N14o19L4n44j95M12J108q78Q29J00l50m06k60J31l49O37r35L84
$$ -1030 -142 1 515 -104 -70 -614 -809 -397 711 -167 662 762 412 6 -254 -123 -472 165 -770 -386
4620c86m56J101K15Mj729Q91m91O34P50L58p08K10k58l39l58J09L55m28J792n33
$$ -386 -842 259 474 478 -1251 -360 -851 -217 533 891 183 393 135 -204 -562 -453 -98 -526 1266 733
4640G33n13o34M24k11o76N79M70J3N39o42o38J117n82m9K86P05j085L67L82j64
$$ 733 220 -414 10 -201 -877 -298 172 185 724 82 -556 561 -21 -70 216 921 -164 203 585 421
4660D21k94k41j14L5k85R0J071j58j70m52L56q15k71M54N09P70O07j289o41m47
$$ 421 127 -114 -228 -193 -478 -388 683 525 355 -97 259 -556 -827 -373 136 906 1513 224 -417 -864
4680h64M18R9L37K55R8l71J30j54k92j92K52m02J006j7O5L9p64K20j31o49R00
$$ -864 -446 -347 -10 245 343 -28 102 -52 -344 -536 -284 -686 320 303 368 407 -357 -137 -268 -917 -17
4701a7Q33m57J89m77L76m99p65k11Q01J166n05Q2o33qj053O86O33N36K63n77O82
$$ -17 816 359 548 71 447 -52 -817 -1028 -227 939 434 516 -117 -125 -1178 -492 141 677 940 363 1045
4722A045p95j373Q48p93M16k29N76J638k61r65j67m83l97k22J110J068o94Q96
$$ 1045 250 -1123 -275 -1068 -652 -881 -305 1333 1072 107 -60 -543 -940 -1162 -52 1016 322 1218
4740A218p56r79K58k73K39M65m11L83J395j088o74J005j088k35J05o3J375j069
$$ 1218 462 -517 -259 -532 -293 172 -239 144 1539 451 -223 782 -306 -541 -436 -499 876 -193
4758a93J4O13m36n23m38L47P74M15N6L8j164P2L66r5R22l89P07j9n67L2q13n25
$$ -193 -179 434 -2 -525 -963 -616 158 573 629 667 -497 -425 -59 -154 768 379 1086 1067 500 532 -281 -806
4780h06o20J191Q2J302p33J39o9m84p97K13P38j049J618n08N78l25r40O78j092
$$ -806 -1426 -235 -153 1149 416 555 486 2 -795 -582 156 -893 725 217 795 470 -470 208 -884
4799h84J54L96N84O85p33m77k22K88K39r72P11N69J23J92Mr59J91o08j19Q95K28
$$ -884 -730 -334 250 935 202 -275 -497 -209 30 -942 -231 338 461 653 657 -302 -111 -719 -838 57 285
4820B85k37P23L38j492m56o7J80J11J012n14N15J37K03j552L11k36O41P73O5K65
$$ 285 48 771 1109 -383 -839 -906 -726 -615 397 -117 398 535 738 -814 -503 -739 -98 675 740 1005
4840A005p49p35n40J128p7o38L26O58J335r41j071j58j005M75Q23k1K86J8O22
$$ 1005 256 -479 -1019 109 32 -606 -280 378 1713 772 -299 -457 -1462 -987 -164 -185 101 119 741
$$ [...]
8191b42
##END NTUPLES=NMR FID
##END=
