##TITLE=1H_UK-20
 CDCl3,8 sc, 
 3.9.2021
##JCAMPDX= 6.0         $$ Bruker NMR JCAMP-DX V2.0
##DATA TYPE= NMR FID
##DATA CLASS= NTUPLES
##ORIGIN= UXNMR, Bruker Analytische Messtechnik GmbH
##OWNER= root
$$ XWIN-NMR		Version 3.5
$$ Fri Sep  3 10:39:41 2021 Russian Standard Time (UT+4h)  she@DPX200
##.OBSERVE FREQUENCY= 200.13
##.OBSERVE NUCLEUS= ^1H
##.DELAY= (6, 6)
##.ACQUISITION MODE= SIMULTANEOUS
##.ACQUISITION SCHEME= undefined
##.AVERAGES= 8
##.DIGITISER RES= 18
##SPECTROMETER/DATA SYSTEM= spect
##.PULSE SEQUENCE= zg30
##.SOLVENT NAME= CDCl3
##.SHIFT REFERENCE= (INTERNAL, CDCl3, 0, 15.7039)
##AUDIT TRAIL= $$ (NUMBER, WHEN, WHO, WHERE, WHAT)
$$ ##TITLE= Audit trail, XWIN-NMR		Version 3.5
$$ ##JCAMPDX= 5.01
$$ ##ORIGIN= Bruker BioSpin GmbH
$$ ##OWNER= she
$$ F:/spectra/data/she/nmr/H-F/1/audita.txt
$$ ##AUDIT TRAIL=  $$ (NUMBER, WHEN, WHO, WHERE, WHAT)
(   1,<2021-09-03 10:38:30.53 +0400>,<she>,<DPX200>,
      <created by zg, POWCHK disabled, PULCHK disabled
       configuration hash MD5:
       00 E9 B6 7A A2 85 ED C7 34 08 36 98 17 FE 4E 26
       data hash MD5: 16K
       A7 A0 72 F0 17 B4 40 78 3D CD 5F 54 3C 9B 58 53>)
$$ ##END=
$$ 
$$ hash MD5
$$ 20 FA 03 F5 CA 71 DC 81 1B 20 3A EB D4 AF C0 65
##$RELAX= 
##$RELAX= 
##$RELAX= 
##$RELAX= 
##$RELAX= 
##$RELAX= 
$$ Bruker specific parameters
$$ --------------------------
##$DU= <F:/spectra>
##$EXPNO= 1
##$NAME= <H-F>
##$PROCNO= 1
##$TYPE= <nmr>
##$USER= <she>
##$AMP= (0..31)
100 100 100 100 100 100 100 100 100 100 100 100 100 100 100 100 100 100 
100 100 100 100 100 100 100 100 100 100 100 100 100 100 
##$AQSEQ= 0
##$AQ_mod= 1
##$AUNM= <au_zg>
##$AUTOPOS= <>
##$BF1= 200.13
##$BF2= 200.13
##$BF3= 200.13
##$BF4= 200.13
##$BF5= 200.13
##$BF6= 200.13
##$BF7= 200.13
##$BF8= 200.13
##$BYTORDA= 1
##$CFDGTYP= 0
##$CFRGTYP= 5
##$CHEMSTR= <none>
##$CNST= (0..31)
1 1 145 1 1 1 1 1 1 1 1 1 1 1 1 1 1 1 1 1 1 1 1 1 1 1 1 1 1 1 1 1 
##$CPDPRG= <>
##$CPDPRG1= <>
##$CPDPRG2= <>
##$CPDPRG3= <>
##$CPDPRG4= <mlev>
##$CPDPRG5= <mlev>
##$CPDPRG6= <mlev>
##$CPDPRG7= <mlev>
##$CPDPRG8= <mlev>
##$CPDPRGB= <>
##$CPDPRGT= <>
##$D= (0..31)
0 1.2 0 0 0 0 0 0 0 0.06 0 0.03 0 0 0 0 0.0002 0 0 0 0 0 0 0 0 0 0 0 0 
0 0 0 
##$DATE= 1630651109
##$DBL= (0..7)
120 120 120 120 120 120 120 120 
##$DBP= (0..7)
150 150 150 150 150 150 150 150 
##$DBP07= 0
##$DBPNAM0= <>
##$DBPNAM1= <>
##$DBPNAM2= <>
##$DBPNAM3= <>
##$DBPNAM4= <>
##$DBPNAM5= <>
##$DBPNAM6= <>
##$DBPNAM7= <>
##$DBPOAL= (0..7)
0.5 0.5 0.5 0.5 0.5 0.5 0.5 0.5 
##$DBPOFFS= (0..7)
0 0 0 0 0 0 0 0 
##$DE= 6
##$DECBNUC= <off>
##$DECIM= 32
##$DECNUC= <off>
##$DECSTAT= 4
##$DIGMOD= 1
##$DIGTYP= 9
##$DL= (0..7)
0 120 120 120 120 120 120 120 
##$DP= (0..7)
150 150 150 150 150 150 150 150 
##$DP07= 0
##$DPNAME0= <>
##$DPNAME1= <>
##$DPNAME2= <>
##$DPNAME3= <>
##$DPNAME4= <>
##$DPNAME5= <>
##$DPNAME6= <>
##$DPNAME7= <>
##$DPOAL= (0..7)
0.5 0.5 0.5 0.5 0.5 0.5 0.5 0.5 
##$DPOFFS= (0..7)
0 0 0 0 0 0 0 0 
##$DQDMODE= 0
##$DR= 18
##$DS= 0
##$DSLIST= <SSSSSSSSSSSSSSS>
##$DSPFIRM= 0
$$ [...]
##$SUBNAM2= <"">
##$SUBNAM3= <"">
##$SUBNAM4= <"">
##$SUBNAM5= <"">
##$SUBNAM6= <"">
##$SUBNAM7= <"">
##$SUBNAM8= <"">
##$SUBNAM9= <"">
##$SW= 22.9630152165798
##$SWIBOX= (0..15)
0 0 2 0 0 0 0 0 0 0 0 0 0 0 0 0 
##$SW_h= 4595.58823529412
##$TD= 16384
##$TD0= 1
##$TE= 0
##$TE2= 300
##$TE3= 300
##$TEG= 300
##$TL= (0..7)
0 120 120 120 120 120 120 120 
##$TP= (0..7)
150 150 150 150 150 150 150 150 
##$TP07= 0
##$TPNAME0= <>
##$TPNAME1= <>
##$TPNAME2= <>
##$TPNAME3= <>
##$TPNAME4= <>
##$TPNAME5= <>
##$TPNAME6= <>
##$TPNAME7= <>
##$TPOAL= (0..7)
0.5 0.5 0.5 0.5 0.5 0.5 0.5 0.5 
##$TPOFFS= (0..7)
0 0 0 0 0 0 0 0 
##$TUNHIN= 0
##$TUNHOUT= 0
##$TUNXOUT= 0
##$USERA1= <user>
##$USERA2= <user>
##$USERA3= <user>
##$USERA4= <user>
##$USERA5= <user>
##$V9= 5
##$VALIST= <valist>
##$VCLIST= <CCCCCCCCCCCCCCC>
##$VD= 0
##$VDLIST= <DDDDDDDDDDDDDDD>
##$VPLIST= <PPPPPPPPPPPPPPP>
##$VTLIST= <TTTTTTTTTTTTTTT>
##$WBST= 1024
##$WBSW= 4
##$XGAIN= (0..3)
0 0 0 0 
##$XL= 0
##$YL= 0
##$YMAX_a= 83995
##$YMIN_a= -53615
##$ZGOPTNS= <>
##$ZL1= 120
##$ZL2= 120
##$ZL3= 120
##$ZL4= 120
##$ABSF1= 10
##$ABSF2= 0
##$ABSG= 5
##$ABSL= 3
##$ALPHA= 0
##$AQORDER= 0
##$ASSFAC= 0
##$ASSFACI= 0
##$ASSFACX= 0
##$ASSWID= 0
##$AUNMP= <proc_1d>
##$AZFE= 0.1
##$AZFW= 0.1
##$BCFW= 1
##$BC_mod= 2
##$BYTORDP= 1
##$COROFFS= 0
##$CY= 11.3945322036743
##$DATMOD= 1
##$DC= 2
##$DFILT= <>
##$DTYPP= 0
##$F1P= 2.36226072786647
##$F2P= -0.459571619588291
##$FCOR= 0.5
##$FTSIZE= 0
##$FT_mod= 4
##$GAMMA= 1
##$GB= 0.15
##$INTBC= 1
##$INTSCL= 1
##$ISEN= 128
##$LB= 0.24
##$LEV0= 0
##$LPBIN= 0
##$MAXI= 10000
##$MC2= 0
##$MEAN= 0
##$ME_mod= 0
##$MI= 1.114404
##$NCOEF= 0
##$NC_proc= 0
##$NLEV= 6
##$NOISF1= 3.799351
##$NOISF2= 2.8
##$NSP= 1
##$NTH_PI= 0
##$NZP= 0
##$OFFSET= 15.70392
##$PC= 1
##$PHC0= -13711.5
##$PHC1= 14.00097
##$PH_mod= 1
##$PKNL= yes
##$PPARMOD= 0
##$PSCAL= 0
##$PSIGN= 0
##$REVERSE= no
##$SF= 200.130013532006
##$SI= 16384
##$SIGF1= 3
##$SIGF2= 2
##$SINO= 400
##$SIOLD= 16384
##$SREGLST= <1H.CDCl3>
##$SSB= 0
##$STSI= 0
##$STSR= 0
##$SW_p= 3612.71676300578
##$SYMM= 0
##$S_DEV= 0
##$TDeff= 0
##$TDoff= 0
##$TI= <>
##$TILT= no
##$TM1= 0
##$TM2= 0
##$TOPLEV= 0
##$USERP1= <user>
##$USERP2= <user>
##$USERP3= <user>
##$USERP4= <user>
##$USERP5= <user>
##$WDW= 1
##$XDIM= 8192
##$YMAX_p= 0
##$YMIN_p= 0
$$ End of Bruker specific parameters
$$ ---------------------------------
##NTUPLES= NMR FID
##VAR_NAME=  TIME,          FID/REAL,        FID/IMAG
##SYMBOL=    X,             R,               I
##VAR_TYPE=  INDEPENDENT,   DEPENDENT,       DEPENDENT
##VAR_FORM=  AFFN,          ASDF,            ASDF
##VAR_DIM=   8192,          8192,            8192
##UNITS=     SECONDS,       ARBITRARY UNITS, ARBITRARY UNITS
##FACTOR=    0.0002176,     1,               1
##FIRST=     0,             0,               0
##LAST=      1.7823616,     0,               0
##MIN=       0,             -53615,          0
##MAX=       1.7823616,     83995,           0
$$ Real data points
##PAGE= N=1
##DATA TABLE= (X++(R..R)), XYDATA
0@%%%%%%%%%%%%%%qJ6j6J6j6J8k6L2l4M2n0N8p2Q1q9J04j20J37j57J80k03K28
36A21k57K87l21L60m02M45m93N47o03O67p37Q12q95R85j086J197j318J454j609
55h46J781j972K194k452K753l113L552m100M808n760P113r210J2928k1468Q0293
70F6501J7494q4762N7169l4940m1261L0773k0396m4193N9638k149m9333L6391
82i068J9772m9019K0910J6917k9944K8710K6425l8721K3010L5904l7676r407K7619
95B5432k3490l389K1036k5865m353L6205k1960k5350K4255q533j9767J9997m879
108a0661r255L0190j312k2731K3433O563k5586R479N959j4330J6433O923j9555
121d450J5923J2952k6554k937R007j6885J338Q867j4564R902K0102j6721l410
$$ y = [0, 0, 0, 0, 0, 0, 0, 0, 0, 0, 0, 0, 0, 0, 0, -8, 8, -8, 8, -8, 10, -16, 16, -18, 24, -26, 32, -40, 41, -48, 56, -64, 73, -84, 96, -107, 121, -136, 151, -170, 190, -212, 233, -260, 287, -316, 351, -386, 426, -469, 516, -570, 627, -691, 763, -846, 935, -1037, 1157, -1295, 1458, -1655, 1897, -2203, 2605, -3155, 3958, -5252, 7676, -13792, 66501, 83995, -767, 56402, 21462, -19799, 10974, -9422, -53615, 6023, 3874, -45459, -9068, 10704, -38315, -17405, -488, -30432, -1722, 24703, -14018, 8992, 44896, 7220, -2187, 25432, 1942, -1447, 19589, -6276, -10629, 25576, 3616, -21734, 2521, -6012, -25779, -5782, -10661, -19916, 10274, 8962, -13769, 9664, 16227, -9359, 120, 6079, -8251, 8182, 15105, -4450, 11473, 24425, -2129, -5066, 3941, -12944, -11606, -2739, -17303, -7401, 12701, -4020, -7430]
134g430J6625j1745k817J1350j0417M255J6857j1471m699J3207r538j0029N701
147a51p493l649J1658n517l675J5792j963r909P017j959n526Q937k830m935J4209
162A0006J569j1422L186J75j0586K951l98q360J0351P805q666N481P970r955l58
177b51L618r649L156Q590q792J975J1813q014n186O337p707k953Q605o207k121
192f786J4223j759p786P178k624q787O332k459p784J1534M001q886P904L951j0111
207a859K701J685r099M910O148p716L800Q945q344l112M090q220j354O789n764
222f400N3J2588k759m133P283l500m976M617l515m946Q888J268o903N748J973
237E286q643J592M97p001M789M128n162N397O731o331p37K905n255m49L418m674
$$ y = [-7430, 9195, -2550, -5367, 5983, -4434, -179, 16678, 5207, 508, 13715, 4177, -5852, -151, -7644, -11293, 365, -5152, -8827, 6965, 5002, -4907, 2110, 151, -5375, 3562, 732, -4203, 10006, 11575, 153, 3339, 3514, -7072, -4121, -4519, -12879, -2528, 5277, -3389, 2092, 10062, 107, -251, 3367, -6282, -3126, 5464, -3328, -1353, 10460, 2446, -2740, 3597, -4110, -7063, 1542, -4665, -6786, 7437, 5678, -2108, 5070, 2446, -6341, -9, -2468, -10252, 1282, 5283, -3603, 4301, 8252, -1859, 842, 2527, -6572, -1662, 4486, -3230, 570, 9515, 1171, -1941, 2149, -6071, -7425, -636, -6400, -6347, 6241, 3482, -651, 6632, 3132, -1844, 2773, -742, -5688, 3200, 4468, -2435, 3313, 5286, -3357, -1765, -1268, -8269, -3480, 648, -4514, 883, 7614, 1283, 546, 3451, -1804, -2253, 1165, -3509]
253c509J358P180k021l235L532k211m031J226j287j656N220J403k908M057J171
268D289m934p07P8l195K304J633j113L184L612k293j631P56k043j885N30p33J497
285f51K842m86j369P92j062k565n49n78R54K520J243J122J549P7j670j413j752
302i96p59M49n14J247K107l20m23k74k070m90J04j623J346L887pP10J916j846
320B444j534p2k657j710K723o91k02L469N49k146J026j280l216K079N0j524L768
337A076K299k557J667N65l748l43M53l126J162L691j007L80L226k196k445J741
353H38k323k173L300n3j313M514j65k607J303p58l395J094J290j849K923K729
369C355k301R15J513m201j061J667k707l2L549r75K58L053k073k076J751j610
$$ y = [-3509, -2151, 5029, 3008, -227, 3305, 1094, -2937, -1711, -2998, -4654, 566, 1969, -939, 3118, 4289, -645, -1352, -1274, -4469, -2165, -532, -1645, 1539, 5151, 2858, 1227, 1983, -60, -1945, -1415, -2148, -651, 2191, 1705, 336, 1128, 66, -2499, -3048, -3626, -2672, -152, 1091, 2213, 3762, 3839, 2169, 756, -996, -1755, -1306, -1820, -573, 1534, 1214, 791, 517, -1553, -2043, -1939, -3562, -2216, 1671, 1664, 2374, 4290, 2444, 910, 838, -1819, -3529, -806, -1497, -1699, 1770, 2319, 173, 1199, -81, -3297, -1218, -1168, -2692, 1076, 3375, 818, 2485, 3050, -698, -1041, -588, -3714, -2552, 1139, 132, 512, 3738, 1542, -903, 838, -1485, -3658, -358, -411, -1724, 2790, 2625, 18, 1321, 563, -2832, -1738, -448, -2297, 626, 3355, 1054, 1969, 3482, -719, -1780, -113, -2820, -2852, 697, -278, -20, 3033, 960, -1116, 635, -975]
385i75k182L066N90j101L173Q37l226J091n30l592N88J278j405J870K256j145
401E93Q61R27k672p62Q46j212j32K468J03m35J676q45k051K53p85j902J606J281
419a82jJ784J062j486j14m04j626p71R85l41M52J999po84L74j224j306n0N33o34
439a641J632J591l27L59J27j239j044n55n45m94J503J313j79R55K25j415j81p66
457f81r67O50N69M68R68R81m68p77l76j118q95L37K99L06J499N50j95J11k07j696
477f42m92O30j001M75J818j08k23J182j438q74M62j077n34J956N60l48J159P50
495B255j824j09j30k241M97J191j030J394J818j323m88J033j715p73J275q31R7
512i04K666m11m85J142j254j711L02n39r27J285J109m89J112J095k189lM06j428
$$ y = [-975, -3157, -91, 499, -602, 2571, 3408, 182, 1273, 743, -2849, -2261, -983, -2388, -518, 1738, 593, 1454, 2381, -291, -1053, -207, -1419, -1551, 917, 1020, 585, 2261, 1416, -635, -382, -1167, -3069, -1463, -182, -183, 1601, 2663, 1177, 1063, 659, -967, -1738, -753, -1094, -642, 1357, 1350, 666, 1040, -184, -1490, -1540, -1007, -1641, -9, 1582, 1255, 1614, 1741, 502, -542, -1097, -1642, -2136, -633, 680, 501, 1456, 1681, 266, 85, -681, -1648, -998, -429, 39, 1007, 1988, 1520, 743, 367, -751, -1646, -1309, -1010, -704, 795, 1345, 1150, 1261, 1054, -642, -1134, -504, -1505, -1030, 788, 680, 457, 1639, 201, -673, -211, -1288, -1822, 134, 694, 346, 1505, 2255, 431, 322, 192, -2049, -1552, -361, -1391, 3, 1821, 498, 10, 1043, -672, -1445, -170, -1001, -904, 1762, 1351, 866, 2008, 754, -957, -655, -1194, -2121, -836, 273, -216, 896, 1991, -198, -201, 205, -1223]
530a223J31J131n09M31J946p94j023Q70j151j633R83l32O8J755O09r91J287j79
548A376k089J83j41o34O45J181n95P59J045j438r41O66q86n04J177J13K91J175
566A383l47o26rl59j646L76M16kP58R88q5L3J17j318n24L33p4k34R54P08k46K45
588H41k03j209N0n29n18O48P83L49M19P67m59m77k11p30n93O37K14j99J130J06
608H16l09k70m39j136J74P35m03O30Q83P70m46J35r13o48m2l06k64R22L76j49
628A16M94j42o24l60j79n22N29J045l18Q5J211k10j147M07q98m82R28On76J452
648H15M01p12qn8j171O7j2n09P53J366n56n1N62j057o86N63o96j29J643j33J7
669D09R75l67q91K42j79j210L55N94p41J244O99j146RJ75r43l63P36k97J43J557
$$ y = [-1223, -1092, 39, -470, -39, 1907, 1113, 90, 960, -191, -1824, -841, -1173, -1105, 650, 1259, 268, 1555, 1376, -713, -530, -671, -1305, -660, 521, -74, 685, 1730, 292, -649, 17, -869, -1373, -196, -83, 208, 1383, 1036, 410, 401, 42, -1604, -1228, -812, -814, -56, 932, 847, 880, 997, -321, -845, -512, -586, -820, 134, 842, 596, 841, 638, -571, -521, -1050, -1568, -920, -137, 212, 631, 1398, 939, 462, 251, -479, -1072, -435, -221, -420, 710, 816, 507, 237, -202, -1338, -1164, -429, -832, -202, 681, 1451, 1005, 1140, 227, -421, -463, -769, -1033, -111, 265, 116, 610, 468, -156, -516, -695, -1217, -688, 357, 39, 124, 1335, 1125, -22, 385, -513, -995, -67, -61, -637, 815, 1216, 504, 496, 438, -733, -666, -678, -1187, -434, 932, 376, 325, 887, -170, -856, -293, -989, -1118, 525, 392, 409, 1384, 1017, 126, 368, 189, -1021, -666, -72, -813, 431, 1130, -16, -7, 168, -775, -1138, -402, -699, -556, 1001]
689A001n0l10K79j57j317N34m09j052J553R4j76Q84m2q96l81L17p05j61O51K0
709c23M32J119p92n03M89p15n74M72j82N2J050M1J17J39k00j068l5j32k72J91
729f94R40k19J43N12o30m58J67l06k21O03J83J78J014j38n26Nn50o46k05K97l11
750h62R19M00l30J19M0o23l42O49j56K39M78K90K23R6m84p85m38M45r88J61P45
771b04L08n0P84o00n13K40j23n08K97N46r9N30J84k78j49j66q65J6L33l06J12
792e11J101n4k77K21o54o84P12l02l83Q61M37k23M27K28r11J27k43o50M36P52
812D10o14O97L41r71K5L65q72l67M97m8m2J031Q9k30L83k51p74K61k31j15N51
833A35N38n74K73J39p89k93L48r15K37Q62n0K46O12j10p21L23J6p98M93Q2j80
$$ y = [1001, 951, 641, 920, 763, -554, -20, -429, -1481, 72, 166, -10, 874, 832, -64, -445, -128, -833, -994, -343, -323, 109, 1228, 436, -67, 422, -293, -867, -395, -577, -525, 525, 566, 683, 822, 622, -446, -481, -613, -885, -694, 246, 27, 170, 682, 52, -406, -239, -545, -766, -163, 20, 198, 1212, 1074, 548, 553, 3, -643, -848, -551, -862, 57, 457, 127, 246, 286, -337, -679, -30, -186, 53, 531, 821, 1044, 1140, 656, -129, -567, -122, -1110, -949, -204, 104, 54, 838, 238, -275, -35, -158, -666, -369, 177, 78, 608, 792, 514, 365, 199, -666, -650, -317, -623, -511, 590, 536, 259, 480, -174, -858, -146, -448, -831, 30, 467, 244, 671, 899, -12, 115, -128, -778, -342, 410, -204, 493, 834, -137, -112, 253, -619, -986, -489, -537, -579, 452, 541, 311, 694, 443, -331, -70, -301, -416, 135, 673, 99, 372, 511, -278, -571, -223, -1138, -901, -39, -89, 157, 769, 659, -62, 261, 277, -521, -28, 54, -126]
854a26O22J02n20j12K32r80M0N08l21K76P92j35j17K03m42l65J88q5l05O17L42
875D14l94M17J42q28J22J62m38J12K03r8M72J76k08j61K74p52O5M8K82m39Q80
896D51k10j16L80k14k27j69J8k37q5L07J62K59J12l05m12n5J48j72J54L65K21
917C75K53R8n55m5K5n41K05J1N6K72J89k51j2K07o23k04J43K36k43N94J29o6K35
940D88j64n75J2R5l03K29M09K07l0n3m84k39K77j52j44N71k09n9M22r6J53o6k76
963A3m68K31K00j00M69L3j20l4J13q6m00N6m66K51N39J5j82K68j82k87J82m76
985d31j2J42M93k73N00J05l72K5j94l08k03M69k23L26M81k92l43L45m15j93L14
1006e9n6RJ96K36k53J89o8%n70n2k30M10L29o5N1K72j83k62J09j37j80%L24J74
$$ y = [-126, 496, 598, 78, -34, 198, -782, -742, -234, -555, -279, 513, 378, 261, 464, 22, -343, -155, -240, -545, 72, 414, 20, 437, 579, -249, -127, 35, -403, -291, -88, -186, 286, 462, 254, 93, 367, -385, -320, -272, 10, -429, 451, 241, 125, 505, 291, 64, -105, -87, -324, -409, -102, 60, 319, 431, 126, -286, -341, -193, -365, -211, 154, 375, 628, 726, 171, 126, 151, -390, -185, -174, -118, 154, 343, 92, 80, 287, -336, -540, -397, -161, -404, 190, 319, 253, 488, 324, -251, -239, -144, -447, -218, 191, 398, 368, 315, -169, -408, -131, -283, -427, 144, -65, -124, 298, 202, 355, 289, 13, -455, -224, -24, -124, 345, 378, 258, 224, 337, 251, -149, -93, -559, -308, 231, 246, 64, 332, 150, -137, 45, -431, -443, -301, 192, -81, 419, 524, 152, 177, -17, -325, -528, -59, -282, 44, 525, 233, -110, 235, -180, -373, -59, -115, -106, 90, 326, 73, 262, 194, 194, -376, -428, -658, -248, 81, 16, 67, 339, 156, -106, 3, -134, -314, -314, 10, 184]
1030A84J48J77m44J18Q3n38o9L32l56J08M51K62l03K40l10l94K49k28J05J73N2
1051D0j40P57k80l49l6k17k56M00j2J19L63k14o7q9L05p38K2L47j91L46k01J00
1073IL25j66p8j54j72N86p02L03J79J19nP5n59J78l1Q3k27K37J60o7J10k1j06
1096G6j34L6n02N96k13J10K36P6m1o8k35j70N3L91j74q0m2K07k4O3n9j77j83J52
1120a06j15l7L53j42K4L44l95L34k47m18K0L77J32j77K26L22m77r3Q3n74M68M7
1142e1j30R3M95k28N2J4k94j83O2N0o1K46k52K32L67l80j47J03l89K00L45q5k04
1165a45M15l9l0l45j32K44k68Q5J23M44p7j03J07j78k48q9K6J58n9L47j52N9J7
1188A60K57m74j10q3R7J24OJ44k8K63n23L03j79K4j57J09J24j02M03j72j53j64
$$ y = [184, 332, 509, 65, 183, 266, -272, -341, -9, -365, -257, 194, 456, 153, 393, 83, -311, -62, -290, -185, -12, 40, -100, 657, 377, 28, -8, -225, -481, -81, -93, 26, 389, 175, 108, 19, 324, -414, -392, -45, -236, 110, -91, 9, 334, 168, 90, -64, -236, 350, -352, -49, 130, 249, 244, 319, -240, -62, -93, -10, -237, 0, 160, 93, 203, 182, 76, -58, -22, -524, 72, -141, -31, 205, 281, 240, 172, -63, -233, -180, 211, 37, -43, -85, 122, 98, 161, 102, -75, -258, -106, -221, -258, 95, -47, -23, 321, -74, 260, 13, -405, -385, -8, 124, -53, 173, 495, 18, -75, 8, -566, -98, -51, -181, -88, 407, 179, 231, 245, -49, -232, -170, -120, -181, 65, -187, 45, 412, 32, -115, -12, -401, -201, 144, 59, -145, 270, 231, 201, -144, -276, -32, -300, -215, -92, 352, 275, 172, 279, 101, -147, -236, -210, -52, -111, 236, 84, 143, 160, 417, -57, -167, -250, -153, -29, -23, 121, 93, 356, -167, 136, -43, -19, -176, -67, 57, -45, 358, 186, 33, -131]
1210a31j28n5l9L20k13L89K17j45k89L53k64j6K0k32Q3j43M91j05P8K45o19R6
1232h7J65j48R5k68L53nO5lr5j32k90R8R8R5O4K91k17J78k61J58l33k87M33j54
1256a87J27K17j95J98p9k01j36J45J31j21n3K55P5o8o7o6K99l81p6M4J46p6k07
1279b76L87P6j5L7l08k91K07K43k81O37l47J47k9Q2l08L14j84j38J69j09r3M9
1301c1K77l36j44K02q2J9J9n4J75J91R4k19Q8j69l91J53K77J08k41Q1J18o4M3
1324A14l13K00K2l29K66J3L46n28L29o6k30P0J94l25K03L98l59J63q2k02K33l6
1346H1j65j78L52q5K78j28q1k02K22k40j4J31qq9J03J36j93K89l6l09m9J91l03
1369b97K84J53q8P0j41o0L0m1K71l06J60on6j8K03rO8J36k2m04j48kM20kk26K9
$$ y = [-131, -259, -314, -353, -33, -246, 143, 360, 215, -74, 279, 15, -1, 19, -213, -130, -273, 218, 113, 191, 436, -183, -87, 78, -70, 25, -243, 110, 105, 170, 167, 72, -60, -350, -252, -154, -59, 5, 296, 79, 257, -4, 154, -179, -466, -33, -187, -60, 157, -38, 160, 81, -120, -256, -111, 20, -101, -154, 101, 176, 108, 41, -25, 274, -107, -183, -139, 7, -69, -276, 111, 187, 172, 209, -99, -390, -183, 60, -221, 416, 69, 216, 187, 269, -39, 275, 91, -47, 122, 13, -80, -31, 246, -90, -234, -32, -114, -95, -76, -130, 45, 236, 330, 111, 199, 30, -361, -208, 69, 177, -64, 17, 135, 71, 114, -199, 1, 23, -306, -40, -27, 319, -209, 120, 54, -176, -106, 88, -237, -34, 364, 5, 168, 86, -116, 117, 81, -84, -262, 90, 5, 283, 155, 74, -128, 94, -146, -160, -29, -37, -126, -23, 113, -80, 209, 173, -136, -185, 6, -297, -13, 140, 52, 122, -19, -79, -49, -90, 181, -125, 35, 29, -27, -45, 158, 149, 217, 353, 331, -73, -221, -223, 197, 195, -31, -2]
1395bM8m8l29K22j24K25N0l5J47p3j15Q1n8k46K88j24j50M44k29K86l19k16L79
1418A02q5j3J17N7k08K08J3k99K27k49m0j87L26J20j19K62k93Jj65K34j51r3J07
1441a28K58k01K02m4j80K94pp0l83K46nj07J29L74l15J6k10M9J8j78K13P6j47
1464a00J04J48j48L53k53r6k15N5J73K11k95K04J67l16l29K11J9J13j25J82K04
1485B67n32N35j99K4j18j17j60J38J66Rr0L47p3K8p2q9l35K06k60L72n0J70l47
1508a80J42m4j61J21j7M3m3J52J06N9m17M38q9J4j97lM4K29k85J21k15L45l66
1531b03K01M3j00J83k08O6K21k86K9o9nj47M28j61l39M22o7j21L01n6k24k02J85
1554a09J49j64l7j26L64k98M46k61M6j54O2O6L3K8j06J90j88K30j11k01K13K3
$$ y = [-2, 46, -2, -331, -109, -233, -8, 42, 7, 154, 81, -34, 47, -11, -257, 31, -93, -243, 201, -28, 258, -61, -277, 102, 17, 4, 121, 178, -30, 178, 191, -108, 119, -130, -170, -357, -31, 89, -30, 232, -61, -60, -225, 9, -142, -235, -128, 130, -71, 131, 87, -93, 201, 194, 124, -259, -13, -18, -125, 4, 378, 63, 79, -131, -82, -64, -242, -29, 47, -100, 4, 152, 4, 357, 104, 8, -207, -152, 21, 232, -63, 141, 308, -8, -337, -126, -107, 6, -119, 63, 267, -265, 270, 71, 95, -23, -140, -300, -162, 4, 13, -77, 270, 197, 225, 153, 64, -271, -65, -325, 47, -3, 167, -180, -38, -82, -243, -122, -139, -96, -139, 13, 119, 178, -239, 199, 110, 124, -73, -76, -32, 197, -88, 33, -182, 163, -203, -2, 41, -59, 124, -84, -18, 203, -83, -54, -123, -128, -275, 153, -8, -347, 75, 8, -113, 188, 132, -92, -294, -109, 40, -124, -161, -287, 77, -221, 225, -36, 10, -144, -82, -16, 17, 45, -61, 129, -59, 171, 60, -141, 72, 95]
1576I5j87J16j53N5J55j14J79k20j30L44k12M9j20K89n4k18L25j31k79J83j47
1597a75J09m6K20j76j5LK70j43k15L3j66J6P1L61K76k41l15K87k13J84k08J52
1619F9j03J2k42J72J5L23k85P4k7K20k15q4K75k90K67j30O7R9l21J8J21o8j19
1642a52K97K56l15j80J05j1o3M80k05kk94K12j60j74N9o1J97O2K35l39M63l18
1664I2p9L6k60L05m1J21l93K40J19l87j0J78q4J84j73K02J53k58K92j43j40K50
1686B04Jn4k83k7j7K12M4j69P9K12k74L19l75L83n69M40qj79J70q1k6Kl78R1J67
1711a16l51K78J53L47j87k05k43J70L59m95P5J13j56J02J5K31l27K11J42l33K25
1732Hj09j55K53r3J57J86k47j1P3k45k05J93L19p9l1j76L48r8k32j82M83k68P
$$ y = [95, -92, 24, -129, -74, 81, -33, 146, -74, -204, 140, -72, -23, -143, 146, 92, -126, 199, 68, -211, -28, -175, -66, -112, 108, -68, -83, -80, 190, 47, -168, -135, -301, -285, -214, 147, 423, 182, -133, 154, -59, 125, -83, 69, -34, -22, -264, -92, -77, 246, -39, 35, 8, 228, 13, -71, 204, -86, 181, 51, 118, 217, -104, -86, 35, -33, -152, 145, 401, 86, -94, 11, 0, -63, 417, 212, 210, -84, 128, -32, -206, -147, -208, -11, 51, 286, -53, 410, 92, 13, 49, -211, 94, 53, 174, -219, 21, 140, -247, -257, -79, -163, 21, -152, 50, 203, -55, 237, 94, -46, 204, 205, 151, -132, -159, -176, 36, 80, -89, -10, 202, -72, 247, -128, 255, -314, 126, 118, -61, 109, 28, 2, 4, -374, -283, -116, -467, -189, -36, 311, 124, -81, -324, -154, 205, -290, -215, -102, -258, -156, -141, 90, -237, -26, 116, -217, 8, -101, -256, -3, -96, 61, 247, 0, -11, 62, -183, -388, -195, 124, 45, 14, -162, 186, 88, -144, -326, 157, -111, -104]
1755a04O7j20J87n4N3KJ29n4l36r3M22P7k22RJ65k27K15j37J10n9J07p3r5j53
1779a84No1K91o4J31r4K57j07j31l2j8K02k73N2m3Q0J88l24J69N5p2q2l5Q0l45
1804c55N31k54K25m26K80J95JM3n07R9K95k06Q0LK62j17m7j95R9p0J20j51L31
1827B36l32Q6m6R3l7L3J6j94L49j17%l18L91j72J23j25o5p3J25L21j23j98j81
1850b08K79o8l5J54j99n9P2o8L18o8k44L1J36m5K56k83j82J68M4J13o0m9j45J13
1874b9J01q1N4j81K92J26j26k49r9K09l7k38L43j55K2N6J18j06j54K28j5o2j23
1897a06J16K20k12l05M31J01k04k64N4R3J75J8q8K03k61K00O1l39L10J23m39J60
1919D7R7k15J7j67L35Qj94l4L04k73J15J46l4k49j44N14k69r6P1j60K30r4L49
$$ y = [-104, -37, -157, 30, -24, 29, 31, 160, 106, -230, -323, 99, 176, -46, -37, 128, -99, 116, -21, 89, 30, 137, 64, -31, -184, -179, -240, 51, -13, 118, 24, 281, 174, 43, 11, -7, 195, -78, -26, -69, 11, 199, -125, 44, 99, 27, -55, -90, -10, -355, 176, -78, 147, -279, 1, 196, 197, 240, -267, -168, 127, -79, 1, 4, 266, 149, 102, -93, 6, -64, 56, -95, 236, -96, -10, -56, 37, 0, 33, 49, -145, 204, 87, 87, -231, 160, -12, 111, -14, -79, -152, -27, 294, 171, -27, -208, 71, 3, -32, 122, -77, -136, -64, -132, 186, 118, -126, -95, 41, -4, 252, -31, -213, -45, -1, 112, 52, 3, -142, -29, 72, -9, 45, -136, 156, 282, 156, -93, -192, 17, -20, -258, 85, -70, -48, 8, 126, 20, -134, 94, 79, 17, -106, 10, 230, 18, -287, 144, 245, 41, -223, -169, -76, 99, 117, 29, 232, -29, 171, 232, -107, 203, 326, -113, 47, 144, -71, -54, -221, 114, 122, -72, -106, 198, -75, 40, 186, 152, -97, -241, 273, 4, -92, -21, -181, 49, -45, 304]
1942C04J07n00QK04k71L18l03K02k78J80L20k12k5j44L27k73L1Q8J84pm13J48
1964eo1L60l78R8O6J05J1j21j43K58j12j53k2J88J51l86K72k14J34n1Q8q3l8q1
1988a17K46M5j43k89M64j40k35K27o7K16q0J63l81M68m55J73J85j08J6k02k13
2009b27M96k82L0q1K0l1k36L02j61K09mk24K30l4LJ41mk59J44j71K06K22l04J30
2033A15N0k54j37L55j29Q2J48m24J95J51j16M2l88K56l5K18k08J26l03K86J50
2054A80j26j08K7j52M10k14L6k15K7J86j80J32N4P1j25j97J94l2j35J87k30L40
2076A30k01K97k11l09M07Qm18N47R9n62M08j44j23q2J38j79J62k19M27L4p1j22
2098A6j23K77r9K8j11n4K51n4k38q5J48P6Q8J59k28l02J89P9k53K74Q1Q2k52K94
$$ y = [304, 411, -89, -81, 123, -148, 170, -133, 69, -209, -29, 291, 79, 54, -90, 237, -36, -5, 83, 267, 260, -153, -5, -66, 294, -84, 14, 80, 185, 196, 75, -68, 190, 78, -75, -97, 91, 242, -144, 128, -86, 48, -3, 85, 2, -36, -117, 129, 174, 31, -258, 206, 66, -169, 58, -9, 207, 127, 290, -91, 377, -78, 95, 280, 172, 188, -14, -227, 269, -13, 17, -64, -44, -75, -311, -9, -170, 39, 35, -189, 41, 7, 10, 151, 147, -112, 32, -139, 67, 289, -15, 115, 165, -89, -226, 129, 0, 82, 230, -194, 1, 152, 36, 78, -310, -54, -89, 129, -79, 47, -256, 30, 180, 54, -54, -27, -179, 231, 17, 53, -162, -135, 51, -129, 3, 57, 128, 3, -194, 0, -32, -167, 20, -210, 130, -71, 226, 15, -294, 113, 121, -297, 250, 349, -213, 195, 51, -72, -154, -16, -195, -33, -252, 175, 209, 138, 16, -107, 170, 71, 99, -12, -66, 185, 131, -107, -192, -44, 32, 120, 279, 51, -251, -62, 17, -236, 38, 119, 201, -51, 243]
2122B43j33J01j61N7R2q7j65J96j0j85K07k3l33L56l47p1K54%K04P7n3j08l08
2145a97k4J45J6J96j15L36k23l32m5L1K93Mk44J46k59L37Q4k38J88j33M2k83K08
2168f7J32J86k68j49J2oL00k24r7p6J30K28N1k09j47jL25L0k19K8J89j16K68j70
2192A30k10K66l52K15p3l9O8R8qk26P0J45j49K43k81L8J65j59J45O2K5l16J89
2215D6l5j84J39K7j29K17k9l73K40k7nK69l03NJ9m8L11k67L0L7K67p1j94j23J84
2240CK0J8l73L10n8P4n5l2L3k05N0K93J48j06J5l10JJ04J68l4k5J5l7J61k70M1
2266e1J08j1k57L97l69R2J63k51J96K56j90l42J98J27j88j71P26l07j16J76l06
2287a20J80r6Q7l04K62J7K01l46N5J63j76K72j98k2l7j07M52m79M51j42j75M1
$$ y = [243, 110, 211, 50, 107, 199, 112, -53, 143, 133, -52, 155, 132, -201, 155, -192, -263, -9, -9, 195, 272, 219, 111, -197, -221, -76, -60, 136, 21, 357, 134, -198, -243, -212, 81, 85, -159, -13, -272, 65, 149, -89, 99, -34, 8, -275, -67, 65, 251, -17, -166, -154, -160, 140, -84, -181, -257, -127, 101, 152, -57, -204, -205, 120, 150, -69, -41, 148, 32, 300, 130, -80, 186, -166, 49, -24, -63, 5, 103, 95, -131, -61, 84, -65, 178, -103, -65, 100, -59, 86, 148, 173, -143, 46, 11, -173, -34, -7, -136, 81, 52, -321, -81, -108, -113, 156, -147, -142, -123, -171, 140, -127, -97, -60, 207, 136, -58, -181, 3, 23, 41, -332, -22, -80, -6, -61, -93, -60, -265, -215, 78, 226, 120, 135, -175, -174, -70, 98, 64, 39, 54, 17, 178, -92, -51, 57, 46, -211, 186, -183, -91, 72, -179, 17, 273, 83, -259, -61, 66, -122, -293, 433, 126, 10, 186, -120, 60, -36, 51, -253, 9, 26, 227, -119, -64, 99, -77, 195, -3, -25, -62, -169, 283, -196, 255, 113, -62, -21]
2309b1o4N0lr4J92J08j40K23o5K77k31j37k52K45O7O0k41J70k21j5j08j03M45
2332A42l62J82OJ43k5J04o2MR2l31j16mL30Jj5J92j69k61m8o5P7J83jl45L68k02
2358a82K85k61J1J95l27K16j48K59J27j51J35l98J35J2J73L17n64L08n3m1j13
2379f5R3k44K55l06J88j7J36o6r1J7K55l63K66j83J40kp3J72Q1l03K15l02J61
2402c6n8n0J73J05l63O5K66J54k23j97J09q3L01m48K80j70l6L48l53L61j5r8j14
2425h2R5M7n07K48L29k26J18j50o4J74J13K50o74M17n1j73K45l37K90j80M3J10
2447C5lM2K28P7k7m58J71q2L46n44M43j56Jk28K1K35l66K40j96K74k01K70j07
2470A5k05J56L28l61J8O8k72O1q0K57J59j63o9K27m30K71j0j42L30j15N2m07L01
$$ y = [-21, -85, -35, -38, -132, 60, 168, 28, 251, 186, 463, 232, 95, -157, 88, 155, 215, -26, 144, -77, -92, -200, -303, 142, -220, -38, -32, 111, 86, 190, 128, 132, 224, -107, -223, -227, 103, 104, 89, 281, 112, -149, -197, -262, -185, -2, -3, -348, 20, -182, 103, -158, -147, 48, -279, -63, -211, 48, 175, 24, 159, -239, -104, -92, 81, 398, -166, 142, 89, 48, -65, 28, -216, 39, -267, -79, -96, 40, -26, -117, -100, 155, -208, 58, -125, 15, 13, -60, 112, 193, -110, 105, -197, -36, -94, -144, 29, 134, -229, -164, 102, 256, 33, -164, -55, -138, 163, -285, -5, -175, -211, 137, -216, 145, 130, 32, -82, 13, 60, -447, -199, 130, -96, 22, -128, -192, -18, 95, 345, -329, 88, 37, -136, 109, -228, 62, -118, -75, 35, 32, 74, 302, 379, 352, -106, 65, -17, 329, -215, 228, 72, 73, -155, -134, 101, -265, -25, -221, 53, -148, 122, 15, -190, -34, 294, -67, -49, 19, -253, -192, -272, -15, 144, -19, -88, 139, -291, -20, -30, -172, 158, 43, 95, -312, -11]
2493a1R7l2k1j80K31l5J79l35P9kL24l66k0J60j50j11Q8mJ01P0K64l16p4P3N6
2518F5j73J86j30k12M79k16QQ5k19M84l36J34O9k42j61k59P06l40L77j74p1p1
2540a1r7Q2Q8l67J20K0M47l41K11j12j66K15j47J00k55K95m42J80L7R0N0k06J02
2563a07J00l1Q4p1L4k23K05k29L16Pj22K58k33l0p2L01J85j98j85o6m8L86m0l07
2587h6K37j97L93j08j62r4%J53k6k39O3K03P8j91P4J47k79J36k22M12k74m89M85
2610A4P5j31n2Kk56M69Q4m9j18l9J56j10J7k5Jk97J84J56q3k56P1N35m68p2J26
2635f6J85j96J77j03J72No6q8m4Q5j83M30l59J22M1j93J7J13J78j03j45l24L54
2658IL63m62L41l22l7J67J00j96l9p9j82N85j57j05k8M8K7L3Q7R8l60nJ07J15
$$ y = [-11, 86, 54, 33, -147, 84, 49, 228, -107, -28, -30, 294, -72, -92, 68, -82, -193, -105, -109, -8, 62, 326, 10, -64, 9, 65, -108, 78, -52, -264, 215, -1, 7, 92, -127, 357, 21, 155, 224, -18, -179, -438, 268, -72, 305, 131, 60, -11, -108, -26, 62, -305, -185, -165, 282, -59, 152, 40, -126, 89, -58, 42, -213, 82, -360, -180, -143, -53, -3, -209, -107, -7, -38, 46, -25, 9, -214, -9, -238, 78, 85, -37, 221, -12, -42, -114, 187, 372, 174, -11, -77, -125, 261, 221, -86, 151, -46, 347, 239, 77, -17, -17, 136, 110, -129, -66, 137, 215, 24, 98, 245, -34, 102, -120, 292, 18, -471, 14, 89, -42, -94, -92, -348, 121, 205, 156, 38, -1, 155, 45, 62, 37, 38, -259, -75, 81, -2, -258, -187, 348, -120, -192, -66, 119, -77, 100, -3, 169, 174, 108, 20, -24, 61, -122, 308, -51, 71, 112, -81, -64, 49, 227, 124, -21, -345, 9, 372, -90, 251, -71, -108, 59, 159, -37, -76, -155, -337, 248, 91, -14, -42, 6, 33, 66, 153, 251, -109, -114, -7, 108]
2682A08j68M0q4j13J7K11j55J62L20k86k03J06L25k36o7j39O6K36J15j98q8J65
2704A34L6j46j32K03n8l4J07j53J9k05m4K69Q5l94k7M59m9m97N86J07k33r5K83
2727B21p3q6K0k33M59m38J34J97l50J95J70j09k9n3J43m45M48J17m89L43k64J01
2749b1m2R4j16N0J13QR0k31k81K61J09K09j45k98K29l44M58r6k10L80K2m27K31
2772D3J18j38l09J50K74j79K6j98j75L65k62L28j58Q3m8r4L01k12k29K17o9L11
2794A45L8k63m0J13K30l00L27l13o1M0j2J61l34M14k25L11J6m15m8k9J7P3K12
2817E7K03j89l3r5L2j80J6K66k6Q3N3j60q1L24j63J19k88R9J48o6q1j21L2j9R8
2842B8q6k77M68k52L6K15J11j49J6r2j73L09j06J02l32J38J21R5j27o2j0Q7m94
$$ y = [108, -60, -20, -104, -217, -200, 11, -144, 18, 338, 52, -151, -45, 280, 44, -23, -162, -96, 140, 255, 57, -31, 134, 170, 24, -108, 95, 37, 3, 110, -43, -24, -229, -273, -4, 81, -313, -340, 119, 70, -427, 159, 266, 33, -62, 221, 148, 62, 82, -151, 308, -130, 4, 201, -149, 46, 216, 107, 78, 25, 168, -277, 171, 288, -201, 142, -122, -21, -63, 31, -85, -35, 78, 86, 176, -55, -336, -75, 34, 243, 98, -200, 29, -315, 143, 47, -163, 217, 239, -188, 43, 161, 23, -286, -136, 138, -41, -15, -213, -388, -23, -285, 43, -115, -32, -80, -174, 127, -85, -314, -97, -166, 145, 183, -80, -120, -7, 223, -77, 250, -63, -124, -84, -96, 65, -269, 145, -80, 231, 247, -168, -216, -245, -228, -155, 57, 260, 71, 38, -57, -25, -205, -189, 77, 51, 134, 187, 27, -54, 270, 107, 226, -62, 37, 185, 119, 38, -83, -51, -70, 28, -58, -335, 133, -119, -83, 132, 243, 94, 110, 18, -155, 154, 48, 150, -182, -44, 77, 172, 45, -17, -27, 60, -434]
2865d34O74l18N5J1K64R4n53L56K10k6n64J46K61j99Q4l80K09l5Q9J48j83L55
2887B64l03K00j05m4q5L00j09m0J61l29J87j38J21l0L6m4J44p8l04J33m0R7r4
2910a00L27n0l42J14K03k06J41J4n1K8k18J61j60K02j66J60k78J34J84j42Q2J02
2932A39k07J9J1J24j9O7j16J29j99j4J84j95j20J28J00k1P9o9j38K40j44Jj32
2955a53K90j21j7J10j24J48l01J1P3j06K81j57l1L73k34n6O6J5J1O8K09n47K70
2978G8M3n3L14o03J03K0K47k74J09K3j6l2j63M35j83j23O5O6j61J59m9l6r9J84
3002E4J35k03K30j30j37L7J47l10K62j85L39r1J0j73Q8K64k17j90m8K86k76K37
3024A29j87J07n4n4M5P9P3l0N3r0j39J83q8N5k70J59Q1j81O2M8J36K7k36j25j0
$$ y = [-434, 240, -78, -23, -12, 252, 346, -207, 149, 359, 333, -231, -85, 176, -23, 61, -319, -110, -145, -56, 92, -91, 264, -39, 161, 56, 12, -73, 227, 118, 78, 239, -90, 97, -41, 80, 50, 86, 42, 186, 108, -196, -63, -103, -6, -100, 227, 177, -165, -51, 152, -54, 87, 101, 50, 78, -140, 21, -139, 63, -103, 57, -221, -87, 97, -45, 37, 139, -68, -49, -38, 86, 67, 134, 18, 147, -52, -66, 118, -77, -197, -69, 31, 10, 89, 20, -118, 122, -22, -21, -153, 137, 16, -1, 109, -15, 133, -168, -157, -84, -190, 91, -66, -97, 276, 42, -14, 52, 67, 78, 146, 355, -192, 78, 121, 68, 382, -221, -118, -98, 149, -125, -16, 7, -9, -41, -204, 231, 48, -75, -10, 56, -105, 54, 5, -31, -130, 54, 189, -14, 216, 86, -51, -14, 133, -177, 85, -100, 239, 148, 158, -15, 73, 337, 120, -70, -118, 168, -108, 129, -58, 49, -5, -59, -14, 65, 138, 108, 161, 71, -68, 115, 27, 82, -188, -29, 52, -129, -67, -19, 117, 144, -92, -217, -227]
3049b27M59l10J99l20K12k84M00k73P8K71J73k61m24J25Q8r0M1J80l17L14m13
3070c79L57M9j18J7K65l05L0K20j59k26M5J8l1K15L6k61j63L56J14K2l14O3J34
3093a5K09j26n9rj66M6K66k42M2J8j48L9K6K17k0k06J37Jo2l28K09M17l09J45
3117H2J6j35r1J22P1K06l55j85L03J20j17k03K60J38n13M18m3l2K05l88Q5l2J24
3140E6K8nj46J32m5j50N6J55k3k85K81q6j61K86k15K19j4j12K5J37j13Q5J48l25
3164g2L44q8K8j78j79L41m6k11K84k55nJ45k98M35p5q4P3k24N15m24J51j96j7
3187c6p7J49K02j45J4k68q4J79J99j13Q9k68L82k39N0m8j02K14j04j12L57m47
3209b08nL66j28j15K67k64J22K8l02K63J74l10J54j3j34j29K54j7k52L79k59M9
$$ y = [-227, 232, -78, 121, -199, 13, -271, 129, -144, -66, 205, 378, 117, -307, -182, -94, -184, -143, 37, -280, 34, -379, -22, 27, -91, -74, 191, -114, -84, 136, -23, -249, -204, -186, -217, -2, 34, -227, -390, -34, 80, 102, -212, -149, -15, 194, 68, 9, 0, -166, -120, 146, -96, -54, -36, -184, -145, -119, 98, 78, -128, 9, 10, -52, -380, -171, 246, -63, 82, 98, -37, -128, -6, 65, 271, -84, -269, 34, 154, 37, -166, 94, 232, -281, 137, 94, 62, 267, -121, -36, -68, 56, 84, 79, -67, 65, 20, -130, -74, 81, 58, -227, 54, -32, -193, 93, -122, 97, 83, -29, -4, 133, 20, 105, 253, -72, 272, 184, 212, 34, -145, 196, 150, -61, 223, -32, -37, 108, -190, 245, 170, 86, 159, -65, 450, 26, 177, -19, -36, -113, 36, 238, 93, 107, -161, -245, -66, 133, 20, 109, -159, 223, -16, 34, -14, -116, 98, -6, -118, 239, -208, -213, 153, 25, -90, 177, -87, 35, 63, -239, 24, 198, -112, 42, 29, -105, -234, 20, 3, -249, 130, -129, -80]
3231h0L06l40L0J5m6J60LK04k63J55k46J53m5J32k91P8j75K72j9j72K10Nl11J15
3255a50K31k15Q3K82m09J16j78K5k9L21p8o8m5k3r2K02M9j6J5K42k91J08M5j13
3279A2J6r0K32k41r7K31k32J61L24m36j07J25K96O2j87Q6ll7k41J03K04k44L93
3302C30l21j12k16K41K93l83K75J96m30K27j16Q2P9l79L96J11l68K57k75J92j98
3323a19J29J01n1k06J06K33k83K84k36N4K98l04J13m7j65O7j2R8j3q0L36m65J1
3346a51K77mk56P7PL5q2P5k1J29k14J70J46k99j52K28J58l0j09M3kO3J01j50j01
3371f2p0O5L3P5J2L7j26k04L45j69N0K3j05L8j30L01j04j68J00JO3k18L05Q9L
3396A84k89M5K08k54K87k25p4J46k18M33k51r9R6oN2r6M35m15L4R3j87L38l32
$$ y = [-80, 226, -114, -84, -69, -115, 45, 48, 252, -11, 144, -102, 51, 6, 138, -153, -75, -250, 22, 3, -169, 41, 46, -265, -150, 81, -134, -51, 231, -178, -62, -240, -215, -244, 77, -1, -69, -114, -137, -229, -27, 22, 6, 21, 263, -28, 80, 125, 12, 28, -62, 170, -71, -168, 63, -169, -8, 316, -120, -227, -102, 194, 256, 69, 155, 152, 115, -126, -23, 181, -63, 330, 9, -103, -319, -78, 215, -168, 107, 303, -127, 100, -16, 66, 145, -234, 162, 273, -95, 162, -113, 79, -119, 10, 111, 60, -146, -40, 193, -90, 194, -42, 12, 310, 6, 119, 72, -93, -26, -38, 60, 47, -33, 303, -162, -151, 126, 122, -134, -57, -50, -15, -97, -22, -43, 86, -128, 42, 188, -111, -263, -35, 123, 93, -16, 27, 25, 88, 189, 39, -62, -132, -67, -34, 41, 53, 90, -36, -240, 105, -64, -14, 9, -96, -58, -188, 113, 9, -159, -59, -58, 5, -213, 92, 181, 184, -105, -60, 148, -106, 181, -44, -118, 28, -190, 243, -8, -107, -11, -17, 35, -61, 374, -41, -7, 86, -101, 237, -95]
3419i5K53j70K22l89L94l85K76k67L06o2k26Q8k16L69j39nK98j6j64k12J13J58
3441A31n02L02L42n14K18o4J73j97j9L1mJ0J42q8m7J04j96J94J04j11J82m56L23
3464E8L8k7j77M5n3O8L4J32q4n2Q5Lq0j1K10m7j57j20J86J57Rq4j41j37J89j81
3490a37L26l75M86n36M4K75r0n1J95j95P5oK50p6j88K7l52L36J67k31r6K43o8
3513B3J91j73j03J05N9R1l55K68o7l4j40K89j57j41J65O5k47K08o6k6J29J69l10
3536e7K00m3l26L02m8k29J95L27l69q1R5m3R4j14J75k18K80j13J54j41k9k0K88
3559B79l26j64P2J37J14j76J49p8J45j86N1j46K52j65P4J73j4j81j08l56O06j24
3581B8k08J38J18J03k71M49k55j25M91n14L21k28O4j67J16j19M49l24m1J73k16
$$ y = [-95, 158, -12, 210, -179, 215, -170, 106, -161, 145, 83, -143, -55, -271, 98, -41, -46, 252, 236, 72, -140, -27, 131, -371, -69, 273, -241, -23, -87, 86, -111, -130, -99, -103, -93, 49, -39, -86, 18, -178, 16, 120, 9, 191, -265, 58, 96, 69, -108, -63, -116, -48, -14, 118, 34, -18, 67, 70, -10, -21, 189, 142, -15, -135, 51, 208, 217, 133, -8, -145, 44, -137, 189, -186, 300, -236, -192, 83, -7, -58, 137, -58, 17, 11, 261, 185, -3, 24, -328, 8, 175, -56, -152, 91, 23, 214, 41, -62, 43, 102, 193, -162, 106, 39, 5, -135, 154, -3, -144, 21, 86, -161, 47, -19, -45, 84, 253, -57, 143, 100, -226, 76, 28, -201, -6, 321, -48, -129, -34, -77, 17, -97, 78, -140, 140, 27, 181, 40, 11, -9, 279, -47, -211, -139, -2, 112, -64, 85, 7, 152, -34, 17, -129, 123, -42, 32, 205, 191, 10, -98, -454, 152, 28, -180, -42, 76, 179, -92, 357, 102, -23, 468, -46, 275, 47, 111, -56, 60, -59, 390, 66, 25, 198, -18]
3602a8j87j8K73k25M24p7j38J51l46K47K09m23L35pl25MJ73p9mk34K15k0P3K43
3626B46k73j04R9j27L04m5j78J44J17r9K22m29R9k89M59l73J22K70QQ7k18mj30
3649i2K08m29L90M0K4k52K66j41k12M29k33j24L06j75K19j18L3j71J34k00lj25
3671b26Q4N17l57MM1l8k65L95m3O7l80L04J73j29m44M50q4k14NJ66LJ38l07q4
3695b24K73Q8k5l2l5l5K43l78L43k07p7J60K59m26K23j41n2J28J57j77K6p9j25
3718a13PJ59m0J49P4j69K04m11J4L2q5l78M91L59k92K34m16K09j61J19K24j03
3740A07j57N5j64M40l98K42j54K48k6j22P7j23j45l7M1o9J52L0j40K47j7R0L4
3763B11l25J24O1k06L83r1j00pK52l69M2N7l90K48qJ7M17o56L33R4J65l37K69
$$ y = [-18, -205, -223, 50, -175, 249, 172, 34, 185, -161, 86, 295, -128, 207, 200, -125, -121, 52, -27, -31, -265, -50, -70, 3, 246, -27, -131, -32, -159, 145, 100, -78, 66, 183, 84, 306, -123, -24, -313, 146, -227, -105, 165, 173, 260, 42, 38, -92, 116, -313, 77, 117, 141, -111, 155, 14, -198, 231, -2, -126, 180, 5, 224, 106, 139, -32, 102, -98, -101, -226, -142, 375, 18, 22, 63, 25, -240, 155, 112, 179, -201, 103, 276, 147, -297, 153, 69, -145, -140, 26, 29, 167, -140, -224, 49, 137, 112, 80, 45, 10, 253, -125, 218, 11, -66, 94, 353, -73, 150, 9, -43, 85, 242, 65, 91, 12, -113, -106, 53, 13, 162, 236, 67, 271, -140, -126, -94, -179, -557, -66, 293, 1, 235, -181, 28, -133, -14, 210, 107, -50, 5, -159, 281, -117, 125, -29, 219, 193, 71, 148, 25, -120, -157, -116, -185, -33, -3, -143, 104, 87, 177, 211, -114, 10, 71, -135, 248, 157, 57, 50, 302, -67, -25, 32, -358, -110, -118, -101, 316, -340, -7, 87, 252, -85, 184]
3786A84j53J08r7j13K64k08Q3j16K72j54P0q0kO0j44p9J13J67k6M8m06N7j46L05
3810GK03k46J49m8j85p0P5L50j91O5M8p2K53l41K43k30K61k99j33R9q1K90R9k93
3834d7m7J06K03k33j94K39J61J5l57K4k13K53j16K28KK06n15N18m10J40K27j86
3856DM1j06j29j8K43k38K60j68O8K5j57M34q1K5m1j42j65J85QJ94k92J38K89j79
3880A98j63mJ94pp4k13j5J84j3j48N8j9j8r9K00j70j39J08L91j49O6j17k38P6
3904a11K20k41K32j85K65k05k7o2J62J07j45p2j0M3j30rK91j61J90k00l8L3N2
3927ak11J41J78K8k06j31L18j13j32J30j11Q9p9M22j88j62K07l29M8k1K82r3r2
3950b6j97M05j04j23P5j28m3R2m7j9K16l20M25k44M7Q4j13J88m37J83J1k7j02
$$ y = [184, 31, 139, 42, -71, 193, -15, 68, -48, 224, 70, 140, 60, 58, 118, -26, -105, 8, 175, 149, 197, -209, -152, -298, 7, 210, -36, 113, 65, -120, -190, -115, 235, 44, 109, 157, 85, 338, -3, 240, 10, 271, -28, -161, -62, -143, 147, 246, -47, -94, 12, 215, -18, -212, 27, 188, 203, -154, -130, -343, -90, -206, 22, 24, 230, -285, 233, -177, -37, 190, 4, 45, -61, -190, -208, 35, -203, 57, -111, -43, -18, -175, 259, 178, 203, 162, 20, -145, 40, 48, 242, -50, 88, 377, 198, 35, 31, 225, 218, 144, -69, -84, 100, 87, -61, -3, -22, -40, -139, 61, -109, -248, -140, 251, 102, 168, 51, -187, -111, 109, -132, 100, -85, 180, -25, -52, -114, 48, 155, 10, -62, -72, -29, -159, -168, 123, -38, 152, -48, -86, -53, -1, -212, -71, 107, 135, -71, -202, 116, 3, -129, 1, -110, -21, -100, 322, 134, -28, 179, -150, -102, -123, 159, 66, -26, -223, 182, 78, -45, 30, -98, -141, -49, -96, -115, 101, -219, 206, -38, 9, 93, -20, 168, -269, -86, -75, -102, -204]
3973b04J87J61j77J10m7%K02j90k45K94m0m2J11m0p5J17k36j49J97R2J03k2rj95
3997i7L31K6k27K25l16K00j77J67r4ro1J63j16j7J19Qn1p3q0j04N9J58qJ05o1
4022G0k17K15k23J40P7M4N8j91m39K92J62l3J24k68L64m0r6j60J95M4P2j40J10
4045A60k35q1L06rj37j8J15l19K99n5k03M3P0J40k48j46K68q5M3J27n6J57j41
4068eJ26m29J94L72l51J41J64R7p0q4l31j7K58j42L6N9j48J1K4o6K38j66o2k98
4092d49O91o16M12J41l39R4M7K64j98l36L92Q1k3m9j84k4l02L65L78k36k24j87
4114c02K86k3o8K36l4m1j78L40j20m1r2Q8j81K05l3l31J69J40l08L58k27J55J18
4137A16j94j28Q6Q9PK05r4n8L0k62L2J54j7M4j02l2J22J9O7p9k13L52o7j61K02
$$ y = [-204, -17, 144, -33, 77, 30, 30, 232, 42, -203, 91, 51, 9, 120, 80, 5, 122, -114, -263, -66, 26, 129, 107, 98, -97, 234, 260, 33, 258, -58, 142, -35, 132, 38, 29, -32, 131, 15, -2, 117, 125, 74, 1, -79, -183, -124, 34, 26, 131, 70, -147, 68, -155, -15, 62, 106, 164, -27, -466, -174, -12, -45, 79, -189, 175, 135, 39, -121, 74, 118, 190, 50, 160, -75, -156, 150, 141, 4, -14, 101, -218, 81, 26, -177, -134, -64, 76, -172, -318, -50, -135, -92, 35, -21, 136, -5, 121, -308, -114, 258, -93, 48, 212, 309, 239, 155, -176, -193, 65, -77, -41, 18, -130, -119, -95, -161, 77, -89, -151, -449, 242, -374, 38, 179, -160, -66, -19, 245, 47, -289, 103, 184, 161, 112, -72, -96, -398, -33, 345, 109, -115, -302, -16, -39, -107, 129, 95, 54, -124, 216, 96, 55, -37, 51, -130, 75, 42, -289, -120, 20, -288, 70, -157, -2, 116, -78, -206, -120, -31, -24, 181, 87, 29, 59, -203, -171, -17, -34, 10, -92, -124, -2, 17, 84, 5, -208, 144, 77, -84, 118]
4162A18j15R1k01L22j30n2O5m17K62KK19p4j5j3L25j92j72l16J84l7l89M62J10
4185C7L04q48M56M1K22l99R1K53Ll10K3J46N1O5k58O8Jj49M9p0J64qK61j26J70
4210B37J23n36J13K5R4m9K74k80j82J91J02k36P8j83K47l21Q1P2J95J08j80j75
4232b02Q9J87k28L17j98m4L16k24j46K22l11L11r5J10N1j08k8J9k21M4j65M24
4254A20l24J47J81j87J08k41J73l1J55j29J29K6p5q6K11j42k22nJ85j56L81k0
4276A98l26J55o0K25m08L31L5j55j85K99o1o7J29k90P1r7K01Q5k95L09k35J24
4298a7J52q0l0q9j61K58J67l77K64L6R8j82l6L43l93K63n3r6j52j26j1Q1N7J8
4322f6J53L4l13K54r4Q5K3j62j3J11n2l9L20l67L96l40j55L31J86k15K80m83K45
$$ y = [118, 3, 94, -107, 215, 85, 33, 98, -319, -57, -55, 164, 90, 75, 62, 387, 195, 23, -293, -109, -146, -535, -73, 37, 341, -507, -51, -10, 212, -187, -96, 157, 160, -150, -127, 19, 70, 135, -123, -55, -54, -203, -154, -224, -60, -68, 193, 67, 237, 360, -176, -63, -38, 56, 7, 281, 1, -181, 10, 112, -124, -46, -229, 18, -303, -222, -150, 45, 153, -27, -202, -113, 74, -154, 163, -35, -79, 237, 13, -133, 89, -222, 89, -6, 104, 155, 47, 19, 38, -183, -139, -304, 120, -204, -57, 124, -63, 45, -196, -23, -54, 101, -28, 101, 127, 52, -34, 177, 35, -187, -192, -7, -163, 218, 198, -128, 27, -33, 192, -216, 115, 150, -5, -190, 109, 48, -19, 110, -180, -109, -206, -5, 80, -215, 94, -141, -17, 135, 55, 25, -64, -225, 33, 200, -177, 87, 123, 221, 39, 3, 346, -47, 216, 163, 67, -85, -211, -222, -141, -84, -66, 87, 121, -192, 62, -32, 53, 76, -86, -99, 12, -40, -79, 241, -126, 270, -70, -225, 106, 292, 77, 357, -126, 119]
4345A19j0j06j67o5K64L1J8j08J6j87L8j6M46m26O0K63m23M81l34J28J37j27L96
4368D28n24K21l5k36J9l1p7N05j04Q2m33L72j44q3Nk18J6K96j73%K02J5k96J36
4392e7m6L95k34J0q7J15K4j78j46qK35Q9q6j39L25k46m2P0j80J80J08N6m98L50
4416A0n6p3M5M3p0o1J77L76k03j87j02N7k5l08M40L7l87M89l79J64J61L48o85
4439a89K03M6J19o80M22J62j24N2l3j79K17J73j97m4j60N8J53j39K20k70K37q
4461C9J10M3J9j71K28m83K24l7J49l2J9m11M27K5J28r9m21N24k38p1MJ1J15j89
4485h7J22N5j78j67J09L01J67l02j08R9J29k70j24K26P8k2j93J90L4l3k71J50
4507i5j18K28m6K07j90J11k77k7J35n0jK2R9K48k23K18j63O1k5k0j67j13r0M54
$$ y = [119, 109, 3, -164, -229, 35, 66, 84, -24, -8, -195, -157, -173, 273, -153, -93, 170, -253, 228, -106, 22, 159, 32, 428, -96, 125, 90, -146, -127, -158, -235, 270, 166, 248, -185, 187, 43, -40, -35, -253, -237, 59, -114, -114, 88, 103, -193, -57, -103, 292, 58, 68, -19, 96, 120, -58, -204, -212, 23, 112, 26, -113, 212, -34, -76, -6, -186, -6, 102, 158, -340, 10, -46, -119, -74, -31, -101, -162, 15, 391, 188, 1, -101, -44, -69, -377, 63, 100, -287, 202, -177, -13, 148, 496, -189, 14, 60, 179, -501, -79, 83, -41, 11, -22, -201, 16, 189, -8, -52, -212, -154, -1, -140, 80, -190, 47, 39, 149, 192, 211, 40, 268, -215, 9, -28, 121, 89, 108, -303, 124, 149, 277, 178, -243, 281, 43, -28, -24, -13, 102, -87, 35, 90, -88, -255, -146, 155, 322, 20, -88, 11, 140, -130, -254, -28, 50, 28, -165, 25, 59, 26, -245, -95, -213, 15, -31, 176, -14, 97, -180, -207, -72, -122, -123, -101, -2, 246, 23, 241, 78, 139, 114, 94, -73, -186, -276, 178]
4531A78O0k04j72PR6K48L9l96K24k5J53J12l98L13l92P7NL5R8J20j04k07L45k40
4555b8PJ33j79o1K01J06o5j76Q5J15j64J09k24J37k5P4lk69J62K85j35n5J0n1
4579a1K12m52K27Q8K4j54r8K21J39l6k61J04l9n4r0O6n7j6L23j55Q3k57P4J24
4603Ej22J32o2J63j16J93n4j59n7N6o2J55L07m03j0K84l12L22l66L6j48L63l07
4626a62L44k34l9J5L41k92O0L3j20r8j04L40n4j1J25k77L44j5j2N3k35n8j49J92
4650a3N0k05L49j3m17K28L7K05J5j93J78k68n4j25K24m8P5j33L0Q3q4K23n05K47
4674a14M9P0L26l73k8K7J36l93J72K75j99mN6np9o3J82J04j17J95l52L54J7q8
4698A48p9J04k12q7K74q1j4J03j95K8k29J11L34k79k6J35k03K69P0l51L02k89
$$ y = [178, 238, 34, -138, -131, -35, 213, 252, -144, 80, 55, 208, 320, -78, 235, -157, -80, -75, -40, 58, 178, 74, -133, 212, -28, -21, 112, -67, -128, 73, 179, 114, -62, 23, 138, -26, 83, -141, -4, -29, 45, 42, -227, -65, 220, 85, 30, 40, -11, 201, -251, -24, 64, 88, -66, -164, 57, 196, 160, -101, 3, -36, -90, -180, -114, -171, -187, 136, -19, 64, -193, -119, 5, -117, 15, -47, 116, 0, 193, 139, -20, -77, -21, -83, 72, 379, -24, -34, 250, -62, 260, -106, -70, -218, 145, -162, 182, -52, -91, -76, 265, -27, 33, 66, -54, -152, -256, 84, 30, 19, 144, -133, 211, 196, 184, 237, 2, -56, -205, -13, 37, -168, 181, 168, -249, -21, 16, 221, 236, 43, 221, -47, -101, -226, -2, -50, 25, -108, -78, 5, -79, 144, -361, -114, -65, 5, 331, -42, -70, -43, 93, -300, -128, 147, -52, -56, 0, -5, -84, -147, 35, 139, 22, 217, -135, 219, 236, 148, 69, 173, -39, -126, 148, 67, 53, 156, -39, -11, -240, -129, 205, -74, -100, 35, -168, 101, 171, -180, 122, -167]
4720a67K00j9j24K53l6l12O8N0r4M10k47OR0q3q7J51l7M8l50J18Q1Ol73O23l9
4745A36R1l12j83P1K74l6Q6j22j55P6L03j47j36K79j89J00K8n17K32L5j36M01
4767A79j78J05o7J44k31J27R3l11L12rj25L6L25m54L5k46J71J03j22K83M3J07
4789C20m17r4L4J45J91Rj05J82m09J15L12n4k86l2R7n4n2k44L01K7Nj29K1J32
4813A5M8J56k60n3K27J29l26qK04l05K8L3j17K67J34j36j91l5K98n45M66k56j9
4836b46m1Q8K73k25K05k67P4RK76k63P8J09P9p0M4p6k15j29J90J01K12j3j36J15
4860A72j80J09n0N5n8J81k36J98m65L81o0J30k49J29p2pj58J55K23k1k58K02L5
4883A56kk17m2L7L08j17m11M72k02k7j19J72j0m6L84Q5l38p7j51o7K55k7J18k35
$$ y = [-167, 33, 14, -110, 143, 107, -205, -137, -87, -181, 229, -18, -12, 78, -5, -92, 59, 22, 70, -280, -162, -81, -75, -448, 175, 136, 227, -85, -268, -197, 77, 41, 127, 5, -150, -74, 229, 82, -54, 225, 36, 136, 164, -353, -121, -86, -222, 179, 1, 106, 39, 183, -48, 79, 172, -139, 173, 164, 39, 75, 400, -54, -19, -265, -94, 9, -113, 170, 213, 320, -97, -191, -157, -12, 179, 188, 83, 265, -144, -29, 283, 229, -57, -89, 8, -46, -98, -342, -41, -14, -9, -138, -117, 15, 63, 219, -41, -94, 133, 262, -64, -72, 132, -173, -145, -112, -229, 38, 172, 36, -155, -190, 108, -437, 29, -227, -246, -287, -199, 74, -151, 54, -213, -139, -130, 146, -117, -39, 70, 149, 79, 123, 47, -168, -297, -107, -6, 206, 193, 57, 172, -8, 101, 51, 106, 48, 229, -7, 191, -274, 107, 47, 177, -72, 57, -15, -22, -180, -25, 198, 177, -81, 121, 156, 154, -63, -105, -68, 240, 123, -288, 184, -18, -45, -164, 8, -2, -48, 336, 421, 83, 6, -145, -212, 43, 16, 134, -101]
4907a01R7J67j18j96J14R9Q2q9nj8J49l03K32m7j62L03j92l23K93J92k16J32n1
4930C9p2j67K89q7L16m5n73L98l43M67l35J7p8j79O09k15l9r9N4l76K07K36J84
4953B08l79Q4j36K09L54m12K40%m6N3n3l8m3K36k25j65J58K71m25J78qk76K46
4976C1K81m52j83J09K78j01O8J66l88J91k29L02j98K50p0j14P1j53O7L70k09n27
4998d40N08o9N2p9j17N7N2n7r5j00M65k48O8K1N5J48j44l13M59l06j10K66J36
5021B09k11j8m0J85j16j19K6j58L69J40j06p4j37J25q7o5N1k58K34J47k80K28
5043D5q0j64L60j65P7J71k71KJ0K53k84K8Q8K39l66J89k30j23N7L59o5k89K82
5066A23plq3k87L69j93J94j00l13L12q7K37k21OJ62N5k65K5K70k78K72p4l6k7
$$ y = [-101, -4, 163, 45, -151, -37, 62, 144, 55, 50, 32, 181, -122, 110, 63, -99, 204, 12, -311, -18, 174, -42, 90, 39, -33, -200, 89, 2, 318, 273, -300, 98, -245, 222, -113, -96, -174, -353, 256, 41, 2, -97, -43, -419, -212, 24, 208, -171, -87, -223, -14, 340, -72, 168, 168, 122, 175, 122, 84, 41, 277, 52, -113, 45, 316, -109, 69, 61, -215, 31, 312, -140, -323, -214, 64, -37, 31, 197, -191, 0, -229, 73, -125, 125, 55, -59, 12, -141, -74, 296, 87, -440, 68, -1, 51, -28, -145, -88, -36, -93, -188, -288, 177, -71, -3, 18, 73, 221, 77, -236, 223, -83, -193, 73, 209, -2, -20, -60, 125, 9, -110, -84, -242, 127, 267, 161, 87, -50, 75, -12, -77, -26, -284, -50, 97, -183, 45, -35, -199, 161, -4, 73, 244, -27, -25, -15, 238, -46, -18, 70, 309, -57, 132, -98, -221, -164, 195, 130, -159, 123, 116, 113, 30, -257, 112, -81, 113, 13, -300, 12, -75, 162, -59, -53, 109, 164, -101, -76, 194, -84, 188, 114, 78, 51]
5090E1j91L97l15J1J04j43K9j44K76J0l62L37j68p7L24j03m2J17j31j48K44j68
5112i2j15J36j4M58l33K2K60k81L0j60J84j23j19L30k15Q3L7j18J5J40j39k9K07
5135A64n1l9k44K40K61j48K7k55K19j60j11oJ70l8m1m3j52K17J50o6j32Rp3o1
5159a63L80j4k80K31j49j75J35J04Ml5j06K27k3l06L1J14j15J97q9J09P1RL1m2
5183A46k73Q5J48l36L48n5o8j1J68k99J09k33K25K36j04K4L2l7O0J4Rj31k1M8
5207H4M0j91k12J96M74n01L32m48J63NJ07j84J15O0J9q3j8k65K50K32p9M2l27
5230a89L64l53j2N22j66k38M0K76k67k9J83K47o34J17M6q7K01j92L36p4j56JM97
5253D33l73k87jL04j49K38n6J7l48J06L3r1l9J07J75k66J13ON7r3k4J68K66j37
$$ y = [51, -140, 257, -58, -47, 57, -86, -57, -201, 75, 85, -277, 60, -108, -185, 139, 36, -6, 111, -20, -168, 76, -92, -207, -71, -85, 373, 40, 62, 322, 41, 71, -89, 95, -28, -147, 183, -32, 51, 88, -30, -15, 125, -14, -43, 164, 113, 74, -170, 70, 331, 183, 210, -45, 174, 14, -97, -103, 67, 29, -12, -55, -207, 10, 160, 94, -38, -29, -102, -163, 217, 203, -77, 154, 5, -170, -35, 69, 73, 38, -68, 159, 136, -170, -139, -25, -140, 57, -32, 77, 148, 157, 188, 146, -127, -42, 106, -230, 118, 63, -5, -16, 152, -147, -38, -271, -46, 190, 86, 110, 142, 105, 165, 179, 188, 57, 36, 84, 124, -67, -279, -83, 391, -110, 222, -226, -63, -58, 49, -135, -20, 40, 59, -24, -42, -307, -57, 175, 96, 138, -189, 175, -178, -190, 332, 166, -72, -32, 244, -23, -52, 131, 378, -256, -139, -93, -180, 21, -171, 165, 91, -65, -64, 433, 60, -227, -228, 76, -73, 165, 109, 126, -222, -116, -83, -174, -213, -106, 69, -197, -84, -78, -21, -114, -138, 30, 296, 159]
5277A59j54j66J33m8m8J07J03J44l04L52n16K90j12j42k20M43N5j3j85oJ68k22
5299a82K18O4K7ol9K51j79m3p8j10L25l80K49J1P6j88j26K17k62J62N9j90K22
5322I8m51O75m3k99J07j52l7j3J23j54J99l8k41K54J38J52l19q4N7P8J6k46K80
5345A00j91J6Q2r0k0l5J7J75l5N4J29j40j94Q7Q5K15m24K52j71m7K31M7k67J10
5369a4P3Lj91j30O59l09p7R2j06J05k88L64k39N5j54P9L21J7n11L37J90j54J6
5392A38m1M6j10J47k31k24L36k54M77P9l14j64q1L8M13l33J08j01NJ05j90J35
5414a6mj9n8l4L73l80J31o9L00k39R8m2K48m16JJ21Q2KM8L3j52k23P4J93j53N9
5440d2K3k06L87P8k59p4N6K18m79L69q4O5j52k2K17J18k67J3n8J0J02J39j95J28
$$ y = [159, 5, -161, -28, -76, -124, -17, 86, 230, -74, 278, -238, 52, -60, -202, -422, 21, 76, 63, -122, -128, 40, -182, 36, 100, 127, 121, 82, 333, 154, 111, 33, -77, 248, -132, 117, 128, 204, 16, -110, 107, -155, 7, 66, -124, 98, -353, 322, 279, -20, 87, -65, -102, -115, 8, -146, 53, 15, -226, 28, 166, 318, -1, -85, -28, 50, 66, -180, 100, -91, -75, 7, -83, -103, -138, -121, 54, 19, 73, 202, 62, -132, -45, 40, 255, -169, 83, -88, -135, 96, 143, -124, -14, 59, 62, -129, -259, 400, 91, 14, 106, 0, 105, -183, 181, -58, -3, -157, -78, 243, 260, -251, 86, 276, 122, 138, 97, 143, 33, 180, -51, -275, 61, -193, 284, 363, 49, -115, -196, -158, 255, -78, 30, -71, -66, 39, -151, -16, -20, -39, -97, -131, 242, -138, -7, -76, 224, -15, 83, 41, 289, -127, -126, -5, 77, 79, 127, 160, 8, -215, -141, 52, -101, -42, -19, -225, 162, 240, -19, -93, -37, 181, -298, 71, -13, 52, -100, -122, 95, 213, -54, -41, -99, -89, 13, 152, -43, 85]
5464H5J77k04M7m50K47L6K32l34K78q2M0j25J63R6k86M8m5O5j14q6J04J41n7q1
5488a05P6Nk57K50q7R6N4K82l20o5J46j86Rj8K55k71J44nL0J70J1k71j8J1j21
5513a85K13J01K7m01K33J31K34m41J86k22K76k25m3K91m40J36K01k06L49l28m9
5534a62K92o1J2l25M02j41p4N7L7j30L05k21J74m2ml51P5J69l0K22n00J27J71
5557BMj73K06P7m7n8k15L24j54k2m2J97l11N30m32j30L26M6k25K08m5J20k24J29
5581I1o0j28K79k62j17L50k58J62kk23r1QL70k7l19K89m4p0K65j36l0l6K95l58
5605e2K13p4k03j32J23o2R6Q2k1L0L59j61k42M8O6l5J09J74k00r4K0j03k24M85
5629B02k19q1L50l37K65m54M31k85L29j68j92K15j24k1L23j33m6j29l0K25J50
$$ y = [85, 262, 58, 105, -345, -98, -62, 170, -164, 114, 32, 72, -53, 110, 206, -80, -32, -77, -12, -126, -212, -108, 33, -24, -105, -29, -24, -281, -31, -118, -22, 32, 314, -6, -71, 75, -111, -102, -120, 135, -136, 8, 3, 33, 203, 214, -57, -75, -64, -185, 28, 129, 156, -245, -12, 119, 353, -88, 98, -124, 152, -73, -116, 175, -265, -129, 72, -134, 215, -113, -162, 130, 69, 81, -244, 158, 17, -57, 0, 37, -93, 212, -9, 165, 123, 119, -232, -157, 12, -18, 204, -296, -169, 2, 6, -167, 39, 116, 69, 11, -204, 120, -34, -56, -98, 99, -212, 318, -114, -244, 82, 128, -97, 111, 66, 186, -38, 91, 31, -97, 182, -80, -197, 153, -105, 57, 55, -168, -259, -251, 119, 92, -227, 62, 18, -52, 213, 77, 47, 11, 306, -52, 161, 87, -116, -248, -125, -187, -91, -9, -30, 0, 359, 198, -44, 4, 70, 35, 144, 318, 118, 24, 44, -59, -283, 202, -17, -98, 252, -85, 180, -274, 157, -128, 201, 33, -159, 56, -68, -89, 234, 101, 55, -74, -104, 121, 271]
5650B71j77l54M35p8L1k10Q6J53P8m55L82l19Q6J7J76n2j11J57k13L5M8Q6k71
5673a99L00K5k88Q8J20RK8l81Q7K70p3j28M17j63K3k11k36K04J11K12k3L3m76
5696b51M01r0l92J98K76k00J94j50k2k24M62k7q7L27l58k15K28K13k46J44m30
5717b49K11Q9l54L1L09j98J03J19k3l30R8j2K02r0R8j79N89l06k77P2J8Q9Plj11
5742i7R5j92L33R6k58R6O2P9m4k46q6J41K12j88k4j04K3R0p6R9o3o5J6J57r6j58
5768a98J28l4L46m56L29Rk8M4m2r7m8Q8K2O5J57l39K77l8o2q7Lj56L37m7j98K6
5794Ak82K80j74K82j71o5N5K45j83k9p6J47J26k09J01J31j99j9r0K96k7n5K7j58
5818d6K76k37N5k8K17j25k72K59P1jj12j39qK43k79L58j51j44K02j93k08M10J18
$$ y = [271, 94, -260, 175, 97, 128, -82, 4, 157, 235, -220, 162, -157, -71, -54, 122, 70, -41, 116, -97, -62, -14, 72, -199, 101, 126, -162, -74, 46, 55, 83, -298, -211, 59, -14, -142, 275, 112, 135, -76, -312, -108, 3, 215, 192, 225, -251, 150, 60, -332, -134, 142, -58, 136, -14, -36, -260, 202, 175, 88, 415, 57, -158, 70, 283, 37, 181, -249, -38, 51, -303, -272, 37, -161, -58, 61, 38, -292, -194, -206, -4, -94, 4, -175, 414, 108, -169, -97, -79, 10, 17, 14, -97, -2, -194, 139, 235, -23, 73, 135, 214, 170, -76, -162, -21, 191, 3, -21, -125, -102, -12, -88, 11, -52, -117, -101, 56, -40, -198, -70, -104, 242, -214, 115, 124, 96, 140, 98, 1, -47, 41, 63, 128, 285, -54, 223, 185, 123, 36, 39, -117, 220, 173, -25, 1, -281, -1, -175, 107, -64, -129, -74, 171, -12, -41, -117, 30, 156, -53, 48, 179, -20, -39, -129, 167, 140, 85, 112, -46, 230, -7, 48, 20, 237, 112, -160, 99, 170, 169, 57, -82, -90, 153, -126, 232, 81, -63, 139, -54, -262, 148, 266]
5841B66k08j39r7K11qK10k90k22M35o3N6j91kP2l8j08J08J54m14L31j6M9J8l64
5865b50K43j24J50l6j86L05k08K01k28K92m72L90K85l67J42n71N54l7j85J37M3
5886G8N5O0l02o6J20K39j94r7K66k61oJ34J00j0K47n57M26j25M0l56L20j05K48
5909B54j6k87J21j00J21L8q8ok63N8K70n8j44j5r4K20O3k23K00m3J31J32k72P1
5933G0k25J13J42j16J30j57O4J90J68p5m96j25mR7J35J03j68L41j35l87O78k93
5955E0R6k69L46k02k61L02k80R0K17j34K35k98n4J56j55J82l40M14m24M77j04
5976D4M6k47M43j21k84j58K59o1J99J07l41K3L56k90l63K98o4K63k02j4L74m18
5998a51R9M8N6J5l53K45J55j77jr7oJ59j07L6K13K51m41Ll28N80j82k1j39J1J73
$$ y = [266, 58, -81, -178, 33, 25, 235, -55, -277, 158, 95, 151, -40, -42, 30, -8, -116, -8, 146, -268, 63, 47, 96, 114, -250, -7, -131, 19, -17, -203, 102, -106, 95, -133, 159, -313, 77, 362, -5, 137, -434, 120, 83, -102, 35, 78, 133, 193, -109, -175, -55, 184, -10, -107, 159, -102, -108, 26, 126, 116, 363, -194, 232, 107, 147, -209, 111, 6, 254, 238, -49, 72, -28, 93, 131, 43, 37, -226, -168, 102, 44, -100, -115, -209, 11, 74, -149, 51, 8, 139, 271, -1, 70, -155, -42, 100, -16, 114, -43, 21, 211, 379, 304, -192, -317, -321, -224, -89, 14, -154, 187, 52, -335, 343, 50, 146, -123, 223, 21, -240, 62, -218, -128, 89, -45, 190, -108, -162, -6, -161, 21, -319, 95, -329, 148, 44, 90, -157, 286, 165, -119, -277, -18, -79, 120, 227, -114, -91, 265, -25, -388, -90, -154, 109, -93, -107, 267, -151, -52, -4, 52, 67, -286, -41, 114, -63, -64, -161, -167, -8, -115, -79, 134, 385, -56, -53, -381, 199, 17, -4, -143, -132, 41]
6023D1P5j23J24k10K60k65j7JP7p3J9K44k24%o1K55j3j65J51q2k10L10n44O58
6047B28K4k55M1j9q7J58j6o6M2N0m29L66j2j86Q2k63K52J15k7k24L80p9J15k54
6071f4K86j90j08J45n0K6J12j12j6J00l9M2k38J09k24L52j43j79J83L4l54M38
6093A10j97K6N8K03l0m0j19J15j36J53j74ON7Q9j00j62p3K09r5L01k51k6L1k1
6117f6K26l29M5kk17J59Q5L6O3J10M1j68L5J12M9p6q4n9N5m2k57K98k2K4j91K47
6143G2N9j52J46o6j58P7N7Rk06L19l01L67J3m69K06M9NK9l25L43j62j13J00L02
6167B01k79l1L9o2K39m7j11J05R8j91K01l77K70M1q4O0J8j18n0j39J19K05j60
6190e3N1l55M38l72K21QJ64Rj39rJ13j59P0p7J31k26Q7O1o8P2j7k21J69L28J0
$$ y = [41, 116, -7, 117, -93, 167, -98, -115, -114, -37, -110, -91, 153, -71, -71, -132, 123, 110, -55, 96, 14, -196, 114, -430, 228, 252, -3, 38, 19, -68, 90, 74, 8, 50, 100, -329, 37, 25, -161, -79, -342, -90, 25, -2, -226, 154, 75, 190, -64, 222, 32, -76, 69, 19, 45, 157, 45, 29, 129, 90, 132, -106, 3, -221, 131, -12, -191, -8, 26, -328, 110, -87, -61, -3, 200, 170, 130, 11, 126, -10, 143, -31, -25, 32, 121, 21, -141, -214, -5, -100, 201, -50, -76, -45, -66, 160, -169, -124, -126, -343, -184, -99, -63, 0, 110, 151, -17, 18, 130, 179, 103, 19, -40, 15, -27, -284, 14, -8, 16, -175, 72, 131, -21, 125, 59, -99, -22, 35, 44, -162, 157, -144, 223, 236, -233, -27, 22, 27, 56, -269, 74, -88, -201, -101, 201, -78, -109, -70, -132, 107, 60, -51, 54, 152, -39, 162, -215, 55, 96, 12, 72, 90, -28, -78, -217, -98, 107, -53, -2, -357, 81, -291, -70, -62, 102, 111, -28, -37, 76, -83, -13, -90, 41, -185, -98, -37, -105, -33, -50, -271, -102, 226, 236]
6215B36j35J47l23K70k11j59J25J15J7J1L2j2k06J03j00K58K8l78M46l16P1P1
6237I0j33K80l19k4p6J85M2k72j50L12Km6M32l53J78j5K21l28k12L39k35mK17
6260A31l99N82m05J35m62N5N55l44L28j06J0j51rJ53Qn8j85J24J6J04o4J01k38
6283a19J35k98K42J46j60L14l91J67k2j67J41j11P4K31m4j39L5j67J05j14R2J80
6305A30j22l02L61r4j53m6K90R5j99K10k30r7L8J15k00M99k63k38K91j77O9J10
6327H7O6q9j82N0J3j88M19J05j87l69K71N9J31l52O3K9J96P3o5j38J56j48o3q9
6351a52J93j22J98j23P3n1j49O2j74J26M4R8jn6J02m8P5k32L20l69L2M02l48K76
6375A76l74K52J45jl48m5K65J1n8q0Q9j64J11L27m99L56k17o0qK34K10k59k37
$$ y = [236, 101, 248, -75, 195, -16, -175, -50, 65, 82, 93, 125, 113, -93, 10, -90, 168, 196, -182, 264, -52, 19, 90, -43, 237, -82, -106, -182, 3, 45, -227, -377, -65, -63, -109, 323, -30, 148, 133, 354, 26, -186, 153, -82, -86, 131, -268, 314, -91, 44, -418, -363, 192, -152, 176, 70, 80, -71, -80, 73, 81, 23, -162, -38, -22, 82, 18, 119, -119, 16, -282, -40, 106, -54, 260, -131, 36, 14, -153, -12, -123, -49, 182, 138, -1, 34, -133, -28, -142, -50, 130, 8, -294, 67, -27, -180, -226, 64, 159, -40, 170, -60, -157, -119, -4, -204, 295, 32, -206, 85, -92, -23, 87, 153, 64, -118, -68, -55, -243, 176, 281, 94, -275, -4, 55, 186, -166, -103, -74, 122, 195, 130, -8, 148, 0, -63, -152, 41, -81, 117, -6, 67, 16, -133, -71, -245, -119, -75, 23, 22, -34, 68, 20, 95, -137, 183, -186, -154, 248, -100, 176, -198, 54, 199, 198, -150, -195, 70, 81, 23, -57, 32, -132, -21, 306, -193, 163, -54, -114, -122, 112, 322, 63, -174]
6398a74J76q8k0N41l89k67ML52lk85K93l04K10j71J20J06J86n03L10M4j01n6K90
6421B71N3n75M37k12p6K52K2L2l87J72k01P3J67k29J98l44L08j02K32q6J4J40
6443A59j8p8j16J24j28j60K73J19k74J93k77L32k07M7m51M66J84m2m07K64P4K7
6465A04j57j24M88k33j82K07k85N7L23n4j29K00l64M18l92j7L02k54K15m0j08
6486b5l94N69N7k42j15K59K0j80j87K36J05k1j0k15K18Kl96N70l32R6J49p9M1
6509A26j40n5j75m5l9M4L06J05j54K0M3k68K55O0j63N5J26P7n0n9N6k82K03K84
6533C30l25m6k4K8%J84l07j8K53k58K39J41k48O5J8J26k1k55J32j03R0j3K0j01
6557i3j61K09j55N3K61k47J86L1O8l59K44n2p1J18N6k27o0L9Q2J30oJ42j78J0
$$ y = [-174, 2, -86, -106, 435, 46, -221, -217, 135, 132, -153, 140, -164, 46, -125, -5, 101, 287, -216, 94, 138, 37, -19, 271, 324, -251, 186, -26, -102, 150, 172, 204, -183, -11, -212, -139, 28, -201, -3, -347, -39, -141, 91, 5, 19, 159, 141, 63, -53, 71, -57, -217, 56, 175, -99, 94, -183, 149, -58, -11, -462, 4, 188, 146, -261, 3, 77, 104, -53, -177, 311, 78, -104, 103, -182, -125, 198, 144, 15, 215, -149, 269, -123, -140, 162, -92, 123, 83, -25, -419, 150, 207, -35, -150, 109, 129, -51, -238, -2, 103, 82, 72, -143, 75, 77, -319, 251, -81, 15, 164, 85, 126, -14, -69, -244, -289, -328, -284, 22, 127, -27, -7, 36, -232, 23, 83, -80, -25, 101, 178, 128, 69, 125, -157, 46, 330, 5, -41, -65, -37, -37, 147, -160, -178, 75, -183, 56, 197, -51, 14, 32, 158, 137, -118, 14, -89, 1, -12, 8, -93, -254, -45, -200, -147, 114, -133, 53, 84, 152, -207, 37, -15, -86, 32, 88, -139, -199, -160, -78, 52, 46, 188, 10, 20]
6581B0J30n6L4j20k6k03M04rl00K07k58l16N83l8r1J22J71l53j18N51n97J73N9
6604c1K7O2p1M24m05k32n4J50K69l58L23k91j53N04j70j09J71l01K15N6j81J06
6626d9M5l3P2J27k06K1J58k40J4J94r0J86j20j85J77K02l05M0j89J17J14q4oL13
6650B73j60n4j4j19J93j26L0J5J58k88J74J9j14o3l5j0J84p2J27o5j53l45O63
6673B18l27M8O1J81j38q2J04k28P5P5J28o6j16Q2j32p2j93M25l22L48R5j49p9
6696f4R4j12J20J80k2q7k49Q5j0R7j12j42J16J15j46m2n9M12k92K7K71j72r5L04
6720B17k68O4J5k32J80J37Q4j08J88l64p7R4M37j36j94m14N29j01O4K19l84K93
6742B43K3j59m3m2J28j01p0Q1O5Q7m51pK8L9K24k08J10nl55N95l33K85ll61PJ16
$$ y = [20, 150, 94, 128, 8, -18, -221, 183, 174, -126, 81, -177, -493, 90, 52, -39, 83, 254, -99, -217, 334, -263, -90, -31, -4, 58, -13, 411, 6, -226, -280, -130, 139, -219, 104, -187, -340, 164, -6, -115, 56, -245, -30, 26, -155, -49, -4, -37, 35, 162, -44, -23, 135, -105, -91, 103, 13, 199, 79, -106, 71, 273, -32, 8, -181, -64, 50, -34, -40, 273, 113, 59, 45, -74, 119, -7, 23, 38, 196, -92, 82, 101, -13, -76, -111, -121, 63, -9, 118, 53, -100, -445, 218, -109, -61, 0, 181, 43, -39, 65, -163, -88, -13, 115, 49, -67, 15, -117, -189, -382, 43, -279, 69, 164, 15, -64, 30, -82, 38, 218, 196, 109, -140, -55, -65, 32, -80, -222, -106, 9, -137, -179, -238, 174, -118, -91, 180, 8, -87, 217, -51, 13, 28, -204, -24, 113, 197, 89, 277, -87, -164, -70, 367, 231, 37, -377, 152, 51, 115, 334, -50, 243, 266, 107, 64, 22, 150, 49, -21, 60, 125, 212, -239, -246, -218, -179, 45, -163, -53, -58, -413, 182, -151, 134, 131, -230, -223, -107]
6768a07J64R8j96j0J19K35j88j30K0j34l2K58m20M01j79M2r8J02j90M7M58k9m07
6791a76J69p9K65r4K76k12j23j73J4O1J28j23m0K34m9j20k45J41J27J3J84J40
6813C18l78mN1L8j7K5j35J34p6J94j41j46K04J26j64j30K49l5J38q3k27P4J29
6836A44j01k82L04j0n3J37k76OK15p0J13l64O3J05K27l44J60j02J36J18K72l72
6858B6M7j31J68k84J16J60j71JJ34L6j82L3J63l7n09N49j85J9l0L2j00j78L25
6881Bk8p6J28j08J71l08K85k0l36L96k7k20J91J42k29N2p3k54j55N03m05L01K37
6904A69J38%q8k76L1J08j52L61l84q8L59M6k09j77P6l4J93j13K32j4j35j3N0j23
6928d3L72k68j54J9J98q1R1j92K19k82K00l3J44n19L01J07r0J73j24J75j72K71
$$ y = [-107, 57, 155, -41, -51, 68, 303, 115, -15, 5, -129, -161, 97, -323, 78, -101, -59, -157, -55, -245, -198, 260, 231, -176, -7, -86, 179, 85, 361, 149, 26, -147, -133, -72, 56, -67, -107, 127, 78, -42, -287, -146, -19, -6, 178, 318, -60, -64, -13, 25, 8, 33, -102, 32, -44, 150, 9, -137, 67, 193, 29, -101, 148, 113, 251, 168, -59, 15, 144, 43, -239, 65, 55, 2, 139, -137, -131, 84, 14, 127, -237, -174, -69, 158, -186, -26, -128, 8, 126, 398, 26, 73, -58, 110, -174, -58, 102, -69, -68, 66, 102, -80, -47, 116, 79, -430, 119, -66, -47, -77, -45, -145, -323, 2, -26, -102, 26, -82, 89, -219, 66, 46, -290, 106, 79, -141, 50, 192, -37, 15, -58, -312, -467, 36, -369, -68, 169, 307, 307, 219, -57, -26, 82, -70, 291, -93, -181, 178, 224, 15, -162, -86, -120, 73, -40, 192, 178, 43, 30, 80, -43, 329, 61, -93, -74, 124, 43, 134, -58, 161, -121, 79, 46, 190, -329, -28, 79, -11, 162, 38, 213, 41, 312]
6950C12l49jK33l60M1J19P0r6K56k15O8m0r2j1L23P5o33N26k71L9L66j68P0m51
6974a89Q6L28j34k99J73M5J71j56j56K63j13j49K51J24k64o8K16J89o21K41m6
6995a08Mr1oM2J14m8PK53J8K4n2n29O25o7j60K24m88L18J3j25J30k45J21K03l29
7020a52K41k08k8J17J53j15L6p8m8J87j21k5l5P2r5K67K2o9l34N35l13n7m0J37
7044D9o1J11J3J64k82O6J45k90Q9m8j51K56Q3P6k33K44O2k87O4J1k51J09J11J52
7068B02l14K0J38n0j18J72j01j23J18J4J11n7m0J06j9j96j0j0N2Q1J0j5J76j64
7092a7OJ04j6j83k4K85j68J17M9l77J75R4k88K46L01m64O0K65l10r0K82P0j01
7115A6o1RK23r9o1n7K86j01k32J91k72J84j61K61K02k45l29J60R6n9L68l81j79
$$ y = [312, -37, -38, 195, -165, -124, -5, 65, -31, 225, 10, 78, 38, -54, -65, 258, 333, -300, 226, -45, -6, 360, 192, 262, -189, -103, 225, 91, -208, -35, 10, 181, 25, -131, 132, 19, -130, 121, 245, -19, -87, 129, 318, -303, -62, -108, -104, -195, -201, -159, -45, -93, -86, 167, 185, 209, 157, -372, 253, 186, 26, 250, -238, 80, 93, -32, 98, -147, -26, 177, -152, 89, -119, -147, -30, 123, 8, 44, -34, -82, 105, -16, -41, -76, -4, -99, 168, 190, 121, -213, 322, 9, -48, -88, 49, -12, 99, 112, 276, -6, 60, 205, -85, 4, -44, -195, 61, 144, 220, -13, 231, 293, 6, 70, 81, -170, -61, 50, 202, -112, -92, 46, -4, -122, 50, -51, -174, -56, -42, 69, 12, -28, 78, 59, -137, -147, -157, -105, -24, -14, -29, 147, -17, -11, 93, 77, -106, -130, 155, -13, 104, 153, -224, -49, 45, -243, 3, 304, -160, -100, 165, -145, -235, 47, 117, 16, -45, -36, 187, 88, 27, -30, 256, 155, -77, 114, -158, 26, -135, 126, 328, 83, -246, -86, 10, -49, 319, -62, -241]
7138b41M11J22l36M6l7J27M7R5j96p0N6J55m00K9M6O5m3L0m1J32l39N80p9k08
7162d9K24o0o6j32K41k87K70j1j99J76k12JK81m7J11k42jj06RK81Q7j46j84j69
7186b30J24k07M17K4k29J03l0k36R1J72j08J53k38K98j41L23j51l56K75k65J64
7207d7m6P7N9j55O0J9k30L66m1k8j69Q6K23k27J59j56P5o3J55J0n8k60M01m47
7231b37J18J77k47n8K60K9R7l29RJ26j48J35O0K08Pj34j34J68k44J56J72l93P9
7254a23J20j95R5O7N5k52K6K64K2J2r1j02M63k32j79P3j83J88k0K6j08K17j39
7277DJ1m9M9j77M61k51lJ32l47J50K33n23J89K29j79o1K04j26k19J03M30n04J42
7300a02K95j23J45k42M8R8k94L13n5L9j4k20J04j71O3mK1J71L59k80P8n09J11
$$ y = [-241, 170, 292, -44, 2, -35, 92, 139, 234, 38, -32, 24, 179, -221, -192, -146, -81, -124, -94, -135, -3, -342, 238, 159, -49, 175, 115, 49, -83, 158, -129, 141, 130, -69, 107, -105, -104, 177, 130, 241, -1, -2, -108, -99, 182, 269, 123, -61, -230, -106, -313, 104, 128, -101, 2, -28, -264, -173, -1, -109, 44, -194, 104, -37, 286, 135, -221, 54, -211, -47, -93, -16, 43, -112, -52, -33, -263, 103, 62, 34, -135, -49, 174, -53, 106, -50, 25, -38, 117, 127, 69, -191, 210, -237, -119, 58, -189, -247, 13, 42, 139, -190, -181, -55, -203, -68, -8, 200, 207, 73, -61, 107, -137, 19, 191, -202, -123, -3, -198, -103, -36, 19, -233, -207, 57, 79, 91, 0, -102, 361, 129, -50, 23, -160, 28, 8, 34, -74, 143, 4, 15, -34, 15, -162, 299, 48, 45, 177, -170, -20, 213, -310, -121, 108, -71, -132, 72, -54, -273, -170, 260, -244, -102, 193, 70, 215, -27, 21, 119, -175, 138, 83, 122, 108, -112, -8, -179, -116, -120, -99, 72, 431, 151, 229, -280, -169]
7323a69Q1n1K79L6k83L85m43K01K34n84L80r5k42L93k72N22l97J43j08l62L42
7344a0K8j05J68J19m79M87m57J77R9k25J82j42J9j15L05l80N51r9ql27M82k33
7366C7p8j77p8J80Rj26K07j02P7l25M91o0J95l32M9J86L6j4k53j4rK69q7m6q1
7391d6N5j06J60j08R7J57l02j78L58K40l38K18n54J88K39j42K28j63K27j0L3o00
7413c47N83k16K5N5M9j24K12j02j17j91M3K10l1KLj37mN0J50j17n0L3j05L89k70
7438go3m8L8J35k5k2q9l1M7l7J30o6J50j60J11m9j33K88j37m3p0J17k6M9j5K11
7464B55j53j41J30l60N93l2k85Q7j94k15M21L8l17J63J01L5l8NJ65l57m9K70p6
7487D6J02l8j55k37M70l91L01l1k13J49k93L47l3J8J27j22j79M00l78R1J1N6R6
$$ y = [-169, -88, -139, 140, 176, -107, 278, -165, 36, 270, -314, 66, -29, -271, 122, -150, 372, -25, 118, 10, -352, -10, 18, -87, 81, 200, -279, 208, -249, -72, 27, -198, -16, -158, -139, -254, 51, -329, 222, 123, 115, -212, 270, 37, -41, -218, -296, -116, -107, -233, -26, -128, -51, -376, 115, 55, 250, -82, -33, 153, 189, 175, -78, -92, -101, 168, 81, 35, -46, 9, -97, 63, -45, 52, 209, -93, -271, 87, 327, -11, 207, -347, -159, 80, -62, 166, 3, 230, 220, 253, -347, 236, 20, 45, 100, 149, 25, 237, 135, 18, -173, -130, 80, 49, 51, 54, -83, -87, -37, 113, -4, -54, -21, -126, 263, -7, -70, -118, -80, 55, 30, 8, -81, -112, -65, -102, 28, -38, 112, -48, 63, 14, -119, 169, 32, -11, -81, 36, 10, 59, 44, 255, 102, -39, 91, -269, 324, 292, 7, 94, -100, -315, 106, 144, -173, -10, 91, 126, 88, 93, 258, -99, -148, 122, 46, 148, 110, -45, -282, 188, -203, 98, 67, -146, 3, -290, 57, 24, 42, 169, 47, -132, 268, -110, -19, -8, 48, 144]
7510A44j34k16K98n6j82J60l13L56k04N9q7j0j2q7K28K4k43J98j8lL51l31L31
7533B53k73M4P4k55ML6p6J62K31k39j04O3J07K2j18rn2J30K5j15j45J36j09K75
7557F7j60Q9L21n13J87j50K11j66K95k28J88k26OR9o3n9K3K63l31O7L47l91J4
7580a10P0N0J61j2L9j43K4l2k1N9Kk06K94j56R2m0j71KL08j85J02k43J52p0k42
7605b76N03j47k00J05Q3k09L02Q4l83k7K22q4k3j50L4j81O03j88l72L41j39J49
7627D7J57k51K27j17j48J24J61m41K10j78K48J78j56q9K36K7j50J45m15K74j30
7648d1K6pK4J39j25r6j46R5J11k6Q9j7p0j20K23j1o1j48l6J71P6K04m3m8k53l
7674i3r8N10N8l46k54J01O1J15P0j51j27K27L85l75j75J20M5l24J53j29lK21L3
$$ y = [144, 10, -206, 92, 36, -146, 14, -299, 57, -147, -88, -175, -185, -197, -284, -56, -32, -275, -77, -95, -98, 253, -78, 253, -20, 24, 98, -157, -153, -117, -193, -31, 200, -39, -143, -80, 27, 49, -69, -78, -130, 0, 25, -90, -235, -99, -208, 67, -93, -4, 317, -196, -9, -159, 52, -114, 181, -47, 141, -85, -79, 20, -43, -102, -79, 184, -147, -80, 267, -124, -110, -40, 10, 171, 159, 198, 55, 79, 47, 26, 85, 87, -119, 175, 19, 111, 71, -100, -98, 210, 25, 127, -116, 36, -34, -276, 227, 80, -120, -15, 68, -141, 161, 245, -138, -165, 57, -27, -50, -200, -166, -347, 256, 68, -304, 37, -102, 47, 204, -47, 180, 63, -85, 39, 200, -241, -31, -209, 39, 217, 61, -28, 208, 235, 85, 230, -185, 89, -41, -15, -22, 2, 141, 16, -80, -226, -131, -20, -46, 43, 26, -44, -164, 59, 48, -13, -161, -197, -26, 50, 254, 211, 163, -90, -93, -191, 319, 377, 31, -223, -122, -61, 54, 124, -27, -154, 73, 458, 83, -92, 28, 73, -251, -98, -227, -230, -9, 24]
7697B4o3J52k19PK37m9j71L0q7J75Q3m1m3j75M18j29j89J59M6J4j98m9j53K54
7721C3m0J24j82j78K09J23j21k54J12J70K29l54j84L92k4k55J95ko1L1J18m1K46
7744B86m61K12m7r7K0J28J87q4k45K07n2k48N7K51p6j81K3n5L07k77L13n2L0j8
7768A28j22J14j50R6m6n1L3L13k9j65j35J59k00R8k68K67Q0j34L20j60l3j55j0
7791e0k4K12k2j98Q8l2K0J76j77j11J7L25J35m09J48k35O4L4j65K00n3j09K79
7814A13j99J09J01k84J58Q2J13j26O3J15k91j77J60J58k12J95j95J09K25j40r0
7835a3J7j35J84j14K99k09R3N7j88J48k99R6j06O9P8lJ54Pq7L75n19K9M2K3J23
7860A21l4k20L7K57j06k52J73J56j90l5Q6j04J31j11K84l24J49k70K96R9m97L67
$$ y = [24, -39, 113, -106, -99, 138, 89, -82, -52, -139, 36, 119, 78, 35, -140, 278, 149, -40, 119, 165, 179, -19, -68, -221, 33, -7, 117, -65, -243, -34, 89, -32, -286, -174, -4, 225, -129, -313, 79, 55, -200, -5, -7, -68, -37, 81, 40, 286, -175, 37, -10, -107, -87, 41, 228, 144, -101, 106, 54, -194, -137, 114, 38, -143, -120, -175, 132, -145, 168, 116, 146, 128, 6, 120, -30, 66, 20, -31, 2, 315, 286, 121, -14, 145, -55, 43, -225, 42, 122, -12, 308, 148, 115, -40, -50, -74, 138, 116, -82, 6, -26, -6, 170, -7, -118, -101, 224, 359, -50, 98, -137, -73, -39, -204, -4, -57, -166, 113, -86, 23, 124, -160, -2, 80, 193, 67, 130, 245, -46, -223, -63, 95, -117, 78, -117, -8, 217, 77, -13, 4, -131, 53, -61, 238, 29, 122, 179, -9, 139, -160, -64, -170, -101, -23, -26, 128, 135, 48, 423, -96, -67, -25, -2, 121, 87, -133, -96, 161, 55, -197, -24, 132, -58, -93, -7, -111, 20, -91, 193, -131, 18, -252, 44, 143, -354, 13]
7882A3j10j5j2L59k16K05k86R3K64l62Pj06J60P2j02J9J08j35L56j65m00K93M7
7905H7r3K12n3l68K39J42k60J02p4K15k91o7M57l38o4q1L04n8q0K68n15O65j14
7928B35k91m18O54m5j32j6K03k72K44r1nr0l1J02J00k49l5K60O1j82k34M12j62
7951A8K98j29k6q0J9j37R7L43l14m8K07l61J36m8l4p3l6J74J05l08L7K8mK02L79
7976D45l75NO1pm37J47n0K53k83J74J46r1N4k7K01k65m3rK60J57m18J78k56K28
8000D8j98K18mlK0m1Nn5K0J5k97M19J22j46j56j3L60j76j18M8n4O4j03r8n3j23
8026b99L75n10N37j82J33M8Ok99K40N6k97L42k69N4K41j94L00k02NL34n02K24
8048A41p1j90K5J6K4J63j43l6m3J49N2o3J52lj80k61K18L13l02L29j85r4m0j08
$$ y = [13, -97, -112, -124, 235, 19, 224, -62, 31, 295, -67, -60, -166, -6, 66, -36, -17, 91, -44, 312, 147, -253, 40, 87, -6, 206, 153, -215, 24, 166, -94, 8, -66, 149, -142, -209, 248, -90, -154, -235, 69, 11, -69, 199, -316, 349, 235, -56, -474, 180, 135, 3, -13, 190, -82, 162, 71, 66, -24, -55, 47, 147, -102, -137, 123, 184, 2, -232, 180, 18, 316, 187, 161, 81, 100, -37, 60, 403, 89, 41, 248, -113, 23, -25, -59, -132, -168, 6, 111, -197, -160, -132, -136, 66, 445, 70, 75, 136, 129, -308, -161, -211, 42, -241, -67, 79, -12, 42, 15, 216, -49, -92, -101, 159, 316, -102, 76, -180, 48, -150, 68, 64, 61, 81, 40, 45, -10, 10, 25, -272, 147, 269, 123, -33, -46, 314, 138, 20, 68, 14, 78, -25, -123, -176, -299, 76, -434, 103, -79, 54, 102, 108, -191, 49, 105, -192, 150, -119, -65, 176, -18, 282, 80, 85, 419, -83, 141, 70, -120, -95, -79, -55, 108, -35, -71, -114, 35, 87, 24, 176, 173, -7, -268, -50, 263, -39, 290, 105, 11, -29, -137]
8072a37K39j50M06l43o0qJ9K02l8j62j2M6K84j19k60K08J98j11m27K06K1Kk85
8095b81K68j35J7K42j91K88jj87J1K44j22l19K74j45L6K05j20p8j14J52j91J89
8117D2k69M47l21K91m12O2J10q6QL55j53J8j39k28K90p2R3j11k29K64m7K55k14
8140d6M56l27k75J71J90j32L4o6K69n43M10R6l65K30O3l39R7K73k65J49j18j59
8162a97J75J61k64M96l4k24j94K33p1k94K77j8M0J62n28K50L12j04M4j51N6j01
8184B6J88k5n34L23K50k49l44
$$ y = [-137, 102, -48, 358, 15, -45, -53, -34, 168, 130, -32, -44, 2, 286, 167, -93, 115, 313, 202, -225, -19, 2, 4, -281, -13, -148, -131, 111, -80, 208, 207, 20, 31, 275, 153, -166, 108, -37, -1, 204, 84, 6, -108, 44, -147, 42, -227, 220, -101, 190, -222, -160, -50, -136, -128, 227, 74, 92, -47, -275, 15, -57, 36, -75, -304, -40, -87, 168, -46, 410, 83, -192, -21, 169, 37, 71, 5, 274, -269, 141, 237, -128, 102, 165, -174, -77, 196, -69, 80, -38, -197, -22, 139, -125, 371, 337, 113, -81, 152, 81, -213, 64, 46, 86, 248, -280, -30, 282, 178, 222, 71, 127, 26, 214, 189, -345, -22, 228, -21, -365]
8191c65
$$ Imaginary data points
##PAGE= N=2
##DATA TABLE= (X++(I..I)), XYDATA
0@%%%%%%%%%%%%%%%%%%%pJ5j6J6j6J6j9K7l2L2l9M7n1N9o7P5q7R8j09J24j39J54
41H1j71J90k12K35k59K86l15L49l86M26m69N15n67O25o91P64q47R41j050J181
61F26j337J525j758K055k457L029l914N542j3786N4624k3002j6297O1975l9609
75B7216j1194L7725m7732k7848N6907k4814l8388M4574m116m0655K7021j0037
87a1341l2597L6924M132l8579L7664K6793l2960J1360J8198k5053J3093J4887
99B2521l3891J0531L3923k5247r434K2162j9316j1099J4486k1370n434K9208j2160
112e120j4836K7948j485j7498J3835n955j2549K0566k828j5249K5582R967j8918
125C460P868K402j7189O887j548k1087J4443J3200j8538N466J0607j3838M682
$$ y = [0, 0, 0, 0, 0, 0, 0, 0, 0, 0, 0, 0, 0, 0, 0, 0, 0, 0, 0, 0, -7, 8, -8, 8, -8, 8, -11, 16, -16, 16, -23, 24, -27, 32, -35, 40, -47, 51, -58, 66, -73, 81, -90, 100, -112, 123, -136, 150, -165, 184, -202, 224, -245, 270, -297, 328, -363, 401, -446, 495, -555, 626, -711, 814, -944, 1111, -1346, 1683, -2231, 3311, -10475, 44149, 21147, 4850, 66825, 27216, 16022, 53747, 6015, -21833, 35074, 10260, -28128, 16446, 12330, -28325, -1304, -11341, -43938, -7014, -2882, -41461, -3797, 22996, -9964, 1396, 19594, -5459, 7634, 22521, -11370, -839, 33084, 7837, -1597, 20565, 1249, -9850, 4636, -16734, -22168, 7040, -5120, -19956, 7992, 6507, -10991, 2844, -3111, -15660, 4906, 2078, -13171, 12411, 22378, 3460, 11328, 13730, -3459, 3428, 1880, -19207, -4764, 8436, -10102, -4636, 5971, -7867, -3185]
138c185M069j5443R857J3290j1714M801J3803q919j336M014j2650m63P809j2367
152h434r25J4254m594l964P339o862k333P961q591k795J5063L51m933P928j951
167G514p096M752o837j0460R774J372q297R863N052o852N090P9j0873O225L576
182B882j0886O205J0265p269J443M637r753P36M963j1202k93J2642m011j721Q979
197G617m920m540P109q231p757J1436j903o048J0820J034o245O852k449r531P354
212E98J221q777Q095O890o757K854K964r969J355K641j0702J567R223m289J15
227b971Q244m389j139M975o531l793Q859j834m458Q794j51n277M076l124p263
242e982M607m24o633O817N046m797L221K160n448J361J265o350K044O069k529
$$ y = [-3185, 884, -14559, -4702, 8588, -3126, 1675, 15478, 6559, 5223, 9237, -3413, -3876, 3933, -8434, -9359, 4895, 301, -3663, 3676, -3186, -5519, 2442, -6149, -8944, 6119, 6470, 1537, 9465, 7514, 418, 5170, -1667, -12127, -2353, -981, -9278, 585, 5637, -1215, 3875, 3954, -6919, -694, 2882, -8004, -1799, 8466, 1197, 2640, 7277, -2476, -1740, 3223, -7979, -8272, 4370, 359, -1362, 7617, 2697, -1843, 5266, -2965, -10722, 714, -1189, -7237, 3583, 4617, -1628, 5224, 2775, -6756, 598, 1819, -6958, 1137, 8027, 1270, 4124, 7088, -2881, -1526, 1115, -9587, -8020, 1203, -3086, -2971, 5273, 884, -255, 4720, -1811, -5604, 3255, 1421, -3037, 5757, 5606, 329, 4405, 1281, -5982, -1375, -1799, -8432, -1615, 3431, -1366, 1855, 4015, -1433, -72, 1193, -5157, -3113, 2956, 427]
257D27j36M636k400j879J309m723j856M275r06j500N420J206k311R86j915l206
273b573R47j074k189L566L437q87Q05R98j232j449n28k394P88K623j04M76J656
290B866o78j398j903k198m64O00N3J451K704J518M46n03j363j68j012k198R55
307a292J956O15P92p0j428m86j219l130N01K089r78K632K475k02Q81M93l759r94
325a124J115j946l76L576n15j15K264k388j941J380k014k306L849Q07j114L675
341B827L43k447J026q21m155J185J628j886J888L474k150M29J654l927j163K511
357D16k813j67L958l05j015L063j858l036J794j404k632K961J656j519L091J594
373C784k897M42K38l886K12J948j954J392L033j961l25J997k609k118K198j308
$$ y = [427, 291, 4927, 2527, 648, 1957, -2766, -4622, -347, -1253, -2753, 2667, 3873, 1562, 2548, 633, -2573, -1626, -2700, -4889, -1323, 2114, 1227, 2032, 3030, 1798, 349, -179, -2573, -1785, 838, 734, 1210, 2866, 2188, 790, -1113, -3311, -3775, -3175, -3122, -1671, 1033, 2551, 2997, 2494, 1131, 963, -49, -2247, -1292, 664, 1279, 2071, 2001, 573, 87, -1132, -4262, -3761, -1672, -2650, -18, 2457, 2255, 3136, 3629, -130, -1124, -9, -1955, -2331, 1245, 730, 615, 2879, 491, -1450, -70, -2084, -4390, -541, 266, -848, 2827, 3170, 723, 1749, 928, -3227, -2042, -414, -2300, -412, 3062, 912, 1341, 2995, -932, -2095, 416, -2397, -2564, 1394, 1089, 74, 3137, 1279, -1757, 37, -1367, -3999, -1038, 618, -901, 2190, 3784, 887, 1329, 1567, -2319, -2107, -159, -2113, -721, 2312, 351, 26, 2023, -586, -2704, -506, -1814]
389a814n73M058K25r45K296q32l302J005r56k312J675J587j199K403R03j987q8
406A44P54k385p27J780m18P63K385k46j090J037k180k232J340n57p58K149R93
423G52R1R25L47k005m80l64p66J35J539o7R72O34o00r69m12j072o55Q13Q05k1
443c98J668J154p83o37k91j661n60M85m36O82J631J19l00L47r29j179j74L02k49
462a209R36J467m4K40N19j783q48q4o72n27J396P22L32J128J19j163k74l76j364
481a485P7J420n26R12J330r51l95K42j683j000J389j07l77K645j66m99J126r57
499I95j996P85n29j368J464J315p86Q85N94j669jM29k098O1K275m15K20K345p90
518A716j011L44j378j291J007l70m05J640Q20o63L43Rj734K68K53j334J231J431
$$ y = [-1814, -2387, 1671, 1896, 951, 3247, 2415, -887, 118, -838, -3150, -1475, 112, -1087, 1316, 2219, 232, 144, 898, -1487, -2214, -434, -852, -89, 2296, 2050, 960, 1997, -183, -2415, -1075, -1632, -2390, -241, 752, 843, 1768, 2115, 110, -370, -734, -1500, -1365, 174, 107, 1079, 1713, 1113, 144, -268, -1340, -1995, -1182, -377, -398, 1270, 2424, 1641, 1004, 713, -948, -1508, -1023, -1459, -777, 854, 973, 673, 1020, 91, -1088, -1262, -960, -1209, -273, 1194, 1150, 1390, 1909, 126, -722, -806, -1478, -2005, -609, 113, 445, 1573, 1692, 529, 255, -121, -1485, -1408, 12, -514, 398, 1728, 777, 382, 624, -1059, -2059, -670, -777, -1154, 1491, 1325, 826, 1952, 995, -1001, -216, -745, -2113, -649, 666, -120, 765, 1359, -310, -311, 118, -1980, -1919, 356, -59, 161, 2506, 1716, 705, 1049, -329, -1620, -613, -983, -1388, 252, 1072, 409, 752, 761, -973, -705, -452, -1786, -555, 876]
536H76l40J50J133j007j561N44r23p93J817j97n10K367R6j507n8J9j582Q05N2
555f19m09J320J168j076K90J75j275o75N98l57j13J574m9j04J013k50j712l1l77
574i09q59R15N61K43O74P17o97n46k10m18o75O54L37M28R55m9o39J29q91r72Q6
595a166j4L00O63O79L24L8J92j153l73L26j39j6M03N85RJ60m81o95k57j31q91
616a637L33Q57M04M56O41l16j5m94o74n77O66k9K95P07M26l37p3l31j470K53M72
637d43m73N52J250j99j82M55j058m44N43r48j70J165P72r90J431k36n15j79n97
656b66q89P71M69m52O03Q97o20Qn8j592q1M19k56M06J460p6k47P01o80r10K78
677a15l22o29J195O84o82L28M77j351L11m77r29O10R65j90M74R63l00m99J87p07
$$ y = [876, 536, 686, 1819, 812, -749, -205, -1128, -1921, -104, -301, -811, 1556, 1652, 145, 87, 106, -1476, -671, -619, -1028, 292, 1460, 384, 674, 849, -426, -1101, -503, -860, -973, 601, 552, 448, 1461, 1211, -501, -532, -909, -1768, -853, -292, -49, 625, 1342, 645, 99, -111, -529, -1204, -550, -213, 215, 1170, 1121, 482, 611, -280, -1252, -1166, -1180, -880, -217, 462, 786, 824, 1016, -137, -510, -184, -323, -339, 64, 649, 658, 818, 337, -358, -615, -746, -1637, -1304, -447, -43, 413, 1054, 738, 723, 229, -445, -1022, -356, -385, -90, 617, 1043, 706, 633, 302, -1168, -915, -443, -916, -364, 886, 687, 505, 960, -98, -542, 1, -947, -1117, 48, 820, -170, 1261, 1025, 510, 331, -266, -1155, -384, 85, -367, 236, 1133, 513, 521, 463, -1129, -1210, -791, -1047, -641, 819, 743, 496, 1197, 517, -393, -115, -437, -1066, 129, 813, 131, 459, 936, -415, -104, -581, -1510, -900, 65, -125, 349, 1312, 1012, 513, 700, -7]
697gr98P79k37J58J120R8r24R08n89o46m74J14n35O57J329n19L97L05l29n59k64
718b16n57j49J061q3J21R36K2p93J95o05r64O49j76L6R20O54p56j62M52q59l39
739f13m8j19N67O77L88l63O11n72o98l00K08k55M7K15K34M45n6o04k35Q8n9m9
761d91J12M00N38M29k72k14N09q05p81k16M92N2K59K52J8l0J84n44p98O26l33
782f13p6P54L18K36l8j18o56J50j74q01O21M82J87n9L80l31j95j6o56n41Q45J09
804a92j16Q66J42m14J80m35m82J59L94m16L96O50l56R5O6o31j94J4n68R0O46K35
826A29m30P74J65n13mj93l27J12M05O3L00K46n12j08j1r70J4P24n26M53L45k05
848f9K82N2J21p35N02l73p9O06L23k70K30N5m72k26m44n50N87K70l6L16P36o12
$$ y = [-7, -1005, -226, -463, -305, 815, 913, -11, 897, 308, -338, -812, -698, -1233, -576, 753, 234, 631, 936, 607, 48, -216, -773, -922, 139, 56, 177, 1113, 1135, 342, 537, -68, -1032, -383, -559, -523, 397, 1051, 295, 133, 585, -274, -613, -661, -780, -213, 464, 852, 489, 1100, 528, -170, -470, -262, -517, -470, -255, -21, 424, 368, -236, -471, -383, -442, -491, -379, 21, 559, 988, 716, 502, 1011, 206, -575, -791, -299, -247, 12, 264, 282, 252, 436, -108, -906, -280, -613, -689, 65, 383, 619, 581, 463, -193, -43, -217, -1018, -397, 85, 272, 213, 593, 262, 67, 51, -605, -1146, -301, -192, -308, 558, 700, 286, 466, 31, -451, -292, 102, -314, 82, 732, 376, 471, 537, -94, -288, -274, -842, -752, -106, 129, -301, 473, 638, 125, 121, -72, -399, -287, 118, 181, 481, 727, 215, 107, 96, -874, -860, -136, -662, -209, 136, -69, 213, 265, 386, -349, 153, -220, -299, 307, 630, 360, 590, 645, 173, -53, -497, -1047, -460, -190, -226, 90, 826, 214]
870B14p6J47p96p4P19l08nO56l6j19J45q6m52j25k8m54O22M12j94L58O3m13l69
893a99K60m87j44N43L38J1K95L1m10q2K77q44J4J80rL38K34k03k11K6j98p3L2
916b81n7K96K89J39l15M42Q2k48o02L20j32N4K60m9N9K0l19M4O9o25L1K95K18
939a0J76L43j1n23J67j86j86k83L41j38N78K69k24m8m7n19J48O2m47N8N26J38
961A84j04K18k10k51M46n87l53N66M95l60L60M9k60lR1o87p5K93MJ0K74k75K84
984A09J70n94l01L93lj20M83J91k51J95K56m77k03M4k13j73N42M5m4K49J3m56
1006a45L63q14Q1L62pp0L66J22KJ23l30p85N20L23l78N5N22k66r6M29n05j3k33
1029c74j07M3N91N0m5K43n5l21m24M34n65N29L0k36K53L48j96k01J65l63KJ74
$$ y = [214, 138, 285, -511, -585, 134, -174, -179, 477, 441, 322, 467, 381, -71, -196, -224, -678, -56, 356, 162, 520, 583, 170, -199, 61, -426, -570, -27, 311, 322, 617, 648, 238, 156, 433, -411, -397, -217, -226, 112, 346, 143, -68, -42, -240, -313, -281, -338, -42, 247, 386, 71, 513, 595, 347, -255, 65, -67, -13, 247, 198, 257, 277, -42, 2, 71, -554, -523, -228, -10, 166, 509, 498, -25, 142, -44, -230, -513, -172, -310, 268, 537, 313, 265, 218, -301, -153, -91, -538, -480, 46, 184, 80, 298, 88, -163, 283, -304, -657, -91, 404, 44, 404, 453, 193, 190, 281, -406, -481, -188, -184, -174, 100, -175, 109, 279, -315, -616, -223, -226, -346, 137, 328, 77, 272, 528, 51, -152, -108, -321, -494, 48, 93, 49, 298, 311, -145, 218, -596, -515, -153, -160, -230, 136, 258, 260, 383, 53, -732, -212, 111, -267, -212, 310, 44, -52, 377, -128, -141, -374, -481, -438, 153, 203, 158, 401, 346, 25, -399, 35, -530, -1, 29, -207, 46, 394, 198, -3, 162, -201, -199, -25]
1051b5j58K75k03M07k36J30l19k64k3M36l51J62L00J17J0%l74k10R3l51L58J10
1073a16o5M11P8j38j11k82J52l97L09L33j39K81m4k64J91j4l45j73K9R9J64J63
1095A22K9m1Jk4j80j47J29l12N95K22l94J73Jl07r7n1q2mJ29J11j14L56K33l89
1119d1K7n8n41K52M61m43M21o4M0j09J34j69l14J88Q3K6L26J06j44o9J72m59L85
1142B10n72J81J59K72j55rK95k90R7j95ml02L86l15K09O9Q4j29kj68k03K82j45
1165b45l9J66L59k89N16l54l05J71K0J5p6QJ92j31L8J43q7l97J97j54K51J04n7
1188D6J23K3R6m5p05N21k48J11m9j4L16j94K36k1k84M7J21j95j68M83j2l28K83
1211A43L73o16j60j17J24K97L1L6J3J39J3m46L46m25J83O0m1J48j45J6J91j13
$$ y = [-25, -183, 92, -111, 296, 60, 190, -129, -393, -416, 20, -331, -169, 131, 248, 258, 258, -116, -326, -233, -584, -226, -116, -181, 230, 308, 170, 59, -223, -71, -468, -159, 174, 35, 316, 272, 8, 199, 185, -160, -333, -304, -205, -41, 122, 151, 110, 111, 87, -93, -240, -111, -423, 172, 394, 0, 173, 174, -133, -230, -281, -363, -367, -238, -127, -241, 115, 348, -41, -14, -72, -613, -361, 100, -343, 78, 14, 54, -55, 79, -90, -404, -216, -133, -107, 219, 325, 181, 112, 284, -175, 210, -362, -181, -22, 250, 95, 86, 381, 91, 188, -7, -11, -313, 73, -242, -33, 36, 120, -9, -11, -179, -382, -100, -245, -284, -118, 241, -48, 468, 114, -191, -20, 0, 15, -61, -53, 139, 8, 46, 189, 102, -295, -98, -252, -1, 103, 46, 169, 192, 288, 243, -462, 59, -189, -78, -127, -141, 175, -19, 217, 196, -88, -41, 80, -115, -283, 200, 188, -140, 143, 516, -100, -260, -377, -253, 44, 75, 111, 124, 263, 276, -170, 176, -249, -66, -6, -47, 101, -44, -28, 163, 50]
1233E0r5q2o5P3o5m9M75k54J60k0j41k60O8O7m03O12j23J86J14p9j50K43k74m0
1257e2R8k10J09l0L16k62o5O1L0m16N39k66k6J14K30k23K50P3o0m38L6O6J13L49
1281C36Pj32n8k32O8j88M49k51p5n8K61j14r2J05J1j72r0L3K33k01K37k2M6j26
1305b5J58k55l75N78m88M86J04j67L95k89k8j86J43n36K04M37oj28K70k98J05
1326I9k25k7N1J0O6j35K59kQ2J97j16l35j28K84M8k35J33LK52j48J86m72J00J03
1350E0q6o5J44L8K63k78j92R1P5N4O0l93K51r7n2K37PJ23k24j04K8j27K83k4j
1375F1k9m9J24rR5mj44r0l42N01j69J37j7p0M4l31P9q9J96r0O3N8j88L39k68J14
1401g8J25J96j32N6J29l36P6KO1k71N4k39J06K27K58k10K18j22j80kK8K86m68
$$ y = [50, -45, -127, -192, -119, -184, -233, 242, -12, 148, 128, -13, -273, -205, -138, -541, 71, -52, 134, 248, 169, 19, 262, -12, -52, 46, -164, -55, -85, 231, -31, -96, -35, -5, -421, 118, -148, -174, -60, 170, -53, 197, 270, 210, -228, -192, -126, -13, 336, 343, 211, 153, -79, -11, -199, 250, -1, -76, -134, 127, 13, -79, 26, 37, -135, -225, -192, 41, -160, 77, 55, 101, -25, 133, -122, -497, 81, -407, 79, 183, 16, 411, 122, 94, -92, 51, -485, -281, 156, 150, 22, 292, -6, 99, -126, -153, -102, -92, -26, -161, 98, 96, 178, 375, 259, -76, -204, 80, 128, -107, 26, 29, 281, 133, 319, -153, -53, 50, -36, -101, 43, 81, 344, 66, -126, -35, 40, 94, 154, -239, 12, -85, -137, 100, 107, 230, 6, -98, -70, -197, 86, 62, 61, 32, -17, 107, 98, 193, 189, 45, -45, -387, 114, -55, 82, 65, -5, 39, -292, -213, -302, -106, -196, -133, -75, -263, 76, -192, -78, 47, 243, 111, 167, 296, -40, 36, 38, 99, -172, -118, -357, -251, -24, 234, 24, 242, 120, -60, -62, -34, 252, -216]
1424b16R9J70j70R2p4J03j7J4j67J12K10m41K47K50j47J31J99m74J18l0j1J24
1446A22r5J14j17L42m32P8j33j2n4J30J21j6L92k98k01P5m7j02j30L39k33J10
1468d7J79k70J70k39P8O1R4j08l9K93j32j60K32K31m77o9L89j24jQ4nq7m6M1k55
1493b07K35o3n2k5K77l98O87j87l01k60N46m5m87R0R6K2K54k13J34k6J53q4l23
1516a77J05k62P9K85Lm8j8K8J05o3j43L8K10k02J54K35j59q1N9m90L0M22n1pj45
1541i3kJ38R0J05k44j04L68j72l51K38K02k97N17p01J21R3J63L1k36J21j1J60
1563A36j01K6j33K72l55O6K81k07o1p1J67O4k29J29j98J13J01J43k14J62Ro6j88
1586a54J44J64j16J26k48J28m8k93K85R4qJ89m94J73l0J61O3j43K94k82J08j66
$$ y = [-216, -117, 53, -117, -25, -99, 4, -13, 1, -166, -54, 156, -285, -38, 212, 65, 196, 395, -79, 39, 9, -2, 122, 27, 141, 24, 366, -66, 12, -121, -133, -187, -57, 64, 48, 440, 142, -59, 16, -31, -133, -263, 76, -157, -47, 132, -138, 32, -207, -129, -68, 26, -82, -121, 172, 40, -120, 112, 343, -134, -203, 186, 62, 61, 145, 140, 53, 7, 48, -207, 28, -35, -87, -112, 165, -233, 454, 267, -34, -294, 252, 207, -280, -190, -94, -72, 182, -31, 103, 77, 230, 146, -177, -72, -334, -255, 30, 33, -15, -33, -5, 100, 37, -106, -68, 142, -60, 94, 329, 170, 89, 148, -342, -312, 110, 59, 52, -93, -95, 43, 133, 238, -6, -110, 258, 86, -265, -27, 175, -122, 395, -306, -185, -92, 71, 102, -134, -13, -24, 136, 35, 61, -72, 200, -155, -89, 192, -15, -76, -147, 20, 84, -145, -16, -214, -101, 0, 143, -71, 91, 100, 34, -154, -10, 154, 38, 164, -84, 44, -4, -297, -12, 82, 74, 263, -231, -58, -88, 73, 136, -7, 287, 5, 113, -53]
1608e3k44J14J12j3mJ85R8j15K52l32L3J03Mq9k53L64l29J20Q4j56q6J10J43o6
1632a8j8N5j60K38k52J92j82j38L16j3L5r3J11R9l92L43k34m1K11k74L84j13R3
1655A49K76l69N8l0m69M52P0n9q4k64K47o8K41k84K99K1k79J40J25j44K13k98
1677e7O1o1K29Mk12k1L3k57M05R0k45l37L28J64k06Kr5R4r4L38j15k96L06K25
1701B83m69K38k09J4K66k32L14k02mK14m25J35J67j60M1J47l22N3L61j30Q5k50
1723h5j73J63k0L26m02J72M3j96K57j17J70k46r0K02k9j01R3L30l65RN7j12L00
1746A86p0Kk29L85n3j92j27n6K71k64J10K57j98J11l1j08j37jL14k68K03J47q4
1769A68k22k7K4lP4M3J88j45%J89m1j09J1ll70J36J03Q3j01J95j45j40K89l39
$$ y = [-53, -297, -183, -71, -84, -88, 97, 195, 80, 332, 0, 33, 136, 140, 51, -202, 162, -167, -47, 37, -119, -205, -95, 48, -18, -36, 19, -141, 97, -155, 37, -145, -283, 33, 20, 55, -38, 73, 172, -220, 123, -111, -152, 59, -215, 169, 56, 149, 425, 56, 114, 84, -385, 67, 137, 78, -6, -270, -23, -91, 150, -134, 165, 186, -93, 47, 172, 28, 241, -57, 4, -57, 172, 176, -36, -57, -24, -281, 124, 214, -31, -368, -40, 124, -82, -80, -175, -81, -175, 163, 48, -248, 58, 283, -186, 52, -157, -143, 123, -109, 205, 3, -1, 213, -212, -77, 90, -70, -29, 118, -204, -151, 210, 80, 165, -85, -258, -95, -115, 211, -191, -19, 24, -172, 85, -32, 138, -108, -198, 4, -25, -126, -33, 297, -68, -59, -2, -114, 186, 116, 118, -111, 274, 221, 29, -98, -154, 117, -147, -37, 220, 22, 133, 102, -6, -143, -144, 170, -98, 105, 252, 168, -54, -81, -57, -60, 14, 57, 245, 100, 100, 289, 248, 139, 150, 147, -223, -87, 16, 99, -2, 193, 48, -92, 197, -142]
1793a42K89k14m8j12N01l04R8Jl3M1k82J84P6l08RJ86o1P0P1j05J01j33rJ91j52
1818h5K07n5j19PL27ok88N6j2j94M0K41k01K51j1l5j01K06k93j22J44P3J3J19
1842A62q0r2J07k88R9k9k3J10J18l99N51j43j63j7m9J33j94K93k15J11j24J53
1864B1J73k07k16M21j21Oj61J13J77J51l93o0L38l51K69o2l7p0%J04l38j77O68
1887B48j29m5m58K77j90M54j87oj55J27J26j8M9O3m87M39k46K17j78k5R2m1K42
1910A69j24j62K9j2K96k93J74j49K9J57m2m38M90Q5M1J00m24L04k48R8k51o0K
1933b29K55j95J29J42j54J07Q8k12J61j64K72J15k98j79J73J5j92J72m9j2J80
1954A25r5J13j67J94o18M82l54L76j99J25J21j49J83j7N5k78M6j08M16n02K74
$$ y = [-142, 147, -67, -115, -227, 274, -30, 68, 69, 36, 77, -205, -21, 55, -253, -244, -58, -119, -49, 22, -83, 18, -115, -124, 67, -85, 122, 67, -52, -45, 282, 276, -12, 44, 32, -162, -122, 119, -82, 169, 158, 123, 22, 228, -65, -187, -43, 30, 43, 162, 82, -10, 97, -191, -92, -121, -144, -34, 84, -315, 236, 93, -70, -87, -136, -3, -197, 96, -119, -8, -132, 21, 194, -13, -229, 192, 71, 77, -84, 29, 206, 357, -36, -96, 242, -109, 160, 98, 61, -9, -9, 95, -243, -420, 248, 119, 74, -384, -107, -297, 157, -30, -36, -191, -64, 62, 44, 93, 156, -331, 108, -138, 79, -99, -124, -32, -73, 169, 45, -117, -88, -100, 196, -97, 77, -72, -43, 114, 72, -366, 124, 209, 250, 350, -74, 230, -18, 80, -171, -231, -229, 26, -169, -40, 102, -52, 55, 143, -69, 92, -72, 200, 315, 17, -162, 11, 26, -166, 6, -43, -55, 125, 30, 143, -24, 170, -448, 34, -320, 56, -143, -18, 103, -46, 137, 120, 175, -103, -57, -165, 251, -251, 23]
1975B3qj10K50k03j89J65K50j38K08j54l05L17k09L00M3l98j15K64J39j08O5J20
1997B07n0j30p3J06j83P09m92j50k40Q2M09l34L10l75K52p4j90M38k06P1J97k10
2019G4j4j34j3L73k11Q1j88N2j67L17j52j69pL33k47r8L61n01L22L38j70k15L49
2042C14m33o5K55j46K47j40L3R8j98J36J70k93j0p5J80o2P4k74L47j26J34o5k67
2065a66L36j09J19k46P1k31L94m68L86N9n01M15o7k5o3J88o9j1J71n9n12L58j6
2088d6L2j26j79L66K5l73L26n8n4K7r7K2J68Q0ro4O1K91m17K10k08L1o6L1k50
2113b77K44J46j10j97K54nk73M86k02k34J77L8j87J78K93j09j51J94l49L7j42
2134a89K01J98k28j3K44k80L49l03L32n95J99K61j10k03j79N61j07k6j85J26k39
$$ y = [23, 15, -95, 155, -48, -237, -72, 178, 40, 248, 94, -211, 106, -103, 197, 240, -158, -273, -9, 130, 22, 87, 207, 157, 27, -46, 60, -123, 586, 94, -56, -296, -214, 195, -139, 171, -204, 48, -26, -216, 222, 16, 87, 284, 74, 60, -74, -87, 286, 75, 156, -32, 20, -147, 170, 18, -151, -158, 175, -72, -170, 191, -310, 12, 350, 180, -35, 314, -119, -184, 71, -75, 172, 32, 65, 163, -35, 101, 271, -22, -32, -107, 73, 11, 85, -189, 158, 32, 166, 101, -166, 170, 61, 180, -66, 5, -226, 168, -300, 86, 145, -356, 59, -8, -33, -96, 92, 23, 12, 183, 124, -388, -30, -46, -14, -140, -319, 47, 72, -301, 25, -33, -87, -60, -157, -135, 33, 113, 104, 40, 101, 392, -25, 185, -23, 8, -58, -27, -277, -33, 113, 3, -194, 60, 55, -218, 268, 66, -168, 9, 47, -140, 38, 331, 222, 71, 265, -84, -47, -189, 12, 210, -18, -31, 213, -67, 282, -21, 311, -284, -85, 176, 66, -137, -316, 245, 138, 112, -73, 53, -186]
2155a86K67P8k23j7K33l68L27j24J0Mk38L67K1J76m64j62L25j97J80l55K37L4
2177g5O1R1k07j62K99n2k73K46L43J96n28J84P4n49M81m50K97K87m67J09L2L44
2199B81m60J81m9K49l27K62o2%k59J52J50J14k84J04k7J51n04L48J55k32J17k8
2221C2M8k85L56k86M06j29l2Q4R3k61J63l14O9Q8j3J73j11M1j71l76P9L04J03
2244F1j56JL0j73L19l49K59R3l65L46l44J96K45l07J09n7P8k04K93rj76J78k32
2267a64J69J29k5j9m2P0j44Lj55L99o8k18l08K96K6J58j14J72k02R8r5J84l02
2290a52q3N27m11J87j11J33l39J66q5L64j42k91K97J37j39j45r2J16M8j08J29
2311Fo9l0K50j40k89L91k51j40J67K10n5k10P6j05P05k92k82K65k9l47L90l09
$$ y = [-186, 81, 159, -64, -81, 152, -216, 111, -13, -3, 1, -237, 130, 151, 327, -137, -299, 26, -171, 9, -346, -109, -75, -14, 77, -130, -292, 7, -45, -318, -72, 271, 467, -61, 123, 197, -352, 129, -321, -24, 263, -204, -95, -63, 281, -179, 2, -47, 202, -125, 137, 75, 75, -184, -32, 118, 232, -52, 52, 25, 176, -328, 20, 175, -57, 60, 32, 80, -205, 151, -135, 271, 142, 110, 194, 287, 26, 189, -125, -56, 32, 19, 192, 81, 122, -49, -425, -346, -42, 61, -95, -94, -64, -237, 82, -267, -8, 85, -280, 66, -278, -82, 163, -144, -35, -92, -14, -218, 75, 66, -110, 68, -164, 5, 134, 109, 90, 48, 118, -26, -23, -178, 221, 153, -65, -373, -77, -51, 107, -7, 165, -37, 61, -34, 150, -152, -235, 292, -119, 68, -43, 90, -249, -83, -168, 196, 54, -237, 60, 197, 58, -87, -179, -63, -15, -123, 6, -63, -93, 157, 17, -272, 119, -132, -272, -105, 105, 50, -160, -84, -189, 516, 224, -58, 207, 178, -169, 221, -88]
2333h8K92k2J00m39k8K46l2j03j74N93l67m6j1l7K03N5p3k18j5P5p8o9L92j23
2357C3j47L7J08k0k14K62l3L26m82m4K6K94m20M55l38L58J0m3j10j62j01R8j11
2380b18k9M83l70O1K12jk21J62l3J83j72o7j26K24P6q4k86M3J12j29L5J08j63
2403b00K70p8L3K00l5l22J83L8k20R5j26J62o6J7r5J63J17m32M02J8j89K00j95
2426f0J90%n1r7L0l2k21L46J9j81J06o0k6J8J2l24M39j38M3M8k82L43j1M9k9r8
2452C3j09p6J30m5L8q9J66q9K39k11J35j44K31k9K6k48j1J32j26K8J65j27jl28
2476c10M92o9q2j16K33j70j27L19k34M4QK97k64J5N4k37J3K93k47k35N51j08j83
2499f3J23l71L65j96o6M36K9l45K02J70j61j48m3L26j68q7M2r0J45j69J40J25
$$ y = [-88, 204, 182, 282, -157, -185, 61, 29, -74, -248, 345, -22, -68, -79, -116, 87, 142, 69, -149, -164, -89, -167, -236, 156, 33, -114, -77, 31, 11, -203, 59, 26, 352, -130, -174, -148, 146, -274, 181, -157, 201, 211, 168, 58, -104, -205, -107, -218, -247, 236, -134, -73, 139, 138, -83, 79, 46, 229, 57, -10, -136, 88, 164, 80, -206, -163, -51, -180, -145, -37, -200, 70, -8, 25, 225, 190, -132, 51, 89, -131, -36, -162, 0, -66, -49, -144, 19, 136, -296, 106, 124, -65, 135, -60, 130, 130, 79, -18, 12, -20, -241, 105, 124, -57, 49, -11, -37, -19, -7, -331, 108, -30, 13, 61, -221, 122, 111, 160, 131, 33, -76, -152, -22, -67, -29, -118, 48, -41, 198, -13, 122, -22, 209, 180, 206, -42, -53, 79, -47, -19, 146, 19, 18, -310, 182, 113, 31, -85, 148, -22, -149, 170, -64, -20, -12, 285, 21, 36, 90, -147, -134, 159, -88, -323, 228, 120, -63, 60, -311, 54, -142, -208, 228, 257, -88, 114, 284, 123, -25, -68, 258, 90, 3, 45, -45, 100, -69, 71, 196]
2521A96k22k2P8J03j93L15j48K6j81j57N03j56m7K2j92n6o8M04k2j56J13k49j73
2544b82K17n8K51j65m5k8J82j27N2j65M1J04j05K73k37N1j25L0M59j3m9j76K3
2567A08l14L72j75QO2k47N3J57J0q0L1j4Rj17o1J14JJ51R1l10L11j53K52l21J76
2592A14j95R7L8K53k70p5J11r7J10Q1l9j31j58K24j95j77N94l61N2L7J9j37K05
2615A00k30J71k0j16q3J97N0k58M71l47O6J00o4j44J20Q0j28M3K7O4l23L03p2
2638GR7L4J68j41k27N2P5Pm4J7m5J49l4k89J68q4P2k02N31n23J63J47p3j27O6
2663c6k23O01n61J57J69l25N06o6q9k83J3L69j08p6r5K07j88k40K98r1R6M4j15
2686c6M6J59j01j84m9M28j78k44K40j76M28q6m8m04K09j19L64k21r1j04M05o5
$$ y = [196, -26, -48, 30, 133, -60, 255, 107, 133, -48, -205, 298, 142, 95, 117, -75, -131, -199, 205, 183, 27, 140, -109, -282, -65, -123, 128, -37, -82, -110, 72, -55, -3, -168, -127, -23, -128, 145, -92, -41, -166, -136, 323, 310, 261, 85, 108, -206, 166, -9, -1, 61, -186, -133, 24, 34, -46, -15, -29, -20, -137, -198, -84, -83, 68, 159, -151, 160, 7, 259, -62, 114, -81, 16, 54, 307, 37, -38, 73, -24, 86, 167, 128, -3, -161, 63, -132, -309, 285, -76, -24, 13, 32, -105, 100, -130, 41, 21, -95, -178, 19, 69, -189, 282, -65, 1, 101, 37, -107, 13, 93, -35, 8, 35, 99, -224, 79, 7, 104, 138, 306, 165, -62, -10, 65, 72, 28, 45, 0, 149, 115, -174, -6, -90, -18, -220, 311, -212, -49, 98, 25, -102, -36, -259, 342, -219, -62, 107, -218, 288, 222, 133, -150, -137, 232, 124, 48, -47, 160, -28, -268, 30, -61, 35, 79, -36, 10, 169, 68, -116, -165, 263, 85, -159, 81, -95, 333, 247, 199, -205, 4, -115, 249, 28, -63, -167, 238, 173]
2708A73k27K0O2M4j44M5p7J35p7J54R3j86k86K29N5j49j7K38j20J73k67j8k0O3
2732a04K13L4j64J19k49j03M41k40K0O6K54m74K45J1K5K7j72K15o9j84N8j3r1
2755a35J98K31k39J48k22k50J22K63j35k47L78r7lk60K6L59j04J02o1N0l08m3
2777b27J44J04o9n1K01j15J7R7p2N1l00L58rk53K7L29l10m4O6J34k4L1l16K48
2801A7P3k13L29l07J91J11l43J75L10p8l10L5N4l04K70q4j64L17r5J3J11j11k53
2824b56K53k28l8N64k69l56L93k60L41j06j42P9J94lj94j64J44K50j42p2J84j49
2846B3r7K02k87P4k7J34K14j51q5J59k22R4ok14J27J72j67J78l72J54J46k66R1
2869a26K53q3J57j86j0J7j84%K31j00j23Lo8J15N7O9J19l37L39k37n8j18K76P3
$$ y = [173, -54, -34, 28, 72, -72, -27, -104, 31, -46, 108, 201, 15, -271, -42, 13, -136, -153, 85, -35, 138, -129, -147, -167, -104, 109, 143, -21, 98, -151, -254, 187, -53, -33, 33, 287, -187, 58, 69, 94, 121, -51, 164, 95, -89, -31, -44, -135, 63, 294, 55, 203, -19, -269, -147, 116, -19, -266, 112, 15, 12, -248, -222, 137, 33, 135, 74, 124, -184, -227, -83, 21, -48, -99, 102, -13, 4, 101, 29, 80, -220, 138, 129, -124, -97, 232, -78, -122, -56, 78, 54, 85, -231, 17, 90, -123, 206, -101, 90, 201, -142, 33, 343, 265, -45, -10, 44, -260, 10, -74, -238, 79, -16, -3, 108, -3, -256, -3, -231, -269, 295, 26, -330, 63, -197, 144, 38, -104, -25, 169, 166, -28, -192, -48, 202, 60, -12, 172, 23, -74, 128, -159, -85, -112, 22, 236, 85, 0, 159, -63, 31, 25, -189, -62, 110, -57, 121, -251, -97, 49, -217, -126, 127, 44, 201, 15, 5, 22, -162, -162, 69, -31, -154, -151, -219, -104, -47, 22, 141, -196, 143, -94, -152, -270, 6, 79]
2893G9k38L4J28l07K97K4k28K19J49M6j82L3k46k28O35m42N1R4L52j00k46M97
2915D21n09Q0J78l10r6J44q2N5J19m20M03q4j30K31K30j39K05l73K0K1J0p9kM19
2939C12k28j95J33j71L14k71J71oq2J59k69m0J46j2q3p5n1L9L0rO2K93l66K54
2963E5l45J58K46j65N5j87M40m29M01k6j16J36k05q2K3N7r6k72K34L33k28m8n9
2986a20M1n5N6K0R3o8J60k52J43J43n12L08q2J48l1K89j55J63J23o27O7O2J0N9
3010a7K38l00j09J07o1K76o6L4Pj81j81M15o5qk19n9K58R2k32q8L52k80J92m61
3034c56L09o6J62kQ4n5n6k78K58K86o5k95n7qL99m5J77l27k20LK16r1J21l07j59
3059c72N15k4Q1l28j69L75k91M04j67j60J43O1J06l19J53J21j68j32L57%j87k0
$$ y = [79, -159, -125, 3, -304, -7, 17, -211, 8, 157, 203, 21, 54, -192, -420, 215, -227, -176, -82, 270, 170, -76, 421, -88, -8, 170, -140, -236, -92, -174, -119, 0, -420, -17, -101, -231, 0, 230, 91, 296, -77, -57, -36, -26, -105, -107, 312, 84, -111, 22, -149, 165, -106, 65, 59, -23, 136, -133, -173, -27, -39, -122, -197, -248, -209, -179, -188, -126, 167, -199, 55, -290, -132, 114, -51, 4, -183, 257, -172, 229, 203, 87, 223, 18, -64, -41, 16, -80, -352, -118, 215, -13, -61, -120, -79, -134, -78, -58, 35, -33, 127, -125, 18, 161, -351, -43, -125, 23, -8, 281, 126, 289, 412, -215, -148, -86, -76, -17, 221, -79, -188, -81, -142, 134, 68, 102, 109, -72, -253, 162, 97, 89, -130, -189, 69, 161, -71, -159, 193, -87, 105, -356, -47, -113, 49, 47, 131, 76, 20, -258, 0, 286, 221, -74, -131, -139, 260, 215, 392, 65, -155, -152, 64, -27, 94, -213, -372, 143, 119, 200, -128, -297, 78, -213, 191, 24, -136, 7, 68, 174, -145, 8, 129, -39, -171, 186, 186, -1, -21]
3081b1r5r2K25k8P8p5j37j33M63m12r5L40o7k65K45L53l08J74k65K43j59k2K59
3104B06k36K07k01k90L36k35O23m52j59J78m2J54Mk65O8n6o4L41k18k7K01k8L8
3127H3l6J55k81j3J75k91M82l00ql21K39k2J60j96L92k62L4m8K3rJ8J91o6k5k7
3152D7k6R0n2j98J16l23L69j53q5N39l41QL1n3O4J26k13j1k74M86l42J29K60j59
3176C5m2l9K88m32J42N5q2K76k9L3l5k56j23K40q8o2N75o60J21L4L33l60K9P0
3200B3Q1L6k82L43k70N7J86R7n74L10j68K54j49J65m1j20j03K62j99J28j6j45
3222a25K19l14R9J00J9Q5j56j36P8M04n14L37j45j38N5J73q6L2j88N8K42l5j59
3245i5j15K17m3k20L09q4J98l45K41J05P5n13J09L87j44K36k03j6j66J53j21p1
$$ y = [-21, -116, -208, 17, -11, 67, -8, -145, -278, 185, -227, -322, 18, -49, -314, -69, 284, -24, 150, -115, 128, -31, -53, 206, -30, 177, -24, -314, 22, -213, 410, -42, -201, -23, -65, 89, 93, -172, -104, -160, -224, 117, -101, -128, 73, 45, 83, 47, 202, -79, -92, 83, -208, 274, -26, -34, -355, -116, -138, 22, -174, 218, -44, -10, -58, -35, -44, -26, 165, 99, 74, 47, 21, 111, 59, -139, -23, -346, 23, -130, -215, 324, -17, -9, 22, -31, 33, 159, -54, -65, -339, 147, -195, -66, 194, 35, -7, -46, 242, -190, -48, 7, -75, 201, 172, 205, 170, -86, -209, 31, -57, -119, 456, -204, -83, -49, 284, -76, -47, 23, 104, 140, -142, 201, -69, -12, 174, 271, -303, 7, -161, 93, -56, 109, 68, -52, -155, 107, -92, 36, 20, -125, 94, -220, -121, -21, -2, 83, -73, -209, -131, 273, -241, 96, -49, -187, -132, 41, -45, -13, -201, -143, 99, 64, -95, -210, 7, -36, -256, 53, -31, 167, -178, 63, 168, 243, -270, -161, 226, 82, 318, 115, 99, -67, 86, -35, -106]
3267a06M99m40n9J81k9j51L8j2jj79K68nJ09j63J73K35n27M10l54J46j34J61R1
3290A51k94J44j02N19k10m1q3o7m4Q6R8k21J16l60J87J82j8k7O9j40K40j91j1
3313a7r1M8J57j61J09l0j3m0k2K44p2j60M5P8p7J1L2jJ49l30L17j25k46K71l5
3338D1L0j05j45j02L40L9j99l13K90K04J4o9J03L0k77l83N19jK0j86J45k83m1
3361c29M55n61N26n3R3j15q5K08L2m5M5j51k05K09j00J79k42M4N22n40L93j7k02
3384F1o5j44K28p7K47n0j79j2nJ90j73J90k84j65K04k02K75j47K90n7j65k11J11
3407a40K33j84n7J72j11L69O0k93Mq7j41j8K39q2L6R2n5k21K36j38J64M7l73K26
3431b2j73Q6O4K74l43KK35J9J6J60n91K38K05j46k30L59k2j74k72N9L02m1j6j38
$$ y = [-106, 393, -47, -106, 75, 46, -105, -67, -79, -80, -259, 9, 4, 113, -50, 123, 358, -169, 241, -113, 33, -101, 60, 151, -143, 1, -101, 418, 208, 167, 84, 17, -27, 59, 157, -64, 52, -308, -121, 61, 43, 16, 85, -55, 185, -6, -17, -108, -60, 97, -64, 45, 15, 2, -38, -60, 184, 112, -48, -3, 75, -2, 9, 41, 40, 189, -141, 176, 51, -195, 76, 41, 71, -34, -179, -281, 59, 98, -101, -414, -124, 80, 94, 25, 128, 158, -119, -502, 17, 16, 36, -150, -5, -288, -329, 126, -435, 91, 38, 131, 16, -69, 139, 171, 126, 171, 20, -185, 24, -76, 103, -139, -95, 427, -113, 280, 263, 61, -4, -148, 80, 3, 250, 200, 21, 9, 4, 194, 21, 211, -73, -238, -34, -236, 39, -108, 182, 125, -40, -251, -140, 93, -91, -148, 24, -87, 282, 342, 49, 53, -34, -175, -193, 46, -36, 0, 92, 37, -184, 52, -86, 78, 125, -248, -22, -195, -109, -45, 229, -114, -112, 123, 142, 158, 318, -273, -35, 170, 24, -206, 153, 131, -43, -315, -256, 46, 5, -11, -149]
3455a49n8k8K30N1k2R9k24Q1K39m22K35p7p5j9m9J46J81p4k97K1J40K90j38J89
3479B70k14k43J11j0j28J80K4o1J32J82l91K70L0j08j00r1R3K61k28J70r3J68
3501B24n15K76J15j53J64j22K82n7k52r9L88l54J0R0j65m9q4M23J12l30k0R4q0
3524a02L60m89K44J19j50o0R4J0J10k74K29J18q3K10k36j94j54k6M17j31K2j17
3546h3j27K68k32K97j10R6n9j29j77J35K36j62N3J08Q0p6k50PR1J06j01j0J33
3569I4K20l56P7k20L11n9J24l3j98J21q3R6p2k39j4K94l87L16Q9k93N47l80J00
3592E5j86J75m3J40k47j18M1n0K08L6j22J31K7J92k99J09J02J7j69p5J76j94R3
3615aN6n4j0J56L5j09k10J78j02n0P2k2p4l9Q0J38j31ON3O4J7j79J43k13J4J37
$$ y = [-149, -207, -235, -5, 46, 24, 123, -101, -20, 219, -203, 32, -45, -120, -139, -188, -42, 139, 65, -232, -211, -71, 219, 81, 270, 56, -187, -76, -86, -214, -34, -10, -71, 61, 243, -148, 122, 152, 44, -56, -147, -54, 207, -21, 149, 56, 224, -291, -15, 100, -53, 111, -11, 271, 214, -38, -137, 251, -103, -93, -3, -168, -217, -301, 122, 234, -96, -116, -22, -102, 258, -231, 13, 132, -18, -78, 16, 26, 136, -138, 91, 209, 126, 336, 100, -94, -248, -274, 143, 12, 34, -83, -210, 58, -174, 123, 13, 109, 50, -79, -256, -121, 115, -47, 6, 114, 194, 118, -132, -125, -34, 72, -29, -39, 94, 314, -42, 35, -185, 126, 67, 191, 158, -40, 81, -2, 94, 22, -217, -231, 63, -324, -8, 81, -212, 335, -45, 55, -131, 44, 1, 141, -106, -224, -183, -233, -25, 11, -111, 20, 47, 239, -60, 49, 151, 168, -1, -76, 100, -94, -1, 55, 1, -9, 147, 182, 73, -137, 41, -61, -111, -39, -61, -135, -174, -94, 44, -87, -81, -28, 36, 53, -126, 17, -196, -182, -45]
3641d5m0O2q4K29j67k90M91j52j18R2J34j15m3Q7j22L22k98K56l47J73k67L0L25
3664A13N3k93J87N1l00J67j78L08O3L6k99nQ1N2m4K6J09m3N9j63n5J58Q2j67j61
3689a63L14l48J13kO4j15K74l62L59JO8k42q7R2J37j30j60m0Q0K45J17k83L5P4
3713D1J9q6k49K57K05j73P1k00J47k1JK80j92O8k30K59K7m93L13j71J54j88j27
3736b88K85R9J7k85L32l50K77k99M20m02J17J52N2j80j30J13j09K49j90J53j05
3757g2j23L25o5K1j0k47L79m4l08L47l49K03m2o7N0l8N36n56Q9N9k7j5k96L82
3781A32j9j58j16L0R4M7J70k30K74l68J15k69J98k07K75j32K88j69J03q7J07N5
3803A33k0o9k06J18J57J73m03j6J32K7r5l1L12k59Q0J02j83j3J40j16J14j63r5
$$ y = [-45, -85, -23, -107, 122, -45, -335, 156, 4, -114, -22, 112, -3, -46, 41, -81, 241, -57, 199, -148, 25, -242, -212, 113, 166, -127, 60, 111, -189, -22, -200, 108, 171, 207, -92, -97, -16, 36, -8, 18, 127, 84, 143, -20, -75, 83, 165, -2, -163, 151, -197, -84, -86, -22, -137, 137, -225, 134, 135, 203, -39, -126, -34, 103, -27, -187, -227, -147, 98, 215, -68, -33, 41, 60, -26, -275, -18, 187, 14, 85, -115, 32, 11, 12, 292, 100, 168, -62, 197, 224, -269, 44, -127, 27, -161, -288, -3, 96, 113, -172, 160, -190, 87, -212, 208, -194, -77, 75, 127, -53, -183, -70, -179, 70, -120, 33, -72, -195, 130, 65, 86, 76, -171, 208, 164, -144, 203, -146, 57, 15, -52, -2, -40, 496, -60, 29, 88, 61, 46, -250, 132, 113, -45, -161, -131, -37, 10, 180, -50, 224, -144, -29, -298, -100, -307, -32, -164, 124, -45, 58, -29, 78, 133, 113, 44, -162, -44, 113, 286, -117, -133, -1, 26, -69, -100, 212, -47, 33, 135, -48, -61, 79, -37, 77, -86, -181]
3826a81J11J78k92J70l1j5m1P8p6K39l05K34J21l55K74j89J32J04k13kJ74K17
3848C32K0j74N5k87J88k89K2j20K59K85l87L43l00K9O6o0J85k63K07j71J67k53
3870a46K37nj73K10K2r4q8M6l2J00q7P1J49p8j61Qr2K22j61k06J79N4o8R7l10
3895c06L28l9j26R5J86k74n2J90m8J7J49K2j29LN1n9m1j39K37j8J73k38J7j44
3919a45N2R7o7N6J32k4n8Q2k63J87J92p1k6J18q4l02o6J11j47J37k27J66L50n16
3943c16QJ21L7O2K22m8l47K97R7n2k83K00k24L88j10J3L3no7l2j71L32j37j47
3967a29M18l38Qm1L59n48L19R4k74J34P7j53J2M38l85k7rkmJ32J5K7k0j06O8J98
3993B63m9k14J4k65J42L93m59M59k19J42ol40K50l41J98j77K62j41R6J1P4j40
$$ y = [-181, -70, 108, -184, -14, -45, -60, -101, -23, -99, 140, -165, 69, 190, -165, 109, -80, 52, 156, -57, -59, 115, 332, 352, 178, 233, -54, 134, -155, -133, -253, 6, 291, -96, 247, -53, -24, 42, -18, 167, -96, 111, -60, 107, -146, 91, 86, -87, 123, 145, 51, -37, 9, -23, 77, -10, 61, 210, 132, -29, -21, -113, 109, -52, -258, -79, -25, -93, 4, -306, 22, -17, -143, -48, 138, -136, -188, 2, -46, -29, 120, 142, 13, 16, 67, 8, -33, -172, 65, 47, 220, -18, -1, -145, -93, 4, -63, -7, 125, 101, 43, 125, -138, 49, 241, 170, 144, 262, 178, -124, -190, -79, -226, -89, -316, -150, 200, -316, -308, -187, -150, -88, 134, 86, -261, 36, 133, 81, -202, -2, -226, 162, 52, 65, 98, 93, 26, -6, -177, 155, 18, -129, 289, -49, -41, -82, 277, -271, 48, 142, -132, 2, 79, -74, -62, 376, -9, -36, -45, -47, -51, 81, 96, 123, 103, -3, 65, 263, 214, 0, 14, -251, -109, 284, -175, 284, 65, 207, 201, -139, 111, -230, -32, -209, 53, -88, 8, 19, 93, -47]
4015d7jL2J54k10N1j71O8L36r6j59m1M95j18m45L6L38k34J50j62j2R2K41j38j95
4039c6M2j18K30m13J26M15m32J69J60j33j91N0L35l37j48J25P2m3j1K11j64K91
4061B00o2k35J05k57M9K99N3R2l36L14k22m1L9J97o1m4k39L56k22j09J89J01j63
4084Co5J04n6j50n3L25L3k41L98l23r4j43M3K47j85J17J07q8Q5o5J2r6J18J21
4108A54j53j0P3j40J75k05K22r1J9j78J89J4J50j95j82L35P5k49J26l82K87j66
4130a32L27p2j12j68J06J88j03k3j24J27qNJ30j51MJ98p5%pj8j75N74l58J26j61
4155I8l04L07j19N7j13K56j70J0o6R2J17l85K96j51r4R1R7q8m6K50m50L54J73
4178B12l47R9J0O3PJ7o2J0K2j07N6K68k57p4J48N7q6J41l29K10Lj89R5J65k14
$$ y = [-47, -48, -16, 138, -72, -21, -192, -124, 212, 116, -43, -84, 411, 293, -152, -116, 222, -12, 138, -24, -36, 56, 297, 159, -36, 6, -112, 118, -295, -169, 246, -186, -17, 143, 10, -181, -131, 204, -133, -281, -156, -84, -127, -138, 73, -91, 200, 138, -97, 8, -249, -200, 99, 152, 244, -92, 222, 0, -41, -2, 195, 134, 90, -149, 207, -15, -124, 65, 166, 3, -62, 42, -14, -164, -217, 108, 141, -100, 298, -25, -119, -262, -219, 28, -157, -40, 67, -21, 64, -1, 11, -85, 33, 154, 1, -9, 64, -76, 99, -106, 116, 25, 44, -134, 55, 69, 219, 24, -158, 177, 252, 3, 129, -253, 34, -132, 195, 123, 11, -157, -51, 137, 34, 11, -113, 14, 6, 11, 141, -10, -6, 192, 117, 117, 110, 92, -83, 491, 133, 259, 98, -206, 101, -18, 39, -74, 182, 12, 22, -44, 48, 165, -220, 76, -75, -169, -78, 19, -69, -115, 135, -315, 39, 212, -135, -36, -26, 37, 44, 61, -1, 9, 31, -76, -20, 248, -9, -83, 65, 122, 36, 177, -152, 58, 61, -128, -33, 132, -82]
4203h2K41j8j01k26L54r4J2Q8m43J40L59m0l56M77k82o0K69o3M0k71J76n1m44
4226c75K90J56K3l94N13m35J53J18m3j60J82j43M8N4K76m05J03J37o8q0r1l2K02
$$ y = [-82, 159, 141, 40, -186, 168, 74, 86, 174, -269, -129, 230, 190, -166, 311, 29, -31, 238, 175, 215, -56, 120, 69, -375, -85, 71, 94, -300, 213, -222, -69, 49, 6, -154, 28, -115, -67, -13, 263, -142, -39, 98, 30, -50, -141, -173, 29]
$$ [...]
8191B51
##END NTUPLES=NMR FID
##END=
