##TITLE=1H_UK-19
 CD2Cl2, 8 sc, 
 31.8.2021
##JCAMPDX= 6.0         $$ Bruker NMR JCAMP-DX V2.0
##DATA TYPE= NMR FID
##DATA CLASS= NTUPLES
##ORIGIN= UXNMR, Bruker Analytische Messtechnik GmbH
##OWNER= root
$$ XWIN-NMR		Version 3.5
$$ Tue Aug 31 12:11:55 2021 Russian Standard Time (UT+4h)  she@DPX200
##.OBSERVE FREQUENCY= 200.131506
##.OBSERVE NUCLEUS= ^1H
##.DELAY= (6, 6)
##.ACQUISITION MODE= SIMULTANEOUS
##.ACQUISITION SCHEME= undefined
##.AVERAGES= 8
##.DIGITISER RES= 18
##SPECTROMETER/DATA SYSTEM= spect
##.PULSE SEQUENCE= zg30
##.SOLVENT NAME= CDCl3
##.SHIFT REFERENCE= (INTERNAL, CDCl3, 0, 15.7039)
##AUDIT TRAIL= $$ (NUMBER, WHEN, WHO, WHERE, WHAT)
$$ ##TITLE= Audit trail, XWIN-NMR		Version 3.5
$$ ##JCAMPDX= 5.01
$$ ##ORIGIN= Bruker BioSpin GmbH
$$ ##OWNER= she
$$ F:/spectra/data/she/nmr/H-F/1/audita.txt
$$ ##AUDIT TRAIL=  $$ (NUMBER, WHEN, WHO, WHERE, WHAT)
(   1,<2021-08-31 12:10:59.89 +0400>,<she>,<DPX200>,
      <created by zg, POWCHK disabled, PULCHK disabled
       configuration hash MD5:
       00 E9 B6 7A A2 85 ED C7 34 08 36 98 17 FE 4E 26
       data hash MD5: 16K
       82 55 54 2D 6F 1B D0 5C A8 F8 FA EC 14 48 DA F2>)
$$ ##END=
$$ 
$$ hash MD5
$$ 40 9C 11 56 75 42 61 F4 31 10 3D 4A DE 00 3A D3
##$RELAX= 
##$RELAX= 
##$RELAX= 
##$RELAX= 
##$RELAX= 
##$RELAX= 
$$ Bruker specific parameters
$$ --------------------------
##$DU= <F:/spectra>
##$EXPNO= 1
##$NAME= <H-F>
##$PROCNO= 1
##$TYPE= <nmr>
##$USER= <she>
##$AMP= (0..31)
100 100 100 100 100 100 100 100 100 100 100 100 100 100 100 100 100 100 
100 100 100 100 100 100 100 100 100 100 100 100 100 100 
##$AQSEQ= 0
##$AQ_mod= 1
##$AUNM= <au_zg>
##$AUTOPOS= <>
##$BF1= 200.13
##$BF2= 200.13
##$BF3= 200.13
##$BF4= 200.13
##$BF5= 200.13
##$BF6= 200.13
##$BF7= 200.13
##$BF8= 200.13
##$BYTORDA= 1
##$CFDGTYP= 0
##$CFRGTYP= 5
##$CHEMSTR= <none>
##$CNST= (0..31)
1 1 145 1 1 1 1 1 1 1 1 1 1 1 1 1 1 1 1 1 1 1 1 1 1 1 1 1 1 1 1 1 
##$CPDPRG= <>
##$CPDPRG1= <>
##$CPDPRG2= <>
##$CPDPRG3= <>
##$CPDPRG4= <mlev>
##$CPDPRG5= <mlev>
##$CPDPRG6= <mlev>
##$CPDPRG7= <mlev>
##$CPDPRG8= <mlev>
##$CPDPRGB= <>
##$CPDPRGT= <>
##$D= (0..31)
0 1.2 0 0 0 0 0 0 0 0.06 0 0.03 0 0 0 0 0.0002 0 0 0 0 0 0 0 0 0 0 0 0 
0 0 0 
##$DATE= 1630397459
##$DBL= (0..7)
120 120 120 120 120 120 120 120 
##$DBP= (0..7)
150 150 150 150 150 150 150 150 
##$DBP07= 0
##$DBPNAM0= <>
##$DBPNAM1= <>
##$DBPNAM2= <>
##$DBPNAM3= <>
##$DBPNAM4= <>
##$DBPNAM5= <>
##$DBPNAM6= <>
##$DBPNAM7= <>
##$DBPOAL= (0..7)
0.5 0.5 0.5 0.5 0.5 0.5 0.5 0.5 
##$DBPOFFS= (0..7)
0 0 0 0 0 0 0 0 
##$DE= 6
##$DECBNUC= <off>
##$DECIM= 32
##$DECNUC= <off>
##$DECSTAT= 4
##$DIGMOD= 1
##$DIGTYP= 9
##$DL= (0..7)
0 120 120 120 120 120 120 120 
##$DP= (0..7)
150 150 150 150 150 150 150 150 
##$DP07= 0
##$DPNAME0= <>
##$DPNAME1= <>
##$DPNAME2= <>
##$DPNAME3= <>
##$DPNAME4= <>
##$DPNAME5= <>
##$DPNAME6= <>
##$DPNAME7= <>
##$DPOAL= (0..7)
0.5 0.5 0.5 0.5 0.5 0.5 0.5 0.5 
##$DPOFFS= (0..7)
0 0 0 0 0 0 0 0 
##$DQDMODE= 0
##$DR= 18
##$DS= 0
##$DSLIST= <SSSSSSSSSSSSSSS>
$$ [...]
##$SUBNAM2= <"">
##$SUBNAM3= <"">
##$SUBNAM4= <"">
##$SUBNAM5= <"">
##$SUBNAM6= <"">
##$SUBNAM7= <"">
##$SUBNAM8= <"">
##$SUBNAM9= <"">
##$SW= 20.0188882624521
##$SWIBOX= (0..15)
0 0 2 0 0 0 0 0 0 0 0 0 0 0 0 0 
##$SW_h= 4006.41025641026
##$TD= 16384
##$TD0= 1
##$TE= 0
##$TE2= 300
##$TE3= 300
##$TEG= 300
##$TL= (0..7)
0 120 120 120 120 120 120 120 
##$TP= (0..7)
150 150 150 150 150 150 150 150 
##$TP07= 0
##$TPNAME0= <>
##$TPNAME1= <>
##$TPNAME2= <>
##$TPNAME3= <>
##$TPNAME4= <>
##$TPNAME5= <>
##$TPNAME6= <>
##$TPNAME7= <>
##$TPOAL= (0..7)
0.5 0.5 0.5 0.5 0.5 0.5 0.5 0.5 
##$TPOFFS= (0..7)
0 0 0 0 0 0 0 0 
##$TUNHIN= 0
##$TUNHOUT= 0
##$TUNXOUT= 0
##$USERA1= <user>
##$USERA2= <user>
##$USERA3= <user>
##$USERA4= <user>
##$USERA5= <user>
##$V9= 5
##$VALIST= <valist>
##$VCLIST= <CCCCCCCCCCCCCCC>
##$VD= 0
##$VDLIST= <DDDDDDDDDDDDDDD>
##$VPLIST= <PPPPPPPPPPPPPPP>
##$VTLIST= <TTTTTTTTTTTTTTT>
##$WBST= 1024
##$WBSW= 4
##$XGAIN= (0..3)
0 0 0 0 
##$XL= 0
##$YL= 0
##$YMAX_a= 77899
##$YMIN_a= -113438
##$ZGOPTNS= <>
##$ZL1= 120
##$ZL2= 120
##$ZL3= 120
##$ZL4= 120
##$ABSF1= 10
##$ABSF2= 0
##$ABSG= 5
##$ABSL= 3
##$ALPHA= 0
##$AQORDER= 0
##$ASSFAC= 0
##$ASSFACI= 0
##$ASSFACX= 0
##$ASSWID= 0
##$AUNMP= <proc_1d>
##$AZFE= 0.1
##$AZFW= 0.1
##$BCFW= 1
##$BC_mod= 2
##$BYTORDP= 1
##$COROFFS= 0
##$CY= 11.3945322036743
##$DATMOD= 1
##$DC= 2
##$DFILT= <>
##$DTYPP= 0
##$F1P= 2.36226072786647
##$F2P= -0.459571619588291
##$FCOR= 0.5
##$FTSIZE= 0
##$FT_mod= 4
##$GAMMA= 1
##$GB= 0.15
##$INTBC= 1
##$INTSCL= 1
##$ISEN= 128
##$LB= 0.24
##$LEV0= 0
##$LPBIN= 0
##$MAXI= 10000
##$MC2= 0
##$MEAN= 0
##$ME_mod= 0
##$MI= 1.114404
##$NCOEF= 0
##$NC_proc= 0
##$NLEV= 6
##$NOISF1= 3.799351
##$NOISF2= 2.8
##$NSP= 1
##$NTH_PI= 0
##$NZP= 0
##$OFFSET= 15.70392
##$PC= 1
##$PHC0= -13374.4
##$PHC1= 33.00098
##$PH_mod= 1
##$PKNL= yes
##$PPARMOD= 0
##$PSCAL= 0
##$PSIGN= 0
##$REVERSE= no
##$SF= 200.130013532006
##$SI= 16384
##$SIGF1= 3
##$SIGF2= 2
##$SINO= 400
##$SIOLD= 16384
##$SREGLST= <1H.CDCl3>
##$SSB= 0
##$STSI= 0
##$STSR= 0
##$SW_p= 3612.71676300578
##$SYMM= 0
##$S_DEV= 0
##$TDeff= 0
##$TDoff= 0
##$TI= <>
##$TILT= no
##$TM1= 0
##$TM2= 0
##$TOPLEV= 0
##$USERP1= <user>
##$USERP2= <user>
##$USERP3= <user>
##$USERP4= <user>
##$USERP5= <user>
##$WDW= 1
##$XDIM= 8192
##$YMAX_p= 0
##$YMIN_p= 0
$$ End of Bruker specific parameters
$$ ---------------------------------
##NTUPLES= NMR FID
##VAR_NAME=  TIME,          FID/REAL,        FID/IMAG
##SYMBOL=    X,             R,               I
##VAR_TYPE=  INDEPENDENT,   DEPENDENT,       DEPENDENT
##VAR_FORM=  AFFN,          ASDF,            ASDF
##VAR_DIM=   8192,          8192,            8192
##UNITS=     SECONDS,       ARBITRARY UNITS, ARBITRARY UNITS
##FACTOR=    0.0002496,     1,               1
##FIRST=     0,             0,               0
##LAST=      2.0444736,     0,               0
##MIN=       0,             -113438,         0
##MAX=       2.0444736,     77899,           0
$$ Real data points
##PAGE= N=1
##DATA TABLE= (X++(R..R)), XYDATA
$$ plain form
0 0 0 0 0 0 0 0 0 0 0 0 0 0 0 0 -8 8 -8 8 -8 16 -16 16 -24 24 -32 38 -41 48 -56 64 -73 85 -97 110 -122 138
36 138 -156 175 -196 216 -242 271 -299 331 -367 406 -447 494 -545 601 -660 729 -802 885 -977
55 -977 1082 -1200 1336 -1494 1679 -1899 2170 -2509 2948 -3540 4393 -5730 8139 -13919 63024
70 63024 22225 -10160 77899 -9551 -9045 72118 48277 17470 70717 37526 1675 17461 2514
83 2514 -4745 31579 22056 29248 54071 18506 -3162 20206 -10847 -20802 28177 26029 5924
96 5924 35680 23482 -10507 2761 2460 -16394 4995 16245 9360 21727 16040 -3031 3745
109 3745 -3943 -16867 3770 10411 473 18288 17854 -7167 -525 3346 -16946 -6532 10653 -968
123 -968 2916 15409 1152 -4037 3639 -7530 -10643 2898 912 -275 11785 7314 -1437 1915
$$ packed form
0@%%%%%%%%%%%%%%qJ6j6J6j6K4l2L2m0M8n6P0p9Q9j04J20j37J58j82K07k32K60
36A38k94L31l71M12m58N13n70O30o98P73q53R41j039J146j261J389j531J687j862
55i77K059k282K536k830L173l578M069m679N457o488P933j0123J3869k2058P6943
70F3024m0799l2385Q8059q7450N06Q1163k3841l0807N3247l3191l5851J5786j4947
83B514p259L6324r523P192K4823l5565k1668K3368l1053r955M8979k148k0105
96E924K9756j2198l3989J3268l01j8854K1389J1250o885J2367n687j9071O776
109C745p688j2924K0637O641r938J7815m34k5021O642L871k0292J0414J7185j1621
123i68L884J2493j4257n189P676j1169l113J3541j986j187J2060m471q751L352
$$ plain form
137 1915 -4228 -11715 -2671 -21 -3729 5311 8830 -567 -476 720 -9056 -10228 -2957 -4592 -1657 8715
153 8715 6656 -1081 -1864 -7300 -14844 -9826 -3649 -3088 3032 7534 1483 -4076 -6294 -12318 -13792 -8070
169 -8070 -3608 684 5823 4912 -151 -6823 -13473 -14650 -11543 -5236 2852 6120 3307 156 -6246
184 -6246 -13956 -14257 -10702 -8259 962 7112 3264 994 -1826 -12481 -14851 -10287 -9379 -1760 9502
199 9502 5924 759 49 -10124 -16664 -9198 -6456 -4329 7870 8965 685 821 -4365 -14567 -10794
214 -10794 -4677 -4381 3788 9772 3953 28 -3148 -11580 -12101 -6213 -3069 2380 7790 5098 1122
229 1122 -1501 -7941 -10199 -6229 -3319 1568 6560 6014 3853 277 -6442 -8714 -6841 -5073 474
244 474 5673 4967 4267 1488 -5145 -7680 -5722 -5606 -2312 5088 4598 3308 4606 -1793 -7359 -5056
$$ packed form
137A915o143p487R044K650l708R040L519r397R1J196r776j172P271j635K935J0372
153H715k059p737p83n436p544N018O177N61O120M502o051n559k218o024j474N722
169h070M462M292N139r11n063o672o650j177L107O307Q088L268k813l151o402
184f246p710l01L555K443R221O150l848k270k820j0655k370M564R08P619J1262
199I502l578n165p10j0173o540P466K742K127J2199J095q280J36n186j0202L773
214a0794O117K96Q169N984n819l925l176q432n21N888L144N449N410k692l976
229A122k623o440k258L970K910M887M992n46k161l576o719k272J873J768N547
244D74N199p06p00k779o633k535J958J16L294P400m90j290J298o399n566K303
$$ plain form
260 -5056 -5309 -5138 2620 5734 2936 4170 1429 -6082 -5891 -3735 -5322 -304 5522 3808 3424 3672
276 3672 -2620 -6200 -4056 -4995 -3210 3588 5017 3212 3810 60 -6015 -6104 -5056 -4267 521 5033
292 5033 4620 3662 1844 -3119 -6323 -5586 -4257 -1249 3112 4994 4427 1706 -1817 -5401 -6777 -5586
308 -5586 -1729 1656 4323 5220 3186 -1100 -4117 -5848 -6428 -2826 1351 3394 5316 4724 -308 -3750
324 -3750 -4993 -6901 -4804 804 3172 4338 5740 1977 -3452 -4566 -6160 -6073 -910 3184 4067 5571
340 5571 4281 -1731 -4460 -4899 -6126 -3336 2282 4114 4304 4365 827 -4336 -5053 -5003 -4018 305 4608
357 4608 4987 4246 2269 -2195 -5216 -5377 -4354 -1770 2800 5217 4373 2594 -643 -4828 -5830 -4381
373 -4381 -2392 1285 4934 5330 2979 835 -2670 -5761 -5009 -2586 -141 3580 6030 4254 1395 -1528
$$ packed form
260e056k53J71P758L114k798J234k741p511J91K156j587N018N826j714l84K48
276C672o292l580K144r39J785O798J429j805N98l750o075q9J048P89M788M512
292E033m13r58j818m963l204P37J329L008M361J882n67k721l523l584j376J191
308e586L857L385K667Q97k034m286l017j731n80L602M177K043J922n92n032l442
324c750j243j908K097N608K368J166J402l763n429j114j594Q7N163M094Q83J504
340E571j290o012k729m39j227K790N618J832J90O1l538n163p17N0R85M323M303
357D608L79p41j977m464l021j61J023K584M570K417q44j779l237m185j002J449
373d381J989L677L649L96k351k144l505l091P52K423K445L721K450j776k859k923
$$ plain form
389 -1528 -4853 -5804 -3225 -33 2409 5582 5304 1720 -535 -3423 -5709 -4604 -663 2120 4268 5525
405 5525 3571 -80 -2707 -4900 -5112 -2216 1631 3633 5271 4373 1359 -2207 -3813 -4606 -2878 652
421 652 3826 4999 4610 2823 -946 -3703 -4044 -3474 -1083 3046 4707 4487 3440 569 -3590 -4098 -2956
438 -2956 -1847 1337 5073 4479 3293 1932 -2344 -4320 -3000 -1745 35 4168 4813 3287 2344 -486
454 -486 -3739 -3530 -2142 -1159 2370 4670 3823 2756 955 -3054 -3713 -2688 -1420 718 3788 3857 2914
471 2914 835 -1863 -3516 -3426 -2430 335 2713 3694 3911 1874 -836 -2598 -3402 -3130 -568 2224 2919
488 2919 3822 3094 -662 -2467 -2845 -3739 -1901 1655 2652 3561 4014 678 -2283 -2613 -3483 -3432 648 2390
506 2390 2887 3952 2444 -1745 -2651 -2948 -3866 -698 3170 3185 3662 3419 -117 -3170 -2737 -3403 -2272 2157
$$ packed form
389a528l325r51K579L192K442L173k78l584k255k888k286J105L941K783K148J257
405E525j954l651k627k193k12K896L847K002J638q98l014l566j606p93J728L530
421F52L174J173l89j787l769k757l41N70K391M129J661k20j047k871m159n08J142
438b956J109L184L736n94j186j361m276j976J320J255J780M133O45j526r43k830
454d86l253K09J388R83L529K300q47j067j801m009o59J025J268K138L070O9r43
471B914k079k698j653R0R96K765K378R81K17k037k710j762q04K72K562K792O95
488B919R03p28l756j805l78q94J838L556R97R09M53l336k961l30q70N1M080J742
506B390M97J065j508m189r06k97r18L168L868J5M77k43l536l053M33o66J131M429
$$ plain form
524 2157 3784 3557 3630 1545 -2503 -3501 -3341 -2783 261 3355 3512 2887 1506 -1358 -3768 -3426 -2936 -451
542 -451 2292 3565 3136 2300 -948 -3107 -3581 -3281 -1514 1463 3060 3296 2486 -530 -2762 -3322 -3527
559 -3527 -1908 1121 2286 3154 2493 -228 -2616 -2949 -3588 -3021 19 1897 2142 3105 940 -2584 -2384
576 -2384 -2975 -3751 -638 2184 1589 2177 1968 -1603 -2777 -1850 -3066 -2013 1103 1444 1671 2257 -160
593 -160 -2265 -1838 -3351 -3191 542 1320 1284 2533 938 -1929 -1994 -2547 -3280 -529 1028 807 1794 1796 -743
612 -743 -1858 -2485 -3148 -1570 323 1066 2404 1896 80 -1283 -2511 -3498 -1671 -118 328 1793 2489
629 2489 241 -430 -1141 -3197 -2816 -344 -399 988 2850 1197 -515 -1080 -3060 -3429 -690 33 612
646 612 2650 1574 -616 -121 -1992 -3386 -1470 -225 87 2299 3216 596 -330 -1600 -3682 -2388
$$ packed form
524B157J627k27P3k085m048r98J60N58L044L094J57o25j381k864k410L42M90K485
542d51K743J273m29q36l248k159m74L00J767K977J597K36q10l016k232n60k05
559c527J619L029J165Q68o61k721k388l33o39N67L040J878K45R63k165l524K00
576b384n91p76L113K822n95N88k09l571j174R27j216J053L116L41K27N86k417
593a60k105M27j513J60L733P78l6J249j595k867o5n53p33K751J557k21R87Kk539
612g43j115o27o63J578J893P43J338n08j816j363j228r87J827J553M46J465O96
629B489k248o71p11k056L81K472n5J387J862j653j712n65j980l69K739P23N79
646F12K038j076k190M95j871j394J916J245L12K212R17k620r26j270k082J294
$$ plain form
662 -2388 -255 413 2223 2951 980 -527 -879 -2402 -2654 -902 67 1169 2524 1702 493 -442 -2208
679 -2208 -2486 -1409 -134 1102 2959 2063 824 -172 -2346 -2693 -1108 -450 898 2668 1783 1166 676
696 676 -1368 -2465 -1479 -1121 -14 2701 2452 971 1013 -781 -3254 -1714 -458 -49 2398 2858 843
713 843 907 278 -2235 -1983 -81 -467 495 3024 2001 953 947 -1192 -2413 -1079 -267 481 2444 2449 1133
732 1133 658 -557 -2194 -881 -501 103 1578 2287 1753 1057 313 -1566 -1674 -742 -250 1300 2655 2144
750 2144 1191 271 -1077 -1531 -823 -314 711 2066 1718 1196 1038 -357 -1102 -726 -1211 -238 2166 2227 1425
769 1425 1398 -366 -2044 -1222 -318 -472 1372 2481 983 1049 1004 -1270 -1462 -524 -1202 47 2019 1884
787 1884 1139 1410 -772 -1989 -807 -710 -173 1768 2183 546 1301 371 -1743 -1048 -69 -1002 613 2187
$$ packed form
662b388K133O68J810P28j971j507l52j523k52J752R69J102J355q22j209r35j766
679b208k78J077J275J236J857q96j239r96k174l47J585O58J348J770q85o17m90
696F76k044j097R86L58J107K715k49j481M2j794k473J540J256M09K447M60k015
713H43O4o29k513K52J902l86R62K529j023j048ok139j221J334Q12P48J963Nj316
732A133m75j215j637J313L80O04J475P09n34o96p44j879j08R32M92J550J355n11
750B144r53r20j348m54P08N09J025J355l48n22j58j395p45L76m85R73K404O1q02
769A425k7j764j678Q22R04j54J844J109j498O6m5k274j92R38o78J249J972j35
787A884p45K71k182j217J182R7N37J941M15j637P55r30k114O95R79r33J615J574
$$ plain form
805 2187 1231 1083 986 -1593 -1816 -751 -713 -36 2084 1500 868 873 -924 -1597 -834 -1040 -373 1255 1551 916
825 916 1198 -243 -1660 -1441 -1216 -409 1120 1748 1023 1036 -53 -1578 -1360 -1182 -696 1022 1892 987 1269
844 1269 694 -1401 -1185 -995 -1240 230 1942 929 1120 1256 -983 -1683 -587 -1153 -207 1840 1513 851
862 851 1082 -415 -1736 -862 -707 -949 899 1482 788 1316 223 -1535 -1185 -403 -821 342 1649 1045
880 1045 822 373 -1049 -1494 -696 -933 -20 969 795 603 776 -659 -915 -870 -971 -127 868 814 911 892 -547
901 -547 -888 -685 -809 -359 923 806 468 713 -122 -794 -624 -1015 -891 522 668 478 727 257 -796
920 -796 -663 -693 -1060 -123 716 526 798 636 -550 -667 -308 -1100 -589 545 442 675 1170 187 -789 -310
940 -310 -637 -626 272 457 338 804 515 -424 -596 -791 -1083 -421 555 633 627 226 -119 -736 -1367 -866 -344 196
$$ packed form
805B187r56j48r7k579k23J065L8O77K120n84o32Nj797o73P63k06O67J628K96o35
825I16K82j441j417K19K25Q07J529O28p25J3j089j525K18J78M86J718Q70r05K82
844A269n75k095K16J90k45J470J712j013J91J36k239p00J096n66R46K047l27o62
862H51K31j497j321Q74J55k42J848N83o94N28j093j758L50P82m18J163J307o04
880A045k23m49j422m45P98k37R13R89j74j92J73j435k56M5j01Q44R95n4R7j9j439
901e47l41K03j24M50J282j17l38K45q35o72J70l91J24J413J46j90K49m70j053
920g96J33l0l67R37Q39j90K72j62j186j17L59p92N11J134j03K33M95r83r76M79
940c10l27J1Q98J85j19M66k89r39j72j95k92O62R76P8om01l45o17o31N01N22N40
$$ plain form
962 196 399 670 598 -103 -360 -767 -1070 -604 -115 252 563 665 162 -369 -960 -1088 -768 -67 65 549 1074
983 1074 155 -560 -426 -1081 -1144 -182 152 412 729 237 -535 -540 -729 -1061 -547 340 227 787 754 91 -572
1004 -572 -638 -550 -798 337 465 423 765 121 -534 -667 -442 -719 -117 247 350 532 333 -405 -682 -657 -519
1025 -519 -568 261 505 363 348 119 -439 -558 -286 -463 76 506 424 128 78 -77 -445 -393 -227 -178 311 626
1047 626 680 378 174 -287 -408 -293 -330 137 291 362 382 132 -158 -394 -368 -222 53 472 549 495 336 61
1069 61 -272 -128 -327 34 261 311 509 725 12 -303 -24 -329 -385 360 502 324 560 -103 -135 -388 -398 -915
1091 -915 -48 402 224 640 318 -163 -674 -420 -877 -156 556 -86 504 569 4 -387 128 -361 -202 396
1111 396 396 366 676 -117 -433 -336 -437 -482 393 412 153 466 137 -480 -246 -222 -379 298 346 573 615 511 -87
$$ packed form
962A96K03K71p2p01k57m07l03M66M89L67L11J02n03n31n91j28L20P01J32M84N25
983A074r19p15J34o55o3R62L34K60L17m92p72nj89l32N14Q87j13N60l3o63o63
1004e72o6Q8k48J135J28m2L42o44o55j33K25k77O02L64J03J82j99p38k77K5J38
1025e19m9Q29K44j42j5k29n58j19K72j77N39M30q2k96n0j55l68N2J66M9M89L15
1047F26N4l02k04m61j21J15l7M67J54P1K0k50k90k36K6J46K75M19P7n4j59k75
1069F1l33J44j99L61K27N0J98K16p13l15K79l05n6P45J42j78K36o63l2k53j0n17
1091i15Q67M50j78M16l22m81n11K54m57P21P12o42N90O5n65l91N15m89J59N98
1111C96%l0L10p93l16R7j01m5Q75J9k59L13l29o17K34K4j57O77M8K27M2j04n98
$$ plain form
1134 -87 -143 -53 -288 309 321 406 450 347 -336 -188 33 -391 267 232 -156 450 606 -191 -197 100 -364 -358 325 29
1158 29 -225 608 53 -197 356 -198 -143 304 147 -159 414 304 -404 17 123 -537 194 256 -85 307 704
1179 704 46 -24 353 -156 -261 491 109 -141 464 -6 211 -49 42 -302 139 -162 -41 548 174 -292 94
1200 94 -49 -526 31 49 -329 354 416 -74 262 -111 -519 -1 244 -166 273 493 1 116 266 -716 -66
1221 -66 15 -224 19 752 -126 -173 -136 -348 -445 384 -130 -159 309 187 -535 10 -186 -521 304 416 -176 417
1243 417 209 -317 -5 -98 -423 33 299 -190 420 464 -592 -134 102 -11 -436 252 -18 -140 361 -257
1263 -257 -336 189 -282 -178 -55 -332 -90 337 -176 -45 86 -13 -244 -114 -241 -252 185 -103 -30 37 -180 -99
1285 -99 90 -73 -382 -174 90 -321 95 125 -313 -171 -64 -198 -23 22 -348 -90 334 -78 -168 203 -33
$$ packed form
1134h7n6R0k35N97J2Q5M4j03o83J48K21m24O58l5l88O06J56p97oK97m64OO83k96
1158B9k54Q33n55k50N53n54N5M47j57l06N73j10p08M21J06o60P31O2l41L92L97
1179G04o58p0L77n09j05P52l82k50O05m70K17k60R1l44M41l01J21N89l74m66L86
1200I4j43m77N57J8l78O83O2m90L36l73m08N18K45m10M39K20m92J15J50r82O50
1221f6Q1k39K43P33q78m7L7k12r7Q29n14k9M68j22p22N45j96l35Q25J12n92N93
1243D17k08n26L12r3l25M56K66m89O10M4j056M58K36j13m25O88k70j22N01o18
1263b57p9N25m71J04J23k77K42M27n13J31J31r9k31J30j27j1M37k88P3O7k17Q1
1285i9J89j63l09K08K64m11M16L0m38J42J07j34J75M5l70K58M24m12r0L71k36
$$ plain form
1306 -33 -340 295 20 -167 386 94 -468 251 -144 -390 250 296 -104 -155 212 -325 -34 157 -390 -6 252
1327 252 -42 -186 -77 -79 -201 177 -125 -8 118 -312 -159 -88 -316 -445 78 -51 -82 74 -11 -29 211 9
1349 9 -283 85 -222 -39 389 384 -188 261 -27 -395 106 321 -12 -31 228 -483 -136 -201 -381 192 157 -102
1371 -102 124 149 -392 -306 309 29 -124 355 148 -243 120 -90 -394 412 211 -34 640 353 106 226 111
1392 111 -370 -248 302 -119 521 543 34 -188 -134 -222 27 -204 -142 327 278 -102 -216 237 -415 -166 -160 -309
1414 -309 -202 52 -142 -214 -31 -388 -395 176 110 360 311 163 -329 -91 146 -71 184 -16 -214 207 -169 -229
1436 -229 -62 -10 -208 207 371 -183 155 155 -392 -145 -188 -198 101 240 155 168 190 34 -187 173 -171 -167 178
1459 178 58 -64 258 376 -336 351 -111 -294 62 232 35 203 214 -52 269 146 -69 59 -42 -134 169
$$ packed form
1306c3l07O35k75j87N53k92n62P19l95k46O40M6m00n1L67n37K91J91n47L84K58
1327B52k94j44J09kj22L78l02J17J26m30J53P1k28j29N23j29l1J56q5j8K40k02
1349Ik92L68l07J83M28nn72M49k88l68N01K15l33j9K59p11L47o5j80N73l5k59
1371a02K26K5n41Q6O15k80j53M79k07l91L63k10l04Q06k01k45O74k87k47J20j15
1392A11m81J22N50m21O40K2n09k22N4q8K49k31O2M69m9l80j14M53o52K49Oj49
1414c09J07K54j94p2J83l57pN71o6K50m9j48m92K38K37k17K55k00j98M21l76o0
1436b29J67N2j98M15J64n54L38%n47K47m3j0K99J39q5J3K2j56k21L60l44ML45
1459A78j20j22L22J18p12O87m62j83L56J70j97J68J1k66L21j23k15J28j01r2L03
$$ plain form
1480 169 262 257 22 186 -58 -265 32 -214 198 180 -6 312 301 -249 -221 -147 -96 38 163 -81 230 134 -387
1503 -387 -467 -127 -351 -181 367 126 -137 171 -187 -105 -142 -255 -286 103 292 188 -112 123 -179 -279 109
1524 109 -16 247 478 131 253 -253 -135 -228 -35 -58 -106 347 238 22 98 -256 -421 -216 24 35 142 133
1546 133 -21 320 -82 -301 -296 -155 156 263 457 273 -59 2 -252 -285 -102 214 167 202 180 85 -254 -246 -158 -43
1570 -43 -300 -43 325 227 130 283 -249 -177 -298 -268 -168 51 293 -38 334 29 -424 -515 -246 -344 113 -84
1592 -84 267 137 -33 -159 -363 -352 -226 -149 -68 116 -71 -45 -380 112 -204 -227 -223 180 271 302 273 -17 -74 97
1616 97 -231 -298 -78 326 313 309 -135 14 -271 -557 -28 291 302 256 427 75 -5 -214 -340 -70 -2 228 222 223
1640 223 89 -247 -129 -413 -264 -13 252 368 413 60 30 -320 -167 -88 -178 174 194 366 164 -17 -122 -251
$$ packed form
1480A69R3nk35J64k44k07K97k46M12j8j86L18j1n50K8P4N1J34J25k44L11r6n21
1503c87q0L40k24J70N48k41k63L08l58Q2l7j13l1L89J89j04l00K35l02j00L88
1524A09j25K63K31l47J22n06J18r3J93k3m8M53j09k16P6l54j65K05K40J1J07r
1546A33j54L41m02k19NJ41L11J07J94j84l32O1k54l3J83L16m7L5k2r5l39QQ8J15
1570d3k57K57L68r8r7J53n32P2j21L0J00K19K42l31L72l05m53r1K69r8M57j97
1592h4L51j30j70j26k04J1J26P7Q1J84j87K6l35M92l16k3MM03R1L1k9k90n7J71
1616I7l28o7K20M04j3mm44J49k85k86N29L19J1m6J71l52q0k09j26K70O8K30oJ
1640B23j34l36J18k84J49K51K65J16M5l53l0l50J53P9r0L52K0J72k02j81j05j29
$$ plain form
1662 -251 -55 -222 50 54 517 134 171 -112 -350 -404 -174 -76 172 369 240 -214 -28 -203 -280 -279 -84 93 -86
1685 -86 3 70 -60 66 183 -511 -158 -220 141 546 201 8 -379 -315 -197 -198 -62 9 260 177 181 90 14 -115
1709 -115 71 -176 1 315 357 109 101 -123 -246 -168 -3 -250 318 -6 289 78 -236 -269 -236 -38 -97 238
1731 238 134 222 18 78 -191 -145 -221 -29 262 211 220 362 194 -161 -306 -213 -189 128 183 264 31 411 171 -480
1755 -480 1 -182 -309 -4 300 395 210 15 -606 -285 -64 -197 37 217 113 147 302 -357 -462 -369 -254
1776 -254 -81 192 299 314 260 -292 -402 -151 -4 -150 -163 -96 261 143 -499 -598 -196 -128 -153 165 199 -153 435
1799 435 168 -354 93 149 -301 -27 103 211 222 181 -23 -160 -27 -265 203 62 162 170 243 -332 17 -76
1821 -76 -357 1 159 309 270 285 -266 -147 -132 -264 -329 218 284 54 159 -69 -269 76 270 -444 466 280
$$ packed form
1662b51J96j67K72MM63l83L7k83k38n4K30R8K48J97j29m54J86j75p7JJ95J77j79
1685h6Q9O7j30J26J17o94L53o2L61M05l45j93l87O4J18jJ36P1K51q3Mr1p6j29
1709a15J86k47J77L14M2k48qk24j23P8J65k47N68l24K95k11l14l3L3J98n9L35
1731B38j04Q8k04O0k69M6p6J92K91n1RJ42j68l55j45R3K4L17N5Q1k33L80k40o51
1755d80M81j83j27L05L04R5j85j95o21L21K21j33K34J80j04L4J55o59j05R3J15
1776b54J73K73J07J5n4n52j10K51J47j46j3O7L57j18o42r9M02O8k5L18L4l52N88
1799D35k67n22M47N6m50K74J30J08J1m1k04j37J33k38M68j41J00QP3n75L49r3
1821g6k81L58J58J50l9J5n51J19J5j32o5N47O6k30J05k28k00L45J94p14R10j86
$$ plain form
1843 280 -33 216 -141 -226 -164 -152 -306 74 79 423 91 287 -216 -124 1 -250 -88 194 44 387 514 -125
1865 -125 -217 -112 -280 -161 70 226 95 404 -142 -210 106 -217 -195 128 317 114 140 278 -144 -289 -217 -406
1887 -406 -171 114 38 281 329 -128 -305 -40 -146 -9 -38 213 283 426 159 -99 11 -235 -260 239 296 183
1909 183 370 119 -260 44 -250 -218 234 12 84 343 358 -140 -71 -279 -451 20 169 -125 213 594 143
1930 143 20 -151 -329 -138 223 135 97 376 168 -234 43 -91 -266 270 -134 118 234 153 -175 22 -218
1951 -218 -264 -118 43 97 204 149 -163 157 -34 -329 -376 149 29 26 506 72 50 -208 -100 -54 214 182 -34
1974 -34 197 270 32 118 -158 -87 -99 133 238 298 309 -71 40 -212 -269 -24 97 157 217 -32 -94 -17 -278 -571
1998 -571 64 131 -126 169 517 46 -245 -209 -211 35 -195 77 320 490 35 -76 -51 -351 -87 102 -88 249
$$ packed form
1843B80l13K49l57q5O2J2j54L80NL44l32J96n03R2J25k51J62K82j50L43J27o39
1865a25r2J05j68J19K31J56j31L09n46o8L16l23K2L23J89k03K6J38m22j45P2j89
1887d06K35K85p6K43M8m57j77K65j06J37k9K51P0J43k67k58J10k46k5M99N7j13
1909A83J87k51l79L04k94L2M52k22P2K59J5m98O9k08j72M71J49k94L38L81m51
1930A43j23j71j78J91L61q8l8K79k08m02K77j34j75N36m04K52J16q1l28J97k40
1951b18m6J46J61N4J07n5l12L20j91k95m7N25j20lM80m34k2k58J08M6K68l2k16
1974c4K31P3k38Q6k76P1j2K32J05O0J1l80J11k52n7K45J21O0O0k49o2P7k61k93
1998e71O35O7k57K95L48m71k91L6kK46k30K72K43J70m55j11K5l00K64J89j90L37
$$ plain form
2020 249 374 51 42 -20 -19 -267 -215 -118 -58 12 327 145 -298 288 -337 58 -129 -183 122 206 80 -82 76 -503
2044 -503 -108 -180 -136 -104 268 83 199 4 -238 -401 -8 -294 -59 388 238 44 315 -69 -373 -58 -112
2065 -112 35 -41 226 117 194 159 -214 -18 43 156 107 175 -68 -212 -117 -101 -158 157 72 -1 290 301 153 88
2089 88 -207 -206 -274 -199 363 376 288 175 161 -64 -133 -93 -143 116 333 322 274 62 -38 -294 -360 -222 254 110 14
2114 14 423 189 65 -350 -194 -220 -64 197 42 31 123 46 -235 -228 -227 -184 6 177 197 -5 52 0 -226 -96
2138 -96 -163 -105 111 322 159 227 -275 -60 108 -103 -104 117 329 59 282 347 -447 -133 122 -86 137 223 164
2161 164 164 54 -197 -51 -12 24 -56 73 175 45 19 14 76 29 -36 9 192 167 237 64 -99 32 -137 -15 93
2186 93 294 275 349 109 70 -78 -99 67 -201 90 201 265 112 114 20 -203 -423 65 82 54 162 248 232 -147
$$ packed form
2020B49J25l23ro2Jk48N2R7O0P0L15j82m43N86o25L95j87n4L05Q4j26j62J58n79
2044e03L95p2M4L2L72j85J16j95k42j63L93k86K35M47j50j94K71l84l04L15n4
2065a12J47p6K67j09P7l5l73J96O1J13m9O8k43j44R5J6n7L15q5p3K91J1j48o5
2089H8k95Jo8P5N62J3q8j13j4k25o9M0n0K59K17j1m8k12j00k56o6J38M76j44r6
2114A4M09k34j24m15J56k6J56K61j55j1R2p7k81PJM3J90J71K0k02N7n2k26J30
2138i6o7N8K16K11j63O8n02K15J68k11jK21K12k70K23O5p94L14K55k08K23Q6n9
2161A64%j10k51J46L9L6q0J29J02j30k6nO2m7o5M5J83k5P0j73j63J31j69J22J08
2186I3K01j9P4k40l9j48k1J66k68K91J11O4j53Kr4k23k20M88J7k8J08Q6j6l79
$$ plain form
2210 -147 -137 -25 -120 -73 -149 295 158 136 259 -123 -214 -115 -26 -130 123 -12 180 160 39 107 -158 -339 146
2233 146 54 220 95 90 397 87 -344 -274 -117 19 260 -197 -81 0 -66 -110 -295 -75 -229 127 73 184 83
2256 83 -172 -115 -233 -44 -15 24 265 173 44 92 -58 -60 -13 135 231 168 46 182 -100 -67 -82 -336 170 -25
2280 -25 -25 62 -47 150 -243 106 -232 -23 121 18 64 259 416 64 -137 -68 32 2 -151 44 -82 20
2302 20 -61 -238 115 -123 -213 -164 244 110 26 15 142 -260 -227 108 50 59 303 215 104 -157 -76 -254 -31 -182
2326 -182 -216 29 -204 64 -39 -209 -298 75 -139 -162 -41 169 -89 92 -19 -128 -114 -205 153 91 187 -35
2348 -35 94 -135 -300 -43 176 -35 -10 102 282 197 -28 40 -139 135 -74 192 -76 202 16 213 -67
2369 -67 -277 -104 26 -7 3 -314 -64 2 -123 35 37 -398 16 157 7 -132 165 161 -30 111 19 -146 -124
$$ packed form
2210a47J0J12r5M7p6M44j37k2J23l82r1R9Q9j04K53j35J92k0j21O8k65j81M85
2233A46r2J66j25nL07l10m31P0J57J36K41m57J16Q1o6m4j85K20j54L56n4J11j01
2256H3k55N7j18J89K9L9K41r2j29M8j50kM7J48R6o3j22J36k82L3j5k54N06j95
2280b5%Q7j09J97l93L49l38K09J44j03M6J95J57l52k01O9J00l0j53J95j26J02
2302B0q1j77L53k38r0M9M08j34q4j1J27m02L3L35n8RK44q8j11k61Q1j78K23j51
2326a82l4K45k33K68j03j70q9L73k14k3J21K10k58J81j11j09J4r1L58o2R6k22
2348c5J29k29j65K57K19k11K5J12J80q5k25O8j79K74k09K66k68K78j86J97k80
2369f7k10J73J30l3J0l17K50O6j25J58Km35M14J41j50j39K97mj91J41r2j65K2
$$ plain form
2392 -124 81 -13 127 222 -50 61 -153 97 -96 138 -141 81 100 199 -22 -290 57 -404 87 52 -57 66
2414 66 -86 84 187 8 14 -195 71 56 156 -94 81 11 -23 -171 182 -59 -167 240 9 -318 53 3
2436 3 77 -107 7 -49 162 62 -122 141 -58 -190 -76 -174 -360 129 -125 131 147 -27 -106 -12 61 -115 -231
2459 -231 -54 -80 -86 -41 -75 253 -39 -51 295 210 -92 -21 -91 8 -230 -6 -6 -240 -211 -4 -3 29 173 11 -38 14
2485 14 -33 -100 -81 -345 47 -34 197 -29 60 -8 -396 -97 -70 -4 -78 33 167 -63 172 -25 -211 152 5
2508 5 -170 -25 -49 -69 -33 -205 -146 -154 -70 134 -114 -68 35 162 -176 103 62 -190 58 89 -87 135 195 -104
2532 -104 -136 159 93 -239 -11 -248 -69 -67 -108 20 111 -104 -181 155 -54 -116 -62 -144 -156 47 158 -363 147 -7
2556 -7 -200 180 428 0 67 63 42 -123 10 145 91 -184 -273 -84 -20 -13 -283 68 -101 81 161 -53 52 55 -59
$$ packed form
2392a24K05r4J40R5k72J11k14K50j93K34k79K22J9R9k21k68L47m61M91l5j09J23
2414F6j52J70J03j79Ok09K66j5J00k50J75p0l4j48L53k41j08M07k31l27L71n0
2436CP4j84J14n6K11j00j84K63j99j32J14r8j86M89k54K56J6j74p9R4P3j76j16
2459b31J77k6oM5l4L28k92j2L46q5l02P1p0R9k38K24%k34K9K07JL2J44j62m9N2
2485A4m7o7J9k64L92q1K31k26Q9o8l88K99K7O6p4J11J34k30K35j97j86L63j47
2508Ej75J45k4k0L6j72N9qQ4K04k48M6J03J27l38K79m1k52K48L1j76K22O0k99
2532a04l2K95o6l32K28k37J79Km1J28R1k15p7L36k09o2N4q2j2K03J11n21N10j54
2556gj93L80K48m28O7mk1j65J33J35n4k75q9J89O4Pk70L51j69J82Q0k14J05Lj14
$$ plain form
2581 -59 -93 276 49 -196 27 24 -116 112 -165 -73 173 -60 -108 -62 -118 -98 1 11 -64 71 98 -173 -94 -19 -240
2606 -240 -41 -267 255 16 60 -162 9 -41 -44 -70 112 217 -291 258 127 209 63 278 -163 -161 232 -41 50
2629 50 181 404 202 162 73 -194 -218 -16 28 333 -141 218 80 -46 -110 -3 -245 -183 40 60 11 164 -139
2652 -139 -42 255 26 121 -396 -45 35 -60 -23 -123 140 -134 -240 -107 112 -65 25 77 151 -133 -16 -101 -212
2675 -212 77 -135 216 286 -108 71 -37 -88 -41 -38 161 -65 -76 86 67 -372 -179 -16 -42 -301 -19 -130 -31
2698 -31 -53 83 -22 -136 67 318 -38 188 237 102 -69 -228 -228 -134 55 -86 -104 -73 205 115 35 -19 -169 43
2722 43 109 -269 80 -132 87 -171 -164 35 -331 -145 36 70 37 250 -207 -77 -175 -194 -158 213 434 -59 -77
2745 -77 65 -180 -65 15 11 -216 -39 62 168 -88 -14 -44 -108 -121 0 -93 -135 70 -15 83 -164 -58 -357 131
$$ packed form
2581e9l4L69k27k45K23lj40K28k77R2K46k33m8M6n6K0R9J0p5J35K7k71P9P5k21
2606b40J99k26N22k39M4k22J71n0lk6J82J05n08N49j31Q2j46K15m41KL93k73R1
2629E0J31K23k02m0q9k67k4K02M4L05m74L59j38j26o4J07k42O2K23K0m9J53l03
2652a39R7K97k29R5n17L51Q0r5L7j00K63k74j06J33K19j77R0N2P4k84J17q5j11
2675b12K89k12L51P0l94J79j08n1M7LJ99k26j1J62j9m39J93J63k6k59K82j11R9
2698c1k2J36j05j14K03K51l56K26M9j35j71j59%R4J89j41j8L1K78r0q0n4j50K12
2722D3O6l78L49k12K19k58PJ99l66J86J81L4l3K13m57J30r8j9L6L71K21m93j8
2745g7J42k45J15Q0mk27J77J01J06k56P4l0o4j3J21r3m2K05q5R8k47J06k99M88
$$ plain form
2769 131 163 164 169 -111 15 110 -247 50 -136 -11 25 134 -68 -105 -43 41 -113 172 -121 133 197 14 -73 219
2793 219 -271 -208 -146 144 350 1 -164 292 -75 -286 -172 -53 -42 59 11 234 303 33 135 -217 -303 263
2815 263 -213 184 474 -141 -141 -431 -93 -336 21 -41 -78 224 14 103 -176 -221 -177 -182 -164 22 215 231 -74 185
2839 185 -40 -136 -15 199 267 48 220 259 5 -46 -252 -20 -225 -209 103 -111 40 -81 -37 -45 -186 -66 146
2862 146 -40 113 225 108 -3 -43 -61 -126 -248 -136 -156 251 88 9 -32 75 -153 -50 347 342 206 377 182
2885 182 -131 -81 -106 -122 8 232 -101 319 -105 -40 44 -39 10 20 -30 350 76 165 24 -194 -268 3 -197 218
2909 218 126 -43 172 76 170 -195 -300 -236 352 204 200 3 -117 -108 189 -275 -231 -103 -25 -89 182 -177 38 -158
2933 -158 -212 54 -60 83 193 251 184 19 119 -112 -205 70 124 130 342 476 -135 225 120 -215 -244 -120 114
$$ packed form
2769A31L2JNk80J26R5l57K97j86J25L6J09k02l7O2Q4j54K85k93K54O4j83q7K92
2793B19m90O3O2K90K06l49j65M56l67k11J14J19J1J01m8K23O9k70J02l52q6N66
2815B63m76L97K90o15%k90L38k43L57o2l7L02k10Q9k79m5M4nJ8J86J93J6l05K59
2839A85k25r6J21K14O8k19J72L9k54n1k06K32k05J6L12k14J51j21M4qj41J20K12
2862A46j86J53J12j17j11m0j8o5j22J12k0M07j63p9m1J07k28J03L97nj36J71j95
2885A82l13N0k5j6J30K24l33M20m24O5Q4q3M9J0n0L80k74Q9j41k18p4K71k00M15
2909B18r2j69K15r6R4l65j05O4N88j48mj97j20RK97m64M4J28P8o4K71l59K15j96
2933a58n4K66j14J43J10N8o7j65J00k31r3K75N4OK12J34o11L60j05l35k9J24K34
$$ plain form
2956 114 291 79 41 275 -30 -108 -270 -75 -54 179 224 246 40 147 -270 -243 -225 -43 254 104 248 -26
2978 -26 87 -270 -269 -136 81 -81 67 127 96 -58 -64 -142 4 -141 124 110 293 176 -11 -211 -151 -312 -70
3001 -70 -140 186 110 5 121 123 -102 -414 -191 -144 59 175 -193 -61 51 -108 -208 -185 -348 35 -16 189 128
3024 128 70 -231 -57 84 -181 -326 363 438 265 119 -72 -120 -160 -56 -92 1 33 104 -87 219 -182 -223 -20
3047 -20 -62 25 79 17 62 -189 -51 73 -96 -31 -92 34 428 93 -6 323 -331 -268 -67 -43 236 172 458 -95
3071 -95 126 -346 -331 -396 -138 -52 -61 107 145 -74 -239 -12 -330 -300 220 -27 102 8 246 146 -170 -10 -217
3094 -217 -14 321 173 60 181 75 -57 -300 -115 -293 16 53 320 46 215 -29 34 -180 -92 -166 208
3115 208 263 124 213 42 -421 -411 -247 12 -73 293 200 66 4 -466 -130 -498 57 118 131 49 94 146 -290 -393
$$ packed form
2956A14J77k12l8K34l05p8j62J95K1K33M5K2k06J07m17K7J8J82K97j50J44k74
2978b6J13l57JJ33K17j62J48O0l1j54op8J46j45K65j4J83j17j87k00O0j61K42
3001g0p0L26p6j05J16Kk25l12K23M7K03J16l68J32J12j59j00K3j63L83n1K05o1
3024A28n8l01J74J41k65j45O89P5j73j46j91m8m0J04l6R3L2P1j91L06m01m1K03
3047b0m2Q7N4o2M5k51J38J24j69O5o1J26L94l35r9L29o54O3K01K4K79o4K86n53
3071i5K21m72J5o5K58Q6rJ68L8k19j65K27l18L0N20k47J29r4K38j00l16J60k07
3094b17K03L35j48j13J21j06j32k43J85j78L09L7K67k74J69k44O3k14Q8p4L74
3115B08N5j39Q9j71m63J0J64K59q5L66r3j34o2m70L36l68N55O1J3q2M5N2m36j03
$$ plain form
3139 -393 -111 -10 -72 -20 270 153 47 -172 -241 -76 -184 -293 194 149 95 216 -83 -29 -103 21 -58 -191 137
3162 137 278 57 -139 61 -317 -95 -360 -21 163 91 108 -28 57 -75 -4 -278 -22 -134 287 105 70 -86
3184 -86 -176 -127 -332 -132 247 380 27 -28 -42 -56 -10 -294 -422 108 241 149 -29 206 -20 -83 -132 -251 -239 194
3208 194 97 73 245 -82 -137 -108 -291 -31 67 172 163 -142 -67 64 -296 41 107 50 150 126 111 116 100 -126 -48
3233 -48 36 87 -48 289 156 -217 71 -2 -107 -296 -242 113 217 144 140 -236 -209 -92 -162 -127 -218 307 160 -1
3257 -1 6 30 -288 -367 -251 -51 106 305 35 -191 -51 -409 -80 -106 282 36 147 292 164 -17 71 -64 63
3280 63 62 109 294 65 170 22 -156 -172 -109 -75 -90 -273 376 261 -41 198 -254 -206 90 -237 239 75 104
3303 104 264 -198 -131 -83 -169 -47 -120 109 80 176 37 -108 -40 74 -46 -47 -71 186 232 174 38 -69 -68 -46 220
$$ packed form
3139c93K82J01o2N2K90j17j06k19o9J65j08j09M87m5n4J21k99N4p4J24p9j33L28
3162A37J41k21j96K00l78K22k65L39J84p2J7j36Q5j32P1k74K56j12M21j82l5j56
3184h6r0M9k05K00L79J33l53n5j4j4M6k84j28N30J33r2j78K35k26o3m9j19J2M33
3208A94r7k4J72l27n5K9j83K60R8J05rl05P5J31l60L37O6n7J00k4j5Nj6k26P8
3233d8Q4N1j35L37j33l73K88p3j05j89N4L55J04p3ml76K7J17p0L5r1N25j47j61
3257aPK4l18p9J16K00J57J99k70k26J40l58L29k6L88k46J11J45j28j81Q8j35J27
3280F3jM7J85k29J05j48j78j6O3L4j5j83O49j15l02K39m52M8K96l27M76j64K9
3303A04J60m62O7M8q6J22p3K29k9R6j39j45O8J14j20jk4K57M6n8j36j07JK2K66
$$ plain form
3328 220 29 37 54 172 96 67 -140 -652 -206 49 324 288 249 475 127 -170 -195 -247 -16 87 370 350 32
3351 32 -336 -230 -290 -103 87 208 -5 -157 86 325 -186 -242 -230 -214 133 41 411 212 -21 65 -58 -272
3373 -272 27 9 79 197 44 108 -66 -156 -410 -45 85 -73 142 223 97 63 -143 -29 -197 -151 107 -13
3395 -13 231 150 -148 -220 -69 -414 -304 -119 271 306 400 71 -78 -183 -99 -133 -203 218 308 252 235 128 -265 -226
3419 -226 -250 67 -212 31 77 62 45 -273 -399 -113 29 106 31 203 392 230 148 -193 -112 -95 37 25 426
3442 426 124 -13 138 -231 -146 -169 -116 123 -17 171 350 -3 -157 -319 -40 -262 26 275 124 34 109 75
3464 75 48 0 -408 -136 164 39 -177 189 129 -98 -40 73 -39 -59 174 532 50 -36 -93 -123 -59 -84 163 44
3488 44 136 235 105 -201 -74 -172 -123 41 -27 109 395 149 -324 -258 -378 -37 -156 298 80 336 88 -18
$$ packed form
3328B20j91QJ7J18p6k9k07n12M46K55K75l6l9K26l48k97k5n2K31J03K83k0l18
3351C2l68J06o0J87J90J21k13j52K43K39n11n6J2J6L47r2L70j99k33Q6j23k14
3373b72K99j8P0J18j53O4j74r0k54L65J30j58K15Q1j26l4k06J14j68M6K58j20
3395a3K44q1k98p2J51l45J10J85L90L5R4l29j49j05Q4l4p0M21R0n6j7j07l93L9
3419b26k4L17k79K43M6j5j7l18j26K86J42P7p5J72J89j62q2l41Q1J7J32j2M01
3442D26l02j37J51l69Q5k3N3K39j40J88J79l53j54j62K79k22K88K49j51r0P5l4
3464G5k7m8m08K72L00j25k16L66o0k27N8J13j12k0K33L58m82q6n7l0O4k5K47j19
3488D4R2R9j30l06J27r8M9J64o8J36K86k46m73O6j20L41j19M54k18K56k48j06
$$ plain form
3510 -18 -354 -224 -337 -180 -58 -7 141 266 -192 -312 -204 -170 -228 4 51 93 72 -68 93 -370 -118 -191 -23
3533 -23 77 332 5 -220 117 -102 -159 -97 -128 18 16 437 -10 -132 66 -357 -133 -310 98 -2 204 168
3555 168 -159 -73 -69 -206 -239 -222 -5 109 24 -42 180 -65 -252 -351 -218 -28 -16 101 276 220 123 -160 -267 -404
3579 -404 111 277 317 129 159 146 -149 -285 -235 -189 -88 263 41 78 -20 74 -57 -254 -38 113 203 302 355 -10
3603 -10 -181 -233 -456 -247 147 -9 -114 187 15 55 -229 -112 -90 -6 105 301 187 26 -27 -252 135 -327
3625 -327 -11 85 4 41 165 186 -36 -275 -316 -105 44 212 249 36 251 -82 -151 -107 -229 -118 377 -18 29
3648 29 -8 45 -96 -350 -6 -451 -235 170 50 274 331 86 -112 -95 -102 248 168 228 363 124 115 -66 -77 -80 -114
3673 -114 31 178 64 85 -87 -337 -101 -191 119 130 157 248 -6 90 -395 -132 -226 -80 94 197 27 241
$$ packed form
3510a8l36J30j13J57J22N1J48J25m58j20J08L4n8K32M7M2k1j40J61m63K52p3J68
3533b3J00K55l27k25L37k19n7O2l1J46kM21m47j22J98m23K24j77M08j00K06l6
3555A68l27Q6Mj37l3J7K17J14q5o6K22k45j87r9J33J90J2J17J75n6r7k83j07j37
3579d04N15J66M0j88L0j3k95j36N0M6J01L51k22L7r8R4j31j97K16J51R0R9N3l65
3603a0j71n2k23K09L94j56j05L01j72M0k84J17K2Q4J11J96j14j61n3k25L87m62
3625c27L16R6q1L7J24K1k22k39m1K11J49J68L7k13K15l33o9M4j22J11M95l95M7
3648B9l7N3j41k54L44m45K16M05j20K24N7k45j98J7pL50q0O0J35k39rj81j1ll4
3673a14J45J47j14K1j72k50K36r0L10J1K7R1k54R6m85K63r4J46J74J03j70K14
$$ plain form
3695 241 -19 -44 -293 46 -77 -165 186 440 180 -82 -169 -159 -267 -89 149 -85 197 29 -160 44 22 -136
3717 -136 -243 -110 82 287 215 298 51 -147 -250 -348 -122 57 44 117 231 425 -42 -155 -248 -342 -29 -3 223
3740 223 186 392 303 -79 -256 -125 167 -22 -27 160 249 -95 -29 -60 -230 -384 278 128 178 117 45 120 -279 -120
3764 -120 -289 89 -55 -66 26 5 22 22 -150 -155 -150 238 230 249 -23 -118 47 -246 -248 1 -132 -144 9 82 212 -103
3790 -103 -81 -134 -341 -72 272 85 125 -74 -38 205 -141 -257 17 185 9 88 249 -2 46 -339 56 -39
3812 -39 232 92 -46 64 14 -135 96 -239 -97 -18 -2 346 149 -121 162 306 -296 -233 -31 182 40 85
3834 85 214 -75 -106 -78 -275 -40 108 112 10 251 92 -292 -76 -135 -361 -264 57 141 51 157 -91 -249 -129
3857 -129 -197 94 -116 -86 -75 91 1 79 -239 -144 -90 -7 -15 4 300 125 -77 -234 -20 69 -32 -98 154 -6
$$ packed form
3695B41k60k5k49L39j23q8L51K54k60k62q7J0j08J78K38k34K82j68j89K04k2j58
3717a36j07J33J92K05p2Q3k47j98j03r8K26J79j3P3J14J94m67j13r3r4L13K6K26
3740B23l7K06q9l82j77J31K92j89nJ87Q9l44O6l1j70j54O62j50N0o1p2P5l99J59
3764a20j69L78j44j1R2k1J7%j72nNL88qJ9k72r5J65k93kK49j33j2J53P3J30l15
3790a03K2n3k07K69L44j87M0j99L6K43l46j16K74J68j76P9J61k51M8l85L95r5
3812c9K71j40j38J10n0j49K31l35J42P9J6L48j97k70K83J44o02O3K02K13j42M5
3834H5J29k89l1K8j97K35J48Mj02K41j59l84K16n9k26R7L21Q4r0J06k48j58J20
3857a29o8K91k10L0J1J66r0P8l18R5N4Q3qJ9K96j75k02j57K14Q9j01o6K52j60
$$ plain form
3881 -6 -14 171 -112 -140 -198 -161 70 162 74 139 210 81 18 -10 150 91 68 301 304 -93 -77 -195 -183 -93 -160 153 101
3908 101 92 276 -14 -96 -141 107 -244 -198 74 256 50 124 -165 -28 -328 -186 -334 66 128 -110 66 -200
3930 -200 -160 -102 124 85 -24 209 -15 -38 -53 -218 -7 -213 -2 94 171 -76 233 -118 167 -416 -81 -141 96
3953 96 -74 490 163 256 -137 57 -50 -128 -128 71 44 211 91 148 -60 -176 -63 -121 211 -23 237 123 237
3976 237 -127 -154 -197 -409 142 22 72 93 -72 20 -205 -376 -144 34 65 244 134 76 217 -97 44 24 -245
3999 -245 126 -136 127 -135 60 -163 87 -163 39 218 243 225 132 174 -76 93 101 -318 118 220 2 137
4021 137 139 -343 -259 -94 -119 -44 40 235 174 248 58 -287 -139 112 199 -113 92 174 74 132 -10 -86 -257 114
4045 114 -128 -112 157 28 180 -73 101 -151 -203 32 -189 172 -116 198 165 39 -250 163 -183 185 153
$$ packed form
3881fqJ85k83k8n8L7K31R2q8O5P1j29o3k8J60n9k3K33Ll97J6j18J2R0o7L13n2
3908A01rJ84k90q2m5K48l51M6K72J82k06P4k89J37l00J42j48M00O2k38J76k66
3930b00M0N8K26l9j09K33k24k3j5j65K11k06K11R6P7k47L09l51K85n83L35o0K37
3953I6j70N64l27R3l93J94j07p8%J99k7J67j20N7k08j16J13n8L32k34K60j14J14
3976B37l64k7m3k12N51j20N0K1j65R2k25j71K32J78L1J79j10n8J41l14J41k0k69
3999b45L71k62K63k62J95k23K50k50K02J79K5j8r3M2k50J69Qm19M36J02k18J35
4021A37Km82Q4J65k5P5Q4J95o1P4j90l45J48K51Q7l12K05Q2j00N8j42p6j71L71
4045A14k42J6K69j29J52k53J74k52n2K35k21L61k88L14l3j26k89M13l46L68l2
$$ plain form
4066 153 172 100 -23 148 -119 -64 -92 -80 -11 154 465 260 -175 -167 -227 261 -68 81 234 175 249 -138 237 -126
4090 -126 -141 -220 91 151 -102 23 -209 -9 79 170 274 -257 -166 132 -17 102 -4 -55 28 -164 93 15 138
4113 138 169 159 -57 -102 129 113 123 -195 165 -22 160 -160 -253 -44 -49 -245 -96 33 -75 61 260 -10 -116
4136 -116 -91 27 12 -26 209 162 -56 281 -81 -63 37 -193 92 215 132 -5 -93 119 39 -150 6 -52 165
4159 165 145 203 158 -55 -10 -171 -75 58 -119 8 239 -203 127 -55 -255 -108 -79 84 341 356 16 82 -321
4182 -321 -153 -82 71 170 34 186 31 125 177 -43 23 -102 -91 -177 259 59 8 252 -187 -90 -227 52 -33
4205 -33 -35 -75 -70 17 -207 -162 -308 -65 -141 33 130 -41 -19 35 -21 85 -114 -183 38 115 -15 17 126 113 -231 52
4231 52 267 94 152 22 240 -117 51 163 -129 209 -156 209 34 -102 -30 -78 -4 -63 -199 105 -81 40
$$ packed form
4066A53J9p2j23J71k67N5k8J2O9J65L11k05m35Qo0M88l29J49J53n9P4l87L75l63
4090a26j5p9L11O0k53J25k32K00Q8R1J04n31R1K98j49J19j06n1Q3j92K57p8J23
4113A38L1j0k16m5K31j6J0l18L60j87J82l20r3K09nj96J49J29j08J36J99k70j06
4136a16K5J18j5l8K35m7k18L37l62J8J00k30K85J23q3j37q8K12q0j89J56n8K17
4159A65k0N8m5k13M5j61R6J33j77J27K31m42L30j82k00J47K9J63K57J5l40O6m03
4182c21J68P1J53R9j36J52j55R4N2k20O6j25J1q6M36k00n1K44m39R7j37K79q5
4205c3km0NQ7k24M5j46K43p6J74R7j71K2N4n6J06j99o9K21P7j30L2J09j3l44K83
4231E2K15j73N8j30K18l57J68J12k92L38l65L65j75j36P2m8P4n9j36L04j86J21
$$ plain form
4253 40 282 -43 -291 133 -110 -46 1 -82 93 -94 -64 -74 -84 93 -56 225 76 106 -43 -30 287 85 45
4276 45 -10 -128 -13 -182 185 152 309 114 -63 -56 -51 -24 116 131 -10 4 -79 168 -230 -168 -130 -18 103 -151
4300 -151 92 -135 -128 -154 -136 347 216 237 196 180 105 -99 -274 11 -38 -192 14 173 102 104 86 208 -236 -88
4324 -88 -5 329 107 117 194 -220 -197 7 -206 -43 97 -94 0 171 -135 115 -13 -139 -204 -172 -80 -121 -110 64
4348 64 11 -45 -233 40 -72 53 364 37 -114 -228 -29 -197 42 76 21 266 47 37 157 -286 12 -81
4370 -81 1 257 -130 -25 189 239 39 -29 -103 -149 -18 98 151 -27 -90 -45 154 -292 -305 93 -277 41 54 -38
4394 -38 229 -153 145 236 -34 160 -37 262 127 242 18 -65 -94 102 133 85 -20 -153 46 -247 -60 -89
4416 -89 -162 -53 -76 61 -26 46 -136 15 30 -103 -96 -154 147 -73 -236 -50 -72 -50 -263 180 -173 -113 -74 47
$$ packed form
4253D0K42l25k48M24k43O4M7q3J75j87L0j0j0J77j49K81j49L0j49J3L17k02m0
4276D5n5j18J15j69L67l3J57j95j77PNK7J40J5j41J4q3K47l98O2L8J12J21k54
4300a51K43k27Pk6J8M83j31K1m1j6p5k04j75K85m9j54K06J59p1Kj8J22m44J48
4324h8Q3L34k22J0P7m14K3K04k13J63J40j91R4J71l06K50j28j26o5L2R2m1J1J74
4348F4n3n6j88K73j12J25L11l27j51j14J99j68K39L4n5K45k19j0J20m43K98r3
4370h1Q2K56l87J05K14N0k00o8p4m6J31J16N3j78o3M5J99m46j3L98l70L18J3r2
4394c8K67l82K98R1k70J94j97K99j35J15k24q3k9J96L1m8j05j33J99k93J87k9
4416h9p3J09k3J37q7P2j82J51J5j33Pn8L01k20j63J86k2K2k13M43l53O0L9J21
$$ plain form
4440 47 140 -80 -276 -239 -93 64 291 -199 142 -9 -76 -37 -317 -73 -41 -16 11 178 215 130 -26 -42 -168 86
4464 86 55 -116 -70 226 93 -40 -74 -94 -55 -23 107 -137 53 77 47 -3 -156 -59 117 -96 -139 -111 -176 169 158
4489 158 -187 234 -142 -92 20 -47 185 112 205 -95 156 -103 29 148 20 -93 341 -106 -17 64 12 142
4511 142 301 103 -172 -130 34 -176 121 -44 -193 164 -224 -109 102 -180 -167 -1 -148 87 105 18 7 174
4533 174 -33 67 84 312 71 167 42 -107 51 86 40 -68 -52 -371 -181 -34 -80 -49 0 46 -218 54 -113
4556 -113 117 -179 -29 -18 75 -68 -102 -22 179 -185 190 -76 99 174 -12 -59 -99 109 3 15 -80 116 120 -27
4580 -27 2 -136 108 14 -76 -110 -127 -218 -129 176 62 -21 -106 174 -51 -157 -122 -148 -86 73 -128 -144 -119 32 47
4605 47 16 -211 153 352 59 -61 -59 45 -66 -88 -249 40 -203 -143 16 -57 -61 -55 -57 -74 84 258 -50 -40 -47 -66
$$ packed form
4440D7R3k20j96L7J46J57K27m90L41j51o7L9k80K44L2K5K7J67L7q5j56j6j26K54
4464H6l1j71M6K96j33j33l4k0L9L2J30k44J90K4l0n0j53R7J76k13m3K8o5L45j1
4489A58l45M21l76N0J12o7K32p3R3l00K51k59J32J19j28j13M34m47Q9Q1n2J30
4511A42J59j98k75M2J64k10K97j65j49L57l88J15K11k82J3J66j47K35J8q7j1J67
4533A74k07J00J7K28k41R6j25j49J58L5m6j08J6l19J90J47m6L1M9M6k64K72j67
4556a13K30k96J50J1R3j43l4Q0K01l64L75k66J75P5j86m7m0K08j06J2r5J96Mj47
4580b7K9j38K44r4r0l4j7r1Q9L05j14q3q5K80k25j06L5k6O2J59k01j6K5J51J5
4605D7l1k27L64J99k93j20KJ04j11k2j61K89k43O0J59p3mOkj7J58J74l08J0pj9
$$ plain form
4631 -66 14 170 -6 16 -59 -209 -158 -125 -139 -118 -23 62 87 45 -130 60 63 117 -259 9 1 -88 38 137 -180 186
4657 186 -15 68 -71 42 -113 200 239 308 57 107 12 -61 -124 242 89 -261 -203 48 -215 41 -75 -47 -87
4680 -87 -68 18 -96 13 16 -20 67 -62 1 201 -146 311 -166 -140 -183 84 -68 -213 -76 159 118 -33 94 -43
4704 -43 231 -161 -154 22 -254 250 17 1 -165 58 100 -22 26 58 147 -79 191 84 93 -17 150 -39 54 -234
4728 -234 10 25 32 89 -116 -31 80 7 -233 -116 137 -10 -117 -87 -174 -70 5 -238 -1 -221 117 -96 20
4751 20 -31 -65 289 -226 93 -243 -121 16 -165 29 -98 14 119 -95 205 -176 -24 -123 -173 12 -216 138
4773 138 3 -189 -315 140 10 -55 -49 -69 196 -124 -4 -197 -98 123 -161 92 -87 101 -16 271 -65 92
4795 92 82 228 -73 -32 15 -75 36 77 -6 46 94 -195 191 62 86 -58 310 -256 234 204 -164 214 -165 241
$$ packed form
4631f6Q0J56j76K2p5j50N1L3j4K1R5Q5K5m2j75J90LN4l76K68qq9J26R9l17L66
4657A86k01Q3j39J13j55L13L9O9k51N0r5p3o3L66j53l50N8K51k63K56j16K8m0
4680h7J9Q6j14J09Ll6Q7j29O3K00l47M57m77K6m3K67j52j45J37K35m1j51J27j37
4704d3K74l92PJ76k76N04k33j6j66K23M2j22M8L2Q9k26K70j07Rj10J67j89R3k88
4728b34K44J5PN7k05Q5J11p3k40J17K53j47j07L0q7J04P5k43K37k20L38k13J16
4751B0n1l4L54n15L19l36J22J37j81J94j27J12J05k14L00l81J52r9n0J85k28L54
4773A38j35j92j26M55j30o5Ok0K65l20J20j93R9K21k84K53j79J88j17K87l36J57
4795I2j0J46l01M1M7r0J11M1q3N2M8k89L86j29K4j44L68n66M90l0l68L78l79M06
$$ plain form
4819 241 -235 118 -170 -200 -22 -194 -10 -327 -92 -238 -70 41 130 35 -72 -49 -35 121 -226 -97 167 279
4841 279 108 -13 58 -73 12 64 100 -159 105 -15 43 -29 -53 -7 262 119 -28 171 -193 -36 142 -74 -115
4864 -115 -202 184 202 141 92 2 -14 -41 -12 -203 -190 -109 59 -110 176 143 -111 -62 -175 58 160 166 155 73 26 169
4890 169 -77 -202 18 84 275 -109 -46 222 -72 26 -130 104 -1 -281 31 -110 63 -161 -27 -74 197
4911 197 -157 -55 290 -161 410 167 -199 -167 71 90 -62 -138 -119 -35 -142 -50 65 74 25 -167 -120 58 -145
4934 -145 -128 162 279 18 -3 -140 -229 -21 187 -111 -96 260 122 -153 8 -52 -157 -79 -115 68 -186 -216 -45
4957 -45 88 -2 -168 48 48 338 95 -335 -95 -304 23 -77 -9 173 220 -20 -91 -114 -47 12 129 -137 117
4980 117 35 25 27 -10 2 111 46 1 -211 91 171 -38 -55 -29 -4 -223 90 -149 -162 -44 -39 -43 -22 -40 60 4 -44
$$ packed form
4819B41m76L53k88l0J78j72J84l17K35j46J68J11Q9r5j07K3J4J56l47J29K64J12
4841B79j71j21P1j31Q5N2L6k59K64j20N8p2k4M6K69j43j47J99l64J57J78k16m1
4864a15q7L86J8o1m9r0j6k7K9j91J3Q1J68j69K86l3k54M9j13K33J02Oj1q2m7J43
4890A69k46j25K20O6J91l84O3K68k94R8j56K34j05k80L12j41J73k24J34m7K71
4911A97l54J02L45m51N71k43l66L2K38J9j52p6J9Q4j07R2J15Rm9j92M7J78k03
4934a45J7K90J17k61k1j37q9K08K08k98J5L56j38k75J61o0j05P8l6J83k54l0J71
4957d5J33r0j66K16%K90k43m30K40k09L27j00O8J82M7k40p1k3O7N9J17k66K54
4980A17q2j0Kl7J2J09o5m5k12L02Q0k09j7K6K5k19L13k39j3J18NmK1j8J00n6m8
$$ plain form
5007 -44 -46 44 324 228 24 -175 99 29 140 -101 76 -210 296 77 -17 73 -1 -235 -13 92 208 75 110
5030 110 -68 210 66 108 210 274 -119 89 56 -47 -80 -184 189 97 225 221 2 -64 56 82 -74 23 -120
5053 -120 -146 -127 99 61 133 -70 140 47 341 -10 24 118 -79 -235 -129 -126 -148 -111 -35 4 -160 219 -103 -155 -14
5078 -14 -80 161 -54 -68 15 -1 -37 -87 77 470 -163 -2 -75 -4 -66 -189 89 -70 -119 -65 -128 -109 58 -264 26
5103 26 43 -297 12 -313 61 -242 66 13 91 -94 -114 -82 -53 91 54 235 -40 -33 23 45 -76 -195 -96 -163 0
5128 0 -148 -152 91 247 3 -107 100 34 -278 -304 -46 282 -169 50 -66 39 -1 59 -51 -103 279 21 -32
5151 -32 196 54 31 -42 40 392 12 140 -258 -44 79 -50 17 76 -120 -29 267 -254 -39 181 180 -293 -6
5174 -6 33 216 -181 167 -205 -13 54 -61 19 159 -130 43 -71 9 136 20 -13 288 -46 -300 12 116
$$ packed form
5007d4kR0K80r6k04j99K74p0J11k41J77k86N06k19r4R0p4k34K22J05J16j33L5
5030A10j78K78j44M2J02O4l93K08l3j03l3j04L73r2J28mk19o6J20K6j56R7j43
5053a20k6J9K26l8P2k03K10r3K94l51L4R4j97j56J06Lk2L7P6L9j64L79l22n2J41
5078a4o6K41k15j4Q3j6l6n0J64L93o33J61p3P1o2j23K78j59m9N4o3J9J67l22K90
5103B6J7l40L09l25L74l03L08n3P8j85k0L2K9J44l7J81k75PN6K2j21j19R9o7J63
5128@j48mK43J56k44j10K07o6l12k6K58L28m51K19j16J05m0O0j10n2L82k58n3
5151c2K28j42k3p3Q2L52l80J28l98K14J23j29O7N9j96R1K96n21K15K20jm73K87
5174fL9J83l97L48l72J92O7j15Q0J40k89J73j14Q0J27j16l3L01l34k54L12J04
$$ plain form
5196 116 -43 -10 25 104 -179 40 112 -224 126 37 50 263 -79 43 106 -305 -22 -24 -15 29 17 -26 -29 -7 -140 19
5222 19 -1 -117 262 -66 299 85 102 202 -53 43 -80 -1 -18 101 -10 -66 -169 -138 -117 117 193 -63 205
5245 205 14 1 -194 37 -4 -161 152 353 130 -26 -82 186 58 -185 -263 51 -246 -65 272 64 14 -85
5267 -85 -93 -5 73 -210 -271 62 211 216 132 240 -155 -1 18 73 214 -166 136 38 271 91 -31 -197 154 30
5291 30 63 -39 132 -160 -76 -116 66 15 110 -64 24 -3 -137 -266 175 -90 -116 141 -212 29 -34 149 13
5314 13 -103 -140 22 24 -91 177 -53 -40 -7 22 28 -301 165 199 -126 408 43 195 8 175 148 -137 185 4
5338 4 151 127 34 -90 -158 -320 -19 -240 -132 37 -97 -24 53 -163 -118 -133 146 -185 280 2 214 32 59
5361 59 -29 -21 51 -74 11 326 117 -207 109 -247 -219 -54 -63 231 63 179 -197 -131 -5 -106 -50 -48 192 117 5
$$ packed form
5196A16j59L3L5P9k83K19P2l36L50q9J3K13l42J22O3m11K83kRM4j2m3lK2j33J59
5222A9k0j16L79l28L65k14J7J00k55R6j23P9j7J19j11n6j03L1K1K34P6k56K68
5245B05j91j3j95K31m1j57L13K01k23j56n6K68j28k43p8L14k97J81L37k08n0r9
5267h5qQ8P8k83o1L33J49Nq4J08l95J54J9N5J41l80L02r8K33j80j22j66L51j24
5291C0L3j02J71k92Q4m0J82n1R5j74Q8k7j34j29M41k65k6K57l53K41o3J83j36
5314A3j16l7J62Kj15K68k30J3L3K9Ol29M66L4l25N34l65J52j87J67k7k85L22j81
5338DJ47k4r3j24o8j62L01k21J08J69j34P3P7k16M5j5K79l31M65k78K12j82K7
5361E9q8QP2j25Q5L15k09l24L16l56K8J65rK94j68J16l76O6J26j01N6KK40p5j12
$$ plain form
5386 5 -110 113 5 -192 88 -46 20 190 121 9 -380 41 110 -126 120 80 -48 18 52 63 -26 -121 -72 -44
5410 -44 -34 -23 -6 15 -63 -3 46 -81 139 223 -280 94 -18 -44 -156 -11 -56 57 11 33 -103 -43 15 88 -63
5435 -63 129 95 -230 -188 13 78 8 44 5 87 -318 -102 -221 283 -31 -217 105 -105 85 -18 -191 -69 81
5458 81 182 272 10 72 -39 1 -126 -131 160 47 -155 164 -150 49 -86 -213 -134 -22 -78 94 -118 -202 -57
5481 -57 43 -146 -35 -174 203 53 34 -138 279 -108 -122 -172 74 98 -250 -207 -24 -180 14 361 -69 177
5503 177 138 -12 4 -67 -23 -93 102 36 158 103 177 19 165 -93 286 85 -98 -20 167 93 194 -121 38
5526 38 117 -62 -381 38 -88 39 59 57 -40 -32 -22 25 -87 -2 116 -234 -62 -5 267 34 -87 -37 31 -38 105
5551 105 -228 285 -164 -82 191 47 -190 135 -159 70 181 -161 81 208 138 1 -36 -83 18 56 -36 11
$$ packed form
5386Ej15K23j08j97K80j34O6J70o9j12l89M21O9k36K46m0j28O6L4J1q9r5M9K8
5410d4J0J1J7K1p8O0M9j27K20Q4n03L74j12k6j12J45m5J13m6K2j36O0N8P3j51
5435f3J92l4l25M2K01O5p0L6l9Q2m05K16j19N04l14j86L22k10J90j03j73J22J50
5458H1J01R0k62O2j11M0j27nK91j13k02L19l14J99j35j27P9J12n6J72k12q4J45
5481e7J00j89J11j39L77j50j9j72M17l87j4n0K46K4l48M3J83j56J94L47m30K46
5503A77l9j50J6p1M4p0J95o6J22n5P4j58J46k58L79k01j83P8J87p4J01l15J59
5526C8P9j79l19M19j26J27K0kr7QJ0M7j12Q5J18l50J72N7K72k33j21N0O8o9J43
5551A05l33N13m49Q2K73j44k37L25k94K29J11l42K42J27p0j37l7m7J01L8r2M7
$$ plain form
5573 11 -113 32 206 37 188 -11 -93 -237 -22 -152 95 247 138 -86 151 128 -132 3 -195 46 56
5594 56 -34 -69 -50 114 11 245 274 -83 -96 -40 123 -15 93 -24 -162 -71 -47 126 -319 -101 -28 -177 120
5617 120 -4 78 -97 161 -349 -30 271 66 197 -171 -23 44 50 90 14 -130 126 98 81 96 46 31 21 152
5641 152 -100 99 174 140 131 109 -69 -38 101 245 36 218 -110 -14 3 95 -10 -222 -241 -76 -81 -120 -92 -135 28
5666 28 106 261 5 -88 -107 4 265 -18 40 -38 64 130 65 23 -32 31 55 -91 -217 78 -39 -16 20 66 170
5691 170 -77 65 -76 57 99 128 -73 -89 44 56 -151 -113 -94 33 -83 -199 304 -128 -41 175 -88 28
5713 28 -168 -66 5 -4 181 -23 -110 -129 -55 -8 115 -70 -178 -27 119 -113 10 19 -85 -19 -224 -72 14 -59
5737 -59 217 270 -180 144 109 -52 -118 222 -72 17 177 15 -35 -30 236 -48 31 307 -77 7 98 -9 72 -30
$$ packed form
5573A1j24J45J74j69J51j99q2j44K15j30K47J52j09k24K37k3k60J35j98K41J0
5594E6r0l5J9J64j03K34K9l57j3N6J63j38J08j17j38R1K4J73m45K18P3j49K97
5617A20j24Q2j75K58n10L19L01k05J31l68J48O7OM0p6j44K56k8j7J5n0j5j0J31
5641A52k52J99P5l4rk2j78L1J39J44k09J82l28R6J7R2j05k12j9J65nl9K8m3J63
5666B8P8J55k56r3j9J11K61k83N8p8J02O6o5m2n5O3K4j46j26K95j17K3L6M6J04
5691A70k47J42j41J33M2K9k01j6J33J2k07L8J9J27j16j16N03m32Q7K16k63J16
5713B8j96J02P1rJ85k04q7j9P4M7J23j85j08J51J46k32J23Rj04O6k05J52Q6p3
5737e9K76N3m50L24l5j61o6L40k94Q9J60j62n0NK66k84P9K76l84Q4R1j07Q1j02
$$ plain form
5761 -30 -47 -160 150 34 53 145 -22 -188 107 -145 58 51 102 -279 204 179 53 -78 33 39 -83 -178 -71 5
5785 5 45 -175 7 95 -229 -50 -248 -14 -120 106 -135 23 -18 146 -127 87 48 34 -170 118 26 12 19 131
5809 131 18 -23 109 98 -45 117 -8 13 299 88 -43 198 -40 -61 145 8 108 31 -193 -130 203 -53
5831 -53 175 42 24 166 343 -60 -70 96 -130 -400 316 149 -106 18 -81 -6 -27 249 -181 67 -283 -130
5853 -130 -4 -247 54 63 -23 -139 61 -36 24 -357 115 -127 -123 -173 66 -96 -140 -35 186 91 -396 -143 -179 97
5877 97 -68 -139 170 6 -81 36 -65 -131 -375 43 -129 95 -72 109 114 52 -107 366 74 10 -38 1 235
5900 235 -192 104 -172 -185 109 183 -347 -49 51 84 -98 -47 -257 -376 -101 53 -98 -106 -106 54 -160 67 -123
5923 -123 17 -49 163 44 124 88 -22 -12 -16 15 12 48 -97 -86 -94 13 130 -3 103 -221 3 183 -206 64
$$ packed form
5761c0j7j13L10j16J9R2j67j66K95k52K03pN1l81M83k5j26j31J11Oj22r5J07P6
5785EM0k20J82Q8l24J79j98K34j06K26k41J58m1J64k73K14l9j4k04K88r2j4PJ12
5809A31j13m1J32j1j43J62j25K1K86k11j31K41k38k1K06j37J00p7k24O3L33k56
5831e3K28j33j8J42J77m03j0J66k26k70P16j67k55J24r9P5k1K76m30K48l50J53
5853a30J26k43L01Rq6j16K00r7O0l81M72k42Mn0K39j62m4J05K21r5m87K53l6K76
5877I7j65p1L09j64q7J17j01o6k44M18j72K24j67J81No2j59M73k92o4m8L9K34
5900B35m27K96k76j3K94P4n30K98J00L3j82N1k10j19K75J54j51q%J60k14K27j90
5923a23J40o6K12j19Q0l6j10J0mL1lL6j45J1qJ07J17j33J06l24K24J80l89K70
$$ plain form
5947 64 71 -52 151 -387 5 190 -52 434 153 156 -66 -204 -51 -328 -303 -250 15 -266 -99 213 -52 -166
5969 -166 350 72 -220 -208 62 -170 -183 -178 -225 89 89 -29 12 -189 -35 78 -107 57 -46 1 -107 244 23
5992 23 231 -74 17 10 -200 26 72 2 168 -123 -180 -62 -187 105 -15 74 -48 18 209 -27 -106 65 -19 119
6016 119 3 -82 -127 -38 -183 -209 -250 10 13 53 -323 77 -262 -268 54 -238 -35 23 190 -20 -33 -45 96 142 262
6041 262 112 7 -163 80 -59 44 -97 -280 -240 -23 -41 -149 -140 70 -96 -42 15 -68 129 -78 286 -183
6063 -183 7 -136 -260 152 -23 -180 -55 97 38 -115 243 -38 -179 -138 116 37 -33 -145 206 -126 -83 -19
6085 -19 -64 288 379 -16 -120 27 -8 64 -305 -167 69 -141 -171 -137 -15 -208 123 62 169 -41 -1 24 -107
6108 -107 -42 7 -136 -180 -224 -67 -24 -74 -74 17 143 -102 -117 -247 30 -164 349 -81 132 -93 12 -95 188
$$ packed form
5947F4Pj23K03n38L92J85k42M86k81Lk22j38J53k77K5N3K65k81J67L12k65j14
5969a66N16k78k92J2K70k32j3Nm7L14%j18M1k01J54J13j85J64j03M7j08L51k21
5992B3K08l05R1pk10K26M6p0J66k91n7J18j25K92j20Q9j22O6J91k36p9J71q4J38
6016A19j16q5m5Q9j45k6m1K60LM0l76M00l39oL22k92K03N8J67k10j3j2J41M6J20
6041B62j50j05j70K43j39J03j41j83M0K17j8j08RK10j66N4N7q3J97k07L64m69
6063a83J90j43j24M12j75j57J25J52n9j53L58k81j41M1K54p9p0j12L51l32M3O4
6085a9m5L52R1l95j04J47l5P2l69J38K36k10l0L4J22j93L31o1J07k10M0K5j31
6108a07O5M9j43m4m4J57M3n0%R1J26k45j5j30K77j94N13m30K13k25J05j07K83
$$ plain form
6131 188 225 -42 -160 121 -75 -38 46 54 64 92 58 -236 -86 -203 -232 -72 -136 -215 -247 -65 164 -18 17 -140
6155 -140 -69 105 -164 -213 -278 -133 31 28 -11 -25 130 31 -64 13 94 -303 -147 119 90 -76 -61 -151 197 -10 -66
6180 -66 93 248 -236 19 -310 72 -63 -96 21 -141 -6 -38 -104 -22 -103 -33 -260 125 -189 -156 -107 26 -218
6203 -218 135 90 123 27 79 8 -512 300 -168 109 -268 -186 -266 -87 40 -20 3 97 67 53 96 -76 100 49 -71
6228 -71 115 32 -56 42 -63 -398 -254 103 47 58 162 191 -89 -32 133 40 14 -34 -30 -29 -37 56 116 -75 -67 9 -333
6255 -333 -165 -177 -144 -18 199 -50 85 34 126 6 31 145 -107 -36 -83 16 -177 -106 121 154 -239 21 50 128
6279 128 -170 -6 58 44 379 16 154 -122 17 117 -15 4 35 -172 157 -110 -39 -279 147 40 124 -86
6301 -86 122 102 -32 7 105 -77 114 186 104 55 56 28 -369 71 14 -231 18 -255 221 125 -114 93 -115 134
$$ packed form
6131A88L7k67j18K81j96L7Q4QJ0K8l4k94J50j17k9J60o4p9l2J82K29j82L5j57
6155a40P1J74k69m9o5J45J64ll9j4J55r9r5P7Q1l97J56K66k9j66J5r0L48k07n6
6180f6J59J55m84K55l29L82j35l3J17j62J35l2o6Q2q1P0k27L85l14L3M9J33k44
6203b18L53m5L3r6N2p1n20Q12m68K77l77Q2q0J79J27o0K3R4l0j4M3j72J76n1j20
6228g1J86q3q8R8j05l35J44L57n6J1J04K9k80N7J65r3k6m8MJqR3O0j91QP6l42
6255c33J68j2L3J26K17k49J35n1R2j20K5J14k52P1m7R9j93P1K27L3l93K60K9P8
6279A28k98J64O4j4L35l63J38k76J39J00j32J9L1k07L29k67P1k40M26j07Q4k10
6301h6K08k0j34L9R8j82J91P2q2m9Jk8l97M40n7k45K49k73M76r6k39K07k08K49
$$ plain form
6325 134 -15 12 185 -68 -176 -97 -36 67 -225 -112 -200 -141 -49 374 98 95 12 -131 291 -169 111 76 -171
6348 -171 -86 -186 -295 351 -130 45 -51 -34 288 95 -15 78 -195 68 -16 89 -12 -46 -131 118 291 17
6370 17 -17 -9 -180 -87 -54 -113 108 160 84 -121 -17 -180 72 -10 -114 -74 13 99 21 161 11 -94 -130 -67 -3 136
6396 136 178 -22 -120 -381 159 -86 -162 60 13 -255 -62 114 147 -119 -229 -258 69 -106 -148 20 246 154 115
6419 115 51 -168 -146 -38 -52 22 85 -2 -59 160 102 -229 -14 -87 68 11 -153 149 -81 -17 -102 -47 -260 181
6443 181 -52 66 -13 107 145 -148 2 -86 -36 21 -43 257 -3 17 -20 134 179 12 145 143 -37 21 184 206
6467 206 -84 206 18 -46 18 36 104 -12 44 -105 115 -174 -116 -75 -243 23 66 225 -255 258 116 -92 181
6490 181 -64 59 146 -111 140 98 77 122 -94 24 46 45 -201 86 -109 79 -192 56 302 124 -37 -62 -131
$$ packed form
6325A34j49K7J73k53j08P9O1J03k92J13q8N9R2M23k76lq3j43M22m60K80l5k47
6348a71Q5j00j09O46m81J75r6J7L22j93j10R3k73K63q4J05j01l4q5K49J73k74
6370A7l4Qj71R3L3n9K21N2p6k05J04j63K52q2j04M0Q7Q6p8J40j50j05l6O3O4J39
6396A36M2k00r8k61N40k45p6K22m7k68J93J76L3k66j10k9L27j75m2J68K26r2l9
6419A15o4k19K2J08j4P4O3q7n7K19n8l31K15p3J55n7j64L02k30O4q5N5k13M41
6443A81k33J18p9J20L8k93J50q8N0N7o4L00k60K0l7J54M5j67J33kj80N8J63K2
6467B06k90K90j88o4O4J8O8j16N6j49K20k89N8M1j68K66M3J59m80N13j42k08K73
6490A81k45J23Q7k57K51m2k1M5k16J18K2jk46K87j95J88k71K48K46j78j61k5o9
$$ plain form
6513 -131 -233 176 -111 -16 -22 -219 157 -224 141 68 -149 34 -39 96 135 -333 -269 -111 -274 195 -140 197
6535 197 174 -86 56 106 -58 22 38 151 -48 -98 -94 26 37 103 -1 -225 93 -42 -99 90 -53 92 -26
6558 -26 -60 -15 130 -145 162 -147 22 -66 -225 -47 29 -191 -405 -38 131 -128 -63 -45 -123 197 -27 109 313
6581 313 2 114 -158 83 -196 -133 145 -38 29 34 -73 -32 -141 27 -187 -23 131 33 80 -51 125 -79
6603 -79 212 -48 258 86 -169 -39 270 239 -98 -23 35 -218 135 -109 -424 42 -233 -102 93 -147 30
6624 30 -82 -127 -21 -103 -58 -52 -173 141 -4 -77 -232 -24 38 -103 7 119 -245 -67 8 -70 137 197 -63 -84
6648 -84 -170 102 35 -123 49 -19 -63 181 -69 -18 -17 -212 -176 -21 -75 5 -57 -12 -88 -143 28 -38 3 -59 -79 190
6674 190 -126 -96 -89 -145 -132 33 -198 -186 18 -111 69 229 23 -72 267 227 163 25 8 -88 150 28 245 101
$$ packed form
6513a31j02M09k87R5oj97L76l81L65p3k17J83p3J35L9m68O4J58j63M69l35L37
6535A97k3k60J42N0j64Q0J6J13j99n0MJ20J1O6j04k24L18j35n7J89j43J45j18
6558b6l4M5J45k75L07l09J69q8j59J78P6k20k14L67J69k59O5J8p8L20k24J36K04
6581C13l11J12k72K41k79O3K78j83O7Nj07M1j09J68k14J64J54r8M7j31J76k04
6603g9K91k60L06j72k55J30L09l1l37P5N8k53L53k44l15M66k75J31J95k40J77
6624C0j12m5J06q2M5Oj21L14j45p3j55K08O2j41J10J12l64J78P5p8K07O0k60k1
6648h4q6K72o7j58J72o8m4K44k50N1Jj95L6J55n4Q0o2M5p6n5J71o6M1o2k0K69
6674A90l16L0Pn6J3J65k31J2K04j29J80J60k06r5L39m0o4j38j7r6K38j22K17j44
$$ plain form
6698 101 -27 -50 94 116 42 157 -137 40 9 -188 64 90 -193 23 -194 156 -80 -111 -56 -158 38 -84
6720 -84 339 -166 -42 -291 -234 -76 154 114 -68 -62 -20 -2 75 193 15 9 -164 -119 9 -66 -6 -52 67 -141 8
6745 8 -99 -136 221 145 44 71 48 -72 -173 18 -14 -69 138 -21 34 204 192 106 -455 46 51 68 -29 -159 109
6770 109 -225 168 5 -87 94 -57 -341 243 29 -61 -66 -71 -212 -157 -219 36 -67 70 -189 230 24 51 144
6793 144 285 -145 130 -144 -24 -14 325 112 -102 -210 9 65 54 156 -188 -143 -118 -186 -206 -66 90 18 41
6816 41 -230 -30 -3 -8 -360 88 101 -18 -7 14 263 231 -223 -240 -84 -159 303 -136 227 -21 -22 -159 158 -17
6840 -17 236 52 65 58 153 -15 148 -29 -25 -30 52 -120 -117 -234 200 -184 -209 141 250 -234 197 -85 94 57 17
6865 17 -1 -323 82 16 369 -128 153 116 -28 127 -88 -124 -14 139 -136 -97 187 230 101 -221 -326 -125
$$ packed form
6698A01j28k3J44K2p4J15k94J77l1j97K52K6k83K16k17L50k36l1N5j02J96j22
6720h4M23n05J24k49N7J58K30m0j82OM2J8P7J18j78oj73M5J28p5O0m6J19k08J49
6745Hj07l7L57p6j01K7k3j20j01J91l2n5K07j59N5J70j2q6n61N01NJ7r7j30K68
6770A09l34L93j63r2J81j51k84N84k14r0nnj41N5o2K55j03J37k59M19k06K7R3
6793A44J41m30K75k74J20J0L39k13k14j08K19N6j1J02l44M5K5o8k0J40J56p2K3
6816D1k71K00K7nl52M48J3j19J1K1K49l2m54j7J56p5M62m39L63k48jj37L17j75
6840a7K53j84J3pR5j68J63j77MnQ2j72Lj17M34l84k5L50J09m84M31k82J79l7m0
6865A7j8l22M05o6L53m97K81l7j44J55k15l6J10J53k75L9K84M3j29l22j05K01
$$ plain form
6887 -125 -187 -185 8 131 208 -45 152 25 -87 -136 -158 -28 51 -42 82 -227 -141 -119 47 83 196 164 197 159 -52
6912 -52 -64 116 -140 -44 138 -282 74 -101 -110 43 -186 122 137 42 170 342 -22 -332 -233 -215 -191 -95 -182 -9
6936 -9 187 -46 -80 -107 51 -11 50 305 -1 6 60 -18 -302 8 35 -245 -56 -100 -127 8 -291 -332 -6 -284 -42
6961 -42 -87 -60 21 -202 71 -84 -201 53 -22 184 -54 101 -242 2 19 -153 81 -206 -96 44 152 -104
6983 -104 45 -47 19 266 -19 -27 214 115 212 -69 -241 -161 -145 122 -110 18 -160 121 -139 25 -111 -85 112
7006 112 -202 -54 -95 316 89 131 -326 -259 -88 -34 -16 8 169 82 225 69 -102 -79 -327 -33 110 27 -57
7029 -57 -51 127 -3 86 94 12 -113 234 -43 243 120 110 -200 247 86 -52 -18 106 100 -134 -146 43 152 -70
7053 -70 51 161 -58 -140 92 0 -471 -101 195 210 48 -79 77 104 -42 7 -155 123 -74 40 -49 303
$$ packed form
6887a25o2KJ93J23P7k53J97j27j12m9k2J30P9r3J24l09Q6K2J66L6J13l2L3l8k11
6912e2j2J80k56R6J82m20L56j75rJ53k29L08J5r5J28J72l64l10R9J8K4R6q7J73
6936iJ96k33l4k7J58o2O1K55l06PN4p8k84L10K7k80J89m4k7J35k99m1L26k78K42
6961d2m5K7Q1k23K73j55j17K54p5K06k38J55l43K44J7j72K34k87J10J40J08k56
6983a04J49r2O6K47k85qK41r9R7k81j72Q0J6K67k32J28j78K81k60J64j36K6J97
7006A12l14J48m1M11k27M2m57O7J71N4J8K4J61q7J43j56j71K3k48K94J43q3q4
7029e7OJ78j30Q9Qq2j25L47k77K86j23j0l10M47j61j38L4J24ok34j2J89J09k22
7053g0J21J10k19q2K32r2m71L70K96J5j62j27J56K7j46M9j62K78j97J14q9L52
$$ plain form
7075 303 158 -105 -63 60 -24 8 128 124 -12 199 -10 -170 163 -161 -2 -255 37 -121 75 -71 -387 -4
7097 -4 -109 237 68 -233 -6 8 16 24 -15 -198 -238 -172 -289 67 13 136 -166 -81 125 -121 -57 59 263 -78
7121 -78 58 104 61 -88 -233 84 -308 99 -228 216 257 30 -108 97 -316 111 37 101 -133 -11 87 83 231
7144 231 117 156 -62 -86 277 -81 -167 138 18 48 -149 -16 77 16 108 121 -107 19 204 -22 -72 -30 -127 -230
7168 -230 -95 22 -90 47 102 -25 -2 -88 215 39 199 -35 -12 -238 186 -202 -35 -49 125 26 53 81 -151
7191 -151 -249 70 63 114 5 226 152 -82 62 -22 73 92 207 255 -5 199 -175 231 175 -159 -166 120 -42 20
7215 20 82 100 2 258 -28 -126 -241 334 -149 -8 181 -196 92 -149 -34 -50 -64 74 -111 75 47 95 -73
7238 -73 262 -219 9 -23 -154 -28 116 61 -136 175 -243 326 11 132 -55 15 7 64 95 -129 -11 -44 232
$$ packed form
7075C03j45k63M2J23q4L2J20mj36K11k09j60L33l24J59k53K92j58J96j46l16L83
7097dj05L46j69l01K27J4QQl9j83m0O6j17L56n4J23l02Q5K06k46O4J16K04l41
7121g8J36M6m3j49j45L17l92M07l27M44M1k27j38K05m13M27p4O4k34J22R8mJ48
7144B31j14L9k18k4L63l58q6L05j20L0j97J33R3o1R2J3k28J26J85k26n0M2r7j03
7168b30J35J17j12J37N5j27K3q6L03j76J60k34K3k26M24l88J67j4J74r9K7K8k32
7191a51r8L19pN1j09K21p4k34J44q4R5J9J15M8k60K04l74M06n6l34pK86j62O2
7215B0O2J8r8K56k86r8j15N75m83J41J89l77K88k41J15j6j4J38j85J86k8M8j68
7238g3L35m81K28l2j31J26J44n5j97L11m18N69l15J21j87P0qN7L1k24J18l3K76
$$ plain form
7261 232 155 -45 86 49 -113 85 120 -122 -241 71 -266 -291 49 -108 -21 -109 158 -12 -85 -95 52 -166 25
7284 25 -209 -101 95 -37 -61 -10 -51 2 -104 205 11 78 1 94 3 -122 -90 220 8 49 -243 84 193 45
7308 45 47 -32 -115 22 -44 -111 -75 -96 26 -86 12 -96 -34 69 -102 -116 83 294 234 23 14 -94 -20 -5 145 263
7334 263 126 -19 -287 -141 -147 -218 -135 -156 -236 189 -32 99 -134 -40 -121 244 8 166 142 347 50 32 -69
7357 -69 56 24 -58 518 -34 180 33 255 -59 211 -73 175 110 13 275 94 96 -91 241 130 -20 39 -5
7380 -5 190 -154 -2 -135 17 -46 44 -234 5 -15 -78 -98 156 -109 -102 172 -152 -70 -73 -36 -66 -323 -4 45 115
7405 115 192 15 -16 98 125 89 88 51 62 -242 -243 -68 -301 -126 5 -426 -208 -77 -26 401 -14 164 14 -50
7429 -50 21 -5 -7 40 168 -129 21 28 -115 -91 20 76 -120 -140 74 -19 68 -32 280 -105 -132 181 80 68 -182
$$ packed form
7261B32p7k00J31l7j62J98L5k42j19L12l37k5L40j57Q7q8K67j70p3j0J47k18J91
7284B5k34J08J96j32k4N1m1N3j06L09j94O7p7R3r1j25L2L10k12M1k92L27J09j48
7308D5Kp9q3J37o6o7L6k1J22j12R8j08O2J03j71j4J99K11o0k11rj08P4J5J50J18
7334B63j37j45k68J46op1Q3k1q0M25k21J31k33R4q1L65k36J58k4K05k97j8j01
7357f9J25l2q2N76n52K14j47K22l14K70k84K48o5r7K62j81Kj87L32j11j50N9m4
7380eJ95l44J52j33J52o3R0k78K39k0o3k0K54k65PK74l24Q2lL7l0k57L19M9P0
7405A15P7j77l1J14K7l6jl7J1l04jJ75k33J75J31m31K18J31N1M27m15J78j50o4
7429e0P1k6kM7J28k97J50Pj43K4J11N6j96k0K14r3Q7j00L12l85k7L13j01j2k50
$$ plain form
7454 -182 119 221 29 -61 125 13 132 -417 -4 158 122 48 70 124 136 19 -92 64 -30 63 130 44 -24 55
7478 55 -113 -66 -202 -184 -61 -29 131 -3 -59 -239 -262 -136 -91 417 33 -168 63 -36 -67 77 -82 -147 5
7501 5 63 130 85 93 285 84 19 -102 11 -37 -174 76 -98 -91 290 -26 73 -201 133 3 0 -127 118 165 -107
7526 -107 -30 17 -65 -4 201 -70 134 -202 58 -8 -108 -161 -132 166 -38 85 51 201 104 -26 26 -163 3
7549 3 147 256 99 -137 27 354 76 203 115 81 98 -53 75 -45 -293 -177 69 -178 -144 -302 67 -85
7571 -85 -122 67 -12 176 -69 124 8 -141 143 -146 93 31 65 -31 -11 88 -63 114 241 -27 -70 234 120
7594 120 -56 -44 -174 -135 118 -47 56 71 55 -52 0 86 228 102 5 -15 88 -189 -12 191 -65 165 168
7617 168 -290 11 -179 223 41 91 -62 187 231 123 45 -177 -96 25 -72 -125 49 123 230 77 76 -60 32
$$ packed form
7454a82L01J02j92r0J86j12J19n49M13J62l6p4K2N4J2j17j11J56r4R3O7q6o8P9
7478E5j68M7j36J8J23L2J60j34n6j80k3J26M5N08l84k01K31r9l1J44j59o5J52
7501EN8O7m5QJ92k01o5j21J13m8j37K50j74PL81l16R9k74L34j30lj27K45M7k72
7526a07P7M7q2O1K05k71K04l36K60o6j00n3K9K98k04J23l4J50r7j30N2j89J66
7549CJ44J09j57k36J64L27k78J27q8l4J7j51J28j20k48J16K46k47L4j58L69j52
7571h5l7J89p9J88k45J93j16j49K84k89K39o2L4r6K0R9j51J77J27k68m3L04j14
7594A20j76J2j30L9K53j65J03J5j6j07N2Q6J42j26r7k0J03k77J77K03k56K30L
7617A68m58L01j90M02j82N0j53K49M4j08p8k22Q1J21r7n3J74P4J07j53jj36R2
$$ plain form
7640 32 108 -52 91 -198 168 -116 -171 -4 82 149 110 193 153 -78 -280 -13 47 -75 168 -123 93 36 -41 -114
7664 -114 70 281 10 -263 -161 72 -121 203 -143 -102 -266 -24 -26 9 155 85 97 -83 115 -76 88 -193
7686 -193 102 -341 8 -148 -170 -32 -136 58 87 -35 89 209 265 -49 -146 176 66 -45 192 -82 119
7707 119 -266 -195 -37 -253 77 11 -73 -297 41 107 -120 126 -14 141 -206 101 102 122 -144 -16 79 -133 -77
7730 -77 -205 90 -247 -284 -196 172 -117 -155 -97 92 36 7 96 95 245 -79 -85 -38 23 111 109 -315 279 -166 -197 -44
7756 -44 -46 -129 -141 -29 -133 50 98 78 146 -104 146 -41 147 -54 166 69 -140 -215 -97 -67 -190 -101 200 11
7780 11 195 154 -335 -45 167 -145 -114 -5 264 94 -124 145 312 -81 -279 -250 48 82 15 -61 -188 -195 7
7803 7 -198 -232 94 165 -73 121 40 163 33 -25 -3 -75 -116 157 51 18 184 -13 11 175 112 -108 -26 -199
$$ packed form
7640C2P6j60J43k89L66k84n5J67Q6O7l9Q3m0k31k02K67O0j22K43k91K16n7p7p3
7664a14J84K11k71k73J02K33j93L24l46M1j64K42kL5J46p0J2j80J98j91J64k81
7686a93K95m43L49j56k2J38j04J94K9j22J24J20N6l14r7L22j10j11K37k74K01
7707A19l85P1J58k16L30o6q4k24L38O6k27K46j40J55l47L07JK0k66J28R5k12N6
7730g7j28K95l37l7Q8L68k89l8N8J89n6k9Q9jJ50l24oM7O1Q8km24N94m45l1J53
7756d4kq3j2J12j04J83M8k0O8k50K50j87J88k01K20r7k09p5J18L0j23Q9L01j89
7780A1J84m1m89K90K12l12L1J09K69j70k18K69J67l93j98K9K98L4o7p6j27pK02
7803Gk05l4L26P1k38J94q1J23j30n8K2p2m1K73j06l3J66j97K4J64o3k20Q2j73
$$ plain form
7827 -199 -200 127 55 -212 -56 -92 -184 103 221 53 117 401 82 148 -24 -418 12 61 67 49 -117 94 3 85
7851 85 152 12 104 -15 34 -88 -57 -12 -235 120 179 -284 -399 180 316 -75 69 57 74 24 -218 18 -117
7874 -117 71 70 -224 108 -82 78 296 -77 -19 -42 -263 -242 -176 -169 165 105 122 -1 15 31 -53 -163 4 -28 102
7899 102 -184 145 -55 54 381 -14 -36 192 -210 -95 35 239 130 50 -212 86 66 107 122 -277 -213 -45
7921 -45 32 25 247 -48 103 -74 40 -303 93 -79 16 136 140 -82 197 37 -5 -95 32 -220 41 106 -189
7944 -189 115 124 -57 67 95 21 115 246 87 165 165 -139 123 -102 107 169 103 282 120 27 -23 116 381 -84
7968 -84 -56 180 36 331 5 122 150 -17 62 -62 -109 170 -115 -208 11 -75 70 -33 317 134 132 196 -28
7991 -28 -24 107 -63 -217 8 -167 -264 61 39 51 190 -121 52 -281 89 -9 152 145 -110 -7 -6 164 -128 -358
$$ packed form
7827a99jL27p2k67J56l6r2K87J18j68O4K84l19O6j72l94M30M9Oj8j66K11r1Q2
7851H5O7j40R2j19M9j22L1M5k23L55N9m63j15N79J36l91J44j2J7n0k42K36j35
7874a17J88jk94L32j90J60K18l73N8k3k21K1O6PL34o0J7j23J6J6q4j10J67l2J30
7899A02k86L29k00J09L27l95k2K28m02J15J30K04j09q0k62K98k0M1J5l99O4J68
7921d5P7pK22k95J51j77J14l43L96j72R5J20Mk22K79j60m2r0J27k52K61O5k95
7944a89L04Rj81J24K8p4R4J31j59P8%l04K62k25K09O2o6J79j62r3n0J39K65m65
7968h4K8K36j44K95l26J17K8j67P9j24m7K79k85r3K19q6J45j03L50j83kO4k24
7991b8MJ31j70j54K25j75r7L25k2J2J39l11J73l33L70r8J61pk55J03JJ70k92k30
$$ plain form
8015 -358 -404 -44 -15 -103 -102 -87 15 -243 -84 7 221 250 72 -61 12 -118 -328 -51 142 -118 76 -41 -202
8038 -202 390 128 -143 0 -54 112 -38 37 -9 11 28 60 105 71 -140 -94 12 192 -164 -74 210 -87 -139 225
8062 225 176 -99 9 76 179 -111 -183 -225 -278 -265 -7 120 -7 -6 111 117 95 -84 -140 157 171 -203 58 134 -14
8087 -14 200 164 -122 104 -38 57 -22 264 159 -327 -130 46 103 161 -70 -7 -143 -181 -185 -110 -174 -58 -167 90
8111 90 -137 -15 4 48 -265 63 -190 50 -365 -14 74 105 5 -42 282 8 -86 -270 -4 283 40 18 115
8134 115 -259 -6 -29 -131 281 -32 -118 -126 155 49 38 -57 -160 26 -5 97 129 56 73 -108 -101 -59 30 194 69
8159 69 -18 -219 -378 -83 -238 -32 -153 43 238 249 190 321 -126 -142 -68 76 -115 141 113 18 174 54 224
8182 224 -47 -26 43 -211 -78 70 180 85 174
$$ packed form
8015c58m6L60K9q8JJ5J02k58J59R1K14K9j78j33P3j30k10K77J93k60J94j17j61
8038b02N92k62k71J43n4J66j50P5m6K0J7L2M5l4k11M6J06J80l56R0K84k97n2L64
8062B25m9k75J08O7J03k90p2m2n3J3K58J27j27JJ17Ok2j79n6K97J4l74K61P6j48
8087a4K14l6k86K26j42R5p9K86j05m86J97J76N7N8k31O3j36l8mP5o4J16j09K57
8111I0k27J22J9M4l13L28k53K40m15L51Q8L1j00m7L24k74r4j84K66K87k43k2R7
8134A15l74K53k3j02M12l13q6qK81j06j1r5j03J86l1J02L2p3J7j81PM2Q9J64j25
8159F9q7k01j59K95j55K06j21J96J95J1n9J31m47j6P4J44j91K56k8r5J56j20J70
8182B24k71K1O9k54J33J48J10r5Q9
8191A74
$$ Imaginary data points
##PAGE= N=2
##DATA TABLE= (X++(I..I)), XYDATA
$$ plain form
0 0 0 0 0 0 0 0 0 0 0 0 0 0 0 0 0 0 8 -8 8 -8 8 -11 16 -16 19 -24 24 -32 33 -40 48 -51 59 -66 75 -83 95 -106
38 -106 117 -131 147 -163 179 -198 220 -243 267 -295 326 -359 394 -433 481 -530 585 -649 721
57 721 -805 903 -1020 1162 -1338 1561 -1859 2275 -2897 3924 -5907 11135 -54263 -113438 9062
72 9062 -33948 -64414 26862 17469 -47665 -4431 -16141 -65253 -38007 -24602 -36271 266 -1136
85 -1136 -18376 -1749 -27341 -57793 -24562 -27323 -41339 5934 12471 -26251 -10207 -10643 -47853
98 -47853 -33275 -14091 -29543 -13058 4483 -11800 -11629 -12776 -33620 -27445 -20054 -29304 -11194
111 -11194 1674 -14937 -9589 -5886 -31470 -29061 -12681 -26125 -20638 1597 -10105 -17676 -5518
124 -5518 -17694 -28706 -16554 -19826 -24151 -8520 -6658 -14019 -6271 -9081 -21367 -17807 -16050 -21120
$$ packed form
0@%%%%%%%%%%%%%%%%Qj6J6j6J6j9K7l2L5m3M8n6O5p3Q8r9J10j25J41j58J78k01
38a06K23k48K78l10L42l77M18m63N10n62O21o85P53q27R14j011J115j234J370
57G21j526J708j923K182k500K899l420M134n172O821r831J7042o5398n9175J22500
72I062m3010l0466R1276r393o5134M3234j1710m9112K7246J3405j1669L6537j402
85a136j7240J6627k5592l0452L3231k761j4016M7273O537l8722J6044m36l7210
98d7853J4578J9184j5452J6485J7541j6283J71j147k0844O175P391r250J8110
111a1194J2868j6611N348L703k5584K409J6380j3444N487K2235j1702p571J2158
124e518j2176j1012J2152l272m325J5631J862p361P748k810j2286L560J757n070
$$ plain form
138 -21120 -11578 -4158 -10265 -6973 -3363 -14742 -17305 -12406 -17456 -17040 -6534 -5053 -6045 371 -3460
153 -3460 -14673 -15218 -14253 -16971 -9535 -245 -1491 -1230 -83 -8621 -15376 -13963 -13966 -11476 -3051 1459
169 1459 1912 1784 -3418 -10277 -14519 -15047 -10280 -2562 3641 6984 5331 -2073 -7609 -11142 -13799 -9159
185 -9159 -730 2254 6286 8481 116 -6908 -7738 -13277 -11931 -1064 3152 5999 11469 4057 -6490
200 -6490 -6618 -10849 -13185 -1373 5588 4235 9719 7830 -5135 -7334 -7009 -11868 -5340 5425 5377
215 5377 7441 9409 -65 -7429 -6952 -9571 -7074 2708 5761 6340 7557 1666 -5540 -6675 -8652 -7291
231 -7291 -17 4292 6191 6739 2915 -2530 -5586 -8243 -6815 -1217 2768 5714 7905 3634 -992
246 -992 -3250 -7496 -7746 -1618 800 3159 7778 4949 -824 -1153 -4688 -8731 -3115 893 1050 6332
$$ packed form
138b1120R542P420o107L292L610j1379k563M899n050M16J0506J481r92O416l831
153c460j1213n45R65k718P436R290j246K61J147q538o755J413lK490Q425M510
169A459M53j28n202o859m242n28M767P718O203L343j653p404n536l533k657M640
185i159Q429K984M032K195q365p024q30n539J346J0867M216K847N470p412j0547
200f490j28m231k336J1812O961j353N484j889j2965k199L25m859O528J0765m8
215E377K064J968r474p364M77k619K497R782L053N79J217n891p206j135j977J361
231g291P274M309J899N48l824n445l056k657J428N598L985K946K191m271m626
246i92k258m246k50O128K418K359M619k829n773l29l535m043N616M008J57N282
$$ plain form
262 6332 7733 843 -1223 -2016 -7365 -5702 382 830 3358 7596 3659 -1108 -842 -4845 -7301 -1429
278 -1429 1084 1888 6634 6338 1024 -1147 -3330 -7180 -4575 60 1610 4483 6570 3092 -950 -2485
294 -2485 -5673 -6009 -2012 1460 3841 6220 5250 1281 -2053 -4844 -5745 -3863 29 3986 5567 4741
310 4741 2679 -1157 -5068 -6185 -4342 -1782 2362 6024 5058 3590 1076 -4302 -6538 -4289 -2624
325 -2624 444 5647 6417 3190 1581 -2290 -6770 -5467 -2532 -1060 3730 6858 4449 1888 -364
340 -364 -5434 -6703 -3200 -889 2221 6508 5798 2452 226 -3052 -6358 -4647 -1259 998 4658 6597
356 6597 3836 849 -1637 -4796 -5344 -2157 1504 3823 6242 5700 2069 -1373 -3511 -5428 -3970 458
372 458 3386 5156 5962 3294 -607 -3504 -4397 -4516 -1327 3154 5039 5463 4886 824 -2942 -4223 -4147
$$ packed form
262F332J401o890k066p93n349J663O084M48K528M238l937m767K66m003k456N872
278a429K513Q04M746k96n314k171k183l850K605M635J550K873K087l478m042j535
294b485l188l36L997L472K381K379r70l969l334k791r01J882L892L957J581q26
310D741k062l836l911j117J843K560M144L662r66j468k514n378k236K249J665
325b624L068N203P70l227j609l871m480J303K935J472M790L128k409k561k252
340c64n070j269L503K311L110M287p10l346k226l278l306J711L388K257L660J939
356F597k761k987k486l159n48L187L661K319K419n42l631l442k138j917J458M428
372D58K928J770Q06k668l901k897q93j19L189M481J885M24n77m062l766j281P6
$$ plain form
389 -4147 -2735 1763 4935 5505 5260 2535 -1796 -4270 -3914 -3303 -174 4154 5647 4881 3354 -139
405 -139 -3695 -4450 -3362 -1477 2825 5452 5002 3202 863 -2866 -4987 -3759 -1688 1049 4293 5597
421 5597 3734 928 -1582 -4300 -4855 -2359 585 2790 4953 4443 1087 -1469 -3347 -5214 -3597 -109
437 -109 1671 3554 4739 2228 -1236 -2340 -4704 -4989 -1084 1493 2432 4532 3180 -29 -2015 -3527
453 -3527 -4848 -2516 1048 2333 3560 4304 1110 -1597 -2446 -4251 -3239 287 2231 3300 4604 2817
469 2817 -335 -2033 -3740 -3861 -1534 697 2870 3861 2939 560 -1440 -4001 -3950 -2276 -299 2224
485 2224 3979 3075 1427 -100 -3641 -4385 -2445 -1270 290 3618 3668 1160 165 -2566 -5043 -3196
501 -3196 -1930 -871 2901 3946 1547 230 -1269 -4933 -4427 -2049 -1443 1392 4516 2565 658 -572
$$ packed form
389d147J412M498L172N70k45k725m331k474L56O11L129M328J493p66j527l493
405a39l556p55J088J885M302K627m50j800k339l729k121J228K071K737L244J304
421E597j863k806k510k718n55K496K944K205K163n10l356k556j878j867J617L488
437a09J780J883J185k511l464j104k364k85L905K577R39K100j352l209j986j512
453c527j321K332L564J285J227P44l194k707q49j805J012L526J944J069J304j787
469B817l152j698j707j21K327K231K173R91r22k379k000k561N1J674J977K523
485B224J755r04j648j527l541p44J940J175J560L328N0k508r95k731k477J847
501c196J266J059L772J045k399j317j499l664N06K378O06K835L124j951j907j230
$$ plain form
517 -572 -3537 -5347 -2666 -775 407 3839 4187 1132 -345 -2207 -4499 -3816 -1112 739 2873 4223
533 4223 2414 -106 -1850 -3842 -4516 -2223 197 2090 3335 2808 750 -1307 -3627 -4131 -2597 -314
549 -314 1630 3184 3229 1392 -856 -3352 -4428 -3246 -796 1190 2996 3045 1405 -62 -2777 -4415
565 -4415 -2602 -1493 -100 2488 3245 1318 685 -1547 -4263 -3309 -1351 -1029 1477 3843 1629 49
581 49 -415 -3006 -4189 -1087 -408 150 3024 2539 546 85 -2009 -3252 -1617 -891 -588 2631 3265 991
599 991 693 -694 -3239 -2268 -668 -506 1824 3335 1536 1035 413 -1840 -2607 -1594 -561 1004 2645
616 2645 2407 1528 435 -1544 -2235 -1553 -994 653 2530 2303 1993 1506 -905 -2197 -1371 -1775 -824 2321
634 2321 2396 1937 2534 308 -2294 -1883 -2001 -1329 1782 2575 1655 2464 759 -2355 -1535 -1164 -1923 704
$$ packed form
517e72k965j810K681J891J182L432L48l055j477j862k292O83K704J851K134J350
533D223j809k520j744j992o74K293K420J893J245n27k058k057k320n04J534K283
549c14J944J554M5j837k248k496j076J182K450J986J806M9j640j467k715j638
565d415J813J109J393K588P57j927o33k232k716R54J958L22K506K366k214j580
581D9m64k591j183L102O79N58K874m85j993m61k094j243J635P26L03L219O34k274
599I91k98j387k545R71J600J62K330J511j799n01o22k253p67J013J033J565J641
616B645k38q79j093j979o91O82N59J647J877k27l10m87k411j292Q26m04R51L145
634B321P5m59N97k226k602M11j18O72L111P93r20Q09j705l114Q20L71p59K627
$$ plain form
652 704 2446 1970 2525 2276 -1195 -2061 -1500 -2106 -257 2537 2341 2112 2494 -259 -2188 -1216 -1369 -483
670 -483 1812 2529 2270 2497 776 -1719 -1419 -1775 -1392 1327 2616 2854 2920 924 -961 -1445 -1797 -1293
688 -1293 1199 2218 2563 2934 1525 -720 -701 -1385 -1914 401 1775 1841 3135 2108 -641 -618 -1299 -2369
706 -2369 -333 2262 1683 2337 2750 -240 -1033 -383 -1873 -1479 1527 1658 1259 2988 1385 -1016 -711
723 -711 -1354 -2424 298 1715 1480 2428 1188 -484 -1107 -1835 -1775 -301 1266 1075 1975 1760 176 -906
741 -906 -1046 -2136 -1153 706 1374 1643 2006 629 -713 -1431 -1936 -974 368 811 1536 2001 760 -681
759 -681 -718 -1405 -1869 -165 286 829 2203 1814 -269 -494 -1087 -2145 -1028 965 811 1267 1933 -180
777 -180 -774 -409 -1614 -1836 258 197 792 2115 1002 -782 -685 -1817 -2548 -218 832 536 1551 1471
$$ packed form
652G04J742m76N55k49l471q66N61o06J849K794j96k29L82k753j929R72j53Q86
670d83K295P17k59K27j721k495L00l56L83K719J289K38O6j996j885m84l52N04
688a293K492J019L45L71j409k245J9o84n29K315J374O6J294j027k749K3o81j070
706b369K036K595n79O54M13k990p93O50j490L94L006J31l99J729j603k401L05
723g11o43j070K722J417k35R48j240j672o23p28O0J474J567j91R00k15j584j082
741i06j40j090R83J859O68K69L63j377j342p18n05R62J342M43P25M65j241j441
759f81l7o87m64J704M51N43J374l89k083k25n93j058J117J993j54M56O66k113
777a80n94L65j205k22K094o1N95J323j113j784R7j132p31K330J050k96J015q0
$$ plain form
795 1471 -615 -732 -798 -2287 -1062 981 140 920 1806 479 -851 -702 -1742 -2046 338 873 858 1810
813 1810 1074 -905 -803 -1433 -1907 -360 549 680 1409 1485 -320 -495 -1272 -2011 -735 254 411 1492 1616
832 1616 -19 -371 -1191 -2342 -1136 -31 -133 1325 1687 44 -403 -868 -2080 -1641 169 217 1036 2038
850 2038 603 -387 -419 -1612 -2253 -81 259 381 1795 1058 -550 -528 -1335 -2157 -699 355 408 1206 1594
869 1594 73 -587 -808 -2057 -1353 330 153 1288 1801 447 -273 -494 -1376 -1428 -93 404 735 1384
887 1384 774 -26 -465 -1005 -1406 -730 164 329 1188 510 -95 -156 -1019 -1370 -450 -86 179 1184 828 224
907 224 36 -556 -1187 -608 -225 -233 866 1006 -80 136 -363 -1394 -913 -29 -535 44 1113 611 -184 315
927 315 -1269 -1522 -321 -380 -261 1074 657 122 245 -500 -1261 -959 -167 42 669 778 370 192 -60 -720
$$ packed form
795A471k086j17o6j489J225K043q41P80Q86j327j330J49j040l04K384N35j5R52
813A810p36j979J02o30m74J547R09J31P29P6j805j75p77p39J276R89J57J081J24
832A616j635l52q20j151J206J105j02J458L62j643m47m65j212M39J810M8Q19J002
850B038j435r90l2j193o41K172L40J22J414p37j608K2q07q22J458J054N3P98L88
869A594j521o60k21j249P04J683j77J135N13j354p20k21q82n2J335M97L31O49
887A384o10q00m39n40m01O76Q94J65Q59o78o05o1q63l51R20L64K65J005l56o04
907B24j88n92o31N79L83qJ099J40j086K16m99j031M81Q84n06N79J069n02p95M99
927C15j584k53J201n9J19J335m17n35J23p45p61L02P92K09O27J09m08j78k52o60
$$ plain form
947 -720 -891 -431 -299 194 1240 860 285 34 -665 -947 -736 -194 256 933 903 378 -69 -675 -878 -665
967 -665 -478 400 905 890 510 153 -303 -799 -786 -754 -103 675 740 653 467 -110 -570 -768 -412 -158 601 689
989 689 692 594 -7 -706 -523 -403 -269 227 947 916 421 58 -511 -1039 -799 -526 54 863 882 408 301 -73
1011 -73 -608 -687 173 347 548 988 744 138 82 -380 -758 -226 331 397 661 854 102 -45 13 -476 -305 6
1033 6 322 396 764 726 225 -208 -341 -377 137 -80 624 710 484 94 27 -308 -291 -473 169 276 651 724 360
1056 360 -55 -148 -445 -316 -168 -108 181 390 400 140 59 -552 -399 -269 -91 301 827 495 388 4 -433
1077 -433 -407 17 101 -281 594 810 208 359 -61 -707 115 17 24 568 960 72 175 -57 -358 -704 -88 -148
1099 -148 103 425 283 200 291 -84 -597 -25 90 -177 840 562 127 107 -106 -649 -464 122 -16 563 253
$$ packed form
947g20j71M60J32M93J046l80n75k51o99k82K11N42M50O77l0n25m47o06k03K13
967f65J87Q78N05j5l80l57m56m96J3L2O51P78O5q7j86n77m60j98L56K54P59Q8
989F89Lr8o01o99J83J20J34M96P20l1m95l63n69n28K40K73N80Q09J9m74j07l74
1011g3n35p9Q60J74K01M40k44o06n6m62l78N32N57O6K64J93p52j47N8m89J71L11
1033FL16P4L68l8n01m33j33l6N14k17P04Q6k26l90o7l35J7j82O42J07L75P3l64
1056C60m15r3k97J29J48O0K89K09J0k60q1o11J53J30J78L92N26l32j07l84m37
1077d33K6M24Q4l82Q75K16o02J51m20o46Q22r8PN44L92q88J03k32l01l46O16o0
1099a48K51L22j42q3R1l75n13N72J15k67J017k78m35k0k13n43J85N86j38N79l10
$$ plain form
1120 253 209 102 -111 -515 -494 -197 -260 226 437 241 86 -201 -450 -389 -160 -347 455 262 11 83 -91 -387
1142 -387 -292 225 -206 -141 655 112 -191 268 -317 -461 -14 -457 -117 272 240 -242 494 -150 -613 54 -239
1163 -239 -527 333 244 -335 -196 258 -280 -294 -181 -485 -32 256 -256 -56 448 -48 -354 76 -303 -296 486
1184 486 100 -56 249 -147 -513 -68 -202 -523 81 249 67 45 258 -424 -420 -228 -423 -49 360 -225 196
1205 196 76 -417 -268 -164 -669 -296 345 -35 185 316 -356 -167 6 -159 -333 268 191 109 311 147 -486
1226 -486 -90 -512 -150 370 48 -257 425 166 -549 -101 -104 -750 99 265 -370 170 204 -479 -170 43 -517
1247 -517 -74 424 -102 -27 153 -570 -262 119 -312 -158 227 -47 -160 360 -307 -326 -47 112 -140 -144 61
1268 61 -322 180 -38 -289 -43 4 -211 361 107 -154 22 -360 -119 -52 207 -174 -130 5 -251 3 518
$$ packed form
1120B53m4j07k13m04K1K97o3M86K11j96j55k87k49O1K29j87Q02j93k51P2j74k96
1142c87R5N17m31O5P96n43l03M59n85j44M47m43L40L89l2m82P36o44m63O67k93
1163b39k88Q60q9n79J39M54n38j4J13l04M53K88n12K00N04m96l06M30l79PP82
1184D86l86j56L05l96l66M45j34l21O04J68j82k2K13o82MJ92j95L74M09n85M21
1205A96j20m93J49J04n05L73O41l80K20J31o72J89J73j65j74O01p7q2K02j64o33
1226d86L96m22L62N20l22l05O82k59p15M48lo46Q49J66o35N40L4o83L09K13n60
1247e17M43M98n26P5J80p23L08L81m31J54L85k74j13N20o67j9K79J59k52mK05
1268F1l83N02k18k51K46M7k15N72k54k61J76l82K41O7K59l81M4J35k56K54N15
$$ plain form
1289 518 -182 -37 515 -192 -206 -65 -311 -13 232 115 -78 162 295 -428 398 43 -298 359 -18 73 147
1310 147 149 -219 307 18 -133 37 330 -112 480 204 -300 3 186 32 -308 76 180 27 286 -102 -193
1331 -193 293 -149 -171 159 -27 281 8 -125 -206 -50 -18 -20 69 -55 -73 67 13 -77 -191 120 -125 -12 181
1354 181 -87 197 85 2 118 262 -211 -220 381 -173 -199 37 1 18 108 -54 -68 274 -98 -254 207 76 -189
1377 -189 33 287 -242 72 126 -93 -22 200 -222 -91 249 -174 25 44 -19 117 322 129 73 345 -39 -9
1399 -9 -39 -137 55 429 -5 6 104 -151 -150 45 127 -4 394 166 -55 94 -272 -410 -59 -345 -38 -74 -145 198
1423 198 178 -119 -336 134 204 -95 330 540 -33 128 -111 -377 -100 220 -279 18 288 -192 160 186 -159
1444 -159 -133 227 -99 -295 424 -321 -79 434 -17 22 155 -78 -130 234 32 158 242 180 -112 -14 376 -124
$$ packed form
1289E18p00J45N52p07j4J41k46K98K45j17j93K40J33p23Q26l55l41O57l77R1P4
1310A47Kl68N26k89j51J70K93m42N92k76n04L03J83j54l40L84J04j53K59l88r1
1331a93M86m42k2L30j86L08k73j33q1J56L2kQ9j24j8J40n4r0j14L11k45J13J93
1354A81k68K84j12q3J16J44m73rO01n54k6K36l6J7R0j62j4L42l72j56M61j31k65
1377a89K22K54n29L14N4k19P1K22m22J31L40m23J99J9o3J36K05j93n6K72l84L0
1399il0r8J92L74m34J1R8k55JJ95Q2j31L98k28k21J49l66j38L51k86L07l6p1L43
1423A98k0k97k17M70P0k99M25K10n73J61k39k66K77L20m99K97K70m80L52K6l45
1444a59K6L60l26j96P19p45K42N13m51L9J33k33n2L64k02J26Q4o2k92R8L90n00
$$ plain form
1466 -124 -111 0 106 145 91 13 -228 71 -264 47 32 -235 30 184 -6 -184 -129 -224 -272 78 41 180 462
1489 462 13 1 11 -487 -287 144 -1 11 382 8 -211 52 -252 -365 140 357 61 -35 241 -459 -293
1510 -293 -168 -268 -58 242 123 19 234 -117 -276 -53 -200 -202 50 126 105 36 -55 -340 -68 -231 75 51
1532 51 43 -69 263 9 -244 -272 -124 -190 9 65 -207 315 201 -130 -352 -212 -29 -77 241 170 481 280 -78
1555 -78 -259 -103 -138 -62 101 -5 238 262 -135 126 38 -248 -41 -214 -86 260 437 93 -191 -67 -154 -123
1577 -123 -6 61 20 276 382 11 -428 -247 -228 -1 117 366 32 173 230 -175 -271 -273 -354 -12 -187 140 98
1600 98 157 -40 -12 -242 -62 -283 112 153 258 29 255 -207 -239 -365 -324 -203 37 361 249 180 -161 -4
1622 -4 -492 -297 -54 114 261 183 37 219 -135 -213 -319 -123 98 406 348 338 54 -188 -374 78 -350 144
$$ packed form
1466a24J3J11J06L9n4p8k41K99l35L11j5k67K65J54j90j78N5r5m8L50l7J39K82
1489D62m49j2J0m98K00M31j45J2L71l74k19K63l04j13N05K17k96r6K76p00J66
1510b93J25j00K10L00j19j04K15l51j59K23j47kK52P6k1o9r1k85K72j63L06k4
1532E1qj12L32k54k53k8J48o6J99N6k72N22j14l31k22J40J83m8L18p1L11k01l58
1555g8j81J56l5P6J63j06K43K4l97K61q8k86K07j73J28L46J77l44k84J24q7L1
1577a23J17O7m1K56J06l71m39J81J9K27J18K49l34J41N7m05r6kq1L42j75L27m2
1600I8N9j97K8k30J80k21L95M1J05k29K26m62l2j26M1J21K40L24j12o9l41J57
1622dm88J95K43J68J47p8j46J82l54p8j06J96K21L08n8j0k84k42j86M52m28M94
$$ plain form
1644 144 155 203 271 17 -264 -360 -75 146 -74 157 286 180 108 22 -196 -267 -410 -87 147 388 57 -143
1666 -143 88 -164 -311 -200 -199 441 192 344 113 -67 -155 -103 -90 -33 37 246 490 44 357 -5 -395 -98
1688 -98 -5 29 193 158 142 154 109 -138 -258 -251 -32 -182 353 81 -37 331 -23 -411 -88 -109 16 -62 53 108
1712 108 68 1 -9 -120 -143 -466 93 205 378 227 6 -60 22 -408 -28 6 151 308 388 190 -92 -217 -536
1735 -536 -273 -114 310 257 310 251 92 -37 -324 -152 167 77 419 629 209 -359 -161 -201 -423 -165 327 82
1757 82 361 377 60 -89 -36 -24 -190 -64 48 247 69 213 11 -18 -112 -326 -177 218 299 611 211 45
1779 45 -199 -220 -272 -13 323 276 219 250 42 58 -325 -578 158 51 -81 325 204 -148 180 -126 -381 -241
1801 -241 232 173 533 355 13 118 -53 -482 -124 109 -33 195 443 133 -25 2 -397 -429 -80 -234 73
$$ packed form
1644A44J1M8O8k54k81r6K85K21k20K31J29j06p2q6k18p1j43L23K34K41l31k00
1666a43K31k52j47J11JO40k49J52k31j80q8N2J3N7P0K09K44m46L13l62l90K97
1688i8R3L4J64l5j6J2m5k47j20PK19j50N35k72j18L68l54l88L23k1J25p8J15N5
1712A08m0o7j0j11k3l23N59J12J73j51k21o6Q2m30L80L4J45J57Q0j98k82j25l19
1735e36K63J59M24n3N3n9j59j29k87J72L19r0L42K10m20n68J98m0k22K58M92k45
1757H2K79J6l17j49N3J2j66J26J12J99j78J44k02k9r4k14J49L95Q1L12m00j66
1779D5k44k1n2K59L36m7n7L1k08J6l83k53P36j07j32M06j21l52L28l06k55J40
1801b41M73n9L60j78l42J05j71m29L58K33j42K28K48l10j58K7l99l2L49j54L07
$$ plain form
1822 73 204 97 99 185 -231 -671 -190 209 -112 380 322 73 108 94 -214 13 -90 -104 251 375 -26 125 21
1845 21 -171 -122 -109 -145 42 455 125 87 -13 -235 -305 -182 -210 230 446 324 163 194 -116 -494 -302 39 -100
1868 -100 325 545 153 121 -75 -389 21 -210 -9 256 606 347 317 264 -518 -231 92 160 -50 333 161
1889 161 -10 259 -27 -474 -300 37 74 380 275 240 69 -169 -457 -185 -137 -230 36 361 259 -222 33
1910 33 -538 9 -22 -35 160 411 -9 41 -8 -201 -453 -75 -26 -141 258 333 114 3 -278 -378 -157 -113 -181
1933 -181 348 122 -39 -130 -80 -647 -116 -7 -78 200 224 410 295 154 -306 -207 -207 -74 516 250 390 208
1955 208 -170 -171 -326 64 -134 168 458 134 174 247 172 -314 -284 -15 74 257 121 119 286 -149 -511 -71 -159
1978 -159 -162 158 177 121 104 -47 -222 -282 -169 13 306 304 253 57 136 -190 -288 48 -400 78 -81 109 295 134
$$ packed form
1822G3J31j07KQ6m16m40M81L99l21M92n8k49L5j4l08K27j03j4L55J24m01J51j04
1845B1j92M9J3l6J87M13l30l8j00k22p0J23k8M40K16j22j61L1l10l78J92L41j39
1868a00M25K20l92l2j96l14M10k31K01K65L50k59l0n3p82K87L23O8k10L83j72
1889A61j71K69k86m47J74L37L7L06j05l5j71k38k88K72M8r3K66L25j02m81K55
1910C3n71N47l1j3J95K51m20N0m9j93k52L78M9j15L99P5k19j11k81j00K21M4o8
1933a81N29k26j61r1N0n67N31J09p1K78K4J86j15j41m60R9%J33N90k66J40j82
1955B08l78jj55L90j98L02K90l24M0P3p5m86L0K69Q9J83j36kJ67m35l62M40q8
1978a59lL20J9n6j7j51j75o0J13J82K93kn1j96P9l26r8L36m48M78j59J90J86j61
$$ plain form
2002 134 -97 -459 -32 -130 -236 270 -61 -39 460 -66 -119 -73 -258 -142 -102 172 13 377 245 -211 -247 -304
2024 -304 -257 29 255 46 -56 14 -199 -308 -359 -402 -44 -152 30 -72 267 -144 -19 0 -263 -14 267 -2
2046 -2 163 89 278 -138 -157 -336 -95 290 139 136 330 24 -206 -87 -59 -66 -162 -99 61 180 -37 -26 95 -168
2070 -168 -154 -19 -13 -18 174 100 -40 23 53 0 -106 96 30 208 368 -102 -61 -354 -181 -420 35 83 108 180 156
2095 156 -15 -70 -180 -383 -43 63 31 -78 41 -236 -158 -78 -252 -358 34 -8 287 146 -111 -142 -194 104
2117 104 55 -48 -26 -109 103 188 172 -81 -87 -288 -321 8 150 119 171 -254 -382 -103 -247 134 -53 -41 431 226
2141 226 7 -301 -13 -245 -310 162 -104 176 210 159 -158 -144 -143 -35 -302 -49 241 -44 330 53 -144 -158
2163 -158 -44 -205 69 42 96 197 -17 157 -83 -173 -176 21 406 138 180 130 132 -123 -188 -263 24 211 255 266
$$ packed form
2002A34k31l62M27r8j06N06l31K2M99n26n3M6j85J16M0K74j59L64j32m56l6n7
2024c04M7K86K26k09j02P0k13j09n1m3L58j08J82j02L39m11J25J9k63K49K81k69
2046bJ65p4J89m16j9j79K41L85j51lJ94l06k30J19K8pr6O3J60J19k17J1J21k63
2070a68J4J35OnJ92p4j40O3L0n3j06K02o6J78J60m70M1k93J73k39M55M8K5P2k4
2095A56j71n5j10k03L40J06l2j09J19k77P8Q0j74j06L92m2K95j41k57l1n2K98
2117A04m9j03K2q3K12Q5j6k53ok01l3L29J42l1N2m25j28K79j44L81j87J2M72k05
2141B26k19l08K88k32o5M72k66K80L4n1l17J4JJ08k67K53K90k85L74k77j97j4
2163a58J14j61K74k7N4J01k14J74k40r0lJ97L85k68M2n0Kk55o5p5K87J87M4J1
$$ plain form
2187 266 249 -48 52 -167 -323 -268 -127 183 177 31 -6 47 -96 -288 -269 77 89 281 -247 201 -262 99 -421
2210 -421 -297 -45 -242 41 244 228 -113 52 -323 235 131 -36 31 159 -150 186 -213 -145 -161 -40 33 -28
2232 -28 -146 185 36 -118 19 2 46 -138 -76 165 77 53 -371 -129 -91 -101 35 -157 179 355 292 -236 -81
2255 -81 232 4 -227 70 -162 118 111 -247 22 -202 -259 224 22 10 155 93 -75 147 134 20 27 104 -32
2278 -32 115 261 -24 58 -167 -48 -81 -216 22 77 -33 206 40 9 -113 -385 0 134 -4 -189 117 -69
2300 -69 -188 -131 -48 -145 -42 201 -45 -124 67 32 38 -132 -263 85 118 63 -125 253 183 76 -214 -51 -241 -102
2324 -102 177 14 163 277 -107 130 -435 -311 39 -11 87 211 25 -79 298 73 -42 127 -70 63 88
2345 88 24 -99 -192 -116 -334 -62 -87 -47 84 249 -150 43 143 -140 -133 223 -13 32 73 29 -176 -109 -268 -51
$$ packed form
2187B66j7k97J00k19j56N5J41L10oj46l7N3j43j92J9L46J2J92n28M48m63L61n20
2210d21J24K52j97K83K03j6l41J65l75N58j04j67O7J28l09L36l99O8j6J21P3o1
2232b8j18L31j49j54J37j7M4j84O2K41q8k4m24K42L8j0J36j92L36J76o3n28J55
2255h1L13k28k31K97k32K80pl58K69k24n7M83k02j2J45o2j68K22j3j14PP7j36
2278c2J47J46k85Q2k25J19l3j35K38N5j10K39j66l1j22k72L85J34j38j85L06j86
2300f9j19N7Q3r7J03K43k46p9J91l5Oj70j31L48L3n5j88L78p0j07k90J63j90J39
2324a02K79j63J49J14l84K37n65J24L50n0R8J24j86j04L77k25j15J69j97J33K5
2345H8o4j23r3P6k18K72k5M0J31J65l99J93J00k83PL56k36M5M1m4k05O7j59K17
$$ plain form
2369 -51 -160 121 -146 108 113 -27 -22 -28 -182 153 88 11 -61 207 -362 -102 -13 -185 -104 -42 -237 46 140 -156 115
2394 115 -9 -159 -120 -50 174 -123 -8 -22 -145 165 146 -25 -210 99 -68 112 -78 2 296 -49 92 239
2416 239 106 -106 58 199 181 -6 -29 -68 34 77 210 175 208 26 150 142 23 -56 46 -171 103 247 76
2439 76 -97 124 -145 -238 -300 -6 94 -35 -80 95 -148 46 122 -369 -4 5 130 19 66 205 60 -73 -147
2462 -147 -114 -196 175 -16 206 13 -218 243 -60 48 79 -279 260 -21 204 -46 91 20 48 -45 -84 -262
2484 -262 -66 -83 -69 52 -168 -74 -203 40 -293 -269 7 -162 31 -131 -396 0 149 -76 -28 -27 -210 181
2506 181 -112 -30 281 103 -108 29 394 -180 -218 -191 106 131 285 67 102 -156 207 21 -62 -79 30 -38 -166
2529 -166 77 -1 82 41 125 36 -68 27 -226 26 -193 -95 61 39 -140 -116 123 174 -40 50 -338 -43 36 -112
$$ packed form
2369e1j09K81k67K54Nj40Noj54L35o5p7p2K68n69K60Q9j72Q1O2j95K83R4k96K71
2394A15j24j50L9P0K24k97J15j4j23L10j9j71j85L09j67J80j90Q0K94l45J41J47
2416B39j33k12J64J41j8j87k3l9J02M3J33l5L3j82J24qj19p9J02k17K74J44j71
2439G6j73K21k69r3o2K94J00j29m5J75k43J94P6m91L65RJ25j11M7J39j45j33p4
2462a47L3q2L71j91K22j93k31M61l03J08L1l58N39k81K25k50J37p1K8r3l9j78
2484b62J96j7J4J21k20R4j29K43l33K4K76j69J93j62k65L96J49k25M8Jj83L91
2506A81k93Q2L11j78k11J37L65n74l8K7K97K5J54k18L5k58L63j86q3j7J09o8j28
2529a66K43p8Q3m1Q4q9j04R5k53K52k19R8J56k2j79K4K39N1k14R0l88K95P9j48
$$ plain form
2553 -112 282 -36 -159 -1 86 -153 -52 310 60 -262 -236 35 -311 -38 44 177 116 110 -116 -31 402 -136
2575 -136 9 89 -7 -71 -73 -85 -79 -123 47 -179 76 -75 -106 -269 -275 -11 -68 -112 213 35 -200 -31 -201 -82 -211
2600 -211 52 -174 65 128 -183 -100 -87 0 -86 205 -64 -7 1 89 -144 -35 -26 -6 131 124 48 -113 79 -2 135
2625 135 183 -22 -110 44 -18 -60 -165 94 -29 -18 2 -147 -176 46 119 67 -98 67 166 79 14 -131 168 -191
2649 -191 -60 -8 -20 -2 -60 -37 117 290 -181 -1 120 -88 113 -45 74 -363 26 -145 12 -52 15 -349
2671 -349 -209 115 -313 -8 -151 -241 -170 -333 -131 -143 -143 -123 232 42 -147 -64 127 43 -65 -80 324 -129 0
2694 0 22 -80 323 287 -16 128 290 -13 21 -213 -81 0 46 73 8 -51 142 29 39 89 176 -134 1 -159
2718 -159 -237 145 -14 114 -56 209 39 -241 -11 -545 -309 -11 20 -27 -230 -42 95 -199 50 -122 -339
$$ packed form
2553a12L94l18j23J58Q7k39J01L62k50l22K6K71l46K73Q2J33o1ok26Q5M33n38
2575a36J45Q0r6o4kj2Om4J70k26K55j51l1j63oK64n7m4L25j78k35J69j70J19j29
2600b11K63k26K39O3l11Q3J3Q7q6K91k69N7QQ8k33J09RK0J37pp6j61J92q1J37
2625A35M8k05q8J54o2m2j05K59j23J1K0j49k9K22P3n2j65J65R9q7o5j45K99l59
2649a91J31N2j2J8n8K3J54J73m71J80J21k08K01j58J19m37L89j71J57o4O7l64
2671c49J40L24m28L05j43r0P1j63K02j2%K0L55j90j89Q3J91q4j08j5M04m53J29
2694@K2j02M03l6l03J44J62l03L4k34J32Q1M6K7o5n9J93j13J0N0Q7l10J35j60
2718a59p8L82j59J28j70K65j70k80K30n34K36K98L1m7k03J88J37k94K49j72k17
$$ plain form
2739 -339 -26 40 -149 10 142 -185 -133 -157 -121 154 -68 -22 -4 149 -115 78 -373 -140 214 52 -112 202
2761 202 303 -229 -157 -84 1 -18 130 427 235 169 -42 -66 -161 -188 -207 -149 173 100 167 169 74 112 -9 -66 154 -31
2787 -31 50 10 22 162 -46 -72 -16 -11 -119 198 169 152 -123 -154 72 -121 167 112 121 -69 -39 143 103 -173 -248 220
2813 220 4 76 -3 86 111 -181 -335 -171 -115 -96 -20 98 -116 91 -42 -102 -194 -163 114 151 -55 286 28 -92
2837 -92 -41 -206 141 -226 -17 139 332 46 -20 -142 -128 -108 -174 -103 73 105 108 -166 -112 -164 -138 172 0 367
2861 367 -34 88 139 -49 -98 -102 -30 130 156 185 331 172 -40 -35 -147 -38 285 -64 226 -53 -20 -25 -264 -13
2885 -13 -80 63 161 -11 -68 295 338 -36 -4 -409 -354 -151 -57 102 110 291 51 -325 -108 -231 -181 22 -100 172
2909 172 178 143 95 18 -450 49 -38 44 230 170 -199 -153 85 -124 -64 -17 172 64 196 266 97 60 -47 -188
$$ packed form
2739c39L13O6j89J59J32l27N2k4L6K75k22M6J8J53k64J93m51K33L54j62j64L14
2761B02J01n32P2P3Q5j9J48K97j92o6k11k4r5k7j9N8L22p3O7Kr5L8j21n7K20j85
2787c1Q1m0J2J40k08k6N6Nj08L17k9j7k75l1K26j93K88n5Rj90L0J82m0k76p5M68
2813B20k16P2p9Q9K5k92j54J64N6J9P6J18k14K07j33o0r2L1K77L7k06L41k58j20
2837i2N1j65L47l67K09J56J93k86o6j22J4K0o6P1J76L2Lk74N4n2K6L10j72L67
2861C67m01J22N1j88m9mP2J60K6K9J46j59k12Nj12J09L23l49K90k79L3nk39K51
2885a3o7J43R8j72n7L63M3l74L2m05N5K03R4J59QJ81k40l76K17j23N0K03j22K72
2909A72Ol5m8p7m68M99q7Q2J86o0l69M6K38k09O0M7J89j08J32P0j69l7j07j41
$$ plain form
2933 -188 -187 -4 246 353 -9 171 -162 -206 -515 -604 -195 358 337 341 2 -28 74 267 54 33 84 77 146 61 -104
2958 -104 -116 -219 -27 -62 203 -10 205 200 36 -151 -142 39 16 -249 213 201 81 -152 23 -151 -17 59 161
2981 161 -30 125 5 219 143 14 -229 -206 1 -70 71 -83 215 147 87 -212 -126 4 -259 -17 133 -135
3003 -135 -53 -234 -221 -435 -207 -319 377 90 28 -84 -186 -75 -258 -273 -75 196 128 298 124 64 -55 -246
3025 -246 -120 4 -59 20 276 282 79 -2 -193 34 -127 39 33 276 249 126 31 -59 18 -194 -58 12 152 318
3049 318 -59 139 -18 -474 -57 -69 -19 -79 81 326 26 14 -42 -170 8 182 225 19 471 -59 -47 167
3071 167 -327 -23 -134 185 216 203 -216 -130 150 4 -186 -189 -199 226 129 218 41 -270 -488 -221 -92 110 22
3094 22 9 119 81 16 50 -351 -457 -46 299 -191 51 98 -207 -27 -163 -176 22 109 164 80 163 50 -41 -145
$$ packed form
2933a88JJ83K50J07l62J80l33m4l09q9M09N53k1Ml39l0J02J93k13k1N1pO9q5j65
2958a04j2j03J92l5K65k13K15nj64j87RJ81k3k65M62j2j20k33J75j74J34P6J02
2981A61j91J55j20K14p6j29k43K3K07p1J41j54K98o8o0k99Q6J30k63K42J50k68
3003a35Q2j81J3k14K28j12O96k87o2j12j02J11j83j5J98K71o8J70j74o0j19j91
3025b46J26J24o3P9K56Ok03q1j91K27j61J66oK43k7j23r5r0P7k12J36P0J40J66
3049C18l77J98j57m56M17j2N0o0J60K45l00j2n6j28J78J74M3k06M52n30J2K14
3071A67m94L04j11L19L1j3m19Q6K80j46j90lj0M25r7Q9j77l11k18K67J29K02q8
3094B2j3J10l8o5L4m01j06M11L45m90K42M7l05J80j36j3J98Q7N5q4Q3j13r1j04
$$ plain form
3118 -145 -332 -236 90 98 106 210 75 -45 -1 37 8 -128 -133 -71 206 251 2 -269 -78 -102 -128 214 -94 113 268
3143 268 92 65 -400 -196 72 -14 106 117 -26 204 -296 -150 -117 -36 -375 -81 281 245 174 318 -343 -320 -214
3166 -214 2 -173 70 351 126 -250 -373 10 -193 -181 -76 204 108 245 -2 71 -362 134 -148 -82 141
3187 141 189 156 182 245 -256 -178 -279 160 2 38 194 3 21 -170 -191 17 -46 -95 93 169 69 54 145 -159
3211 -159 -177 -430 -48 247 272 54 155 -7 -224 -64 -338 -27 -286 191 -136 193 111 -92 -316 -188 -51
3232 -51 138 346 278 148 -16 53 -238 -378 -2 -49 35 201 218 213 192 -514 -88 -468 37 51 36 281 262 -105
3256 -105 57 -271 -247 -266 107 291 67 224 258 -266 -195 -116 -160 76 156 72 361 160 70 31 131 -40 176
3279 176 261 141 197 384 -118 -31 -52 -229 -119 185 49 50 185 -27 -199 -242 -161 -155 81 163 69 126 207 183 55
$$ packed form
3118a45j87R6L26QQJ04j35j20M4L8k9j36nO2K77M5k49k71J91k4k6L42l08K07J55
3143B68j76k7m65K04K68q6J20J1j43K30n00J46L3Q1l39K94L62l6p1J44o61K3J06
3166b14K16j75K43K81k25l76j23L83k03J2J05K80r6J37k47P3m33M96k82O6K23
3187A41M8l3K6O3n01P8j01M39j58L6J56j91J8j91k1K08o3m9J88P6j00j5R1l04
3211a59j8k53L82K95K5k18J01j62k17J60k74L11k59M77l27L29q2k03k24J28J37
3232e1J89K08o8j30j64O9k91j40L76m7Q4J66J7nk1p06M26l80N05J4j5K45j9l67
3256a05J62l28K4j9L73J84k24J57L4n24P1P9m4K36Q0q4K89k01r0l9J00j71K16
3279A76Q5j20N6J87n02Q7k1j77J10L04j36JJ35k12j72m3Q1OK36Q2r4N7Q1k4j28
$$ plain form
3304 55 -174 -216 -129 -283 231 105 147 85 47 -323 72 30 12 233 61 313 329 87 -311 -76 55 146 307
3327 307 327 43 114 126 -151 -133 -193 34 223 30 154 46 -100 -393 -161 -302 -219 -102 -107 82 57 133 68 -146
3351 -146 -320 -67 160 262 108 110 -71 -197 -70 -178 15 68 219 174 176 243 -78 -175 -377 -33 -83 -65 44
3374 44 157 202 78 -94 -373 -1 -307 123 198 383 -181 144 -51 -134 -110 -166 -237 50 172 251 340 -71 26
3397 26 -240 -136 13 263 97 226 -5 195 -68 -107 -546 -258 -7 29 354 2 390 84 -302 -392 41
3418 41 -154 102 298 372 162 -36 -66 -344 -54 -55 -204 -53 93 -60 131 -94 -94 -342 -375 -108 13 -129 243
3441 243 115 103 -211 -314 50 2 51 45 365 88 164 -185 -142 -63 -131 -4 275 471 156 -272 197 -323 -268
3464 -268 -290 88 125 312 128 139 50 -276 75 38 -148 -132 303 170 240 138 -17 -362 -273 -38 242 127 381
$$ packed form
3304E5k29m2Q7j54N14j26M2o2l8l70L95m2j8K21j72K52J6k42l98K35J31R1J61
3327C07K0k84P1J2k77J8o0K27J89j93J24j08j46k93K32j41Q3J17nJ89k5P6o5k14
3351a46j74K53K27J02j54Kj81j26J27j08J93N3J51m5KO7l21r7k02L44n0J8J09
3374D4J13M5j24j72k79L72l06M30P5J85n64L25j95q3K4n6p1K87J22P9Q9m11R7
3397B6k66J04J49K50j66J29k31K00k63l9m39K88K51L6L25l52L88l06l86r0M33
3418D1j95K56J96P4k10j98l0k78K90jj49J51J46j53J91k25%k48l3K67J21j42L72
3441B43j28j2l14j03L64m8M9oL20k77P6l49M3P9o8J27K79J96l15m28M69n20N5
3464b68k2L78L7J87j84J1q9l26L51l7j86J6M35j33P0j02j55l45Q9K35K80j15K54
$$ plain form
3487 381 120 109 -395 -349 -320 -23 30 236 335 -12 -159 -236 -93 -329 -203 5 36 216 336 241 118 -181 -259
3510 -259 -231 46 347 517 142 145 297 -60 -456 -173 70 185 142 286 299 124 4 -74 -203 -62 -140 153
3532 153 219 163 300 -339 -67 205 -147 -241 -141 -59 703 44 151 -152 -162 -186 117 88 12 94 172 30 8 -264
3556 -264 -165 -294 -142 -53 366 303 -73 75 -45 -172 -146 33 381 194 232 116 79 -78 -358 -253 150 37
3578 37 -45 -106 288 36 0 -149 -347 -162 -41 136 190 142 -228 171 -21 -322 -401 93 213 167 132 229 -1
3601 -1 73 -20 -283 -95 123 253 245 85 -95 -351 -370 -290 -88 271 248 289 63 146 -19 -60 -195 -2 -252 -164
3625 -164 173 376 200 -139 -83 -154 -191 44 223 -17 454 -29 1 -145 -339 -381 -222 57 182 161 340 -78
3647 -78 206 -191 -190 -92 80 208 75 143 -83 106 -82 -103 -18 -293 51 173 129 74 214 -101 -258 -264 -277 -15
$$ packed form
3487C81k61j1n04M6K9K97N3K06R9l47j47p7J43k36J26K08L1J80J20r5j23k99p8
3510b59K8K77L01J70l75LJ52l57l96K83K43J15m3J44J3j75j20p8j29J41p8K93
3532A53O6n6J37o39K72K72l52r4J00Q2P62o59J07l03j0k4L03k9p6Q2P8j42k2k72
3556b64R9j29J52Q9M19o3l76J48j20j27K6J79L48j87L8j16l7j57k80J05M03j13
3578C7q2o1L94k52l6j49j98J85J21J77N4m8l70L99j92l01p9M94J20m6l5R7k30
3601aP4r3k63J88K18J30qj60j80k56j9Q0K02L59k3M1k26Q3j65m1j35J93k50Q8
3625a64L37K03j76l39N6p1l7K35J79k40M71m83L0j46j94m2J59K79J25k1J79m18
3647g8K84l97JR8J72J28j33O8k26J89j88k1Q5k75L44J22m4n5J40l15j57oj3K62
$$ plain form
3671 -15 -179 364 199 362 14 -81 -175 -215 25 -60 175 220 168 117 -197 86 23 -25 77 118 -25 158 -48 14
3695 14 -166 -267 -183 14 49 200 16 194 108 -145 -85 -185 -121 -48 170 -27 236 -9 30 -41 -90 67 75 201
3719 201 150 -108 43 -304 -70 -207 -266 -124 -61 171 132 198 28 -168 -444 -72 -147 107 134 98 -68 -145 -382
3742 -382 -273 -9 69 -71 50 87 131 34 -176 -281 -260 -182 -92 -47 201 73 63 -135 65 -337 -91 155 255
3765 255 50 83 222 -302 -76 82 104 -53 84 169 214 -129 188 -201 49 18 150 -55 265 213 -17 -73
3787 -73 -46 -89 90 -242 213 -47 226 189 348 -104 -91 -281 -381 -284 148 136 87 121 259 -43 -279 -20 89
3810 89 26 44 52 -29 -18 -252 -67 -4 -143 -237 11 -128 266 19 90 47 -12 -150 -184 39 159 113 -54 141 -176
3835 -176 -293 -483 -180 76 64 386 6 -123 -98 -179 -157 -248 214 -23 161 119 143 -11 -213 -22 -113 65 112
$$ packed form
3671a5j64N43j65J63l48r5r4m0K40q5K35M5n2n1l14K83o3m8J02M1j43J83k06O2
3695A4j80j01Q4J97L5J51j84J78q6k53O0j00O4P3K18j97K63k45L9p1m9J57QJ26
3719B01n1k58J51l47K34j37n9J42O3K32l9O6j70j96k76L72p5K54K7l6j66p7k37
3742c82J09K64P8j40J21L7M4r7k10j05K1P8R0M5K48j28j0j98K00m02K46K46J00
3765B55k05L3J39n24K26J58K2j57J37Q5M5l43L17l89K50l1J32k05L20n2k30n6
3787g3K7m3J79l32M55k60K73l7J59m52J3j90j00R7M32j2m9L4J38l02k36K59J09
3810H9o3J8Qq1J1k34J85O3j39r4K48j39L94k47P1m3n9j38l4K23J20m6j67J95l17
3835a76j17j90L03K56j2L22l80j29K5q1K2r1M62k37J84m2K4j54k02J91r1J78M7
$$ plain form
3858 112 179 244 330 -189 -164 -253 -184 -99 -270 -161 235 57 426 133 20 -366 -20 33 129 303 305 152 -21 -215
3882 -215 -121 -170 -42 -182 25 3 -2 -245 -207 -177 51 127 -187 192 -3 81 19 15 -121 -247 -38 203 -2 -14
3906 -14 414 51 236 88 -227 -4 70 116 -1 131 -30 112 -150 -311 -279 -81 10 108 121 205 -183 -142 -73
3929 -73 -83 -177 -67 225 151 112 25 -205 -309 -288 -121 -286 -14 210 -19 93 -106 67 11 -116 -14 122 4
$$ packed form
3858A12O7O5Q6n19K5q9O9Q5j71J09L96j78L69k93j13l86L46N3R6J74Kj53j73j94
3882b15R4m9J28j40K07k2nk43L8L0K28P6l14L79j95Q4o2mj36j26K09K41k05j2
3906a4M28l63J85j48l15K23P4M6j17J32j61J42k62j61L2J98R1R8J3Q4l88M1O9
3929g3j0r4J10K92p4l9q7k30j04K1J67j65K72K24k29J12j99J73n6j27J02J36j18
$$ [...]
8191a38
##END NTUPLES=NMR FID
##END=
