##TITLE=1H_UK-19'
 CD2Cl2, 68 sc, 
 31.8.2021
##JCAMPDX= 6.0         $$ Bruker NMR JCAMP-DX V2.0
##DATA TYPE= NMR FID
##DATA CLASS= NTUPLES
##ORIGIN= UXNMR, Bruker Analytische Messtechnik GmbH
##OWNER= root
$$ XWIN-NMR		Version 3.5
$$ Wed Sep  1 08:58:54 2021 Russian Standard Time (UT+4h)  she@DPX200
##.OBSERVE FREQUENCY= 200.13
##.OBSERVE NUCLEUS= ^1H
##.DELAY= (6, 6)
##.ACQUISITION MODE= SIMULTANEOUS
##.ACQUISITION SCHEME= undefined
##.AVERAGES= 68
##.DIGITISER RES= 18
##SPECTROMETER/DATA SYSTEM= spect
##.PULSE SEQUENCE= zg30
##.SOLVENT NAME= CD2Cl2
##.SHIFT REFERENCE= (INTERNAL, CD2Cl2, 0, 15.7039)
##AUDIT TRAIL= $$ (NUMBER, WHEN, WHO, WHERE, WHAT)
$$ ##TITLE= Audit trail, XWIN-NMR		Version 3.5
$$ ##JCAMPDX= 5.01
$$ ##ORIGIN= Bruker BioSpin GmbH
$$ ##OWNER= she
$$ F:/spectra/data/she/nmr/H-F/1/audita.txt
$$ ##AUDIT TRAIL=  $$ (NUMBER, WHEN, WHO, WHERE, WHAT)
(   1,<2021-09-01 08:57:45.85 +0400>,<she>,<DPX200>,
      <continue with go, POWCHK disabled, PULCHK disabled
       configuration hash MD5:
       00 E9 B6 7A A2 85 ED C7 34 08 36 98 17 FE 4E 26
       data hash MD5: 16K
       BE 6D F6 24 6B 86 8B D9 62 1E FD CA 46 69 A6 72>)
$$ ##END=
$$ 
$$ hash MD5
$$ 46 DF 28 05 9D B4 4A 17 3C 13 CA CB 0E A9 43 CD
##$RELAX= 
##$RELAX= 
##$RELAX= 
##$RELAX= 
##$RELAX= 
##$RELAX= 
$$ Bruker specific parameters
$$ --------------------------
##$DU= <F:/spectra>
##$EXPNO= 1
##$NAME= <H-F>
##$PROCNO= 1
##$TYPE= <nmr>
##$USER= <she>
##$AMP= (0..31)
100 100 100 100 100 100 100 100 100 100 100 100 100 100 100 100 100 100 
100 100 100 100 100 100 100 100 100 100 100 100 100 100 
##$AQSEQ= 0
##$AQ_mod= 1
##$AUNM= <au_zg>
##$AUTOPOS= <>
##$BF1= 200.13
##$BF2= 200.13
##$BF3= 200.13
##$BF4= 200.13
##$BF5= 200.13
##$BF6= 200.13
##$BF7= 200.13
##$BF8= 200.13
##$BYTORDA= 1
##$CFDGTYP= 0
##$CFRGTYP= 5
##$CHEMSTR= <none>
##$CNST= (0..31)
1 1 145 1 1 1 1 1 1 1 1 1 1 1 1 1 1 1 1 1 1 1 1 1 1 1 1 1 1 1 1 1 
##$CPDPRG= <>
##$CPDPRG1= <>
##$CPDPRG2= <>
##$CPDPRG3= <>
##$CPDPRG4= <mlev>
##$CPDPRG5= <mlev>
##$CPDPRG6= <mlev>
##$CPDPRG7= <mlev>
##$CPDPRG8= <mlev>
##$CPDPRGB= <>
##$CPDPRGT= <>
##$D= (0..31)
0 1.2 0 0 0 0 0 0 0 0.06 0 0.03 0 0 0 0 0.0002 0 0 0 0 0 0 0 0 0 0 0 0 
0 0 0 
##$DATE= 1630471969
##$DBL= (0..7)
120 120 120 120 120 120 120 120 
##$DBP= (0..7)
150 150 150 150 150 150 150 150 
##$DBP07= 0
##$DBPNAM0= <>
##$DBPNAM1= <>
##$DBPNAM2= <>
##$DBPNAM3= <>
##$DBPNAM4= <>
##$DBPNAM5= <>
##$DBPNAM6= <>
##$DBPNAM7= <>
##$DBPOAL= (0..7)
0.5 0.5 0.5 0.5 0.5 0.5 0.5 0.5 
##$DBPOFFS= (0..7)
0 0 0 0 0 0 0 0 
##$DE= 6
##$DECBNUC= <off>
##$DECIM= 32
##$DECNUC= <off>
##$DECSTAT= 4
##$DIGMOD= 1
##$DIGTYP= 9
##$DL= (0..7)
0 120 120 120 120 120 120 120 
##$DP= (0..7)
150 150 150 150 150 150 150 150 
##$DP07= 0
##$DPNAME0= <>
##$DPNAME1= <>
##$DPNAME2= <>
##$DPNAME3= <>
##$DPNAME4= <>
##$DPNAME5= <>
##$DPNAME6= <>
##$DPNAME7= <>
##$DPOAL= (0..7)
0.5 0.5 0.5 0.5 0.5 0.5 0.5 0.5 
##$DPOFFS= (0..7)
0 0 0 0 0 0 0 0 
##$DQDMODE= 0
##$DR= 18
##$DS= 0
##$DSLIST= <SSSSSSSSSSSSSSS>
$$ [...]
##$SUBNAM2= <"">
##$SUBNAM3= <"">
##$SUBNAM4= <"">
##$SUBNAM5= <"">
##$SUBNAM6= <"">
##$SUBNAM7= <"">
##$SUBNAM8= <"">
##$SUBNAM9= <"">
##$SW= 22.9630152165798
##$SWIBOX= (0..15)
0 0 2 0 0 0 0 0 0 0 0 0 0 0 0 0 
##$SW_h= 4595.58823529412
##$TD= 16384
##$TD0= 1
##$TE= 0
##$TE2= 300
##$TE3= 300
##$TEG= 300
##$TL= (0..7)
0 120 120 120 120 120 120 120 
##$TP= (0..7)
150 150 150 150 150 150 150 150 
##$TP07= 0
##$TPNAME0= <>
##$TPNAME1= <>
##$TPNAME2= <>
##$TPNAME3= <>
##$TPNAME4= <>
##$TPNAME5= <>
##$TPNAME6= <>
##$TPNAME7= <>
##$TPOAL= (0..7)
0.5 0.5 0.5 0.5 0.5 0.5 0.5 0.5 
##$TPOFFS= (0..7)
0 0 0 0 0 0 0 0 
##$TUNHIN= 0
##$TUNHOUT= 0
##$TUNXOUT= 0
##$USERA1= <user>
##$USERA2= <user>
##$USERA3= <user>
##$USERA4= <user>
##$USERA5= <user>
##$V9= 5
##$VALIST= <valist>
##$VCLIST= <CCCCCCCCCCCCCCC>
##$VD= 0
##$VDLIST= <DDDDDDDDDDDDDDD>
##$VPLIST= <PPPPPPPPPPPPPPP>
##$VTLIST= <TTTTTTTTTTTTTTT>
##$WBST= 1024
##$WBSW= 4
##$XGAIN= (0..3)
0 0 0 0 
##$XL= 0
##$YL= 0
##$YMAX_a= 1037495
##$YMIN_a= -696906
##$ZGOPTNS= <>
##$ZL1= 120
##$ZL2= 120
##$ZL3= 120
##$ZL4= 120
##$ABSF1= 10
##$ABSF2= 0
##$ABSG= 5
##$ABSL= 3
##$ALPHA= 0
##$AQORDER= 0
##$ASSFAC= 0
##$ASSFACI= 0
##$ASSFACX= 0
##$ASSWID= 0
##$AUNMP= <proc_1d>
##$AZFE= 0.1
##$AZFW= 0.1
##$BCFW= 1
##$BC_mod= 2
##$BYTORDP= 1
##$COROFFS= 0
##$CY= 11.3945322036743
##$DATMOD= 1
##$DC= 2
##$DFILT= <>
##$DTYPP= 0
##$F1P= 2.36226072786647
##$F2P= -0.459571619588291
##$FCOR= 0.5
##$FTSIZE= 0
##$FT_mod= 4
##$GAMMA= 1
##$GB= 0.15
##$INTBC= 1
##$INTSCL= 1
##$ISEN= 128
##$LB= 0.24
##$LEV0= 0
##$LPBIN= 0
##$MAXI= 10000
##$MC2= 0
##$MEAN= 0
##$ME_mod= 0
##$MI= 1.114404
##$NCOEF= 0
##$NC_proc= 0
##$NLEV= 6
##$NOISF1= 3.799351
##$NOISF2= 2.8
##$NSP= 1
##$NTH_PI= 0
##$NZP= 0
##$OFFSET= 15.70392
##$PC= 1
##$PHC0= -13365.79
##$PHC1= 26.20097
##$PH_mod= 1
##$PKNL= yes
##$PPARMOD= 0
##$PSCAL= 0
##$PSIGN= 0
##$REVERSE= no
##$SF= 200.130013532006
##$SI= 16384
##$SIGF1= 3
##$SIGF2= 2
##$SINO= 400
##$SIOLD= 16384
##$SREGLST= <1H.CDCl3>
##$SSB= 0
##$STSI= 0
##$STSR= 0
##$SW_p= 3612.71676300578
##$SYMM= 0
##$S_DEV= 0
##$TDeff= 0
##$TDoff= 0
##$TI= <>
##$TILT= no
##$TM1= 0
##$TM2= 0
##$TOPLEV= 0
##$USERP1= <user>
##$USERP2= <user>
##$USERP3= <user>
##$USERP4= <user>
##$USERP5= <user>
##$WDW= 1
##$XDIM= 8192
##$YMAX_p= 0
##$YMIN_p= 0
$$ End of Bruker specific parameters
$$ ---------------------------------
##NTUPLES= NMR FID
##VAR_NAME=  TIME,          FID/REAL,        FID/IMAG
##SYMBOL=    X,             R,               I
##VAR_TYPE=  INDEPENDENT,   DEPENDENT,       DEPENDENT
##VAR_FORM=  AFFN,          ASDF,            ASDF
##VAR_DIM=   8192,          8192,            8192
##UNITS=     SECONDS,       ARBITRARY UNITS, ARBITRARY UNITS
##FACTOR=    0.0002176,     1,               1
##FIRST=     0,             0,               0
##LAST=      1.7823616,     0,               0
##MIN=       0,             -696906,         0
##MAX=       1.7823616,     1037495,         0
$$ Real data points
##PAGE= N=1
##DATA TABLE= (X++(R..R)), XYDATA
0@%%%%%%%%%%%%%O8j36J36j36J36k04K72k72L40m08M76n47O16p49Q84j020J158
30F14j312J510j718J935k194K476k787L125l490L893m339M823n346N933o570P256
46C809q011Q834r737J0725j1815J3019j4346J5825j7478J9335k1444K3864k6674
59a4094K9969l3892L8677m4662N2391o2811P7697j00818J41902k36707Q75943
70G23595L13900j077112O40225j74281m56738J87068l27555m52042O98240j35742
80f0442o36464N25170L98208n23850J32103J72057k29236K85154N9430n08968
90c86838M10615M54220m74676n3846M17771j34775m0574L4750l50884Q0977L05304
101B62044m28124j91812M10827q1955k19681J98038l8281j3740K30322k17811
$$ y = [0, 0, 0, 0, 0, 0, 0, 0, 0, 0, 0, 0, 0, 0, 68, -68, 68, -68, 68, -136, 136, -136, 204, -204, 272, -275, 341, -408, 476, -544, 614, -698, 812, -906, 1029, -1165, 1311, -1476, 1649, -1841, 2052, -2287, 2536, -2810, 3123, -3447, 3809, -4202, 4632, -5105, 5620, -6195, 6824, -7522, 8303, -9175, 10160, -11284, 12580, -14094, 15875, -18017, 20660, -24002, 28389, -34422, 43275, -57543, 84359, -152348, 723595, 1037495, -39617, 600608, 426327, -30411, 156657, -170898, -622940, 75300, -60442, -696906, -171736, 226472, -297378, -165275, 6782, -222454, 62700, 122130, -386838, 23777, 477997, 3321, -50525, 367246, 232471, 191897, 226647, -124237, -43260, 262044, -166080, -357892, 52935, -29020, -248701, -50663, -88944, -102684, 127638, -90173]
111i0173j53735L99470l3131l03075K34731J19560j51186J28758n0352j55220
121e4353K61861k2708l60968J56915J45807k80792K6377J11333j60768J31277
131d6019R9994k42012J50205K13803k63462L5694K37644j73396p678J39484j66759
142b2502L8309J40770k33899j4816K25455j64942j12432J73349o7710o3138J37942
153C6386r1519k4619K00356j06452j10799K14111k0375j61870J03990K0961p7889
164a7719O4650p4251r9087J78810J0709k08336Q9399J29668r8977O086L7881m9864
176c1031J04113J3613j79535P7965J49538j50104p0405J15419j3190j7419N261
187D225q4623P7346J26914j57588q8736J69547L0662j09219j1509J0303L7609
$$ y = [-90173, -243908, 155562, 122431, -180644, 54087, 173647, 22461, 151219, 100867, -54353, 207508, 184800, -176168, -19253, 126554, -154238, -127861, -16528, -177296, -46019, 53975, -188037, -37832, 175971, -87491, -51797, 185847, 12451, 4773, 144257, -22502, 15807, 156577, -77322, -92138, 133317, -31625, -144057, 29292, -38418, -101556, 36386, -55133, -79752, 120604, 14152, -96647, 117464, 97089, -64781, 39209, 60170, -17719, 46931, -27320, -126407, 52403, 63112, -145224, -55825, 73843, -25134, -19048, 18833, -31031, 73082, 86695, -92840, -14875, 134663, -15441, -85846, 29573, 16383, -1036, 4225, -80398, -3052, 123862, -33726, -122462, 47085, 77747, -31472, -42981, -32678, 4931]
198D931O1805j07646o8675J74991K7763j60754K9473R8119r169j2455o0315j6072
210c8004J28279k3445j68793M6663J29294o1086r0386L977M3664P0975l7243j15794
222a11899Q5064J39322q3683q2509P2785O1888p628o2909n4958P4997N8700j20099
234c0929p1106J03444M2924q0727m1784L4264P0610J6093r6967j3952J29972J1606
246G3448j05877k633O6973K7170l2882o9903K6009Q8754m0561r4900L7339P1577
258D4514k1068n8934j0031N5758L5404o1735n4385O5993N9340o2635n1303M8184
270a0898M7519j1131n1085o453P2973J9953p4872j2495O4527J2290n1812l1720
282c3204K9366L4377l3243n9510J9724O4257j9818n8856K4902N8202M300l5327
$$ y = [4931, 66736, -40910, -109585, 65406, 93169, -67585, -38112, 60007, 50838, 38383, -21932, -38004, 90275, 66830, -101963, -55300, 73994, 12908, -77478, -73501, -29837, 41138, 3895, -111899, -26835, 112487, 28804, -53705, 19080, 80968, 73340, 10431, -44527, 30470, 89170, -30929, -102035, 1409, 44333, -36394, -78178, -43914, 26696, 42789, -54178, -68130, 61842, 73448, -32429, -35062, 31911, 59081, 26199, -43704, -17695, 71059, 30498, -64402, -27063, 44514, 23446, -35488, -45519, 10239, 45643, -16092, -70477, -4484, 54856, -7779, -59082, -10898, 36621, 25490, -25595, -32048, 40925, 60878, -13994, -26489, 38038, 50328, -1484, -33204, -3838, 30539, -2704, -62214, -42490, 21767, 1949, -56907, -32005, 26197, 30497, -4830]
294d830j5902M8175L7839m9976l9027M3124L0044m2751m4313J7058L6998j3313
306C126m9914r26N6963J1811n7489j274O2607J6088l7836k3835L0568M5369l0889
319B4369o0656K6663N1702k8430n2461O656M6597Q211m7736k1572N4841L6287
331D4471n2638l5964N2407L7079l8191l8210J2400N1311l86o7167l124P1933J883
344C5804n7253r339M2946K8627l4277m9680L1131N8215l3746o0518K1366N5540
356B8816j2251m8482p300N0835L2272n0624l6519N8626M2857m7462m0888K7644
368b476M3188j4114o1462l638O1860L586o5473j1899N8895K4059m4224k9079L9341
381a436M9327k3961n5699K0851O2001j8901o0701J661M8617P472n1513k7811M8559
$$ y = [-4830, -20732, 27443, 65282, 15306, -23721, 19403, 49447, 6696, -37617, -20559, 16439, 3126, -46788, -47714, 9249, 21060, -36429, -37703, 24904, 40992, 3156, -20679, 9889, 55258, 24369, -36287, -9624, 42078, 13648, -38813, -32157, 14440, 22651, -25085, -46657, 8184, 44471, -8167, -44131, 8276, 45355, 7164, -31046, -18646, 32665, 32279, -34888, -38012, 33921, 35804, -21449, -30788, 12158, 40785, 6508, -43172, -12041, 46174, 12428, -48090, -26724, 28816, 16565, -31917, -39217, 11618, 43890, -6734, -43253, 15373, 58230, 10768, -30120, -2476, 40712, 26598, -34864, -38502, 23358, 26944, -38529, -50428, 8467, 32526, -11698, -40777, -1436, 47891, 23930, -31769, -10918, 51083, 32182, -28519, -26858, 21759, 29231, -22282, -50093, -1534]
394a534L7397m2519m0792M0502N0345k8210m5411J9460M4530J250n2026j9413
406c6421N8618J9568o4176k1836M6810K7385l0090l9700K2947N4479j1759n8264
418c2439J1370O0485n675n4694r526M4142J9890m1117l9519L7196M9992l5985
430D120n0107L2749N0195j6360m3345M21M8141J7017n3309k9480N4866K7890n3992
443a1194l3163L6533L5886j9791m3356O582N9192K782o1929j35N7947O170m3344
456g820k3107L4216L6994l3872m8746K5745N0051j7695n3338J1785N2564L36m2696
469a5583j3570M1925L0657m3385m1331M0713L8474l3548m3222J9821M4781o896
481A8836m3989o064N0656K0406m9231k3175M8960K4446l8642l0049K1347L6141
$$ y = [-1534, 35863, -6656, -47448, -6946, 43399, 15189, -30222, -10762, 33768, 35018, -17008, -36421, 22197, 41765, -22411, -44247, 2563, 29948, -142, -39842, -16895, 37584, 25825, -32439, -21069, 39416, 33741, -20953, -30479, 13663, 33553, -7564, -47083, -9887, 40105, 4120, -45987, -13238, 36957, 20597, -22748, -22327, 25814, 42831, -10478, -39958, 14908, 42798, -11194, -44357, -7824, 28062, 8271, -35085, -28503, 30689, 33471, -28458, -28593, 29354, 35524, -7820, -30927, 3289, 40283, 6411, -42335, -16590, 33461, 15766, -37572, -25787, 26777, 27113, -15583, -29153, 12772, 43429, 44, -41287, -574, 37900, 4352, -38870, -19049, 25732, 18836, -25153, -31217, 19439, 39845, -9386, -32561, 16399, 40845, 2203, -27846, -6499, 29642]
493B9642j4652m9314K405N1160n75n1382J308M3950J2666k7751k2779K7790M0560
506D3028k6639m3695K5635L8071k1543l5866J816L1329R596m1176k0264M5190
518E482J9212l8968j6491K8267K8954j4194l5786J2590M4118j2557m1219L706
530a6886L7049N494l7890j2899L4822J8411k8413k8507K4144L5708k4446l6448
542b9861J6760L3367r076l4753k049L5503J1647l5150j6402L8611K6457l3817
554A237k0721K7250K4934j6283l3936L001L7565k614m7289m263M2163M054l8573
567b3475q871K9682K5095j6951l4862K2807M7909k1479l9724J6466L4222m805
579B6014l4783j9343L3110K4803m4643k9317L9793K6118k5850k5847J4507M0998
$$ y = [29642, 14990, -34324, -31919, 19241, 18666, -32716, -31408, 12542, 25208, -2543, -25322, 2468, 43028, 16389, -27306, -1671, 36400, 14857, -21009, -19193, 12136, 21732, -19444, -39708, 5482, 24694, -14274, -30765, -2498, 26456, 12262, -23524, -10934, 33184, 20627, -20592, -16886, 20163, 25657, -12233, -25132, 9690, 28101, -312, -28819, -4675, 31033, 6587, -29861, -13101, 20266, 11190, -23563, -25612, 9891, 21538, -13612, -30014, 8597, 35054, 1237, -19484, 7766, 32700, 16417, -17519, -14518, 23047, 20433, -26856, -31119, 11044, 15098, -23475, -32346, -2664, 22431, 5480, -29382, -6575, 41334, 19855, -19869, -3403, 30819, 26014, -8769, -28112, 4998, 29801, -14842, -44159, -4366, 21752, -4098, -29945, -15438, 25560]
591B5560N46m4257M75M7330N440m5283j5957L6185J9698l1884k9635J7694L9218
604B5130j4422m5751J3143M6848m626l8955n104L3964J7760l0908k5137K9656
616A598L4785k7540m0675K5509L4892j4274l2134m470L6221J4471m3587k1100
628c6304M1892K3570l4001k4811K2469K8945j1090l2723J044M1580O328m3781
640a6882j245M0826L691k8590j3205J8196K6315j7188m3042J2916L7974j8444
652A322l4808J0870K6866Q052k0349j5827K8727K8397k5643k1972K5771J8519
664B9925k1639k2610R550K0570l28k9933j0209L2670N679l6174o458K9342J1233
677A1618j5774j4146J0544K7725j426k9723O757L2471j0141k6487L753J3965J547
$$ y = [25560, 26106, -18151, -17676, 29654, 35094, -10189, -26146, 10039, 29737, -2147, -31782, -14088, 25130, 10708, -35043, -21900, 24948, 20322, -18633, -23737, 10227, 27987, -2921, -28058, 1598, 36383, 8843, -31832, -6323, 28569, 14295, -17839, -22309, 13912, 28383, -15204, -36304, 5588, 29158, -4843, -29654, -7185, 21760, 10670, -22053, -21009, 20571, 26899, -16882, -18127, 22699, 26390, -2200, -15405, 2791, 29106, 11918, -31124, -18208, 19766, 1322, -33486, -22616, 4250, 12302, -8047, -23874, 4853, 33250, 7607, -14365, 11406, 29925, 8286, -14324, -4774, 15796, 15468, -14465, -24674, 7996, 13675, -22499, -28957, 385, 11618, -4156, -18302, -7758, 19967, 18541, -11182, -4425, 28046, 17905, -8582, -4829, 9136, 10683]
690A0683j5494j6857K0512K1551k5124k2646K2762K1219j5696j7050N211J9060
702H131M432k3257j1701L2435J2662k7907m427K1224P044j0840j4175O067K0248
715A9936r452l3156Q742K7266j2275k4229K688J8548J4337j7018k1070K3637K7669
728B5623j9845j8400J6891J9388o678j9375l684K0760P278l2410j0493K7501L302
741I858k8941p838J9541J8959r356k4374O425L4982m06l2722M605L0029O48k0106
755A304j0353J0408J9401j5435k6616J6007K4260j9361k1933J3265J9159k176
767G930k1868o411K4758J6339k8910j7271L0359J6510j8357j3995N992K1485L399
780A9960k6903o250L2392J088l0729l443J7596L112j1870j5712P853K6794j2980
$$ y = [10683, -4811, -21668, -1156, 20395, -4729, -27375, -4613, 16606, 910, -16140, -10929, 8131, 12563, -10694, -22395, 10040, 22702, -5205, -9632, 11592, 18636, 7796, -6379, -312, 19936, 10484, -22672, -13930, 13336, 1061, -23168, -20480, -1932, 12405, -4613, -25683, -2046, 25623, 5778, -12622, 4269, 23657, 16979, -2396, -6080, 14680, 21958, -10452, -20945, 6556, 9858, -19083, -26921, -7380, 11579, 2223, -22151, -15726, 19256, 18850, -13872, -9267, 20762, 21410, 1304, -9049, 1359, 20760, 5325, -21291, -5284, 18976, -385, -22318, -9053, 10106, 7930, -13938, -20349, 4409, 20748, -8162, -25433, 4926, 21436, 3079, -10916, -4924, 16561, 19960, -6943, -13193, 19199, 20287, -10442, -13885, 3711, 6823, -5047, -20759, -12906, 13888, 908]
793I08l0917J5889K9376p209j7468L273J8801J2627j6625k1632K0438K1737k2858
806F340k0195J1238Q811q912j6844k613K0081P412k2346l231K9750P081j9962
819c390l553J7660J1067p426k2819K008K4555m355k8215L305J9796j785j5504
832h656p569R119J3543q988j7087J5964J8807j5503j2671J5204J3211l172j4779
845b577o456J9338Q489k4532j1841K2316R021j5407j0997L807J3327o73j8127
858a4312M17K2826k534j8579N497J6811L20j0407m764J2517J4796j5542k0253
871a3207J1819J6834j3831j8041L678J0840M458j3879r091J8859J2692j3539n760
884h168J6420P969j0202q532O343J3372m487k1156r18J9963l728k2452l488J4030
$$ y = [908, -30009, -14120, 15256, 8047, -9421, -6148, 12653, 25280, 8655, -12977, 7461, 29198, 6340, -13855, -2617, 6194, -2718, -19562, -22175, -2094, 5318, -17028, -20259, 9491, 16572, -3390, -6943, 10717, 21784, 14358, -8461, -6453, 18102, 13747, -14468, -11163, 8633, 6848, -8656, -16225, -7106, 6437, -2551, -19638, -3674, 15133, -370, -13041, 2163, 15374, 12202, -2577, -9033, 10305, 18794, -5738, -17579, 4737, 13758, -1649, -12646, -8839, 4488, 3815, -14312, -13895, 8931, 6397, -12182, -6685, 10126, 10446, 39, -4725, 7792, 22588, 7046, -13207, -1388, 15446, 1615, -16426, -12748, -1908, 2550, -11329, -20420, -1561, 11131, -2408, -8168, 8252, 16221, 6019, -2513, 3830, 17202, 12715, -8441, -9359, 10604, 6876, -15576, -19064, -5034]
898e034P257r838j1231R245K0017m950j3759J1605J5003m884j2292O70J0824J814
912A4447j7727r492J4546P632j9965j0971J2710J3075n196j3938L528J8750L322
925A0721j6589j435J9169M262j4900n146J0805P478r527j4177O588J5311q635
938C925j9248N097J5370k233j4761l654J4907J1690j5139j2614J7341J3583r520
951D744j1648O386J4966N87j7433l237J8117K323j9212q726J4140N525j3338j1400
965a8206P947J6095n461j7483P540K0078M29j4527o13J4809Q301j3128j2799J1750
979D732J0807j2000j6053O266J1076m941j2495j607J4845N120j5746m176J7461
992C289Q727j1301q796J0395J3115n022j5683J538J4907j208j6272l494J1622
$$ y = [-5034, 2223, -7615, -18846, -9601, 10416, 5466, -8293, 3312, 18315, 13431, 1139, 1809, 12633, 14447, -3280, -12772, 1774, 9406, -10559, -21530, -8820, 4255, -941, -14879, -11351, 7399, 10721, -5868, -7303, 11866, 16128, 1228, -3918, 6887, 14365, 4838, -9339, -2751, 12560, 3925, -15323, -10226, 5144, 2911, -11850, -15504, -597, 11093, -4046, -16660, 681, 14264, 4744, -6904, -518, 14448, 15035, -2398, -5635, 12482, 14805, -4407, -13133, 1007, 6532, -6806, -18206, -10259, 5836, 375, -17108, -9568, 10510, 10939, -3588, -4201, 10608, 18909, 5781, -7018, 4732, 15539, 3539, -12514, -6248, 4828, -113, -12608, -14215, 630, 5750, -9996, -14172, 3289, 12016, 715, -8081, 2314, 15429, 10407, -5276, -3738, 11169, 9961, -6311, -9805, 1817]
1005A817M284j1472o855R331Q767p195j0959O464J4717m829j3053N929J0593J658
1019I197r736o474J1644R019j2459p627Q224P906p725r107K198Q233n9j2991j234
1034a0991J3882M33j1914K84R996O150n156p070N229J2209m895j2038L467J0463
1048A0049n259r092Q4L871M109r848p890J1497P364j1043k728Q321P425j459q497
1063c096J405J0921j78j2486j91Q462K297r538m673N795N913n854p450M635R423
1078E385l138j1027M616J1322k842q265l38P058N461p501r310Q893Q882q492p511
1093f807O588O851k603q717j713J0434L668j2631m148J1290L055q088m774M131
1107c464R729m037r443K488J2340n60j0639j55R534O23o902o239M817R593q094
$$ y = [1817, 6101, -5371, -12226, -2895, 5872, -1323, -12282, -5818, 8899, 4070, -8983, -3054, 7539, 9197, -539, -7013, 4631, 13650, 1191, -6436, 1788, 9694, 1969, -7138, -4940, 3293, 3234, -9757, -10991, 2891, 3324, -8590, -8306, 1690, 7840, 2684, -4386, 843, 13052, 8157, -3881, -414, 10049, 4790, -4302, -4218, -347, 3762, -6086, -13976, -2479, 4885, -6158, -8886, -565, 6860, 5401, -3096, -1691, 9230, 9052, -3434, -3625, 4837, 7134, -2404, -7077, -1282, 4631, -1223, -8673, -4038, 5385, 2247, -8780, -4164, 7158, 4316, -3949, -4287, 2771, 8232, 731, -8579, 314, 9196, 704, -6807, -219, 6632, 4029, -4688, -6401, 4033, 7701, -4930, -9078, 2212, 5267, -2821, -7595, -3464, 6265, 2228, -7215, -4727, 7613, 7053, -3586, -3741, 5793, 6416, -486, -6725, -1908, 7685, -409]
1122d09j0316Q058P896m902o579J291Q576K823q239m001R744N283r134n845N627
1137a27O106l833q866R02Q844Q03j0067j73R553L409q716l198P876L972l283q111
1153d909J796J0407m507r876K834O399n11n469j797M164P693n782o661Q113N906
1168G800o340l754K152L020R96p108k314O348K318o045k890O105K769m812j812
1183c567K961L935J110p517O95R348l476o490J279K905J133l784k393L333M486
1198C958l637m987L884L014k301k692R29L435J033m826n43N747J694o507j409
1213c208N272K686m151k490J634M319j073o378p07N713j006o271N76L439J603
1228d2j841l078N935M372m129m107N133M694k900l551j477M861O42p136l651O038
$$ y = [-409, -10725, -2667, 5229, 327, -6252, -4961, 3615, 6438, -1801, -5802, 3942, 9225, 91, -5754, -127, 5979, 2146, -6720, -5818, 3026, 3829, -6238, -6411, 3142, 6551, -2165, -5363, 2513, 6485, 3202, -4909, -3113, 7294, 2787, -7089, -4255, 2144, 1633, -3836, -5633, -1469, 6224, 442, -6219, 1894, 7800, 1460, -2294, -142, 2878, 3874, -3234, -5548, 800, 3118, -2927, -5817, 288, 3057, -1755, -3567, -606, 3329, 4439, -3078, -2383, 6965, 3489, -3001, -1722, 1183, 2316, -1468, -3861, -528, 3958, 321, -4666, -782, 2232, -69, -2761, -1832, 1603, 2636, -2190, -2733, 3014, 4708, -1799, -3208, 2064, 4750, 599, -1891, -257, 4062, 2989, -3389, -4096, 1617, 611, -5660, -5084, -1645, -42, -1883, -4961, 974, 5346, 1217, -2890, 2243, 6937, 4037, 486, -991, 3870, 4512, -2624, -6275, -237]
1244b37J585m408m690M654M276j062m230J697O337J433o439O21O248j280k724
1259A781k573J474M763l500q116K944N799l145o200K196M521J224k417m095M551
1274g93O556m538m029M619K400k221q94j280L000J434m829k082M962Q03n971r46
1290c809L292N25q78k507k093N540J469o370K834N555p94j858J805J94J656l60
1306D201l494J063J657m048k690P34Q48j695J92j644J270K602Qj899M853K361
1322D319k626J890N35j277J049r91j894R21j202m069O88J165l151L01K316k56
1338b282J7L87q63L909J547k497J995K872o13j970j482Q8J556j230k762q51K878
1355F99k567l004Q31L232l82j620l87K489L220j992k782M385L361j901j906n08
$$ y = [-237, 1348, -3060, -7750, -3096, 1180, 118, -4112, -2415, 3922, 5355, -1084, -463, 5785, 4505, 1781, -792, 682, 5445, 1945, -6171, -3227, 2572, -573, -6773, -4577, -56, 1168, -1249, -5344, -793, 5763, 1225, -2804, 1815, 4215, 1994, 1100, -180, 2820, 4254, -575, -2657, 2305, 3108, -2863, -3809, -517, 8, -870, -3377, -5470, 70, 1539, -4831, -1997, 3558, 2764, 906, 2711, 2905, 4561, 4201, 707, 1770, 3427, -621, -3311, -2577, -1729, -3424, -3232, -4876, -3606, -1004, -996, -2895, 1958, 4319, 1693, 3583, 4118, 2841, 3890, 2899, 1005, 1926, 724, -3345, -2657, -1492, -4643, -4342, -2026, -2282, -2265, -1878, -2741, 1168, 2715, 218, 2213, 5085, 4472, 2502, 1020, 1108, 2664, 1434, -1328, -2179, 699, -1868, -4872, -4041, -809, -1191, -2811, -3198, -709, 2511, 519, -2263, 2122, 5483, 3582, 1676, 1168]
1371A168K031J624l292l752J963J625m987j269J710O17o43j35j247M313K237l354
1387a391m22N103K706l459O60j176L207n62n221l92L576q87n442n45L46j73l02
1404d374p44J060M670K2l218K864M254l28J76m06q53L059l219m201J862R17l549
1421b008j69j523J31O77M22j737K532L096k152O69J555O00L67l67k054J675J693
1438C407j617k260M29J184j164l65l64k545J403M99k224J881J745j558R29J483
1454H63j767K201O80k069J615K188j447k30p65j79J19n71k981J42J430j548j629
1471c948M75O92O60J033Q33j528L863J501k705K072J615j351j098n51q09l4j582
1488h62k007n09K321j490j640J158J064J960L85k501K508K777o00r70K18J883
$$ y = [1168, 3199, 4823, 1531, -2221, -258, 1367, -3620, -4889, -3179, -2562, -3205, -3340, -4587, -274, 1963, -1391, -1813, 3290, 5996, 2537, 3197, 2021, 5228, 4666, -555, -947, 2629, 1742, -3700, -4245, -3899, -4072, -4374, -5118, -4058, 612, 634, -2584, 280, 4534, 4206, 4382, 3976, 3123, 6182, 2963, -1238, 624, 1541, -2008, -2177, -3700, -3569, -2892, -2470, -4207, -1675, 1421, -731, -62, 1493, 2093, 2460, 2093, 39, 1714, 3407, 1790, -470, -41, 1143, -21, -386, -750, -3295, -1892, -1393, -3617, -1736, 9, -1549, -620, 863, -904, 1297, 1977, -92, 1523, 3711, 2264, 2034, 1269, 1090, 1209, 638, -2343, -2201, -771, -2319, -3948, -3473, -2781, -2121, -1088, -255, -1783, 2080, 3581, 876, 2948, 4563, 3212, 2114, 1563, 754, 720, -862, -2869, -3378, -1057, -2547, -4187, -3029, -1965, -5, 380, -2121, 387, 3164, 2564, 1594, 1812, 3695]
1504C695m22j853p19l37o67n52j791PJ791j838L77J100J15J459j155j238L794
1521A766R47j754M90p82J786J178j765q84j187J296j37q59k701O57J187k213j38
1538c113J147P24O79O4q2J838J067r53O98L85Q10p75j774J143J73l055k05j485
1556b714LK267j452k227R63K563j371J199L20Q28L716j169k003K467O30k086j176
1573G58L84M38k441j025j657J297K546l339k215L832K020j282L73j093L272K681
1589D549l727k288M777K98l161l4M79M8L41j751k015K651l1l308K93J383J482
1606a4j903n34K859J132p24j085j21L558J59l468J132J990m07m48j548j892J924
1623F10p87l279M51K193j576j257O78K460J2l55J133J413K295j137j636Q56K260
$$ y = [3695, 3273, 1420, 701, 364, -303, -855, -2646, -2639, -848, -2686, -2309, -1209, -1094, 365, -790, -2028, 1766, 2713, 959, 1449, 667, 2453, 3631, 1866, 982, -205, 1091, 954, 95, -2606, -1949, -762, -2975, -3113, -1966, -1242, -563, -499, -581, 1257, 2324, 1371, 2069, 2454, 3264, 2489, 715, 1858, 2031, -1024, -1229, -2714, -2711, -444, -1896, -4123, -3160, -597, -1968, -769, -449, 379, 4095, 2926, 923, 3390, 4020, 1934, 758, 1142, 1580, -861, -1886, -3543, -2246, 300, -3039, -5254, -1422, 598, -684, -311, -1404, 1868, 4549, 822, -1466, 3311, 3609, 448, 414, 893, 941, 1282, -469, -2484, 167, 136, -3172, -2879, -1496, -14, -1917, -2451, 408, 1540, 816, -269, -390, 3168, 3327, -141, 991, 2981, 2574, 2126, 578, -1314, 610, -177, -3456, -3005, -812, -2388, -3645, -2967, -507, -495, -850, 283, 1696, 3991, 2854, 1218, 2074, 4334]
1640D334k301n43K12j774K05j724k210K328r01j280J870P57nR1N94J985O91j13
1658B216q41P75J410O5k571o75P39K16l452L59J507j549J59k3o08K513n72k660
1676b992K650K519k316q90K643Q25L28k344Q4K195J0l155j569L193p70k214l51
1693b154LJ742Q22l204r28M715J01k893Q68L207J006r18k825J476L174j546l733
1710a087L18J802L17m742l47L581J70k404j079K267L110n43l953K658M450r54
1726C564l981J998J189M45k281m084K294L842m084l192K182K229o1l219q08M462
1742D95J782l953k91L221K165k330k381J592K525r15n216J956M392j180l342l16
1758a796J786J498j596l234K365L421l162j193J884J420J82j320k015L768K20
$$ y = [4334, 2033, 1490, 1702, -72, 133, -1591, -3801, -1473, -2374, -3654, -1784, -1027, -1032, -941, -347, 1638, 2329, 2216, 1375, 2150, 3560, 3625, 1054, 379, 1118, 1334, -2118, -1759, -252, -1801, -1642, -1665, -2273, 240, -332, -2992, -342, 2177, -139, -1029, 1614, 2439, 2767, 423, 507, 2702, 2712, -443, -2012, 1181, 411, -1803, -2154, -2151, -409, 413, -2791, -3719, 996, 1097, -1796, -928, 2279, 3285, 2367, -458, 1018, 4192, 2646, -1087, -769, 1033, 1350, -3392, -3739, -158, 12, -2392, -3471, -1204, 1906, 1363, -2590, 68, 4518, 3564, -417, 1581, 2770, 3215, 934, -3150, -856, 2986, -1098, -4290, -2108, 121, 60, -3159, -3967, 495, 2277, -1676, -1967, 1254, 3419, 1089, -1292, 300, 2825, 1910, -3306, -1350, 3042, 1862, -1480, -1796, -10, 1488, -108, -3342, -977, 2444, -718, -1911, -27, 1393, 1575, 255, -1760, 2008, 2228]
1773B228k795n44K195J093j893j340J055J511j160l428K199J103m92n87n08K179
1789H16J516k883n91K776M04j791K36L62J457q41l006J387K399l564j704J592
1805a435K362m85j866o07L043J116k025j653J803J688j572l41N41M71m59k907
1821b326J720J912n73k712J16K548J933k322k048K113L374k373m077K223J564
1836A072N80m442p3M414o6k821r00L785J064k385k460J998M284k495m074K243
1852b76K131N11m500j087L957L047m804k778L910L214k505l139J864K684L58l951
1868a364l81L821J019l759k711L742K779l569k723J883M234j310m493R98L934
1883B100J278l999k098L325K021l477k035K394L120j900k568L51L709R1l827o45
$$ y = [2228, -567, -1111, 1084, 2177, 284, -1056, -1, 1510, 350, -3078, -879, 224, -268, -855, -1363, 816, 2332, -551, -1142, 1634, 2038, 247, 483, 845, 2302, 1461, -1545, -158, 2241, -1323, -3027, -1435, 927, 442, -1424, -2031, 1012, 2128, 103, -1550, 253, 1941, 369, 28, 569, 1040, 581, -2326, -606, 1306, 733, -1979, -1863, 685, 2618, 296, -1752, 361, 3735, 1362, -2715, -492, 1072, 1652, -2790, -2863, 1551, 1485, -1336, -2236, 1549, 2613, 228, -2232, -234, 4050, 1555, -2519, -276, 1855, 2366, -2134, -3221, 736, 3783, -1021, -3799, 111, 3325, 820, -2319, -455, 2229, 2587, -1364, -1745, 2076, 3095, -664, -3375, 367, 3146, -423, -3146, -1263, 2971, 1661, -2832, -1834, 2100, 3378, -621, -2719, 606, 2627, -850, -2885, -491, 2629, 729, -1839, -1488, 2221, 2312, -1515, -2160]
1899b160L312J531m359j012L002J861j845k563J191K168o19l438J623K930N03
1914B125k131r01K190J482k303k731K683P71q41k507O86K246o48l107J526K627
1930A167L92k472r06K893J532k103k188K232J668j975j578Q4J246J25j603P93
1946f93J502k81j995j11J944J278j825m92J348J268k098k425K755K470j725j913
1962i93j09K223P71k478j104L238J53k227l51Q28R03j465k196J468L466j542m050
1979c465J986M012O0k278k114L492K027k619l308K490K792k458k895M37K349n51
1995d3l017Q8M054J522m325n29L816K110k708k636J968L970k002l720J04M053
2011B705P53m564k170K763K468l299k785K586L571k405j832J60M069L21l380n53
$$ y = [-2160, 1152, 2683, -1676, -2688, 314, 2175, 330, -2233, -1042, 1126, 507, -2931, -1308, 1622, 2125, -6, -907, 1283, 2765, 462, -2269, 414, 1185, 344, -2163, -1477, 769, 121, -2986, -1460, 1167, 1559, -913, -1819, 1074, 2606, 503, -1685, 547, 2215, 240, -1338, -1254, -8, 117, -1486, -693, 809, 528, -1467, -1578, 366, 1644, -181, -673, 675, 1943, -155, -2580, 175, 2645, 920, -993, -1102, 1121, 1892, -586, -1690, 1548, 1701, -526, -877, -49, 854, -611, -2807, -1339, 2127, 585, -3465, -1479, 2533, 2593, 315, -1799, 1693, 3720, 1101, -2207, 283, 3075, 617, -2278, -1841, 508, -43, -3060, -2972, 1082, 2604, -1721, -2250, 1566, 3676, 968, -1668, 300, 4270, 2268, -1452, -1348, 2705, 3458, -1106, -3276, -513, 1955, -1344, -4129, -1543, 2028, -377, -2209, -2049, 2020, 2341, -1039, -1592]
2027a592N478n13l502j481K888K060j635m773J709M217k561l792J257K325J82
2042B67k904j752M247J859l547j54K448L094p50l018J877L469j403m750N27K399
2058A909R00l549k829K220K225l066j435J782K212j72l547J768L500J49k373J245
2074I39L411m39k402j282K515L95j967l400Q67K750k385l833J483K189O22p45
2090a282j449K278K613k526l83K942J380k043r55M04K457n32m185O68K780j275
2106H92m357q75L845J62j622l035L265K779o98k236K015K983j296r95r14K812
2122B725M91k870j132K779M23k510l623K378K861k391k395J1M287j27k621p00
2138b414M797K26j090j796K324K196k497k575J544J555k722k332N55K831j65l664
$$ y = [-1592, 3886, 3373, -129, -1610, 1278, 3338, 1703, -3070, -1361, 2856, 295, -3497, -2240, 85, 267, -2637, -4389, -142, 1717, -1830, -1984, 464, 3558, 2808, -210, 1667, 5136, 3733, -1017, -490, 1909, 2809, -740, -3569, -1349, 876, -2190, -3625, -1843, 369, 197, -3350, -1582, 1918, 2067, -306, 939, 4350, 3911, 1509, 227, 2742, 3137, 1170, -2230, -1363, 1387, -998, -4831, -3348, -1159, -537, -1282, -2731, -453, 2160, -366, -749, 2193, 3573, 1530, 575, 979, 3436, 2904, -1281, -613, 2167, 892, -3465, -4340, -495, -333, -1955, -4990, -1725, 1054, 356, -1880, 135, 3118, 1822, 827, -87, 2725, 3216, 346, -786, 1993, 2416, -94, -3717, -1339, 1522, -869, -3264, -3253, 1034, 907, -1714, -2414, 2383, 2609, 1519, -277, 2047, 4243, 1746, -829, 715, 2270, -452, -2784, -2229, 602, 437, -3227]
2154c227o75L572K777k702j961L223K318k041k180P20K815J199m152j081K822
2169A427R69l635j844K975L52k557j355O17M642j371l844K666M752r99l596J64
2185f37L144R41k733l164K701K378l025j808J186J576p34k709L8L215L07k614
2201a938j099M849J162k904j690K113L310j492l823J216L880j519m267O13J570
2216a9J254k987k192L505J987l366j001K572J513r13k169M42M642J59m132J052
2232C47K285J303l230k319J652K997l740k710R57K888j557j640m5L763Q06k923
2248a166p43M140J512l761j524K137L391k559l294J710K306j608j750j527K558
2263a78J637l349j342K374J847k467p17K211K197o55k739R50L878n68l976L0L617
$$ y = [-3227, -3902, -330, 2447, -255, -2216, 1007, 3325, 1284, -896, -176, 2639, 3838, -314, -1395, 1427, 2396, -1239, -3083, -108, 244, -2313, -3668, -3051, 1591, 220, -3624, -958, 3794, 2795, -801, -637, 2507, 3448, 715, -2449, 252, 2630, -395, -2203, -1017, 559, -175, -2884, -2846, 369, 676, -1938, -3037, 1812, 2974, 70, -1620, 493, 3803, 2311, -1512, -296, 3584, 2065, -2202, -1589, -19, 1235, -1752, -3944, -439, 1548, -1818, -2819, -247, 1266, 353, -1816, -1374, 3268, 3427, -705, 347, 2632, 3935, 705, -1614, 38, 3035, -705, -3415, -2458, 430, -1127, -2767, -2812, 951, 1757, -1166, -1909, 2231, 3743, -18, -1542, 595, 3986, 1427, -1867, -157, 2149, 541, -1209, -2736, -178, 1459, -1890, -3232, -858, 989, -1478, -2195, 16, 2213, 1558, -1181, -231, 3647, 3079, -897, -867, 2750]
2280B750l59k483j569J108K521k390k695R79L558k024k782J820J704J251j919
2295e30k50L284Q99j973r18J490P69k040k321P85K338j675k280J1K060P44l226
2312b833k70K620J842j728m39J343K730r29k981J268K442l47l375J4J676m15j721
2329a103j800J744J754k377j282K148K298j478n87M50J847Q60l034m91L141Ok262
2346a66o37J524J554k313k388J114L098k340j971M09K424J60j977q56K063K310
2362B008j815j995L147J648j657k352J324J663k90l459k8K938m72k056j188L086
2378E02k24j692n39J574K718j523k815J811K402n62k082m75K901N66k619j695
2394a752J367K339l078k602K040K630m33j964l31K673M13k201j091M112O71l211
$$ y = [2750, 2391, -92, -1661, -553, 1968, -422, -3117, -2138, 1420, -604, -3386, -1566, 138, 1389, -530, -780, 2504, 3403, 1430, 512, 2002, 2771, 731, -1590, -805, 1533, -142, -2422, -2411, -351, 393, -2833, -3103, -483, 1359, -369, -808, 535, 3265, 2336, -645, 623, 3065, 2718, -657, -643, 1033, 618, -1103, -2903, -1159, 595, -1782, -3064, -916, 1382, -96, -683, -233, 1614, 2474, -560, -1051, 2090, 2096, -166, -803, 721, 2275, -38, -2426, -1312, 1786, -554, -2525, -2116, 308, 468, -1509, -2365, -302, 2008, 193, -1802, 1345, 2993, 1336, -1016, 308, 1971, 1681, -1778, -1806, 1132, 660, -1396, -2584, 502, 278, -1414, -1953, -379, 2339, 816, -1999, -188, 2214, 1652, -430, -905, 1996, 2562, -57, -1752, -385, 1954, -1124, -3726, -1686, 944, 511, -1453, -1784, 889, 1302, -899, -1990, 2122, 2793, -418]
2410d18j065J922J350j551j955N8J917rk918N81K550J216j882j296Q68K294p40
2427I22k948J995J636L5l003J742J519j11k265q99J669J652k340j346J069K186
2443A513j427k162J360J670m05k261N70K158L06j882M8J199O00j422j150J613
2459C28J526j832j302P65J757j805j552P34K266o38j567m26J695K008j516r11
2475d70J457P83m68j780l53J616J90k212L29J372R2j757p73J357J452j564p64
2492a493R47K334q40j716J75J867m89j449j64N00J700j896j322K697J37m55j774
2509a241K64K125p38k170M70K404r51r78m60K006j89L1j134N16J492l16k350R94
2527b25K035j160k093l1K050J45j614p87J808J156j489j530J678J186q61j171
$$ y = [-418, -1483, 439, 1789, 238, -1717, -1659, 258, 249, -2669, -2088, 462, 1678, -204, -1500, -632, 1662, 922, -2026, -31, 1605, 1640, -1363, 379, 1898, 1787, -478, -1377, 292, 1944, -396, -1742, -673, 1513, 86, -2076, -716, 954, 549, -1712, -1142, 1016, 1322, -560, -512, 687, 1287, -135, -1285, 328, 1854, 22, -1280, -515, 1242, -563, -2115, -1381, 885, 247, -1320, -1746, -51, 1957, 441, -470, 987, 1770, 1302, -478, -831, 785, 975, -1237, -908, 464, 556, -1201, -1974, -617, 835, -729, -1493, -546, 1788, 948, -768, -593, 1274, 785, -664, -828, -328, 1372, -524, -1846, 851, 988, 533, -1241, -977, 1148, 410, -1760, -1290, 1114, 163, -815, -1275, 731, 542, 573, -561, -45, 1447, 1131, -1219, -225, 1810, 650, -1443, -1474, 576, 721, -893, -1680, 128, 1284, -205, -1735, -57, 1129, 268, -903]
2543i03M63K158m37k135M27J282r8j512m93J327J570k765o77P97K070O5k733J527
2561f7J544l20j113j144J640J661j950j430O28M85K41j510J175K60N16j838P66
2578d56J228O99j544J13N51P12o75j733P08J934k08k708R12J56R01j883L79Q01
2596a13J522j553p40J405R86j319k056J940N71M6j794M42J892p68j051j199K449
2613F60K42j780q45J662L69O57j435l94K026p20j478R34J845j257q57K46K25P37
2631H37j408r40J431Q51p36j615N30J335O71j063k75J162J057j612o23N15R82
2648A099p03j639M02J289k03j795j84J518o06j36o75J033J885j258l27pJ561O87
2666A941k047n5J188n32o71j78Q57J57j533l48P73K99q34m62J851O58l61j151
$$ y = [-903, -440, 1718, 1281, -854, -427, 855, 757, -755, -1248, 79, 1649, -1116, -1793, -996, 1074, 1139, -1594, -67, 1477, 1157, 44, -1100, 540, 2201, 251, -1179, -551, -66, 175, -1335, -160, 100, 616, -1222, -456, 772, 1471, -73, 40, 591, 1303, 628, -1105, -397, 1537, 1329, -1379, -467, -311, 590, -1293, -914, -113, 1409, -144, -884, 521, 1507, 188, -1868, 72, 643, 689, -1105, -663, 1229, 461, -590, -1789, 660, 902, -878, -1723, -61, 308, 965, -470, -864, 1162, 442, -1036, -102, 1743, 486, -371, -125, 100, 837, -571, -1511, -80, 771, 35, -1580, -1050, 285, 956, -107, -382, 780, 1837, 225, -398, 117, 1099, 396, -1243, -841, 448, 245, -1550, -1734, -216, -822, -958, -1633, -600, 1285, 27, -300, -307, 1254, 1941, -106, -161, 1027, 495, -176, -354, 503, 660, -873, -1221, -448, -149, -983, -1445, 406, 1064, 703, -448]
2684d48l26K535l47j558Q41k95N0j86n80J41L04p73j14k59J030j186Q0N76Q33
2703C18j82j78M08K9O43j204J91mJ857j371p23k65R76P68k594Q27L89m0p86m2
2723i83J587m12j222L56Q31M12o88m33O66P82K56k053M27J517p20j11o05J76J426
2742A209j407q35P37K12o3l35O48J2R90j775K09L49O42j082J08O43L84K20j412
2761e46L77N74O46j230l74L61O33p29j34M0L5N6k07J475K41j282p0L54N98J11
2781I29l19q40N24O89j043m53R72l13m5j449N91j84R33L4l96k63J063n19J153
2800A064j12q48JN03j75P37p16l47j15O39m23j964J415L89o19J44n06m90J435
2819A2m9l25Q63m09N24J61P7j95l91k79k55J173j365p6p0M42j49j65M61q60O36
$$ y = [-448, -774, 1761, 1414, -144, 697, 402, 452, 266, -314, -173, 131, -642, -756, -1015, 15, -1171, -1091, -515, 318, 136, -42, 366, 395, 1038, -166, 25, 21, 1878, 507, -216, -481, 495, 1263, -1331, -504, -115, -155, -941, -983, 604, 192, -1030, -674, 157, 569, -119, -552, 114, 896, 1152, -901, -474, 1043, 323, 212, -393, -217, 1209, -198, -1033, -296, -84, -147, -482, 166, 178, 1168, -607, -398, -49, 593, -489, -381, 262, 646, 866, -546, -169, 405, 1051, -179, -553, -192, 441, -288, -422, -382, -347, -291, -498, 977, 1218, -64, -134, 220, 818, 929, 610, -230, 294, 983, -60, -513, 459, 146, 101, -1348, -757, -941, -8, 26, -370, -633, 430, -89, 1064, 952, 104, 105, 608, 433, 1170, 454, 107, -8, 631, 208, -1756, -341, 48, -571, -427, -933, -1423, 12, -37, -362, 501, 92, 616, 777, 854, 659, 268, -11, -266, 907, -458, -534, -604, -162, -311, -476, -15, -875, -239]
2840b39Q60j048Q36j76n10R33R12k275J292K55M42p91L37j483P84j23j28l56l96
2859h74J53N35M31n18M1L32L55j98K89N40p78m31M69R3L81j456J63J006j269K31
2879e05k93j49M43M2L99j019J895m11L51n04O2k27P19J1q07J85J00L69o77l75
2899c91p63n6R46n10K96o8k86L31R19q14J047l23N63K90N00o36j054N48j172Q56
2919B23J80r59j77Q2n19n27J290n80L67L90q69J497K44L03l83n40R51l8m23P02
2939A214j028L73j30p78Q02r04q94m72R27J148l82r63J408k08K95o83M89J181
2957A395m77o18L43P38j326Q7q86N40J86n57n57L28J140j213K22N26l25P05j60
2976I1o74J406M7l22L04L95m89l7j502L88N77R8j519J94J707j15j274n15M17J335
$$ y = [-239, 621, -427, 409, 233, -277, 656, 1568, -707, 585, 840, 1282, 491, 828, -655, 129, 6, -122, -478, -874, -721, -186, 245, -273, -232, 100, 455, 257, 546, 1086, 308, -123, 346, 439, 820, -636, -473, 533, -736, -505, -798, -947, -504, -462, -63, -1082, 813, 402, 753, 249, 311, 84, 803, 814, 7, 192, 292, 661, -16, -391, -1154, -1210, -264, -774, -478, -546, -832, -501, 418, -396, 651, 328, 891, 1181, 1681, 1045, -9, 539, -633, 223, 403, -556, -733, -651, -1170, -1697, -407, -987, -620, -230, -1099, 398, 642, 945, 562, 22, 973, 935, 512, 1214, 186, 559, 429, -349, 453, -451, -1345, -1817, -890, 258, -124, -1087, 321, 113, 408, -275, 214, 1395, 918, 300, 643, 1381, 55, 142, -744, -204, -18, -575, -1132, -804, 336, -877, -655, -129, -454, 251, 91, -583, 823, 870, 548, 852, 1247, 758, 721, -781, -393, 184, 282, -1237, -1043, 664, 549, -725, -1240, -823, 512]
2996E12j2o23n9O85m7m56L4L31O01J2r87p8O38j121J20k55Q70j18l61m98L79k29
3018f62K87Q7N55Q53j312j6L23L31n45m66O18J358j171k29o3M1o87k4q23P41R32
3039A28j707J38J671M94o09o46P29N93j001q44P71J416n49p38p13J347J80j480
3057h20M57m60R60J01j256K37J329m01p44K43J980q43j261J000k93J657j702p75
3075e91n70J078O8r88k17J306Pj820Q45N38J578j661j54P05R93r02q91n42J983
3094G65m13j052P43P15n06j962J037R54R28k117l21N18J329q54j010J360Q35p82
3112A67j455R19J690K89j124q50M15Q96p23j237R47L44rj879N4K317n70j486J47
3131a148P03J377m33m08m0J398m51k036J259J377j223m81l25J510j3j701m11J189
$$ y = [512, 500, -123, -182, 503, 456, 0, 34, 365, 966, 978, -9, -87, 551, -570, -450, -705, 165, 47, -314, -812, -433, -662, -375, -288, 267, 1120, -192, -208, 115, 446, -99, -565, 53, 1411, 240, 11, -52, -11, -698, -722, -1545, -804, 128, -1579, -1441, 230, 724, 115, -531, 198, 791, -210, -1054, -283, 1133, 584, -154, -867, 480, 660, -820, -363, -823, 137, 238, -1018, -781, 548, 147, -597, -354, 1626, 783, -478, 522, 229, 1886, 184, -591, -1161, -83, -15, -1003, -1220, 86, 93, -1727, -882, -344, 1234, -427, -581, 124, 1117, 215, -676, -1218, 765, 352, -700, 43, 758, 252, -1710, -673, 281, 1209, -908, -1229, -711, 618, -236, -1246, 114, 949, 167, -1288, -369, 1321, 1610, 486, -364, 51, 947, 224, -1013, -66, 278, 269, -1610, -1556, 761, 191, -1295, -1148, -445, 932, 499, 91, 51, 1449, 998, -1038, 221, 1598, 375, -106, -431, 1079, 1066, -635, -1046, 143]
3149A43J98j525J61J291Q09p08l69K6O23K54o56q39J985q63j089l96J174k50Q25
3168G94k267P82J633r22j213J24J121L41j011p2J323K09p73m46K7J230m17j285
3186h22J224N17o37j050p9J796o38m62m72R99R4j48j967J147J095o69q54J089
3204A63J123m22k168P62K179M25k328p86K171l34r67j545J168R69m75j138%J784
3222E81J99j172q58K473k90j208m86M1K243j355r18P34K374k579j176J160J029
3239G92n14j321k27J309J469k130q06J263J427j407j595J049J325Q29k215l86
3255a138K066J17j747l41J652Q37j699j047Q09K471k150j332L26K456k27j901
3271h48n81J994J072j900j289J374J265j322j163P80J309J62k899J761Q89l00
$$ y = [143, 341, -1184, -1023, 268, 1077, 369, 0, 26, 649, 903, 247, -592, 1393, 530, -559, -955, 219, -31, 794, -1473, -691, 942, 20, -1193, -1069, 52, 393, -618, -690, 633, 842, 69, -377, -350, 880, 463, -822, 402, 919, 282, -768, -847, 949, 311, -151, -623, 376, 470, 322, -1645, -498, 597, -72, -926, 163, 1286, 864, -1304, -542, 1637, 2062, -266, -1052, 1119, 785, -182, -1727, -559, 410, -65, -1203, -1203, 581, 780, -392, -1250, 1223, 933, -275, -761, -720, 1523, 168, -750, -16, 2358, -221, -1397, -237, 792, 278, -1043, -1270, 39, 1508, -622, -1428, -165, 1262, -145, -1740, -691, 634, 1463, -752, -1138, 928, 1045, -702, -1043, 609, 1446, -253, -1300, -491, 1980, -170, -1502, -1176, 1280, 1053, -848, -1429, 565, 1637, -263, -1552, -178, 1087, -235, -1398, -618, 691, 853, -2046, -285, 604, 304]
3287C04j516k18J398J631j494j778J733J283j578r81J698P00k02j682M9J181N0
3304E78j618Q6J089J403j022k193J594J285m76j895J121J212O3j846n43J668j03
3321D03q80l31P21P10j008j535J941J040m15j699O27K548r40j741m52J627J096
3338A712k558k24J280Q57r36j447j65L092j081j963K88K802r51j695l05J819P35
3355A260j016k420J356K988k189j264J661J459j369j810n31K235J039k070j871
3370b542K679J403k110k122J805K920j057k506L92K794o96j530K57O85J204j878
3386c02k149K870J155j845k291K082K501j623j534K16K982j146j838K61J513L39
3402A191q65k549K337J312j408j825P29K318l84j662k01J783R64k490o63K289
$$ y = [304, -1212, -1430, -32, 1599, 105, -1673, 60, 1343, -235, -1216, 482, 1182, 980, -702, -653, 528, 578, -1040, -954, 135, 1538, 516, -1677, -83, 1202, 726, -1169, -48, 1164, 1227, -619, -1162, 506, 403, -477, -808, -87, 623, -385, -1920, 21, 1061, 646, -1053, -426, 2122, 1182, -559, -1011, 616, 1712, -846, -1070, 210, 1067, 131, -1316, -1481, 1611, 530, -1433, -1145, 1657, 706, -989, -1294, 525, 1260, 244, -2176, -820, 2168, -21, -1285, 376, 1835, 466, -1344, -1875, 360, 1399, -671, -2542, 137, 1540, -570, -2692, -887, 2033, 976, -1530, -1138, 1656, 960, -570, -313, 372, 1576, -302, -2451, 419, 1574, -271, -2562, -480, 2021, 398, -1136, -920, 2062, 916, -922, -661, 852, 1191, 326, -2223, 114, 1426, 18, -1807, -1078, 1240, 856, -806, -1007, 776, 1740, -750, -1413, 876]
3418H76J032k535n42M80L059j269k591L95J917N65k710j28J491J360k466l05R02
3435d69K210j385j520J287J481j000j038N61J279J5k204j332K619L95j672o33
3451a406J158J880j119k253O06J965R31k066n39K698M75l027o76K201J369k467
3467b70j345J230J415j443k419J244L024j162j201q15K745K08j625j268J593K196
3483B107k347j023J975J047j193p74o08J589l48k195L26K374P15k284o92J330
3499aJ840j184l012K275J354r3j802NK237J15j958j403K145J009k009j469K062
3516A11R46j388j828K036J240o42j757O35J690J22q97j661J624J484j325j858
3532a468J237J629J13l389L21K257J070k873L23J325Q11k054j028K608Q91j864
$$ y = [876, 1908, -627, -1169, -689, 2370, 1101, -1490, -1095, 822, 1387, -1323, -1451, 40, 1400, -1066, -1371, -469, 1741, 356, -1164, 123, 1604, 604, -434, 127, 1406, 1421, -783, -2115, 504, 899, -773, -1406, -248, 1632, 513, -1740, -1134, 831, 1762, -304, -843, 1855, 2330, -697, -1373, 828, 2197, -270, -1615, -385, 1030, -413, -2832, -1588, 1436, 274, -927, -1742, 1003, 1211, -414, -1682, -89, 2107, -240, -1263, 712, 1759, 566, -208, -816, 773, 425, -1770, -1444, 930, 1645, -639, -1331, -1, 1839, 655, -2357, -82, 1272, 1179, -623, -618, 1619, 1734, -224, -1627, 518, 1527, -482, -1951, 111, 1057, -331, -2159, -123, 1117, 475, -1282, -647, 1043, 1165, 268, -1393, 231, 1715, 390, -1468, -231, 1398, 1511, -1878, -1557, 700, 1770, -1103, -780, 545, 1356, -698, -1726, 882, 1773, -91]
3548i1j337J594J834o95j744j350K975J700m025n8K942R88l296j851K641N28j269
3565e14j235M98K562r43j239J16K110Q45l070j259K914Q06p09l330K354J693m92
3582A107l428J762J587o39n63j112J821R64k204r05J992P84p92j525R70K873j921
3599G71l052J380K341p64k187L91K270O25k212j527J630J294n25k148O49L287
3615B223j795j318k05L611l21l671l18K883Q12j894k244J442K256r51k818O17
3631a691L622k31m106J001K150k92j630m45J764J823j290k467J679J156r49j796
3647a702K77K490P59l217p23K753R16k571o71K315Q84r24k428R66L202j453k809
3664a936J224K894o27k371j090J850K084k630j073Q95L055k364j916K24L299o27
$$ y = [-91, -1428, 166, 2000, 1305, -439, -1789, 1186, 2886, -1139, -1197, 1745, 2733, -563, -2414, 227, 755, -514, -1749, -1251, 1311, 368, -871, -755, 1355, 2200, -870, -2129, 785, 1591, 882, -2448, -94, 1599, 1107, -2321, -559, 1028, 389, -174, -1286, 535, 1499, -705, -1610, 382, 1166, 374, -1151, -181, 2692, 771, -2281, -901, 1440, 676, -1511, -1120, 1150, 1775, -437, -1964, -334, 960, 435, -1713, -1064, 2223, 428, -890, -1095, 2516, 2195, -1476, -1794, 1089, 1901, 7, -2237, -795, 1461, 510, -2308, -1691, 1931, 1700, -2406, -1405, 745, 453, -1177, -1622, 142, 1965, 675, -1792, -113, 1043, 94, -1702, -1425, 1065, 1824, -1393, -2116, 637, 1553, -1018, -1689, 626, 1510, 586, -1842, -876, 2326, 873, -1936, -712, 2182, 1555, -816, -1906, -56, 2028, -602, -1675, -780, 2275, -89, -2005, -1781, 1518, 891]
3680H91k586L90K109R36j823j556K073K468k524k425K448J233q96k538J34K413
3696G47L5j672r24K876P01k621j437K430J532j482j434J175J939j117j921k33
3712a406K401J159l098j118K202J769j964l121L673P73m24k502O88K747o23k202
3728a046l42L081K09k228j924K855R39k245j345J921K300j402l544J467K572p69
3744D99k147j344L657J147k527j223J387K624j344l426K861J802r87l391J465
3759i47J455P90k743k49K430J200k138k499L992P88j498k104J235J874L72l205
3775a247J62L208j267l221M98K500M58j626j253J394K269j467k831J615K510l39
3791A363k918k64K577M20j622j609K606J232j918j779K458R21m92k977J628K253
$$ y = [891, -1695, -1305, 804, 1740, -83, -1639, 434, 2902, 378, -2047, 401, 1634, 738, -1800, -1666, 747, 782, -890, -1814, 1062, 1763, -858, -2295, 135, 1667, 185, -1249, -74, 1865, 748, -1173, -1406, 995, 2154, -944, -2062, 140, 1909, -55, -3176, 497, 1270, 846, -1656, -968, 1779, 1156, -1046, -1388, 1693, 1902, -326, -2250, 605, 1544, -701, -2046, -125, 2175, 773, -2771, -1304, 1268, 499, -1648, -2992, 665, 1812, -715, -1938, -551, 2073, 729, -2697, 164, 1966, 979, -2412, -947, 508, 1298, -1445, -1694, 736, 1936, -202, -2701, 1291, 2079, 581, -1523, -288, 1586, 1958, -1247, -1085, 2123, 856, -2365, -1867, 633, 1091, -535, -1788, -394, 1875, 408, -2423, -808, 1702, 1363, -1555, -1819, 758, 1178, -444, -2053, 553, 1785, -133, -1912, 546, 1467, 975, -2002, -374, 1879]
3807A879l06l459M56K229J127k436j093J557J897j934j198P48K032J21l472J157
3823f95J974O63m182J048J237J455j585k976K973K070j789k736J767K382p17j176
3839b87j710K719N79j974q82K649P87j698j964K067R90o72l171Q02L089o79k792
3856b147J068K481L09j520j626J894J673j094l379K332K319k069k051P05K540
3871A435M44l524m87L136O52k640j164J515K650j049k622J228J976q02k050o55
3887a957K713K000l836q91K870J307k976j228J108L164j613l267J437L054R9l442
3903a458n76L175k76k688q10L210R03j281k205R78K176p15j749l06K737P76l109
3920a218m30K716J331l226j199K023J954j381l375J653K972j512k443L20K790
$$ y = [1879, 1573, -1886, -1430, 799, 1926, -510, -1603, -46, 1851, -83, -1281, -533, 1499, 1620, -1852, -695, 1279, 1942, -2240, -1192, 45, 1500, -85, -3061, -88, 1982, 193, -2543, -776, 1606, 889, -287, -1997, 722, 1301, -673, -1555, 1094, 1881, 183, -1781, 286, 1276, 604, -2567, -1765, 1324, 645, -2147, -1079, 1402, 1711, 191, -1435, 459, 2132, 1038, -2341, -9, 2310, 241, -1810, -1105, 1435, 1879, -1645, -2132, 1004, 1656, -984, -2148, -633, 2017, 968, -1654, -426, 1550, 748, -1302, -1957, 756, 2756, -1080, -1971, 899, 2206, -770, -1998, -890, 2274, 661, -2606, -1169, 1885, 1984, -1458, -2034, 1141, 865, -1823, -2633, 577, 1480, 199, -2006, -1028, 1148, 433, -1316, -1622, 1115, 1891, -1218, -1648, 1068, 2399, -827, -2026, -3, 1951, 570, -2805, -1152, 1820, 308, -2135, -1815, 975]
3935I75M09k454o88J863L449l457k227K998N27j353j874J280K967j165k394r42
3951b086L334L54k017j331J398K117j093k139J733J333r89j980N7K875o1k399
3967h94j383K627Q42j684j575K124K128k204k469K488J680j087k244J93K900k18
3983A224k417q76K765J318k424j521J748J472m33k148l68L449P81l914k53K857
3999A260M22k048j665K484R58k068j063J091K046p86k125O65L241j03l842M4J979
4016D90J496k560j597K004K328k471q69M88K261k64k776N89K078L24k905Q1K572
4033A269O79k087j550J516K919k969j976K171J929j048k284N48L211j15l123j712
4049b622K721K127k852k381L569J582j210k140K40K448q05j912j112L154Q97k627
$$ y = [975, 1384, -1070, -1758, 105, 3554, 97, -2130, 868, 1395, 42, -1832, -552, 2415, 1250, -1144, -2086, 1248, 1602, -415, -1746, -348, 1769, 676, -1463, 270, 1603, 614, -1366, -1309, 1566, 1505, -894, -2277, 350, 1192, -492, -2067, 57, 2185, -19, -2488, 0, 1680, 593, -1651, -1458, 1442, 1224, -1193, -2069, 696, 2014, -410, -1931, -183, 1289, 856, -1292, -1660, 1789, 2570, -1344, -1597, 1260, 1682, -366, -2031, 453, 1411, -657, -1720, -629, 1417, 631, -1494, -829, 2412, 2309, -1533, -1489, 490, 1986, -574, -2171, -167, 2161, -310, -1179, -691, 1570, 1306, -1470, -881, 1197, 1521, -1384, -1303, 1269, 1948, -139, -1689, -173, 2746, -223, -2199, -28, 1901, 853, -1431, -883, 2328, 2213, -910, -2622, 99, 2226, -626, -3007, 562, 2144, 934, -1206, -966, 1482, 677, -1235, -2347, 807, 1704, -923]
4065i23q81K653J165j115l017K269J762j129k439O20L352q21l251M59K781K8j743
4082b30j893K213J077j408j517J157K765j178k361m03K881k64j711j511K491J637
4098A745k844j46O42L011k429j841M76L291q47l157R41K365k1j413j099J094K392
4115B160k658j631J723K810j670l079J566K713n52k693m44K673J755k835j277
4130a439J275J954k332j736J464K491o93j866o77M179j170k856J32K083J063j755
4146A17k573K420K779k002k527O38K762o23k501P5K741J020l535r79J869J776
4162A457j230k927K296K517j348k308K81L271o30k546K00K479j70k681l58K165
4178D68J260j754j990J020K623j087j778m84L289j12k219n82K221J468k151k843
$$ y = [-923, -1804, 849, 2014, 899, -2118, 151, 1913, 784, -1655, -1035, 2317, 1496, -1755, -1296, 1485, 1513, -230, -2123, 90, 1167, -241, -1758, -601, 2164, 986, -1375, -1778, 1103, 839, -872, -2383, 108, 1745, -1099, -1245, -603, 2408, -21, -1862, -1386, 1905, 1058, -2099, -1158, 1207, 1186, -227, -1326, -232, 2160, -498, -2129, -406, 2404, 734, -2345, -779, 1934, 1382, -1311, -1755, 918, 2673, -162, -1439, -164, 1790, -542, -2278, -814, 1677, 984, -882, -1559, 2620, 1450, -1406, -1274, 809, 1872, 117, -2456, -36, 2743, 741, -1786, -1148, 1614, 991, -1510, -1435, 1306, 2326, -1209, -2188, -319, 1457, 227, -2700, -404, 2113, 765, -1543, -1262, 2009, 1379, -1167, -967, 1512, 1342, -1339, -1697, 468, 1728, -26, -2016, -996, 1627, 540, -1238, -1722, 1567, 1455, -764, -1346, 875, 2343, 192, -2651]
4194b651K573K597k800k018K043J053J15k453O3L041J98l289K90K200O80k010
4210c68j797K518J635n02l110P81K293j214j768M10K171R4j693r72K508O18r20
4227F84l405K641K407r74k670P20J750J119l369o00K717Q43k229r58P37K287j346
4244C54j726O13J914k75l037N34K838Q15l828L95K274O50j579j399Q28L056k322
4261A05j616O07K578k85k828j28J305J661k125q14K415J289k645j917J604L189
4277B395j321k189N36K677j187j850j97J682J630k450j792K547J799k547j838
4292b105J398K442j085k220J88J949J387l108K86J466J446k416j648K382J596
4307A958j485k344J050K194l36k869K69K945P6k447m37J788J326j731j608J750
$$ y = [-2651, -78, 2519, -281, -2299, -256, 797, 912, -1541, -1478, 1563, 1761, -1528, -1238, 962, 1642, -368, -2165, 353, 1988, 1486, -1624, -843, 1450, 236, -1532, -1122, 1049, 1143, -550, -1522, 986, 1604, 684, -2721, -80, 2327, 1353, -1317, -597, 1153, 2272, -1097, -1697, 1020, 1863, -366, -1324, -587, 1700, 354, -1372, -759, 1155, 880, -2157, -1623, 1215, 2030, -1798, -1403, 871, 1521, -58, -1457, -629, 2427, 105, -1511, -904, 1674, 1389, -1439, -1567, -262, 1399, -726, -1540, 875, 2164, -481, -2398, -794, 2395, 1074, -1115, -579, 2098, 911, -939, -1136, 546, 2176, -274, -2066, 481, 2280, -267, -2105, -707, 1735, 650, -1570, -1382, 567, 1954, -1154, -868, 598, 2044, -372, -2020, 362, 1958, 473, -1871, -821, 1373, 1037, -1832, -1563, 1382, 1458, -989, -1426, 362, 1688, -43, -1651, 99]
4323I9K190k061j708M88L104j240j709j158K534Q75k916p75K299J774k009j727
4339a940J273K287r79k590O55K447J160l494j47K469K89j304k056J400K356j967
4355a41k593K848K238k087k205L91K209N89k025n95K269O17k234j222K278J752
4371B089r22l322O97K398Q99l182o3K056O39j731r69K499J462k414j382J297J581
4388A632j315j275m12L344n30k736m63J967J531j762j724Q37K192o95k088J288
4404b09J576o61k096J111J251O28j816j861L000J736k496j555M58K476j042k890
4420b390J334K060n10k157O34J369J625k683l2J232Q74o64k709J862J953j110
4436F88k512J003K257j091k118k35L679l03j876j079N97L688k706j425J032K023
$$ y = [99, 2289, 228, -1480, -992, 2112, 872, -837, -1995, 539, 1414, -1502, -2277, 22, 1796, -213, -1940, -667, 1620, 641, -1949, -1294, 1153, 2313, -1181, -1328, 1141, 1430, 126, -1930, -530, 1826, -141, -2734, 114, 2352, 265, -1940, -1549, 660, 1249, -776, -1371, 898, 1515, -719, -1941, 337, 2089, 1167, -2155, -1458, 940, 1839, -1343, -1406, 650, 1289, -442, -1411, 1088, 2550, 136, -1246, 51, 1632, 317, -958, -1370, 1974, 1444, -1292, -1755, 212, 1743, -19, -1743, -906, 1286, 591, -1497, -209, 1367, 706, -1390, -279, 972, 1600, -216, -2077, 923, 2659, 163, -1392, -934, 1542, 500, -2390, -1056, 1004, 494, -1663, -1029, 340, 1965, -718, -750, 482, 1356, 692, -2017, -155, 1798, 688, -1824, -821, 1436, 345, -1773, -2008, 1671, 1368, -508, -1587, -990, 2698, -8, -1433, -401, 1622]
4452A622q80j096j80J783L7k382j34K045P60k085j241R72K054j060j562O00J744
4469I97o45j860K76J926J273k892j044K496J439j678j154J808O73n37l180J415
4485f87K661o62k084p28K007J939l767j037K441J359r41k418K218J888j290k454
4501a555N30K863q07j808r84K085J575j800k008J830J517p60k853R91K059n47
4517C28j829r31L118P35k228r83K462J226k220j660J529J910l53k888J307K096
4533A619p82k106J33K131P30k719l37J128K180j703k256J018K337j143k410J283
4549h97K062m66k220l88J986J801k211j906K658J923k216k245J861P05J027l186
4565a712o9L765m98k558k43K148J280k561j853J816K448o35l654J685K591j481
$$ y = [1622, 742, -354, -534, 1249, 1286, -1096, -1230, 815, 1575, -510, -1751, -779, 1275, 215, -1347, -747, 997, 352, -1508, -1232, 694, 1967, -925, -1969, 527, 1966, 288, -866, 942, 1615, 1078, -2102, -687, 1974, 1312, -772, -1500, 507, 2446, -1321, -2358, 83, 1442, 501, -1917, 301, 2189, 899, -1555, -1025, 1838, 1031, -777, -1761, 324, 1899, 99, -1909, -79, 1438, 678, -2175, -1184, 875, 328, -1501, -2432, 686, 1421, -807, -1790, 672, 1898, -322, -1982, -453, 1457, 1104, -1784, -477, 1619, 837, -1269, -1136, 995, 1725, -994, -1331, -203, 1977, 274, -1982, -964, 1373, 230, -2180, -897, 1165, 699, -1521, -1909, 77, 1878, -333, -2239, 419, 2342, 126, -2119, -258, 447, 1474, -1712, -1781, 1984, 1486, -1072, -1315, 833, 2113, -448, -2301, -485, 1963, 1328, -2326, -641, 1950, 469]
4581D69j590l17K323R66k678l32J049J651j221k408K064J554r17j625j04J580
4597D64L69k147j49K091J324k347n34Q74J071o90j908J263J712p54j476M48J185
4614G96L35j440k311L249P07j033j477P93K478j408k316Q96J531n27j508O97J455
4631I17O93k246p72K258N99j111j904K370J001o35k636M52J751J16k009k6J257
4648G5J086k025n82O97K091j466j060J212J249q16k122J107J137O19r81j822K138
4665E37J182k014q95K045Q99j320j390L89J268J41j818m80K841j41k267j1J874
4682H40K76j511p89M69K258j166k417J156K291m86j643p92J659J620k298q37J240
4699a30J845j998n48L11J958r14j974R29J453L99j531j186K924J0k417j6J712
$$ y = [469, -1121, -1438, 885, 1851, -827, -1159, -110, 1541, 320, -2088, -24, 1530, 613, -1012, -1116, 464, 833, -1314, -1463, 628, 1952, -395, -929, -55, 1016, 326, -1582, -319, 1393, 639, -837, -389, 796, 1131, -309, -2620, 629, 1336, 303, -1174, -381, 2097, 689, -1627, -731, 800, 273, -1235, -538, 917, 1610, -636, -1408, 850, 1449, 338, -1566, 804, 1805, 1170, -1466, -1014, 737, 853, -1156, -1182, 75, 1161, -864, -1446, -749, 1342, -124, -1184, 28, 1277, 461, -1661, -554, 583, 1202, 221, -1601, 537, 1719, -295, -1190, 855, 1754, 434, -956, -567, 701, 842, -976, -1456, 1385, 1244, -1023, -1034, 840, 1116, -395, -1184, -715, 1543, 377, -2040, -884, 1407, 921, -722, -1514, 145, 1765, -533, -1370, -130, 1715, -283, -831, -520, 1438, 524, -1450, -521, 932, 1331, -200, -1386, 1538, 1548, -869, -885, 827]
4716H27N86o34j747M77J528n31k138Q47J674n61q86j032K296J66j354j664J223
4733i23K064q84j494kJ858l87j192l05J521R81k618q51J360K125j135j568J202
4750b48K064q72k990J267K559q88j068o99J575O67j675j075J285P72j117o33l65
4767a441K419Kk034L1J793K09j375j288K456Q73j195j109J081J85k95j441R45
4784a84K239m90k907J96K740q60j879L52J099L89Q4l081J952J438m03j761J92
4801h84J689N68j867p20J462Q95j923q42J480J514m76k072M11K477j526n61j32
4818e07J590j69k194o7J754Q30j301j370P06J777j936o41M38J791k91j514K43
4835h61K147Q6j847k00R44J280k205l11Q21J452J04k982M54K179m8k278R65J094
$$ y = [827, 1413, 779, -968, -491, 1037, 506, -1632, -785, 889, 328, -558, -1590, 706, 872, -482, -2146, -923, 1141, 257, -1237, -1239, 619, 232, -960, -1265, 256, 1237, -1381, -2232, -872, 1253, 118, -1450, -248, 1816, 944, -2046, -779, 1780, 892, -176, -875, 700, 1367, -308, -1383, -98, 674, -443, -1076, -1441, 978, 980, -1054, -1023, 770, 979, -396, -1684, 772, 1645, 450, -659, 422, 607, 312, -1129, -184, 2055, 1565, -1342, -1146, 1594, 734, -1145, -793, 306, 695, 779, -2302, -350, 1088, 685, -1076, -884, 805, 1373, -494, -1214, 248, 1143, -780, -1622, -142, 1372, 896, -1176, -765, 1712, 186, -375, -507, 1083, 914, -1280, -1347, 407, 1237, -64, -1434, -728, 1049, -887, -1528, -1090, 701, 410, -1104, -861, 1286, 1372, -475, -675, 269, 1549, -656, -967, -146, 1306, 1410, -1572, -1118, 1061, 1013, -1265, -300, 794]
4853G94J7k130QJ931P29j659r33N52K222j272j106L6O14J782k000q56K203O8j218
4872b18p86J122P26j478n34M60J896n07j900P65J468o87j431k14J061J760j297
4889B06j076j73K434j574j222J152J184L0k100P12J602n35j143r54J323J083j152
4906b03j517J323J397j558o78M82J763k68j055j100J395J649j737q79J481J030
4922A525j074j116K09J203J39j545J12J036K89j504m3K79J448j028r39J157J039
4939A187j180j408P70J866o27j482k8K174o65j028l72N24J088q87o86K87J204
4956G37j24j273J70J622m92j704n4J792P7j186j505K047P69k46j515P6J745q84
4974E2j509M08J310L38j171o8R19K185k980q79J273M55L31p53l45P96M80j287
$$ y = [794, 811, -1319, -1311, 620, 1349, -310, -1243, -691, 1531, 259, -847, -811, -197, 1585, -415, -1271, 932, 1000, -218, -1004, 118, 844, -634, -1168, -708, 1188, 681, -1219, -454, 1014, 327, -1104, -1318, -257, 1503, 206, -870, -1043, 1391, -183, -1405, -253, 931, 961, -1139, -427, 1175, 640, -503, -1457, -134, 949, -203, -1720, -397, 1000, -558, -1236, -754, 1009, 741, -314, -1414, -19, 1630, -107, -986, 495, 1525, 451, -665, -456, 747, 886, -659, -547, 489, 778, -726, -769, -490, 958, -70, -1009, 148, 1187, 7, -1401, -631, 1235, 608, -874, -902, 1272, 607, -421, -793, -269, 819, -68, -754, -467, 737, 613, -660, -490, 1132, 640, -1064, -1118, 674, 751, -435, -1940, 107, 876, 630, -885, -809, 936, 52, -1457, -1049, 261, 599, -572, -640, 279, 2464, -516, -1395, -122, 333, 664, -89, -434, 362, 842, -445]
4992d45r22K103l59j091l86P56J441j537j86Q74M67l88j092J11J952o13j540l01
5010a156J841P0j075k1N72Q78j009j195J277J107m85k147P39J769r02o31l66P27
5028gJ717j627n05M83l1L89k148J568R78m13j558K41J382k81j98q16J012Q20j507
5047e01k29O24L98o10n39K78J491r26m68j06J399k83j544m66K106r3k07j821J079
5066d18J407r74n90j297K480m71j136k27J575J168j839o28J182J010j410j721
5082a889J858K47k42o55p6J228L01q26o19J007p4n30m39j0K087j237j012N03J410
5101A032l98j021q84J070L14p49m95L16K314j513j099N07J435j57j940R46J129
5118H07p27o98J065k15mm98l81P06K30j73m41N84K69j15j251K42R86l67J10q99
$$ y = [-445, -1367, 736, 377, -714, -1100, -344, 1097, -440, -626, 248, 715, 327, -765, -654, 1298, 685, -855, -1156, 685, 755, -320, -341, 231, 1109, 100, -1095, 182, 1289, 804, -1343, -604, 1165, 263, -368, -734, -7, 1710, 83, -422, 61, 30, 419, -1729, -161, 817, 404, -1154, -913, 469, 188, -10, -826, 186, 1006, -501, -730, -106, 292, -318, -857, -579, 912, -14, -482, -588, 811, 528, -1016, -1482, 624, 531, 324, -1497, -418, 989, 15, -575, -1872, 608, 137, -999, -1226, 349, 1517, -322, -950, 232, 1242, -168, -1889, -31, 216, -26, -681, -757, 471, 772, -54, -673, 334, 260, -270, -709, -719, 1368, 131, -881, -378, 1032, 634, -387, -1271, -201, 113, -636, -1131, -815, 1499, -14, -1113, -606, 829, 672, -1268, -322, 807, 80, -618, 447, 232, 228, -270, -651, 55, 285, 112, -329, 255, 524, 409, -842, -600, 386, 19, 129, -770]
5138g70J088L55p50o16r1J554o67j585J067J216k08p81p61J078O84j234l09Q62
5156A32J255j090j074Q17J91J82j061R81O28o80o02l99J604p68m49K8N46M97m68
5175B70j051J059Q55p82j171o7J360L16r84p55O86M16p59o55P50J632q95j194
5193i69J16J634o9j530R5R66M1q75k41J600n12o8j326O97J245m53k98r36J993
5212A110r92j722J417R62K62j445l97J207q6r3l90J02O37O6j200M81Q91N0k102
5231a242K03O07J044n0j129O00J313j357r00N15L07O40j70n00L05M21k04n99m8
5250b44J695j638l40p2J515n84j341R31M57Q7j296j28L22Q79L26j208J629r47
5268D3k84K6K89L35n22O48r38N76M39r77j66Q19P24j270n97K94J186r34l82R13
$$ y = [-770, 318, 673, -77, -693, -784, 770, 103, -1482, -415, 801, 593, -188, -949, 129, 813, -421, -730, 132, 1387, 297, -777, 40, 231, 413, -648, 333, 961, 281, -321, -720, 884, 116, -333, -305, 241, 738, 270, -781, 278, 1133, 351, -820, -887, 473, 789, -195, -950, -264, 152, -607, -1262, -512, 1120, 225, -969, -853, 781, 712, -818, -723, 243, 284, -591, -832, 768, 256, 188, -1138, -441, 804, 351, 53, -883, 1110, 118, -1604, -187, 775, 1037, -408, -805, 402, 316, 223, -167, -65, 572, 638, -562, -81, 810, 860, -1242, -1039, -432, 612, 562, -567, 33, 1346, -11, -911, -396, -89, 551, 381, -119, 186, 607, 403, -196, -244, 1451, -187, -527, -599, 916, 332, -1009, -78, 379, 466, -830, -958, -636, 243, 569, -639, 990, 43, -241, -215, 74, 409, -113, 535, -403, 173, 612, -365, -531, 288, 1012, -258, -855, -561, 625, -309, -691, 222]
5288B22m97N6q55M88Q92K4l32k49K84J259q61j416M15Q39M43j202K15O83J03k42
5308B69j548J436J036r80j108O35O86j222N49J024j24k23q40M92Q19n16k65n76
5326d56R91m0q69N26q52J142j89j234M19O17k40q17R19K50J031j072o18L75O12
5345D95K56k029J814l64o1q90K2J322l09j138L19J829p5j157j71J66m41M93q76
5364g95R32P03p86l43r12J491l9r76L24N81J11j372L82N89P74M3j402P40r22Q63
5384a4l45j68L99M27r39M56K38J82j7p52N38m99Q35j268RJ305R9k58Q9l70j90
5405b43l37J421o79R7l05OK37k20L58r81O41Q6o49l07O20K31J060j237n1k58J530
5426A020j494p8k46J334m81j04K20K22j053K09N10n44R99j483L79J075j06j26
$$ y = [222, -275, -219, -1074, -586, 306, 330, -2, -251, 33, 1292, 431, -985, -570, 269, 712, -490, -275, 408, 511, 269, -1279, 157, 1193, 213, -895, -260, 426, -796, -247, 777, 653, 430, -410, 82, 901, 385, 120, -456, 535, 495, -374, 152, -700, 442, 253, -981, -562, 55, -185, -1002, -83, 167, 1198, 126, -492, -117, 495, 751, -1278, 536, 172, 111, -779, -757, 565, 256, -882, -563, 1266, 1191, 34, -137, 29, -412, 81, -795, 137, 840, 54, -289, -1201, 290, 251, -725, -401, 180, 291, -1081, -699, -110, 664, 707, -695, 45, -877, -14, -359, -527, -128, 299, -640, -184, 54, 236, 219, -533, 5, -494, 341, -927, -918, 387, 486, 228, 317, -53, -243, -580, 841, 162, 259, -46, -40, 197, -23, 335, -646, -5, 81, -568, -875, -255, -24, 1036, -201, -252, -510, 1020, -474, -552, -798, 536, 55, -49, 171, 393, -660, -451, 59, -485, 514, -969, -590, 485, 379, 253]
5444B53j288J085J19q4m65PL46O03q99k80N33O01k10l66L74m91m92J325p38J30
5464F3j2l34j69N58j06m48r1L22J3L69m58j97O52M74o93n37J041l79k15j33k09
5485d89J098q46P5J80j22O5k09j44R31j168N79P46l89k09k35M00O0Q51j445L82
5505A11m6O3K71j270L29N92O55m69l97p2J232j303K94l28L48K4J12l5N5k13o84
5526g31P98K16J168q84q82P33j315J079n55J29L05N7M42q06m57J26Q78L1P9j072
5546f61O98l99k55J29J039p05k31K26m29M81J56J25o57K33J13k46P64q90J034
5565E25L1m7j224Q05k11k69M04j87rJ06L46p45m0N28J77L23J51j150J46j39M16
5586f3L66k47P3K1j42n6o7J67l94o20J068R2o04j24L77M4o00J223m03L48K90m35
$$ y = [253, -1035, 50, 169, 85, -380, -373, -27, 576, -323, -603, -70, 531, 321, -45, 329, -162, -654, 671, -67, 63, 51, -283, -452, 106, 0, -448, -539, -217, -204, 165, -293, -490, 162, 636, -57, -594, 447, 68, -147, -280, -489, 609, -237, -162, 18, -104, -39, -248, -392, 539, -629, -50, 696, 307, 98, -137, 263, 323, 1174, -271, 111, 65, 128, 399, -871, -542, 50, 705, 236, -161, -233, 999, -304, -10, -338, 10, 34, 146, 111, 166, -47, -731, 67, 283, 1451, 567, -315, 418, -897, 182, -373, -244, 61, 118, 560, -246, -703, -577, 301, 332, 411, -661, 37, -362, -617, -488, 551, -154, -385, -159, -588, -107, 49, 174, -483, -250, -137, -383, 381, -509, 525, 556, 509, -715, 90, -121, -390, 14, -173, -182, -76, 270, -475, -515, 13, 190, 513, 664, -486, -340, -479, -63, 303, 56, 129, 150, 8, -48, -115, 52, -342, -962, 106, 198, -406, -530, -153, -109, -709, 514, 111, 459, 749, 314]
5608C14p6j141P4J60j59M22N68O07j227J07M91r69K21l2J330o66J58o75L04j34
5628c23K90N89p5n08q54P73O01np20N10m7n34N95m6K9j38M23p70J6N53k34j80
5650e5P19m3m60l53k85q4J91Q73n00O29q83l21P03k65J177j412o4K88m44J068
5670D79j94l01L94o99M22J92l8J62l92R8o55N43m90K66M93n19MK48j54l05j7J025
5692E62q34R2K73k59L23k31m12O64j234J002K85L48p3j243K18L99l98P04M2j68
5712F0M7J56m51Qo6j46L35K02n09J87M26J79n33m51K81J94l70K69J03Q51k21j105
5734e54L18M63k99n62J46M67j178L80Q29r7L64J35j031Q32R9p54J201j170o7N26
5754D8P2j1l29K7L99o7j80J92o40K92L9l10J86M80m61M27j62p37N27R1k6o6j16
$$ y = [314, 238, -903, -829, -669, -828, -406, 162, 769, -458, -351, 140, -829, -608, -640, 690, 24, 182, -493, -189, -323, -33, 556, 481, -27, -881, -108, 493, 488, -232, 278, 231, -303, 292, 246, 275, 137, 560, -210, -194, 359, 125, -55, 664, 621, 161, -192, -477, -561, -370, 503, 3, 632, -251, -572, 131, -134, 1043, -369, -433, -145, -589, 479, 285, -16, 378, -321, 101, 293, 255, 417, 25, 123, -532, 11, -479, -213, 280, -239, -235, 13, -141, -446, -463, 562, -272, -180, 93, -166, 157, -74, -486, 178, -1056, -54, 231, 579, 506, -737, -519, -120, -518, 186, 228, 60, 107, 263, -188, -180, -246, -392, -57, 145, -364, -177, 249, 428, -105, -556, -275, -81, -451, -182, -79, 772, 551, -554, -236, 227, -72, -634, -488, -21, -1199, -819, 10, -87, 277, 412, -619, 213, 312, -442, 759, -411, -478, 48, 120, 109, -220, -193, 206, 139, -41, 151, -489, -197, -158, -468, -282, 198, -263, 164, 2, -735, -208, -117, -143, -209, -325]
5777c25N37L76m60o93K63P75l36J05p5m55P4J258n36k49Op21q4N86m50j63J504
5798I37q39M43q80K33K58j146J298l30n8M19J71j111P73M20m09K6k17N85m1p99
5818b67r35J976j665O45m82M78R56j174K08M87o2j09J15q03J142m58o57L03k74
5837e76M39O95l18o55L1N77Lp65P77M81j67o24O08J96r42p35M01L50N6o08R69
5858A93l66J86n26Q6l62J121l74J38Ko5J5n56O10M33m42M44n06J4M0p27R76R2
5880D26j598Q89j47N69n73L10n51J081j8m49L84P0L78K30j134l56L29Q86k58j027
5900e59K82N14j3J43q11K03Q35j17j156J385o11R59j457N90p10j64n4K28J514
5919A001j188O3p95P41M10o36j69N26P95l77o39L0M15N89j165J37M10J96q59K13
$$ y = [-325, 212, 588, 128, -565, -302, 473, 137, 242, 167, -288, -214, 1044, 508, 259, 265, -456, -540, 46, -404, -567, 937, 98, 541, -339, -106, 152, -994, 304, -26, -84, 335, 506, -605, 168, 588, 179, 205, -12, 573, 532, -267, -1202, 774, -891, -246, -728, -250, 706, -468, -260, 227, 165, 56, 171, -632, 510, 52, -605, -302, -576, -137, 558, 240, -415, -384, 193, 196, -569, 208, 689, 522, -102, 506, 702, -240, -975, -574, -224, -168, -776, 193, -173, 13, -513, -427, -789, 332, -42, 96, 98, 33, 48, -508, 102, 535, 93, 537, 31, 45, 85, -642, 334, 426, -1172, -283, -430, 139, -434, -124, -675, 406, 388, -61, 323, 393, 771, 1001, -133, -489, -160, 726, 468, -559, -277, 237, 224, 367, -444, -241, 594, 477, -679, 706, 95, 1054, -403, 187, -523, -687, -741, -513, 1001, -187, -124, -919, -178, 232, -404, -573, -47, 748, 371, -268, -238, 177, 766, -399, -262, 148, 344, -515, -302]
5939c02J95j07J02p14M85M22j12q8M93o38K79k3m18L51K63l22o43R48M26q00j88
5960c91L21Q37n62k37N88K84r02m21K86j9j87N88j238J353n55p0m97J691m05l14
5980A50K52p12J030K81m97j514J579l65M26j394M81J179j151J51p4P08p80j11
5998c61Q40l12l34r0J12J63p79J383r91j10J110J30r21N56L07m30k38r4j3P17
6018F45j99r19J354m63n22o12Q85j19Kj84l73Q06R33j979J316p05J91N83q7k24
6038C29j44J9o36j95O05n00l92J035m00P88j710J238n24N91J144j569K11O08j393
6057h95M88O75Q12j678J09P79k14J30q53J518o85j52k87o24O41J015j46j258l91
6076a016J645J37p03O5n62P59p44j14L99M16n89K64M92N12j005o77J219l82K26
$$ y = [-302, -107, -214, -112, -826, -341, 81, -31, -119, 374, -264, 15, -8, -426, -75, 188, -134, -777, 171, 597, -203, -391, -70, 767, 205, -32, 556, 840, -62, -483, -197, -216, -403, 185, -1053, 300, -255, -325, -822, 869, 464, 150, 402, -310, 720, 1001, 504, -1010, 569, 204, 630, -764, -283, 896, -255, -104, -178, 530, -250, -361, 479, 167, -167, -257, -145, 18, -761, 622, -369, -479, 631, 761, -160, 396, 703, 273, 35, -59, -72, 645, 446, -473, 881, 418, -104, -716, 169, 50, 52, -132, -505, 301, 1234, -745, 571, -134, 57, 640, 553, 329, 185, 204, -432, -627, -22, -522, -914, 121, -279, 509, -1201, 37, -487, 104, 1248, -321, -110, 498, -895, -407, 268, 1080, -598, -489, 290, 76, 206, -647, 871, 186, 34, -253, -877, -236, 779, 633, -625, -1016, 629, 766, 63, 128, -434, 325, -419, -533, -134, 282, -307, -43, 449, 961, -44, -721, 498, 116, 342]
6095C42J99k96j181J206m57k79p2J224m59l81O46l06n56L18q3J60M07j69o14J166
6115H15M04j349l1J82P17j087P23l31N16k44r17k03J359q28j6M15Q12P0l71p91
6135a55Q3N16r53K27k37N61K63j171Q43M39l65j69n9M08Q57n58j463O45P15o18
6155a91J17l91M34L29m74j14J007j068L76j013J827l52o11J57m47R25k41q40J112
6174E42l1M37j493r7J408j34q67N48M89K28m12j344N37Q57n85L01o41Q50l23l15
6194d5Q0n51R80n36m54Q9P90j604O52K2P09J04n58K99N01m04j2m88O10N50m07
6215C27m57n72M14L90p49o2J069kp55m20K39J050m13j163R03O89o92n92R48O88
6235H40l27k26m21L39n2J03L93p69N14n04j47P41m4o69rM67k9J92K43n73L46n65
$$ y = [342, 541, 245, -936, 270, -187, -466, -538, 686, 227, -154, 492, 186, -370, -52, -135, 25, 432, 263, -351, 815, 1219, -130, -161, 21, 738, -349, 374, 43, 559, 315, -602, -805, 554, -274, -290, 125, 937, 1007, 636, -155, -72, 444, -509, -282, -519, 42, 305, -866, -23, 416, 51, -118, -177, 231, 1088, 530, -933, -288, 427, -191, -74, -465, -31, 298, -176, -290, 717, -351, 25, -988, 839, 487, -124, 33, -414, 511, 270, -570, 542, 511, 948, -545, -642, 766, 632, -235, 313, 802, 1030, 618, -726, -189, 668, 83, 384, -257, 593, 270, -45, 35, -516, 464, -72, -526, -437, 353, -1251, -599, -577, 132, 236, -322, -23, 478, 74, 62, -426, 184, 734, 327, -130, -702, -288, 102, -647, -709, 360, 358, -397, -817, -578, 472, 59, -1104, -201, 488, -204, -796, 152, 840, 513, 287, -134, 205, 153, 256, 649, -120, 394, -110, -257, 484, 440, -229, -238, 229, 200, 392, 635, 62, 408, -157]
6257a57l64Q78PJ85j089Q94j219Q08q8J012r64n4Q34m57q45K50O38j48j45K6N20
6278E22o81k02N6N60J99l09r66Q80R06p26r72M00o17J648j279R28L58p48k93K27
6298a09P23j03n12j07M39k43k18j25Q22l54J07r26J45M46q03j17Q90L57p64J5
6318d37K8l46J358k7l30l69O39l45n41O17M67r51K15J90N99p30o47l31Q37J96
6338I2P72o26J92l32L19j333M48L19N79j081Q37J18j98j028N06J387j482n97K89
6357h19L37J095m59o7p95J702m72r59R77p83M43k65j086J195O19q13k10rO10p
6377B34m25o07P38K71r72J93Q37j75R1j4P09o25j93p43O52P9K50m22q29K109j570
6398d12k16K73j06Q12o16Q4Q2M50q85j60Q56O78l78k56m75M96M90q90J41P06k31
$$ y = [-157, -521, 357, 364, 549, -540, 354, -865, -57, -145, 867, -97, -151, 683, 226, -619, -369, 269, 121, -24, 2, 522, -159, -361, -305, 255, 454, 145, -821, 59, 965, 239, -733, -333, -950, 698, -581, 347, 705, -43, -336, -109, 614, 511, -1, -108, 331, 88, -130, -255, 567, 213, 320, -606, -461, -15, -818, -935, -45, 312, -452, -437, -409, -755, 603, 576, 246, -123, 516, 171, -370, 247, 714, -237, -22, 168, 767, 37, -610, -941, -104, 92, 864, 238, 430, 98, 417, -916, -468, -149, 430, -651, 186, 304, 106, -922, -416, 971, -511, -1108, -819, -482, 613, 154, 87, -708, 994, 522, -437, 540, -243, 200, -65, -1151, 44, 663, -150, -360, -369, 241, 234, -191, -798, -60, 211, -761, -568, 269, 94, 185, 171, 880, 255, 62, -681, -29, 50, 300, -122, -951, 1158, -412, -628, -355, -461, 351, -265, -181, -99, 351, -534, -694, 162, 840, 462, 206, -269, 227, 717, -173, -32, 674, 443]
6419D43j087R0m33J570j14n85r6R00n68l97l55Q33r4q22N65N45o12L50J53l16
6439c0K86l26q4P5M08l99l82n23J028J137J03j817R6L85M64k72r04P15k06J49
6459i7l60P49L56j5j119O10L79j442J028L1N88J90j672N77R86k130J863j182K74
6478c86L53l5p48R77J11m05j6Q6K33J0L55n56P35l29r6p91J207O2o00j242J135
6499F0O43L17j037k19J478j642R2K58P48k93J14j125J318q48k44L06j11j20N62
6518B57j23m19m7L43j426J740LO27k130M66R58J55J01j098P32j54J98j41L45k31
6538A56o35L41K0L29k53r8K57o88K58J44j19O10J6J80r01O11k54k5j71q2L86j06
6560b4J6n00p84J408j78q34J354n3J12p33K31j84O62p96j90Q65m14J048j315L02
$$ y = [443, -644, -554, -987, 583, 469, -116, -212, 688, 120, -277, -632, 201, 107, -715, -150, 395, -217, 133, 286, -30, 256, -70, -154, -79, 329, -70, -452, -975, 53, 1190, 1293, -524, -428, -43, 421, 149, -755, -40, -246, -97, -457, 292, 648, 633, -486, 124, 503, -939, 89, 120, 708, 898, -774, -197, 789, -1341, 522, -660, -386, -33, -68, -816, 161, 272, -133, -149, -63, 170, 180, 535, -21, 714, 385, 289, -502, 705, 767, 167, -1075, 60, 703, 1020, -17, -236, 1242, -400, -308, -50, 698, 405, 519, -606, 712, -136, -380, -74, -185, -305, 257, 134, -285, -332, 11, -1415, 325, 328, 955, -1175, -709, 249, 404, 505, -593, 139, -15, 183, 42, 387, 156, -479, -138, -118, 211, -42, -140, 117, -571, -313, -169, -288, 322, 338, 518, -383, 228, -26, -51, -222, -304, 82, -24, -8, -508, -1292, 116, -62, -896, 458, 405, 517, -216, 15, -169, 493, -303, -493, 372, -42, 1006, -309, -7]
6580gN14o53l3k67o0N21Q77l73p31M92R4j050L18J021K3r87Q84m45J068j115p71
6601f80L67Q24n15k78J077o85J62p3n84N15O9l75P84p2k25n95K02J95L72p51O09
6622C43k25m12k8j20N39J91p01j83Q71n87J237m18j101R58k68K16j110J353j25
6641D30j235P62j111J173J89l57l19L70J75N51r81L6R97J88q38P8j148R12q06
6660i34J135N05q39l8j49P14n39L4L60p63K179o21j518L20J96j40l67Q36lk80
6680H8m00j4P41m2p30Q2k4J88J08J02K10N22q90K99m01P4K4l21L48j41K23L11
6702C57m98l65K17L04q12Q77K32K08m97o10O28J36L42o39L65n63Q31m62p4O73
6722F50k69m16Q70o22n12L15j37L74J5r03L42O66M82q52J28p61J322j292P30r9
$$ y = [-7, 507, -146, -179, -446, -506, 15, 892, 519, -212, 280, 374, -676, -358, 663, 686, -301, 583, 138, 1206, 91, -680, -313, 511, -4, -282, 795, 110, 272, 199, -385, 130, 199, -176, 608, 536, 311, -284, -82, 113, 485, -266, 343, 118, -294, -322, -442, 97, 288, -413, -596, 275, -312, 925, 507, -594, 364, 96, 312, -798, 555, 430, -805, -43, -1154, 19, 208, -149, -468, -98, 77, 628, -353, -317, 680, 868, 30, 108, -1040, -128, -934, 201, 706, -133, -171, -320, 394, -145, -111, 249, -514, 1665, 1044, -474, -154, 42, -98, -465, 371, 368, 88, -312, -326, 415, 373, -357, -275, -299, -111, -3, 99, 309, 831, -59, 240, -161, -87, -63, -384, -36, -177, 46, 357, -141, -506, -289, 15, -797, 80, 312, 520, 23, -587, 41, 177, 519, -120, 245, -318, 513, 51, -23, 650, 381, -35, 835, 213, -299, 16, -121, 253, 268, -635, -293, 373, 855, 3, 131, -630, 692, -600, 130, 31]
6742C1n83J071O2j274P55K76n40n7Q3J128k48p10L07N18r96k25K31Q2R71n43o49
6763c10Q7k6k00N49Q88n19n29n02R56j019J94K22nN03J1m76Q0o4k21j07m75R72
6785Io45R2N18L19j45l96L17m94J0M74l94M17n51J428j105p19N02Q30o42l24J56
6806c43M78k68l23O33o75O64m79L66p86J220K83j304N91P3J83P1m01r7R08n75
6826B19J48l04O6k39L37m58P36p2j428J459l93k7q03J27O15P0J4J19N62q40k38
6847c30J018j007p39J728r95O49k42N57j391J034q41Q71P1l40K47N9j01j08J56
6866B96O9K25m0m32K21l38k56M69m33L82q26N90r36O82J23M19m13K56M53J19o30
6887@M3l96L6K44j65P75j048M10l27M62oL66o04P03m31o01M55k26Q37q43Q63o80
$$ y = [31, -552, 519, 581, -693, 62, 338, -202, -259, -176, 952, 704, -6, 301, 819, -177, -402, -171, -89, 882, 339, -310, -223, -249, -449, 100, 988, 469, -60, -562, 394, -625, -431, -209, -214, 289, 300, -176, -96, -160, -381, -488, -963, 9, -636, -544, -26, 293, 148, -248, 69, -425, -415, 59, -335, 82, -469, 959, -146, -865, -363, 467, -175, -499, -343, 135, -133, -456, 177, -498, 166, -313, 53, -733, 487, 770, -534, 57, 130, 313, 384, -17, -114, 794, 219, 367, 63, 129, -110, 227, -231, 505, 433, -995, 464, 71, 44, -759, -632, -17, 53, 67, 186, 748, -92, -330, 688, -319, -1058, 670, -325, 324, 82, 639, -752, 282, -559, 312, 383, 43, 290, 349, 248, 140, 296, 365, 590, 550, 118, 339, 1, -255, 214, -219, 163, -663, -73, -1009, -327, -204, 215, -198, 58, 511, 630, 0, 43, -353, -317, -73, -238, 537, -511, -101, -428, 34, 28, 394, -210, 493, 62, -539, -84, -310, 527, -316, 547, -133]
6909a33K46N33M41l82k43o75J62n9P0j19j24K42j066J257L09L78j534N05K0J223
6929A051p95L69k67M44p65k34j30m08J273o67n90J138j141K99Q24o79P03P8m96
6948GK88k57M65o19oK00l98J140j179Q59oq67R81l49p15O61q71l4P58O01p61R43
6970H41j88k22n69k81J82k10k25J023r26N93k99Q06n46J12K55RJ55r90J2k32L86
6991c14p04R89m49R92L69P6j197R0M20K71q74M42l86L72j010K93L88J71K42q20
7011f39R89n25M5m84N55M4K58k25k17K19m08R15j063J024l91k50l72q9o9J438
7031G55p77j082Q37J85R78q82O93j566P44n0Qo16R68Pl51J38M80M45K0o07j72
7052A55N94p26k60L76j45P61j086k80P36j76M43p18L32q33O58j98J99m78J82M9
$$ y = [-133, 113, 646, 1087, 705, 462, -213, -51, -110, -40, -159, -283, -41, -1107, 150, 459, 837, -697, -192, -172, 1051, 256, 625, 358, 802, 37, -197, -327, -735, 538, -129, -719, 419, -722, -423, 401, -278, 425, 503, 7, 295, 38, 503, -116, -122, 78, -320, 820, -359, 500, 494, -373, 608, 259, -456, 205, -666, -700, 58, 659, -102, 841, 653, 431, -138, -419, -237, -447, -672, 351, -575, 18, -281, 525, -21, 91, 346, 355, 510, -480, -468, -700, -314, -1018, -29, -478, 514, 883, 959, -238, -148, 272, 543, -331, 111, -275, 97, -913, -620, -232, -61, 181, -639, 350, -175, -130, -614, -59, -15, 243, 18, -199, 20, -388, 527, -536, 488, 97, -153, -525, -614, -683, 755, -22, -1104, -267, -82, 896, 14, 707, -859, -115, -165, -157, -773, 195, 202, -149, -11, 469, 914, 934, 327, 155, 749, 23, -237, 139, -6, 755, -331, -611, 125, -51, 392, -326, 6, -827, -169, -367, -168, -646, -464, -415]
7072d15K69M61o37J09M04m3k62K73p26J206p35m66k64L08j49J221p25P75j007
7091d03o8J058r29L05j8n36J127r26N56O4l57N15n19k57L71n19J85M34L58n0L22
7112G13p25L61J74j074J195j364N08l31O96k95j02N3M98L04q51N9k08J325p68
7131A68P8K62n07o75O61k52O61j12r79j60Q12p9j27M17l41Q39j278O27q5P77j148
7152d41J20K40R4k79J53J76l60K45N63j218N73R13j297J475j134M18k20k21L31
7171A31K51K67j98j161L53O49n16L12K69M2k24m7j90J15r16P54j97m8l3j38P64
7192B39p96m8Q97m22K95k17J286j464k36P77n45J78J91J76k90m6R4j42O75j302
7212g00P96k45K38k84M9K14m10L8J146r88O6K12n09K66J98o17Q74j55k08J94l80
$$ y = [-415, -146, 315, -322, -213, 191, 148, -114, 159, -567, 639, -96, -562, -826, -518, -667, 554, -171, 604, -403, -471, 587, -342, -37, -55, -591, 536, -390, 166, 230, -127, 388, -131, -388, -17, -536, -351, 83, 441, 391, 713, -12, 349, 523, -551, 644, -720, -212, -543, 153, -142, -244, -191, 307, 611, -240, -181, -389, 936, 168, 246, 508, 1, -674, -13, -265, 396, 284, -695, -855, -43, -122, -249, 168, -173, 666, -612, 15, -70, 707, -441, -321, -81, 13, -266, -113, 63, -297, -52, 511, -707, -134, 779, -518, 957, -177, 241, 21, -200, 131, 382, 649, 451, -710, -357, 292, -224, 88, 357, 399, 175, 128, -62, 53, -863, -109, -306, -354, -387, -525, 239, -557, -605, 292, -130, 165, -52, 1234, -230, -466, 311, -234, -56, 135, 311, 21, -25, 69, -73, 602, -700, 96, -149, 89, -195, -146, 68, -342, -304, 842, -146, -80, 132, -377, -111, 87, -530, 344, 189, -19, 175, -205]
7233b05N36j55l15M8k64J043j156J002p51K01n37O82O48n44o02L68J96o32O17
7252A80j255K026j011N4L43l27m50O17j126J923m12o60m04m7N81K43l64L07p47
7271e29P61m14OJ08k03j9K32j3R5m10kO95j07K38r18J29K45K06k4M69j88Qj136
7294g71J037L7nk69j5M23K02j138K07k86J339p33m27Q25j22M18j476q8R03J143
7314A204j628J06P60p05O23r69J103p88J152N0j019j28J96N21n98M53k63L6j318
7333a212N98J022r4q15ro2J86L00n99J125L19j714O36l10Q13q32K68O17J91n24
7353i6n55Q90R17p50j097j63J484n72k71l45M74j28K03L85L03m36m40l78P7O10
7373A12M36j76m56L19J066j045q62J326j334R46k78m01M52L85k9j141O97oN5q83
$$ y = [-205, 331, 176, -139, -91, -355, 688, -468, 534, -217, -16, -553, 129, 777, 233, -369, -1, 195, -437, 180, -1075, 951, -60, -6, 337, 10, -440, 177, -949, 974, 562, -98, -502, -549, 32, 275, -89, 218, -529, 232, -182, -176, -68, -271, -290, -58, -71, 24, -386, -388, 307, 200, 438, -480, -351, -106, 100, 76, 545, 357, 365, -771, 266, 303, 298, 29, 14, 437, 639, -499, -292, -578, 761, 28, -399, 426, 304, 722, -754, -842, 61, 1204, -424, -318, 442, -263, 360, -609, 494, -294, 858, 908, -111, -239, -43, 478, -120, 333, 70, 106, -1212, -614, 408, 314, -501, -510, -572, -386, -86, -685, 440, 759, -955, -319, -629, 184, -648, -380, 237, 428, -96, -651, 239, 1156, 406, -691, -854, 630, 58, -213, -558, -84, -212, -9, 376, 679, 243, -197, -575, -498, 112, 548, 372, -84, 235, 1301, 256, -606, 720, -614, 332, 54, -347, 105, 490, 461, -680, 17, 11, 66, -817]
7393h17J621m26l76n05O93j3l24J07j00o2M71j46j30N21P2K65r01J67j48P49j576
7414h58L58K71l95R88o11N37p9L84q88k9Q64p25N76m45k15P64m20J00J51p13J3
7435c72k72K82J373j148k18LO26n22l86J097o16R03j756L57J000k75o3o2l28J172
7455G95n60n32K17N19j296M73J018j81o39O71j98m67l65k49L87K42O05k80k70
7474a10j04L44K59j302N96Q41k69j272J196J73l95j56o02J076N00p78o26K72K99
7493e8q2k46n84J060r16K54N95J55K43J17m64l13Q35o11n06K59N06L41p83k70
7513d68J10m70Q58o78K040r52p26K67j57P62L59j010J4M84J27j257p43J366Q77
7532H03o44l79J462j279j10J16l71N84N4j238R81K59o06j13K34N83R7n35j297
$$ y = [-817, 804, 378, 2, -503, 190, 177, -147, -40, -140, -202, 269, 123, -7, 514, 586, 851, -50, 117, -31, 718, -858, -500, -229, -624, 364, -247, 290, 211, 595, -293, -322, 542, -183, 393, -52, -267, 497, 77, 177, 328, -385, -372, -644, -362, 1011, -137, -355, -352, 274, -248, -634, 463, -153, 750, -1006, -649, 351, 76, 13, -49, -377, 795, 235, -297, -80, 439, -857, -384, 634, 453, -186, 485, 287, -180, -545, -794, -407, -165, 440, 160, -110, -214, 130, 389, -913, -317, 524, 255, -1017, 179, 352, -43, -199, -801, 275, 775, -3, -629, -357, -58, -140, -386, -970, 90, -826, -572, 23, 178, 421, 538, 74, -239, 596, -15, -521, -262, 244, 585, -198, -468, -358, -828, 30, -648, 1392, 440, -286, -19, -176, 586, 945, -65, -51, 433, 560, -697, -1440, -74, 803, 159, -220, 1242, -37, -147, -31, -402, 182, 236, -1002, -21, 238, -368, -481, -247, 336, 433, -102, -1399]
7551a399J736j01L53n85K75L17o52p15K34N78N55r14k87J72J483r50n61O8J258
7570H65j126l47K18M57N3m32K9R71R3j340P7L99P37l03n14p51J185j168Q66l48
7590c79P7K74j56j3L45L70j164k40J133O98j396m12P53O37j6j400L00R93Rj291
7610h78M65O16n06j14J46P60o47K02m3p51P45MK29p65Q78n20J75K61j22L47n48
7631f6L28R6K43j69q43M16K15N18j321O50q3j00l20J45J69P82q77l04P28o18M9
7652c62n30N73J77J12m17j06P42K14r77k85J209N82j345j21N38K21l04J45k43
7671a77K34J045p28o58P01K95o41l00k6j5k66P33n34J537o60j062K7Q58n59n39
7691g35J050l85J146j414r18J054R99j402O00l2K98j01J10o86L52K93m09o10R50
$$ y = [-1399, 337, 236, 589, 4, 279, 596, -56, -771, -537, 41, 596, -318, -605, -433, 1050, 100, -461, -393, 865, -261, -608, -390, 67, 120, -312, -283, 688, 781, -559, -482, -83, 654, 351, -163, -914, 271, -897, -31, -379, -302, -28, -184, -197, 148, 518, -646, -886, 247, 945, -451, -863, -110, 527, 511, -889, -589, 404, 413, -878, -413, 203, -303, -417, -271, 489, -158, 44, 1, -750, -5, -1, 228, -537, 341, -179, -4, 257, 135, 482, -66, 262, 358, 601, 432, -411, 5, 220, 738, -583, 67, -16, -116, -436, -291, -122, 660, -217, -521, 207, -411, -362, -892, -319, -142, -30, -447, -553, 189, 403, -574, -859, 350, 932, -413, -534, 4, 225, -79, 66, -177, 57, 1102, 374, -284, 417, 712, 71, -229, -255, -270, -536, 197, -337, 1200, 540, -522, -495, 363, -196, -735, 315, -70, 1076, -338, -1256, -202, 797, -605, -5, -37, 261, 160, 270, -416, -64, 229, -180, -790, 160]
7710A60K66l13Q9p03J319r96q36P31J032l50j057J83M41K73m86l83R15J85N88
7729A058j569j13J093n14j2L62o4J21k83m93K12J108j18j127K54O15q30n49O64
7748a85J199j23q92n12J021K21j222N2M52J381j461J28n25J413l50r04Rj33J391
7767I60j230j19J031k75r26p80J768o6r0j602J096P73L40j509k01P53R24j153
7785c06m13Q39P69m08o97l09J509j58j409J41P85j2R5p08O8N53j253O5J088N53
7805G92k94r19q8R52r30N9J26L19J45n81k41P68R39j278M67m31O89oq41r7R96
7826E46n00j151L56J212l26k58k18LL24K3j85l66R28n23n7m05J032L39r57l06
7846d89P26K71j128M06n8O73O0j521J191Q23k18j823K99R28l41k14M01J74L92
$$ y = [160, 426, 113, 202, -501, 818, -178, -1014, -283, 749, 399, -658, -475, -34, 239, -247, -630, 285, 470, 1058, -511, -624, 469, -45, -57, 305, 241, 362, 79, -414, -202, 906, 788, -339, -85, 530, -300, -849, -185, 1014, 891, -1, -513, 508, 729, -493, -441, 11, 1392, -69, 59, -466, 947, 597, -307, -298, -431, 960, -270, -389, 642, 367, -559, -1339, 429, 363, 273, -1329, -233, 540, 880, -629, -830, -77, 847, -306, -719, 120, 889, 481, -216, -525, 984, 826, -583, -442, 343, 331, 426, -282, -214, 339, -914, -849, 239, 792, 498, -421, -509, 443, -487, -428, -302, 17, 162, -419, -660, 108, 1047, -231, 236, -195, 494, 488, -353, -450, 546, 46, -1105, -749, 463, 137, -121, -339, -336, -12, 11, -174, -540, 388, -135, -192, -597, 435, 774, -183, -489, 237, 508, -620, -214, -272, 401, 461, -1060, 131, 954, 736, -1087, -788, 140, -201, -415, -14, 160, 552]
7865E52o97m3M52qn92j94O0N27k23o25O87Q26K15j117o06J148J68o70j30J98J34
7886F2N7j271M05J103k88k93k64R25n99j128L72R50J74j34o42K56j2J56j35L32
7906B6J152j008m77m02J287K29j940O68J13R81o58j417J193J098l30j195P67q8
7924aQ26j355k98R74P7L29m75M58O50l10n62n17J187j82q50o52J383K3r04l22
7944e21N30L32o90k19M9J072M73q42n71J135L94j424p35J563K16o70k72K78J011
7963A109j226o26O21N93L45p16l20J205m90m59l41k68J307n19n54Q41J010k053
7981e41J15j02J124j31j141L32K46M73p23p79P57N15m26l13L31J153p28K48j25
8000B85p7mj030n8J179L45j022J067p90M4M62j077K58J049l21o68j15Q48l40k19
$$ y = [552, -145, -188, 264, 256, -336, -530, -470, 57, -166, -791, -104, 722, 937, -180, -786, 362, 530, -140, -270, -72, 62, 119, -1152, -747, 356, 68, -225, -489, 436, -163, -1291, -919, 31, 205, 71, -571, -315, -327, -171, -306, 26, 1178, 170, -307, -709, 578, 807, -1133, -465, -352, 629, -29, -1446, -253, 845, 515, -680, 87, -1, 825, -530, -828, 146, 223, 552, 77, 535, 1185, 875, 313, -204, 983, 801, -49, -701, 682, 705, -199, -521, 9, 341, -349, -568, -519, 553, 1026, 184, -387, 748, 1142, -282, -1017, 546, 762, 92, -180, 98, 1109, -117, -743, -122, 471, 816, 100, -220, 985, 495, 36, -305, -573, 734, 215, -339, 502, 1512, -541, -426, -528, 596, 465, -676, -344, -98, 375, -348, -1127, -370, 145, -281, -594, -263, 890, 162, 410, 285, 208, 204, -826, -884, 295, 640, -382, 685, -105, -61, 401, -676, -418, 631, 310, -358, -473, 375, 35, -184]
8020a84j46N62o3l94k02N43P44q78m67N19J6L9q43O62j57N93J88n11L58P40p50
8041C69j87J09Q08p10j077j60J388k06j060J050k57M45j295L59N58M91r88k35
8059e98L27J005j093o46N80J383j01j597L58L72j82K18m42mJ879j660P48n65J09
8078I1m05K42l18Q27P28j403m88R92J459k191N73M85R78j716K6K99L45p6r34N
8098d81Q35K01l47j182M62J115k96j314R84J297r46m93KJ356l71k013P03P06R19
8117A137j268l78R36J60K7q41K27O43j627L21L08J352l15k527J325M47J004n31
8135D00j669J093R34j037n31j74Q28o2n21J01P62k41J51p31J343k07j284l8J198
8154C15j2j58j66j66K15O59j690L68P52K92l68p44Q35L16l45j730J561Q04m69
$$ y = [-184, -330, 232, 169, -225, -427, 116, 860, -18, -485, 34, 50, 89, -754, -92, -249, 344, 532, 21, 379, 1119, 369, 182, 291, 1099, 389, -688, -848, 540, 334, -726, 324, 67, 512, -783, -424, 134, 625, -363, -598, -271, 734, -359, -1005, -425, 958, 857, -740, -382, -10, -192, 26, -416, -420, 1459, -201, 547, -18, 91, -314, -72, -390, 437, 1165, -238, -726, 266, 1725, -466, 107, 592, 1570, -146, -120, 179, 524, 448, -486, -481, 354, 555, 208, -974, -512, 603, 307, -1007, -23, 1274, 328, -165, -163, 1193, 822, -1191, -488, 218, 1137, -131, -509, 427, 587, 614, -227, 0, 643, -984, -663, -355, 997, 682, -1845, -520, -73, 931, 400, -1269, -176, 758, -279, -810, -984, -156, -218, -739, -638, 124, -117, 34, -697, 646, 439, -845, -883, 315, 303, 145, -21, -187, 28, 687, -1003, -635, 117, 409, 41, -703, 132, 448, 103, -1627, -66, 738, 269]
8173B69o47J95J309j091j151J83O87J059j107p26N05L94l41j0J094l5m32n95
$$ y = [269, -378, -183, 1126, 35, -1116, -933, -246, 813, -294, -1020, -515, -121, -462, -472, 622, 587, 155, -440]
8191d40
$$ Imaginary data points
##PAGE= N=2
##DATA TABLE= (X++(I..I)), XYDATA
0@%%%%%%%%%%%%%%%%K4r2J36j36J36j36K04k72K72l36M04m48N16o06O97p76Q91
33D78j024J161j305J464j649J852k069K307k571K861l168L512l893M296m736N224
49B740n757O343o991P701q482R362j0347J1450j2703J4135j5807J7775k0115K2983
63A2287k6594L1277l7643M6866o1669R0608k54013O55146j73080l73151P32235
74F42269k40400m8262L28383n93088k63642O79676m30163n74801N40209J11539
84A51720m06861K27979q4451j90999M22391j81820n30429M98517K76094m47903
94b65762J06834K87465p9332K13882R642l55898K60032K56165m77620p3153L12359
105A94614j93645j07034J20034j69432R4864K12793l36085p3842L78608j52046
$$ y = [0, 0, 0, 0, 0, 0, 0, 0, 0, 0, 0, 0, 0, 0, 0, 0, 0, 24, -68, 68, -68, 68, -68, 136, -136, 136, -200, 204, -244, 272, -334, 363, -413, 478, -546, 615, -690, 774, -875, 977, -1092, 1215, -1356, 1505, -1663, 1849, -2044, 2252, -2484, 2740, -3017, 3326, -3665, 4036, -4446, 4916, -5431, 6019, -6684, 7451, -8356, 9419, -10696, 12287, -14307, 16970, -20673, 26193, -35476, 55132, -198881, 456265, 283185, -89966, 642269, 401869, 353607, 681990, 88902, -174740, 504936, 74773, -500028, 40181, 151720, -255141, -27162, -111613, -302612, 119779, -62041, -592470, -93953, 182141, -265762, -158928, 128537, 49205, 263087, 272729, -83169, 176863, 433028, -44592, -117745, 194614, 969, -106065, 13969, -155463, -60599, 152194, -183891, -257733, 120875, -31171]
115c1171k16257K31497l767m4897J89676j48039o3712L54050q8715k72171K37075
126A43569M5961k36757R6122k8390j73633J94689k8537k60202K26771R9132k70305
137a91580J32297J41556j69694J07876P0845j69400J55820R0882k51815Q3183
147c0J76819j96383k4938J22964j32116O639R2628j66121M0200J75553j70224
158g5009l8538K12112o7512q8287J12019k8262o261R4188j40069o7700K02710
169A09391n0467j86753J03119N7177q0114M1568l0837l7379J58147k5445j73946
180a15539J26096J13518j44396k2388P0206k2437L6950l2480j16652J23599J13386
191A29863j73256n8493J47751J4058o1025j9020l4712O7488P1302j47697n3959
$$ y = [-31171, -247428, -15931, -19698, -64595, 125081, -22958, -86670, 267380, 178665, -93506, 143569, 189530, -47227, 48895, 20505, -153128, 41561, 13024, -247178, -20407, 78725, -191580, -59283, 82273, -87421, 20455, 91300, -78100, 77720, 168602, -83213, -30, 176789, -19594, -44532, 78432, -53684, -47045, 45583, -120538, -80338, 95215, -75009, -113547, 98565, 31053, -57234, 54785, 26523, 20262, 114450, -25619, -93319, 109391, 58924, -127829, -24710, 32467, -47647, -6079, -36916, -74295, 83852, 58407, -115539, 10557, 124075, -20321, -42709, 27497, 5060, 42010, 9530, -107122, 16477, 129863, -43393, -101886, 45865, 59923, -1102, -20122, -54834, 12654, 83956, -63741, -117700]
202a17700J78264m504j33335L0843N5199K6315J4927r3129K821J58339l7591j54671
214g4222N6870J06539m1927o9863l8392K7715R3583o2848j37443Q8722J16338
225F5072q0763o1189M9262O5248L4413o1593n7162J01438O5007j18210o0621Q9446
237C0348L3514o3175n8091J700Q1194J7604j17469j2541J24693O598q3283q757
249d7665M9552N0502k4253q0088L3407R5620m0277q4656L0027O3580o660n7352
261a8263k5268N8380M4057o5267o0020O3761N5785n8091n0159K9295M7819j10
273B1919o1056j4371P8490J9881o9276p655O2324K2530l8510l2155L0863M4594
285E7578l0356o6696J4910N7499k7944o1402J0719M5850J1550l9007k2892N3672
$$ y = [-117700, 60564, 56060, -77275, -46432, 8767, 35082, 50009, -43120, -40299, 118040, 80449, -74222, -17352, 89187, 47260, -22603, -60995, -33280, 60303, -2545, -139988, -51266, 65072, -15691, -76880, -27618, 37630, 72043, 10450, -46712, 54726, 119733, 1523, -59098, 30348, 63862, 687, -57404, -55704, 25490, 43094, -74375, -86916, 37777, 44375, -38908, -47665, 1887, 52389, 28136, -51952, -18545, 77075, 36798, -47858, -17831, 45749, 39089, -18263, -43531, 14849, 58906, -6361, -66381, -2620, 53165, -4926, -55085, -25790, 22029, 21919, -39137, -53508, 24982, 44863, -24413, -32068, 30256, 52786, 14276, -17879, 12984, 57578, 27222, -39474, -24564, 32935, 4991, -56411, -45692, 158, 11708, -27299, -50191, 3481]
297C481M3368m3210l1239M7093L7801l0033m1032J3459L9342j1220n7368r564
309c9122N3932L907o3490n751N1575K0835k9964l1576L2860N7178k6617n6107
321c2340K9935N1824k0676n0458k609M4022J3781n2506l0775N2233L7541n3458
333a3486l4312M7303L7944k5125m2769M229N9253K687p1317k676O6270M250m8782
346a6531j7581L8556M0678l2335n4458L2805N9853k9506n9476J6659N0004m682
358B3986n0346k0970M9772L4772n4188l9162N7408M3552l6504l8168K3843N0917
370D4912l678o3511n567O2240N177o5456j9544N0126K4938m2817l8693L2529N5167
383C5823j9885n8171K2618O4464j0277n2974l281M8656J7641n2255l5082M2965
$$ y = [3481, 46849, 3639, -27600, 19493, 57294, 27261, -13771, -312, 39030, 27810, -29558, -39122, 14810, 18717, -44773, -50524, 1051, 21886, -8078, -39654, -6794, 50384, 23767, -32340, -2405, 49419, 28743, -21715, -24324, 19698, 33479, -19027, -49802, 2431, 39972, -13486, -47798, -495, 37449, 12324, -30445, -26216, 33037, 35724, -35593, -38269, 28001, 32251, -16531, -34112, 4444, 45122, 12787, -41671, -8866, 50987, 21481, -37995, -21336, 28668, 23986, -26360, -47330, 2442, 37214, -16974, -56136, 1272, 44824, 8320, -29848, -6005, 44912, 41234, -22277, -27844, 34396, 39573, -25883, -45427, 4699, 29637, -13180, -51873, -19344, 35823, 15938, -42233, -19615, 44849, 34572, -18402, -21683, 26973, 44614, -7641, -42723, 242]
395B42L9163m3186m7704L5925M8937k4382m2146J0591M8308J2893n4621k0114
407c6094O2858J8669n7077k3572L6179L1643k6835m8382J6320N8921j0944n7876
419c6190R318N9059L743m9347j3689M0220K9031l8801m6760L5591M9695l6434
431E436n1322K5438M7158q128m3160q378N2315K5828n4018k9520N5477K9491m6072
444E45l4273K5361L7625j2852n3025M91O3033K338o1566p29N2345J4628l6358
457b437l0267L4605M3241l2066m8653K0491N1729j7215n3892N162M8230P385m1549
470a5236k1955M2918L8885m2718l9674L7465M0545k7394m4354J1671M3303j264
482B2192m6824j4025N0833K2224m9620k2191M6331K7703k7177l3296J7421M3466
$$ y = [242, 39405, -3781, -51485, -15560, 33377, 8995, -33151, -22560, 25748, 38641, -15980, -36094, 26764, 45433, -11644, -35216, 963, 32606, 5771, -42611, -26291, 32630, 21686, -36190, -26872, 32187, 35930, -13417, -27106, 13114, 42145, 3344, -43416, -7825, 41870, 5436, -45886, -20448, 26710, 18582, -24578, -32956, 19359, 45187, -8831, -38351, 17126, 46617, 545, -33728, -8367, 29258, 16406, -36619, -36128, 26905, 29243, -32323, -33052, 19293, 33921, -2437, -32704, 1901, 45142, 13076, -35577, -15086, 36643, 19428, -34464, -29302, 18928, 26313, -15236, -37191, 5727, 44612, 1894, -37780, -315, 40230, 12836, -31518, -19847, 23456, 22192, -24632, -38657, 12176, 34400, -15220, -37411, 8920, 36623, 9446, -23850, -6429, 37037]
494C7037j0381n1376l24N0130l140m9744o599L6002J7587k6412l0634K7602M6055
507C5803k5885l9506K5351L8482j1076l3757n366L5446J4011m4880k1287M1052
519H388J6273l4627k1753K0035L1949j0862m0287J4112M2708p091l7140l401L8567
532A6871R545l5677j5552L0672K4246k5695l2366K4140L6907k1479l4946J2114
544a1220L3305l848l6268r094L4429J3870l6227k2213L6416K5420k9572k1464
556b6466K4078L0208p646l4768K147M3598N29m6554o264L9811M243l5944j9022
569c2050K0572L1827k0290m1620K4458M5731j8409l5189J3396L6679R255l4737
581c77k2758L8372K7373m5504l1386L3196K3714k1893l2065M475M3997Q08m4723
$$ y = [37037, 26656, -24720, -25044, 25086, 21946, -27798, -34397, 1605, 19192, -7220, -37854, -10252, 35803, 9918, -29588, -4237, 34245, 23169, -10588, -15954, 19492, 33503, -11377, -32664, 8388, 24661, -9966, -31719, -11684, 20265, 9403, -30884, -16772, 25936, 18845, -18295, -21696, 16871, 26416, -9261, -24813, 5859, 30105, 4410, -27956, -3816, 33091, 11612, -23334, -11220, 22085, 18237, -18031, -27125, 7304, 21174, -15053, -37266, -850, 24570, -5002, -26466, -2388, 27820, 20174, -14594, -12447, 31151, 31680, -14874, -21138, 18673, 22916, -13028, -32050, -11478, 20349, 59, -41561, -17103, 28628, 10219, -24970, -11574, 25105, 34360, -377, -23135, 15237, 42610, -2894, -34280, -1084, 22630, 737, -31328, -26853, 17144, 17952, -26771]
594b6771L20M7558J2645l9868j7484L3505K4376k5072l3955J2318M3353j5457
606A5468m8154R772M3003q32l4997j1702L1976K2658l0068l0721K9529L9254k6835
619H351l6988J9692L4022n240l3240j1509M0466J9070m4706k2179L7633K3523
631B8895k8507k6676J6324K9155m744l8447m647M4134M872m2333k234L7880P862
644B1534k0616j8267J8282L5523j4338m2506J4841L5405j8976l2767k16K1834
656b67J1483k4689k2494K9128K7405k4607j8541K6411K1134j4138j9867M286K5502
669B0746M495l0975r533L4462L824l5683j0240K0777J0471j2483k1590O746K9304
682A0321j351l1241J0523L2421o537j8908K682J3595Q697j8095k0709K2207K2125
$$ y = [-26771, -26451, 21107, 33752, -6116, -23600, 9905, 34281, 9209, -24746, -12428, 30925, 15468, -32686, -22914, 20089, 19257, -15740, -27442, 4534, 27192, -2876, -33597, -4068, 35186, 8351, -28637, -8945, 25077, 19837, -13403, -24912, 15554, 34624, -10082, -32261, 5372, 28895, 388, -26288, -9964, 19191, 14447, -24000, -28647, 15487, 20359, -21974, -24208, 13672, 21534, 918, -17349, 933, 36456, 22118, -20388, -5547, 29858, 10882, -21885, -22101, -267, 11216, -13473, -35967, -6839, 20566, -4041, -22582, 3829, 24963, 10825, -9042, -4756, 20746, 25241, -5734, -15267, 19195, 23019, -12664, -22904, -2127, 8344, -4139, -25729, -18983, 10321, 8970, -22271, -11748, 20673, 14136, -4772, -2090, 11505, 20202, 2107, -18602, 3605, 25730]
695B5730k5415k1827J8168J8220j0073j8795N53K0104Q417k8112j2823L0500P972
708A2619k3535m614J8028J0927n635j5544O702K9582r296l3122J0045K4787r607
721A1337k3317p395J7169J6304k0821k5046K1520K5385j9028j7972J5003K0195
733A3334M32j7728m968K6632J1137l0431q794K8186L389k6721j4353J1136K0402
746A1653p496l0808L186L5365j565l1766L666K7521O519j2860j4751J1958K4212
759B4834j4980k6888J8271K1422j6696k1165P369J8542L157k2114j5336K6314
771B730J9292l1510j7913K5310J4790j2351j4421J133K3863Q249k9839m678L3719
784A8374L484k4410j330J3130Q003j0727k2727Q187K8393j6190l1726J0390K3865
$$ y = [25730, 315, -21512, -3344, 14876, 4803, -13992, -13439, 6665, 15082, -13030, -25853, 4647, 12619, -10916, -15530, 2498, 13425, 7790, -7754, -1052, 28530, 19234, -13888, -3843, 20944, 11337, -11980, -19375, -2206, 14098, -6723, -31769, -10249, 15136, -3892, -21864, -6861, 13334, 13766, -3962, -8930, 17702, 28839, -1592, -10386, 17800, 21189, -5532, -19885, -8749, 11653, 4157, -26651, -23465, 11900, 10335, -21431, -17765, 9756, 16275, 3415, -11336, 622, 24834, 9854, -17034, 1237, 22659, 5963, -15202, -7833, 10709, 13866, -8248, -23584, 2730, 22022, -9488, -27401, -2091, 12699, 348, -14073, -12940, 10923, 19172, -10667, -15345, 18374, 21858, -2552, -3882, 9248, 17251, 6524, -16203, -8016, 20377, 4187, -27539, -17149, 6716]
797F716o356j6391m691J9762K0957j8452k0065K4403K1516j6006j3544R793J1225
810A8867n860j9788p901J7761M245k6448o383K6474L601j6693m680J4325J7517
823A5037k153k4144M313K8279m392k4651K853J8087N75j2020j3111P337J4486
836A0496j3535j8084J5876J5060j4927j1962J0785J3532K887j5996o830K2687
848I989J1737k5148q841J8273R028r302j1956J2J4735n80k1178KK0429l823j8254
863a4877M238J2625K306q653j0243J6246J9572j2467j7790J3709J5099q068j5736
876d039k607J0422O567j8103j3231J6155R235j4665m675J3326Q940o771r367N826
890b987K0579J63k1281Q72K1815j405k1082o112R463P551j0877j7600O505J8854
$$ y = [6716, 360, -16031, -20722, -960, 19997, 1545, -18520, 5883, 27399, 11393, -2151, 7642, 18867, 13007, -6781, -14682, 3079, 7324, -19124, -25507, 967, 4568, -12125, -16805, -2480, 15037, 12884, -11260, -6947, 21332, 16940, -7711, -4858, 13229, 13804, 1784, -11327, -3990, 10496, -3039, -21123, -5247, 9813, -5114, -17076, -6291, 7241, 10128, -5868, -12698, 9989, 21726, -3422, -12263, 6010, 15038, 5736, -6220, -6208, 8527, 7947, -13231, -13229, 7200, 3377, -14877, -10639, 1986, 4292, -4361, -14604, 1642, 21214, 8747, -9043, 4666, 19765, 11697, -4039, -6646, 3776, 10343, -7760, -20991, -4836, 4399, -10266, -14941, -1615, 7325, 554, -8813, -2987, 17592, 17755, -3526, -2654, 19161, 17756, -3326, -9438, 25, 7576, -3301, -20901, -14396, 4458]
904D458r101j3536R420J5531j140q011k31J5474P183j6644r252J7340P070j8095
918D66j2991P986J1984o269j7121r3J9766J390j6146k852J7589N893j1680o033
932h111J0653J2142p051j5083Q108J7329q333j7839M167J3705k68j5900r325J4529
946a277J2667j6716j4672J4574J2368q014j1579K706J7904M260j6556j029J7808
959A2444N214j6299o353J3206O795j2408j4238M445J6141q457j9419L365J7830
972B266M93j3104l123J5164J2204j0409j1394J2661J4734j0162j4622O018R995
985A0721k859j3790n414J4169M274j7170p017J4860Q900r837j1033R215J6095
998A1114k925j4800K077J5091K114j3950m973J1944N696j1755p794O964R915o275
$$ y = [4458, -4643, -18179, -8759, 6772, 5632, -2379, -2610, 12864, 20047, 3403, -5849, 11491, 18561, 466, -12525, -4539, 7445, 1176, -15945, -16038, 3728, 5118, -11028, -13880, 3709, 9602, -2078, -8111, 2542, 14684, 7633, -7450, 658, 17987, 9654, -8185, -4018, 9687, 9419, -6481, -15806, -1277, 11390, -5326, -19998, -5424, 6944, -1070, -12649, -9943, 7961, 12221, -4335, -5364, 12444, 17658, 1359, -4994, 8212, 15007, 2599, -11639, -7194, 8947, 490, -18929, -15564, 2266, 2759, -10345, -13468, 1696, 13900, 3491, -7903, 4758, 19492, 9330, -5292, 726, 10721, 7862, -5928, -11342, 2827, 7101, -10069, -17086, -2226, 6674, -3163, -14196, -4981, 11114, 8189, -6611, -4534, 10557, 12671, -1279, -6252, 5692, 11388, -367, -8161, -1197, 8718, 2443]
1012B443j4315M947J4864n415j2822K298R502N833j1050o691J2857Q450j0322
1025E79p593Q533Q617l232r184N21R621O9j3795j868J1703qj1830k272O962O263
1041C086m954r357O283J2561k420j0251N574J0582l133o763l499O832N669j1433
1055a223r294J0204M841j0188m767M997P381R5r303O04J3552J749j0920o18R685
1070F795Q74o768n825N764O800n496j0111M157J0010l792j0735K852J0777k280
1084C022p014j857P065Q170r933r257J0462P864p972o289M582P198O21r478k858
1099e674J1392L518j2966k624R080L673o525p445K550J0137k935j1542K563J2600
1113E802j150r876Q65J0281K749o351p259O165Q412q104r531N877O207k123q700
$$ y = [2443, -11872, -6925, 7939, 2524, -10298, -8000, 1502, 7335, -3715, -10406, 2451, 10901, 579, -7014, 1519, 10136, 6904, -2280, -1759, 7862, 7931, -5864, -7732, 3971, 3963, -7867, -10139, -3177, 3086, -1868, -11225, -4942, 7619, 5199, -5052, 522, 11104, 7971, 1208, -2291, 4541, 10210, -1223, -10517, -313, 4528, -5660, -10427, -5430, 1951, 2046, -7257, -6653, 6899, 8648, -2272, -2890, 6795, 7669, 901, -4924, 840, 7640, 2144, -7967, -3810, 6200, 2408, -8327, -5475, 5302, 3022, -3992, -5849, 1216, 9386, -547, -9804, 658, 8522, 550, -5739, -1157, 6041, 6662, -2816, -5674, 5718, 9236, -3730, -6354, 2726, 6399, -126, -7571, -5021, 5116, 2181, -9361, -6798, 5802, 4652, -5224, -4359, 5922, 8671, 2320, -4939, 1226, 9638, 1534, -7997, -2120, 4087, 1964, -6736]
1128f736p42Q812M251r409l448R818N237p099n759O639O935l897r788M46R339
1143D599j89j0077k240Q853K936o815k913N807N889k075q907K124J1620m878p714
1158c980K377M761n06l777n693M924P047p615n300P288O312m698l612Q21O601
1173D950J368p840k743O983K113p443j251N028J751m191l740K789M714j84o971
1188d667J662Q338k434m391O78K545K483m338m095L393N024m884l503M504L526
1203C841l189l424j8L646J418n714k62N087J578n547j526N208K894l181j838Q17
1219b10N045l83o200N18N791k410m567o44K269K336l605m659M124N789n156l117
1235e079L628M818O58m266j210P844J678o859l111M814J703m976m442J252M475
$$ y = [-6736, -7478, 1334, 5585, -3824, -7272, 2546, 7783, 684, -5075, 1564, 8499, 4602, -5186, -4740, 4599, 4410, -5667, -7907, 946, 3882, -2933, -5846, -39, 5850, 3775, -5132, -3008, 8612, 3734, -3980, -1603, 3158, 2652, -1125, -6818, -1894, 5153, -2462, -7762, -474, 5838, 1140, -2472, -1651, 4950, 6318, -1522, -4265, 2718, 4831, -2612, -3863, 1165, 2916, -1275, -5015, -2226, 2488, 2304, -4667, -3005, 5333, 2899, -1492, -814, 1731, 4214, -124, -4219, -826, 4198, -686, -4189, 315, 3841, 652, -2772, -2790, 856, 2274, -3440, -3702, 1385, 2963, -2584, -4110, 1098, 3992, 811, -1027, -210, 4835, 4452, -1748, -1230, 4561, 2151, -2416, -3060, -791, 1545, -2060, -6719, -2595, 3194, -1962, -5079, -1451, 3367, 4025, -241, -1451, 6393, 8071, 1212, -1899, 2915, 4618, -358, -4800, -3548, 927]
1250I27k122n961J460P587q38n014Q31N797J012j581l834L586O364l938p164L795
1266I07M337l431m638m02L130J681l411n617N021O072m979k830M030K334j104
1281A100k325k32L370K788m676k581O324J182n077j669K213J780K31n065k087
1296d724N246N76o932N90M619j462P43J77j29M195L8k454L457J658l310k153J831
1313A966k11j167j712j875R6J850l767j669M942p15k92L332m54J365J333R4n53
1330B563L212k276k945K837r29l539o21R1l08P09k854k133L438K109l033J627
1346b052L871K92o51K05L08K659m54l444N20L219l149m107P16J241P43j424m126
$$ y = [927, -1195, -7156, -5696, 1891, 1053, -3961, -3130, 2667, 3679, 2098, -1736, 1850, 8214, 4276, -2888, 907, 5244, 1813, -2825, -3227, -97, 1584, -1827, -7444, -2423, 3649, -1330, -4160, -130, 2204, 1100, -1225, -1457, 1913, 4701, 25, -2556, 3768, 4950, -127, -1796, 417, 2197, 2428, -2637, -4724, 522, 1098, -5834, -5244, -625, -2087, -1344, -1167, -1296, 2899, 2937, 483, 3940, 5598, 2288, 135, 1966, 1755, 588, -1124, -2999, -2903, -1053, -4820, -6489, -1547, -2262, -2554, 778, 324, 1689, 3022, 3116, 2563, 5775, 3499, 554, 3391, 2462, -1077, -1698, -1607, -1915, -1206, -4060, -6193, -2755, -646, -3679, -2052, 1819, 2111, 1460, 1665, 1973, 4632, 4178, 734, 1254, 4473, 1324, -2783, -2067, -826, -83, -1507, -5633]
$$ [...]
8191G06
##END NTUPLES=NMR FID
##END=
