##TITLE=1H_UK-14
 dmso-d6, 8 sc, 
 29.06.2021
##JCAMPDX= 6.0         $$ Bruker NMR JCAMP-DX V2.0
##DATA TYPE= NMR FID
##DATA CLASS= NTUPLES
##ORIGIN= UXNMR, Bruker Analytische Messtechnik GmbH
##OWNER= root
$$ XWIN-NMR		Version 3.5
$$ Tue Jun 29 10:37:31 2021 Russian Standard Time (UT+4h)  she@DPX200
##.OBSERVE FREQUENCY= 200.131506
##.OBSERVE NUCLEUS= ^1H
##.DELAY= (6, 6)
##.ACQUISITION MODE= SIMULTANEOUS
##.ACQUISITION SCHEME= undefined
##.AVERAGES= 8
##.DIGITISER RES= 18
##SPECTROMETER/DATA SYSTEM= spect
##.PULSE SEQUENCE= zg30
##.SOLVENT NAME= DMSO
##.SHIFT REFERENCE= (INTERNAL, DMSO, 0, 15.7039)
##AUDIT TRAIL= $$ (NUMBER, WHEN, WHO, WHERE, WHAT)
$$ ##TITLE= Audit trail, XWIN-NMR		Version 3.5
$$ ##JCAMPDX= 5.01
$$ ##ORIGIN= Bruker BioSpin GmbH
$$ ##OWNER= she
$$ F:/spectra/data/she/nmr/H-F/1/audita.txt
$$ ##AUDIT TRAIL=  $$ (NUMBER, WHEN, WHO, WHERE, WHAT)
(   1,<2021-06-29 10:36:31.14 +0400>,<she>,<DPX200>,
      <created by zg, POWCHK disabled, PULCHK disabled
       configuration hash MD5:
       00 E9 B6 7A A2 85 ED C7 34 08 36 98 17 FE 4E 26
       data hash MD5: 16K
       A8 24 8C 78 E7 19 FF DA 44 69 A8 0D 4B A1 8A 28>)
$$ ##END=
$$ 
$$ hash MD5
$$ 34 04 05 EF 53 68 A0 F5 D9 FF A2 DB DA 07 A3 33
##$RELAX= 
##$RELAX= 
##$RELAX= 
##$RELAX= 
##$RELAX= 
##$RELAX= 
$$ Bruker specific parameters
$$ --------------------------
##$DU= <F:/spectra>
##$EXPNO= 1
##$NAME= <H-F>
##$PROCNO= 1
##$TYPE= <nmr>
##$USER= <she>
##$AMP= (0..31)
100 100 100 100 100 100 100 100 100 100 100 100 100 100 100 100 100 100 
100 100 100 100 100 100 100 100 100 100 100 100 100 100 
##$AQSEQ= 0
##$AQ_mod= 1
##$AUNM= <au_zg>
##$AUTOPOS= <>
##$BF1= 200.13
##$BF2= 200.13
##$BF3= 200.13
##$BF4= 200.13
##$BF5= 200.13
##$BF6= 200.13
##$BF7= 200.13
##$BF8= 200.13
##$BYTORDA= 1
##$CFDGTYP= 0
##$CFRGTYP= 5
##$CHEMSTR= <none>
##$CNST= (0..31)
1 1 145 1 1 1 1 1 1 1 1 1 1 1 1 1 1 1 1 1 1 1 1 1 1 1 1 1 1 1 1 1 
##$CPDPRG= <>
##$CPDPRG1= <>
##$CPDPRG2= <>
##$CPDPRG3= <>
##$CPDPRG4= <mlev>
##$CPDPRG5= <mlev>
##$CPDPRG6= <mlev>
##$CPDPRG7= <mlev>
##$CPDPRG8= <mlev>
##$CPDPRGB= <>
##$CPDPRGT= <>
##$D= (0..31)
0 1.2 0 0 0 0 0 0 0 0.06 0 0.03 0 0 0 0 0.0002 0 0 0 0 0 0 0 0 0 0 0 0 
0 0 0 
##$DATE= 1624948590
##$DBL= (0..7)
120 120 120 120 120 120 120 120 
##$DBP= (0..7)
150 150 150 150 150 150 150 150 
##$DBP07= 0
##$DBPNAM0= <>
##$DBPNAM1= <>
##$DBPNAM2= <>
##$DBPNAM3= <>
##$DBPNAM4= <>
##$DBPNAM5= <>
##$DBPNAM6= <>
##$DBPNAM7= <>
##$DBPOAL= (0..7)
0.5 0.5 0.5 0.5 0.5 0.5 0.5 0.5 
##$DBPOFFS= (0..7)
0 0 0 0 0 0 0 0 
##$DE= 6
##$DECBNUC= <off>
##$DECIM= 32
##$DECNUC= <off>
##$DECSTAT= 4
##$DIGMOD= 1
##$DIGTYP= 9
##$DL= (0..7)
0 120 120 120 120 120 120 120 
##$DP= (0..7)
150 150 150 150 150 150 150 150 
##$DP07= 0
##$DPNAME0= <>
##$DPNAME1= <>
##$DPNAME2= <>
##$DPNAME3= <>
##$DPNAME4= <>
##$DPNAME5= <>
##$DPNAME6= <>
##$DPNAME7= <>
##$DPOAL= (0..7)
0.5 0.5 0.5 0.5 0.5 0.5 0.5 0.5 
##$DPOFFS= (0..7)
0 0 0 0 0 0 0 0 
##$DQDMODE= 0
##$DR= 18
##$DS= 0
##$DSLIST= <SSSSSSSSSSSSSSS>
$$ [...]
##$SUBNAM2= <"">
##$SUBNAM3= <"">
##$SUBNAM4= <"">
##$SUBNAM5= <"">
##$SUBNAM6= <"">
##$SUBNAM7= <"">
##$SUBNAM8= <"">
##$SUBNAM9= <"">
##$SW= 20.0188882624521
##$SWIBOX= (0..15)
0 0 2 0 0 0 0 0 0 0 0 0 0 0 0 0 
##$SW_h= 4006.41025641026
##$TD= 16384
##$TD0= 1
##$TE= 0
##$TE2= 300
##$TE3= 300
##$TEG= 300
##$TL= (0..7)
0 120 120 120 120 120 120 120 
##$TP= (0..7)
150 150 150 150 150 150 150 150 
##$TP07= 0
##$TPNAME0= <>
##$TPNAME1= <>
##$TPNAME2= <>
##$TPNAME3= <>
##$TPNAME4= <>
##$TPNAME5= <>
##$TPNAME6= <>
##$TPNAME7= <>
##$TPOAL= (0..7)
0.5 0.5 0.5 0.5 0.5 0.5 0.5 0.5 
##$TPOFFS= (0..7)
0 0 0 0 0 0 0 0 
##$TUNHIN= 0
##$TUNHOUT= 0
##$TUNXOUT= 0
##$USERA1= <user>
##$USERA2= <user>
##$USERA3= <user>
##$USERA4= <user>
##$USERA5= <user>
##$V9= 5
##$VALIST= <valist>
##$VCLIST= <CCCCCCCCCCCCCCC>
##$VD= 0
##$VDLIST= <DDDDDDDDDDDDDDD>
##$VPLIST= <PPPPPPPPPPPPPPP>
##$VTLIST= <TTTTTTTTTTTTTTT>
##$WBST= 1024
##$WBSW= 4
##$XGAIN= (0..3)
0 0 0 0 
##$XL= 0
##$YL= 0
##$YMAX_a= 123870
##$YMIN_a= -154240
##$ZGOPTNS= <>
##$ZL1= 120
##$ZL2= 120
##$ZL3= 120
##$ZL4= 120
##$ABSF1= 10
##$ABSF2= 0
##$ABSG= 5
##$ABSL= 3
##$ALPHA= 0
##$AQORDER= 0
##$ASSFAC= 0
##$ASSFACI= 0
##$ASSFACX= 0
##$ASSWID= 0
##$AUNMP= <proc_1d>
##$AZFE= 0.1
##$AZFW= 0.1
##$BCFW= 1
##$BC_mod= 2
##$BYTORDP= 1
##$COROFFS= 0
##$CY= 11.3945322036743
##$DATMOD= 1
##$DC= 2
##$DFILT= <>
##$DTYPP= 0
##$F1P= 15.9154993809931
##$F2P= -4.1035820241983
##$FCOR= 0.5
##$FTSIZE= 0
##$FT_mod= 4
##$GAMMA= 1
##$GB= 0.15
##$INTBC= 1
##$INTSCL= 1
##$ISEN= 128
##$LB= 0.24
##$LEV0= 0
##$LPBIN= 0
##$MAXI= 10000
##$MC2= 0
##$MEAN= 0
##$ME_mod= 0
##$MI= 1.114404
##$NCOEF= 0
##$NC_proc= 0
##$NLEV= 6
##$NOISF1= 3.799351
##$NOISF2= 2.8
##$NSP= 1
##$NTH_PI= 0
##$NZP= 0
##$OFFSET= 15.70392
##$PC= 1
##$PHC0= -11925.48
##$PHC1= 15.20101
##$PH_mod= 1
##$PKNL= yes
##$PPARMOD= 0
##$PSCAL= 0
##$PSIGN= 0
##$REVERSE= no
##$SF= 200.130013532006
##$SI= 16384
##$SIGF1= 3
##$SIGF2= 2
##$SINO= 400
##$SIOLD= 16384
##$SREGLST= <1H.CDCl3>
##$SSB= 0
##$STSI= 0
##$STSR= 0
##$SW_p= 3612.71676300578
##$SYMM= 0
##$S_DEV= 0
##$TDeff= 0
##$TDoff= 0
##$TI= <>
##$TILT= no
##$TM1= 0
##$TM2= 0
##$TOPLEV= 0
##$USERP1= <user>
##$USERP2= <user>
##$USERP3= <user>
##$USERP4= <user>
##$USERP5= <user>
##$WDW= 1
##$XDIM= 8192
##$YMAX_p= 0
##$YMIN_p= 0
$$ End of Bruker specific parameters
$$ ---------------------------------
##NTUPLES= NMR FID
##VAR_NAME=  TIME,          FID/REAL,        FID/IMAG
##SYMBOL=    X,             R,               I
##VAR_TYPE=  INDEPENDENT,   DEPENDENT,       DEPENDENT
##VAR_FORM=  AFFN,          ASDF,            ASDF
##VAR_DIM=   8192,          8192,            8192
##UNITS=     SECONDS,       ARBITRARY UNITS, ARBITRARY UNITS
##FACTOR=    0.0002496,     1,               1
##FIRST=     0,             0,               0
##LAST=      2.0444736,     0,               0
##MIN=       0,             -154240,         0
##MAX=       2.0444736,     123870,          0
$$ Real data points
##PAGE= N=1
##DATA TABLE= (X++(R..R)), XYDATA
$$ [...]
1924G06r43j95M62K02K2K2l89q01M46J306m9j629k52J716J009j800j272J216J853
1943A630p46j564J15J269J65j035m45L80K14L10K9Lq47m6J506l78j587j93J749
1962E29J066j397j646Q64J705n32j399J86J515K3r25r5K0RK06K41L51j102K34
1981a47J256q8j672o76J619J166r77j871J328J454n38j839J31J249k79o30M9K07
1999b58o8K13M50O9j116o45K074K27j526p28J242J656j553j667Q92J690R7j615
2017e66J44O87L36r57J12M67o07P9Q63K22j295o13J380R41j559j048J262J526
2035A374j071j630M28J900m00j345l8J390j51p27R2N94q33j82J111K02j207o37
2053a130J485J035j539j563J440J524o71j898M10J538k37j203j00J124L4o29K06
$$ y = [706, -237, -432, 30, 232, 254, 276, -113, -914, -468, 838, 789, -840, -1092, 624, 1633, -167, -1439, -223, 1630, 884, -680, -565, 704, 869, -166, -611, -231, -17, 293, 322, 325, -522, -568, 938, 560, -1027, -1220, 529, 1595, 198, -1448, -584, 1121, 589, -810, -624, 891, 914, -11, -106, -86, -77, 129, 370, 721, -381, -147, 1109, 1021, -651, -1327, 292, 1458, 481, -1390, -62, 1392, 854, -985, -854, 395, 116, -514, -465, -258, -326, -113, 337, 406, -710, -1355, 719, 946, -580, -1308, -66, 1590, 37, -1630, -738, 952, 1049, -566, -422, 265, 601, -356, -244, 223, -384, -305, 558, 780, -515, -1128, 252, 1193, -366, -1414, -152, 1374, 303, -1327, -899, 1001, 601, -744, -782, 608, 457, -270, -178, 416, -417, -599, 512, 714, -493, -1130, 355, 1390, -149, -1712, -272, 1252, 581, -1317, -907, 631, 394, -809, -909, 215, 249, -380, -174]
2070a74M19m70n74R46P79j182q76J194J388j261j408O45J764m27k027O70J282
2087F88p0j033R0P23l36l88M64K36o87k06Q10M62j163j147J423J222q97j680P92
2106f97J849n01j717L56J181J49j135p5R33r9n92J77P53j047m88J113Q17r53j283
2125a259J474J164j004j593N66J677k99j411n4J614m23j051L73N79l21m21L07
2142h2P49n53j219J218J021j110j439J193J584p62j518L95J366j10j496J4J179
2159D30J3o73j90P54m16o46R35L32o74q17P76J566r95j601O76J854n94j656K38
2178f88J557K32j561l06J350l24n38M4P55p0r90R55L85r02q70R22J269o93j474
2197i47M61J549l15j511q9J480M49j329p1Q21q4q15J64P20l41o63P78Q48j110
$$ y = [-174, 245, -225, -799, 147, 926, -256, -1132, 62, 1450, 189, -1219, -574, 1190, 763, -1264, -594, 688, 618, -415, -325, 398, 62, -326, 138, 374, -313, -519, 291, 753, -410, -1557, -134, 1088, 191, -1489, -697, 1152, 651, -1066, -710, 471, 620, -515, -590, 343, 244, -348, -171, 582, -465, -953, 160, 977, 24, -1259, 215, 1379, 375, -1218, -652, 1025, 726, -685, -739, 875, 452, -599, -226, 353, 32, -389, -82, 667, 114, -1105, 113, 1134, 24, -1415, -222, 1362, 600, -918, -523, 843, 733, -763, -749, 430, 443, -230, -420, 334, -82, -728, 207, 539, -135, -952, -176, 1390, 395, -1206, -530, 1324, 730, -926, -688, 869, 1101, -460, -766, 584, 260, -278, -234, 521, 451, -539, 416, 801, -101, -971, -49, 1220, 527, -947, -486, 1063, 748, -763, -852, 628, 1077, -252, -323, 498, 414, -401, -237, 483, 142, -521, 257, 1105, -5]
2216ej077P94J357o24j448K51J899n01j346J18J149L56j421j03J015m03l97L30
2234e6O11m67r70P11J210q55j122P28J684r09j591P24R85J91j372k2Q96L04j013
2253c33k3N38n0m34PQ20m08r14N14J029o06j582Q64J730m80j454q5J607j70j013
2273d43RO25K26m90j78P58l31p27N98P02p12r13Q77Q36l35j574M68J461l39j227
2293g09q9J253J35j022k24J044J27p88P6L34j46j95L8N66k05r77M39J314l06j414
2313g49N3J398N3j236l72J062N27r09l96R23K06p54j32K07L61o29L24P04p32p95
2333h86P60R42m85j263O0J373L94j270m80J150L92j050R1M16J49k35m10P80m89
2352f1l66J60Q73l76j075O35J003l89j120K6J172L05j291k76R46L34n10l00K63
$$ y = [-5, -1082, -288, 1069, 445, -1003, -752, 1147, 646, -700, -582, 567, 923, -498, -601, 414, 11, -386, -56, 555, 88, -882, -171, 1039, 184, -938, -210, 1474, 565, -1026, -302, 683, 874, -498, -520, 376, 680, -333, -356, 182, 132, -302, -295, 525, 117, -797, -283, 746, 140, -1442, -578, 1152, 672, -782, -867, 740, 570, -443, -434, 191, 417, -73, -251, 507, 176, -551, 47, 749, 37, -876, 1, 837, 502, -1072, -604, 857, 518, -709, -798, 455, 590, -432, -656, 388, 515, -273, -197, 137, -9, -204, -166, 400, 195, -782, -343, 971, 665, -749, -696, 702, 755, -481, -853, 209, 736, -173, -569, 354, 560, -194, -326, -119, 242, -387, -63, 641, -91, -886, -126, 816, 331, -932, -872, 501, 895, -375, -855, 295, 687, -363, -272, 144, 293, 58, -352, 428, -61, -427, -267, 606, 230, -845, -210, 793, 404, -716, -690, 482, 787, -504, -780, 166, 500, -10, -310, -47]
2371d7M3l92M38K43m07j47J7R79n83o58M60P20L3q60l08J000j4q17m72J090K13
2392E31n27k24M49k2k27j52L97m44o52P36P58n93o07k2J244p3q17o27J316N44
2412I88j073m38N89M42m57j46j41L86k3n0J59j27m32J78Q03n13q78L63J027j30
2432E27j128k69J218L50q37m10K16O11m31k07K67o0L9J03L97m11o76M51P67k51
2452B66r69L57Q64j30p35l18R06O06r36k95L30K20j71k22K44k18J66Q4K32k03
2472G8m92J01O84n8q71j40J043K05q19l65M97P57o30m53M31J51j98L13l25L91
2492C00l86M3M70k66o14L12M69on58k15N04N20n73o71L78P57k88n49K62J41k7
2513CN7K7l09j1K40L38M9r10K57N12J09p45k29P72O37o73n86M88L75k61k68J48
$$ y = [-47, -4, -396, 42, 285, -122, -269, -252, 727, 144, -514, -54, 666, 699, -161, -469, 531, 517, -300, -772, 318, 531, 4, -220, 229, 207, -20, -172, 225, -219, -871, -135, 623, 30, -577, -599, 645, 572, -245, -872, 444, 988, -85, -523, 66, 508, 51, -95, -236, 150, 127, 77, 236, 109, -323, -145, 658, 145, -733, -370, 657, 527, -601, -870, 348, 698, -139, -549, -333, 278, -153, -360, -93, -153, -114, -11, 386, -25, -701, -250, 517, 266, -703, -346, 518, 388, -347, -665, 241, 847, -89, -384, -54, 166, -5, -227, 17, -201, -35, 49, 281, 78, -414, -313, 371, 313, -558, -698, 345, 550, -269, -634, -137, 620, -10, -463, -32, 119, -79, 234, -91, 300, -86, -43, 427, 161, -453, -141, 328, 322, -236, -451, 53, 573, 0, -671, -293, 464, 176, -373, -111, 30, 3, 60, 87, -222, -233, 7, 345, 394, -516, -259, 253, 362, -383, -612, 160, 797, 124, -462, 26, 401, 140, -128, 20]
2535B0o4l7O8J34k89l6n3O10j62o99M81N25jn55l94N23L75k99n78M99J11N8j86
2558E1n24N90j3J6J09j51k84K54O6J37p58J38M79L77o76r8K87M27n04m19M50M09
2580C63p1k67O5k24lM01L7l34j67J75N66k35p47KR06O0n52n20O05K72j30k68l14
2603c80N21o7r8k11L92j05K44K04m52j95qQ60m72k94l15O55L88o95m30R5Q40r2
2625C85n38l20M00l4l15R5K7J21L05R1r0m12L74P0k3k69j24M28J93j97n89L58
2647f4K64R2m09L5k3K92J0l3k3l55L71M1j95q4J24Q7J85n92J43J46L56m47j77
2670b56K42K83q5l18j92K30O6j6j51j11L37K59l00l8l82J44O11p8j30m82M43M88
2692E64n68k92j19N22p0p3l20Q2M19M0k49J60m10K43K95Nl99J04J43J97k08m14
$$ y = [20, -44, -81, -13, 121, -168, -204, -257, 353, 191, -508, -27, 498, 497, -58, -452, 71, 446, 147, -431, 68, 179, 237, 51, -473, 117, 104, 120, 229, 78, -206, 48, 114, 251, -507, -369, 110, 487, -189, -287, 0, 427, -77, -496, -46, 363, 292, 25, 90, -134, -137, 264, 301, -33, -200, -25, 541, 306, -441, -439, 467, 527, -25, -545, 60, 332, 202, -66, -380, 141, 74, -24, -235, 157, 52, 296, 500, 48, -147, -155, 705, 233, -61, -376, 279, 667, -28, -458, -363, 477, 385, -153, -473, -73, -107, -422, -327, -300, -179, 126, 217, 127, -285, 89, 159, 136, -133, -257, 171, 364, 167, -422, -64, 200, 292, -117, -82, -105, 187, 197, 164, 141, -214, 157, 198, 3, -81, 43, 130, 315, -277, -134, 12, 368, -79, -256, -14, 269, 184, -134, -326, -96, -30, -46, -197, -308, 29, 288, -12, -50, -432, -288, 323, 245, 115, -367, 76, 564, -4, -296, -415, 107, 37, -36, -356, -274, 145, 185, -64, 96, -314, -71, 224, 229, -170, -66, 77, 274, 66, -348]
2714c48L22L46p1m63J30j5L62n0k33p9K17K40k63k67j46M00J44o2n18P2L26K03
2736B47l22l82J21L12K20n16R8L21j22J49m90J02J04N17q0k15m69N19K56k18l12
2757a60j40K30K81j13o41L35M46k13R3k78k4M79l69j17j71M2M43j43m03P8J54
2778a91N48j48l21K79m7p2J78k86j29K22o5n9k13L29J49j06j48n5j45K73J27k27
2800a07j06K88O9j13m17J51KL49k14j72k42N88K3n6p1R1J88k19n5r3l6L58J87
2823C93l13n7P8K55k81J40l28M3M51k03j94j46J16K94j21j25j93Q8K17m6p6r5
2845a03J93J55k34l17O2L16M3mk29M99q4r2q2p7l4L61Q0n71j7J96J78k12nj54
2869a32R8K69q8k89K23l8K34k57q1K13K60n43NO0l12N82P3j56l57L06M7Jr6Q5
$$ y = [-348, -26, 320, 249, -214, -84, -99, 263, 213, -20, -99, 118, 358, 95, -172, -318, 82, 226, 164, -354, -282, 44, 247, -75, -457, -336, -24, 196, -320, -222, 99, -23, 126, -364, -262, -158, 359, 279, 64, -405, 114, 370, 152, -160, -300, -70, 211, 98, -543, -208, 238, 25, 118, -160, -184, 295, -74, -191, -362, -320, 123, -20, -423, -345, -191, 357, 209, -112, 167, 120, 48, 226, -60, -189, 33, -32, -91, -304, 25, 174, 68, -80, -135, -280, -7, 120, -107, -213, 75, 144, 31, -386, -235, -233, 116, -98, -270, -512, 76, 99, 43, -28, 63, 251, 32, -23, -116, -152, 206, 393, 80, 23, 101, 356, 75, 215, -113, -70, 381, 178, -16, -162, -46, 248, 127, 2, -191, -103, 114, 68, -8, -103, 90, 245, 11, -306, -244, 72, 115, 111, -118, 381, 297, 205, 123, 46, 12, 373, 453, -118, -135, 61, 239, 27, 22, -132, -34, 235, 147, -142, 81, 43, 277, 20, -61, 152, 412, -131, -126, -66, -378, 204, 277, 121, -236, 70, 117, 118, 22, 107]
2893A07J3R3j52k63J60n9K78K4k93O2K29J34j31m50O7J68K35n01J0K63j16J64
2915D2j12q3L30k6Ql9J13j05P4j03k44R0K2M91j84k94n3J70L16k61k62mL39Q9
2939C14k91j15J26%J33k84J17n6N0q9L15n0j43r3n4l15J37L42J24q5j35k56K18
2962i0J96j57J67n17N20L07m32K2J0j94L60j41m60J83L26l12N5j70K83J86j50
2983hJ66j27RR0j7k89K2j17M77l37R1j58J14R5k7j77l2K64K35L2l24j45K96j77
3007d4j70O7o3J71l1l4p9L4K71j63K9m03M27k37Rk22P4L15K03K5m95L58J62L9
3031B43l17k51M94J58k57j0k08M36j40J3j36j37N9J34L5rk23J21Om7J09m37K61
3054a03m6j03K75k61M38j74p9j83O8M10k00k55J6L57j63l1J09k7j48J66k27P4
$$ y = [107, 120, 213, 61, -202, -42, -101, 177, 201, -92, -30, 199, 333, 202, -248, -181, -13, 222, -279, -269, -6, -122, 42, -70, -153, 177, 151, 159, 120, 233, 128, 202, 99, -145, -55, -33, 458, 274, -20, -73, 97, 413, 152, -110, -114, 225, 314, 23, -92, 34, 34, 167, -117, 0, -56, -6, -95, 220, 170, 27, -66, -120, -435, -298, 44, 168, 83, -52, -308, -90, 106, -51, 116, -401, 119, 426, -6, 16, 26, -168, 192, 51, -409, -226, 100, -212, -157, -327, -44, 142, -8, 158, 31, 40, 130, 113, -176, -154, -271, 206, -131, -40, -198, -84, 11, -16, -193, -225, 39, 274, 306, -18, -163, 133, -44, -214, -147, -210, -39, -70, -104, -183, -149, 122, -41, -12, -415, 12, -225, -216, -438, -364, -49, 154, 179, -316, 42, 204, 243, -74, -325, 169, 327, 70, 60, -148, 288, 148, 161, 25, -112, -53, 81, 116, 107, -116, 5, 11, -36, 73, -364, -103, -149, -252, 23, -238, 200, 26, -53, -236, -168, 242, 42, -213, -197, 160, -3, -34, 75, 48, -100, 66, -161, -87]
3076h7K06q4L82j95m64L67n6q6J71p4j10m4RK32k35Q4K88k35q8k31J80M2o4R3
3100Aj33J15K52J5l50j19L48n8j05J61k26Q3K80j36l79J09L19J71m79j21L39J43
3122B30L4n65J54M02q5K2j1l33K59r4J53r0j07J6P8Pl28K14l3J38J58l76P5j3
3146i5J7J1L13m19M79n00r0N85l58L08m02Lk8M23p1pj49j28J48J86k37nk78L78
3170H4K79l40k16J91K3L07k99m11K60P4K78k99K5K00n3Ok30qO7K88l84L43j02
3193H3r4M42k24l83K81k0J51K01n11r7L41j45O1k45K90J78k12m5j0K2O8pm63K44
3217i4P9L08k00K1j54J79K3j74j38J48K0L58l12k3k18K29L1jj03j25L47j98j41
3240a38L0j7J83q6J84o03M06m6J97k01J55p6Kj09jm4J64K25j43J01k38M34l42
$$ y = [-87, 119, 35, 417, 222, -242, 125, 69, -17, 154, 80, -30, -74, -65, 167, -68, 16, 304, 69, -19, -250, -70, -28, -92, 1, -132, -17, 235, 250, -100, -219, 129, 71, -34, 127, -99, -16, 264, 128, -251, -142, 177, 348, -131, -252, 87, 230, 264, -301, -147, 255, 170, 192, 181, -152, 107, 13, 166, 76, -31, -15, 63, 70, -258, -44, -77, 61, 219, -157, -82, -95, -78, -67, 246, -173, 306, -194, -284, 301, -57, 251, -151, -148, -176, 247, 176, 169, 20, -108, 40, 226, -11, -16, -294, 84, 363, 23, -193, -2, 21, 328, 29, -382, -122, -48, 230, -69, -44, 156, 103, 109, -121, -129, -62, 226, -158, 185, 83, -11, 431, 207, -176, 105, 85, 236, 437, -74, -171, 170, 25, 86, -159, 131, 309, 97, 52, 42, 64, 132, 125, -338, -94, -15, 293, 93, 114, -40, 139, 162, -12, -150, -2, 18, 376, 64, 41, -177, 52, 83, 82, -21, -146, 201, 3, -138, -108, -125, 58, -28, 156, -447, -41, -87, 110, -91, 64, -12, -10, -119, -120, -164, 0, 225, 82, 183, -55, 379, 37]
3263C7k1R3k0J37j27K68j80j56J45j71k76L55J7J03p5k38k42K53K89k61j36N1
3285a55N5K57m6m07M14j37L21j99j33p3K40j77J48j26N3l2K53l94lPJ35J33j90
3308e6m7p6L76j13k08r7J60L17k04l23j8L86O6r4j75J50j71K82j74l12L70n9K28
3331B08k04j49J51J49j00o0j79P6L83l44j02J02L17j47Qj78m8j5j10Q7J38j33
3353a50L5K95k47j20K9L42o3q2j36j81K00J59r5k71L68P7k37Q4M1K19N1l37K03
3376A84l01k7N29m39l34L96K41p7k14R9K0l2j14n8J63l3J30k4R7k39k13M18m34
3399b62R7NM4L55M5m83J51R8J15j68p9J11J78J13k26q3l2K38j94J43j58R2L5j32
3423Ck92q5M45L72k47k27j93K14L32k57j03N8p7K19k53K03l00L09k33R8R9l45
$$ y = [37, 16, 109, 89, 226, 99, 367, 187, 31, 176, 5, -271, 84, 101, 204, 129, -109, -351, -98, 191, -70, -206, -155, -100, 157, 111, -296, 118, -19, 302, 103, -30, -103, 137, -40, 108, -18, 35, 3, 256, -138, -141, -134, 1, 134, -56, -103, -179, 197, 84, -124, -221, -61, 256, 52, -271, -289, 97, 163, 69, -106, 44, -127, 155, -19, -331, 39, -20, 208, 4, -145, 6, 155, 55, -5, -184, -108, 275, -69, -171, -69, 248, 101, 109, -69, -117, -132, -242, -155, -17, -150, -115, 180, -67, -187, -158, 184, 121, 39, -97, -278, -78, 81, -14, -285, 83, 160, -77, 7, 48, 267, 318, -19, 184, -117, -144, 385, -54, -388, 8, 249, 172, -42, 57, 77, 45, -69, -127, 36, 3, 133, 109, 206, -33, -246, 172, -262, -165, -160, -116, 239, 284, -199, -48, 50, 165, -3, -82, 29, 207, 320, 94, 11, -21, 217, 23, 166, 8, 100, 135, 3, -289, -374, 71, 443, 196, -31, -224, -10, 322, 65, -38, 20, -57, 162, -91, 112, -188, 121, -112, -14, 85, -260]
3445b60L51j35o1k5O2J62N5m55J35O7N62k95m64L74o9J23K59n09q1K60n1J0k25
3468b10m4L01J07p6r7j21L96l72J47j04J21lj16k3%P7J76j88J16j42k05K40L31
3491C11n15P4p7M63l99j46K45j8M5l06J77J02J76p6l56K11J39m8j07Q3l23K66
3513g9K46k17k40L55l26L20k7k31j53J67K71M4k63J77P4Q2k44Ok3k2K70k93M9
3536e7P7K25k10j26JK12R6k38l8j23K34J82j47j38m2R3m1Nj38K03J49m3j71j53
3560a88J54o0L26k86o4K01k5J20j17j87P5k5Oq2J45J09K2k39o0K45Q8j31k75Q5
3584a63p1L44j32q8Q7k1K55J0j98j84J19M5m2J0J3J74O5l37l8J99J5K57l82q6
3608a49K74q5q9M8j6l11O21j85k16k8Q7M50n97R3k05M39j0r8m4p1K13RR1n46K66
$$ y = [-260, 91, -44, -105, -130, -68, 94, 149, -306, -171, -104, 458, 163, -301, 73, 4, 127, 386, -123, -204, 56, 5, 15, -210, -254, 47, 154, 78, -19, -140, 256, -116, 31, -73, 48, 45, -71, -94, -94, -17, 159, -29, 87, -55, -260, -20, 311, -204, -130, -207, 256, -143, -289, -44, -62, -17, -323, -146, -44, 132, 56, -300, -89, 50, 2, -105, -22, -345, -79, 167, -50, -290, 65, -261, 59, 32, -199, -352, -185, 86, 130, -133, 44, 118, 200, -44, -38, -61, -83, 187, -106, -57, 20, 245, 35, -91, -90, 122, 218, -20, -58, -181, 53, 235, 88, -50, -92, 1, -40, -35, -173, 30, 179, 136, -35, -188, -34, -94, 232, -54, -118, 83, 58, 178, 61, -126, -51, -76, -70, -152, -7, 102, 124, -115, -175, 70, 158, 27, -248, -163, -234, 110, -22, -110, -23, -44, 211, 221, 23, -161, -42, 3, -39, -29, -16, 158, 223, -114, -152, 47, 62, 319, -63, -149, 125, 40, -49, -1, -17, -328, 293, 108, -108, -136, -49, 401, -196, -103, -308, 131, 121, 23, -21, -92, 121, 130, 221, -325, -59]
3633e9J84J57k77K8J46l53K21r9l2K95J73k30r2P5r6q7K42l26j67M38J49l20r
3656c9j31L07N1q9l00r7L66K67l01l59M50j31J84k30j57K96j71K41j7n3O7M0k31
3679c7N4m1q4J05J35k18o2n4K35M3k10q7M28Ok26k40J41K64j07R3k66K7K66k84
3703a19J31p6M07n23K60L4l8l7J9j42P6l35M56L9m05J61k68O9L81J28n8l14L92
3726B38Pm18K04k1J18k22r6j69O9N05j98p7j97P8J35j3rN1J42o8l44K65l48M56
3750H8J95j90j28N4J60j05j30R2n4J12RM7k30qK49l27K4K02j60J58K30n47J59
3773a00K61j54r2m9j33L43Q7j38k61j7K52O1k27q4j64N45o7J25l38K84n5o1j43
3796a25J37kN2p0k68n5J74L64L7m91j21M39l1M8j62l8K07J17l81O7k09N78l3k14
$$ y = [-59, 125, 282, 5, 33, 179, -174, 47, -52, -84, 211, 384, 154, 62, 137, 41, -46, 196, -130, -297, 141, 290, -30, -39, -170, 137, 188, 99, -201, -298, 68, 335, 34, -325, 125, -6, 178, -52, -209, 87, -84, 157, 140, 87, 154, 194, -37, 17, -24, -108, -3, 132, -86, -148, -202, 33, 76, -134, -221, 207, 213, -13, -253, -112, 152, 45, 138, -128, -101, 165, -119, 12, -64, 343, -180, 80, 114, 76, 39, 58, -84, -8, -343, 113, 152, -253, -92, -360, -291, 90, 218, 160, -154, 238, 245, -173, 31, 10, 128, -94, -190, -359, -290, 215, 17, -60, -257, -179, -44, -57, -66, -15, 127, 59, -285, -20, -368, 88, 283, 93, -35, 19, 179, 74, -56, 36, -18, 94, 103, 150, -80, -88, 161, -166, -142, 60, -100, 58, 288, -259, -100, 161, 7, -85, -134, -267, 76, 163, 25, -236, -253, -1, 60, -167, -251, -415, 130, 63, 188, -150, 134, 79, 18, -125, 12, 10, 62, -8, -276, -331, -157, 207, 244, -247, -368, 71, 40, 88, -74, -112, 95, 212, -169, -102, -311, 267, 234, 20]
3820B0q1K8P4%p1J5J54J05k39L9m6O7j7J22J52k87p1K99l40j45J01j32L41%k89
3845b01M09k64K36k86J38q1J26L4k3l25R7L57l2k52K81j76k8J16j29k42L32j5
3867G2j48M7j68M11k96J09j71J84pk43O3j49K99K23j76%j52N8J97J7l56K57j3
3890E8Q7%j98J45j86PL49k25k24M30J05o34Q3m0K72J10q7MK15M8k06r8j04K61
3914A72j33p0J4l5r1kK40k62j78M06L42m30r8j50M42j43r5L48l60M3J93q9k20
3937a56J36j31K23j01O4r2K04K3m48K2J08J43Q3r2J2k0M9j37K18j16P3J05j90
3960b0P3j87j6L09j85J11k41L56j42M6k58O5J90J15m44J04Q7r2Q3j15j52K26R2
3983Eo8J51j37K80k94j26j13K37J21MK1l99N91k44j26q1J05J72k0J2j75L2o9J13
$$ y = [20, -61, -33, 41, 41, -30, -15, 139, 244, 5, 44, -2, 65, 48, 170, 322, 35, -36, 263, -77, -222, -121, -253, 88, 88, -201, 208, -56, 180, -106, 32, -49, 77, 111, 88, -237, -140, 217, 185, -67, 214, 38, 10, 126, -3, -245, 87, 72, -76, -29, -197, 214, -82, 27, -144, 40, 33, -210, -147, -296, 3, 226, 50, 50, -102, -44, 153, 170, -186, 71, 58, 145, 145, -53, 92, -94, -87, 262, 37, -187, 243, 348, -286, -203, -243, 29, 139, 52, 56, 271, 319, 113, 15, -89, 172, 39, -31, -17, -52, -143, -145, 95, -167, -345, 61, 403, -27, -125, -275, 167, 24, -71, 277, -83, -40, 153, 64, -156, -20, -151, 72, -29, 35, -57, 147, 170, -278, -256, -148, -5, 78, -14, -2, -22, 27, -110, 108, -8, 65, 170, -20, 53, -134, -150, 159, -26, 85, -156, 200, 58, 104, -154, -89, 101, 216, -228, -124, -37, -129, -46, -161, -313, -87, 5, -63, 88, -49, 231, -63, -189, -302, -65, 56, 60, 81, -318, 273, 29, -97, -178, -73, 99, 79, 91, -84, -52, -121, -8]
4007hj05J10j46n5j04J96j3L7K05J40m47L64j60K33pl56P7j02L35k76j24nJ04
4030a07l7O3N3l0J96j44M1k01K24M6k4j36j04j31O29l71J63J9k54J39l42K27o9
4053a50J29p0J39n1k76P1M02Lj89Q3j21mj55j8j96M49J8j46J32O5K03l11q2j26
4077b01K04K15r8j28m12K32K45K6j46lj3J65J20j66J44n2J15m37J51Q4J27k23
4099e1p2J70j72Q6L45m06O7j5m1K37m38J32K81J46k43j48K91j03j42k4J28KK71
4122C01k05n9r7j62N0L13j13k14P2l4M36j12l51j2M53k38L2J07L1l27l70N47k37
4145a89K98ok19j89K13J31M9k02K55j43P9K31j13n76M33J93n16J60R9K4N1k26
4167a63K74j2r9m0L35n92J54N38o75N46k94j25K79O2j95j5l2J73J63n61K85J37
$$ y = [-8, -113, -3, -149, -204, -308, -112, -125, -88, 117, 257, -190, 174, 14, 247, 240, -116, -39, -141, 194, -82, -206, -211, -107, -144, -81, -28, -58, 138, -6, 35, -166, 58, 104, 80, -56, -160, -291, 338, -33, 130, 149, -105, 34, -308, -81, -150, -21, -91, 48, -3, -279, -208, 194, 197, 8, 91, -30, -34, -189, -207, -403, 46, 64, -82, 50, 115, 318, 7, -75, -201, 3, 218, 120, -8, -420, -188, 57, 83, -63, -66, -79, 86, 206, 40, 184, 132, 247, -190, -39, 45, 172, -51, -123, 47, -125, -39, 306, -100, -33, -48, -89, 148, -290, -158, 123, 269, 26, -122, 169, 66, -76, -100, 28, 30, 301, 96, 37, -60, -222, -172, 141, 28, -186, -114, -148, 288, 176, -175, -187, 266, 28, 60, 167, 198, -129, -499, 48, -189, 109, 103, -116, -305, -92, 39, 88, -114, 141, -2, 77, 308, 195, -381, 52, 245, -271, -111, -12, 12, 63, -163, 111, 99, 0, -40, 295, -297, -143, 395, -280, 266, -28, -153, 126, 188, -7, -22, -54, 119, 282, -279, 6, 143]
4189A43j55K1N8j07L8n9L23k87J88k84kK60l16L33k82L74k99jl49O59k97p1J73
4212F1K9j37j4Q1q2k02L88j01l1r8L2J75P0N3o89M79L64m93j32O7L42N0j50m47
4236c85N23k12K04K8k93J61k87K39J92k35k80N23k62jJ4N5N6j15O1p1J44n2j48
4259a41j28M58j61q5j43K13r0k25O98n4o32J59K1K74j73l75J79O83l08k78J19
4280A1k4J62m33L19k4M1m7L19k09j0k65L10J4j1l57K9L75j99m50M45J72k18j42
4303a92M2P9L28j75n03M38J12O2j01j82mj80K53K99m59K9K14J53p8k36J8L05L0
4326B52l60N9J73r2q8j13M08j05jk08J50j72m7L09k1k27k55M47Q5r9m32Q3M15
4349A61M8j99j72J44J44j62nL8M1J83j10o3j50j2L02J19j45m52K00L8K9q6J81
$$ y = [143, -12, 9, 67, -40, -2, -61, 262, -25, 163, -121, -123, 137, -179, 154, -128, 246, -53, -54, -403, 256, -41, -112, 61, 90, -47, -61, 20, -62, -264, 124, 23, -8, -106, -74, 101, 171, 224, -465, 14, 378, -115, -247, -180, 162, 212, 62, -385, 138, -74, 130, 158, -135, 26, -261, -22, 170, -65, -345, 178, -84, -85, -71, -16, 40, -75, -14, -85, 59, 7, -141, -269, 189, 28, -57, -200, 13, -77, -302, 396, 342, -290, -131, -110, 164, -9, -384, -205, 478, 170, -108, 11, -13, 149, -284, 35, 11, 52, 5, 324, 115, 105, -160, 150, 164, 153, -204, -175, 200, 1, -449, -4, 168, -50, -192, -150, -71, 257, 82, -421, 17, 129, 191, 90, -92, -96, -276, -23, 276, -183, -154, 60, 213, 135, -101, -83, 222, 252, -108, -49, 124, 32, -56, -169, 239, 134, 133, -75, 75, -97, -144, 165, 144, -83, -338, 109, 194, 95, -337, -254, 161, 209, 10, -162, -18, 126, -36, -41, -3, 38, 221, 111, 48, -102, -114, 188, 307, 162, -290, -90, -52, -23, -109, 72]
4372G2R2j14j72J74N0Q9j74j39N0j90M29j03J13l33K1M5O4O7j50N5K68l14m7p6
4396b23L29L16j62l41J20K04j09j18J58k20j92K68P7j49N0J98L9j8k50k9J32k9
4418E1j31J93J07j40j47k90K44K72MJ91m35K20J9k09Kk48o3N18K55l99l41J95
4440a32m8M47o52K16J25K29Rq4r3k92M60J39k29o2J42j62K89l15l05kK48J26l47
4463b93j6M57j57j9k42J71K36l7j87k10L92M0k41J29M3N6P8m67K26k72K75L98
4485C60j31l41j24L60k03K16l86K13J14m55K39J48J11kn0J84k71j48L65k9r5j33
4507e8l7M76k70k56K14k1L00n29p3K95k6P1J4N0j09q4N9K58l14o9J56K69k70l64
4531c18J47Q4L17l42j30K84j09r5p9j65N55r3M4K09l31n6K61lm11K95p5J44q5
$$ y = [72, 164, 50, -122, 52, 102, 191, 17, -122, -72, -262, 167, 64, 177, -156, -135, -90, -26, 41, -109, -54, 214, -100, -147, -223, 106, 422, 260, -81, 39, 243, 134, 16, 174, -46, -238, 30, 107, -42, 8, 206, 245, 227, -23, -52, 80, 51, -80, 113, 220, 80, -67, -357, -113, 159, 163, 354, -81, 139, 158, -51, -49, -297, -360, 158, 413, 14, -327, -132, -180, 267, -385, -169, -44, 185, 194, 110, 17, -275, 185, 324, 95, 33, 175, 13, 302, -13, -318, -320, -72, 54, -293, -309, 148, -9, -28, -270, -99, 137, 100, -87, -297, 95, 135, -106, 23, 66, 122, 200, -267, -41, -313, -38, 360, 229, -112, -236, 124, -79, 137, -249, -36, 78, -377, -138, 10, 121, 119, 69, 253, -18, -166, 199, 170, 75, -58, -95, 381, 111, -145, 69, 48, 348, -181, -254, 41, 15, 86, 100, 150, 41, -43, 16, 274, -40, -109, 47, 316, 46, -318, -171, -87, 230, -112, -242, 42, -67, -162, -241, -406, 149, 56, 100, 309, -22, -78, 183, 180, -231, 64, -11, 133, 48]
4554D8k46J58L78j69j34k60J46L65j42m84L04j39J05J06j89K55q0m0K18k63P9
4575A6k04K85J46m47K68J13r4k05Q3K28n5p6l6j33L72k19j47j7N2J0K56O5j58
4598A03l71J72K68J57m98p5K26m2J44l52K27k9K33m51J80J22l1J33l5k39r8J11
4620a45K53j27R3j29K62p4j49J27KL4k55K18p7L2J8l1j44Jm0O9J70j27J62N5J6
4645B14l67K8J15K64pm72kL66j36j47K42l98N27r3q3J18j26j51K21K36j79k65
4667i5J54p1J0j58j90M66J07j10j72%P9J89q5K0j48M6K9j46%m6J37q9K19k96J20
4692c0J86k00N6o9M41k53k27P6L9O2O0m14K28J72q3l6n2p6R2J94J07l57l8J57
4716C5j31J92k37K72J26l95r2M02m53K57J62Kk08J35j27P5j12Q4J06j23JL4K63
$$ y = [48, -198, -40, 338, 169, 35, -225, -79, 286, 144, -340, -36, -175, -70, 36, -153, 102, 22, -18, 200, -63, 16, -188, 97, 243, -204, 64, 177, 83, -122, -39, 189, 134, 58, 22, -111, 261, 42, -105, -122, -70, -60, 196, 261, 103, -268, -96, 172, 329, -169, -244, -18, -60, 84, -268, -41, -70, 163, -288, -108, 14, -17, 116, 81, -158, -256, -145, 108, -19, 74, -55, 207, 133, -16, 111, 113, 147, -108, 110, 33, 65, 83, 52, -92, -91, -131, -62, 108, -19, 143, 198, 214, -153, -125, -10, 254, 247, -225, -227, 139, 3, -144, 98, -300, 227, 134, 51, 169, 43, -108, 113, 349, 170, -95, 59, -12, -2, -160, -350, 116, 223, 113, -59, -59, 20, 209, 124, 144, -4, 42, 71, -75, -75, -121, 16, -73, 146, -150, -30, 156, -44, 12, -57, 384, 131, -96, -20, 19, 81, 141, -273, -45, 127, 44, 8, -44, -120, -28, 166, 273, -84, -122, 35, -96, 96, -141, 131, 257, -138, -230, 172, -281, -24, 138, 140, -68, 67, -60, 15, -97, -13, 93, -30, -29, 5, 268]
4739B68l01R5L2q1OK36j91k88N05N2j48j78J06l37K42j30K07rl12K51j42O3Q7
4762C3j86lP0K98k91Km2J18p5R2j35OO6m3Q1j21K27N4k7j27j9M5K08j67l90P1
4788b55L03O3p9J88k80Q0r6R8q7K07o0p8r9p3J61jN3k61j7L0K98j09O9j10O7L28
4814C40l31J04l33M73k28j63J54Q5o1N4k13j59J38P9L04l70L58k52K05l00k7K
4836a41J67J8k28J53j54L81Pl18J00O2j47J50Qk7k4M8ol37P5J42L15j19k11j17
4860b03K84j24l4Mk03L50K6N3q6j93K95J36k51k20K75k57M82n75l8L79O4j18k26
4883a80J96n1O6jp9j94O7K13r7L4J54k61K32n6n9j6J93k11J03j50J86j52mj08
4907a75J41L4L44l09J08m20L36n4P6j00O8J25j3P5m16R0O4P4j60j92L67l9Q2j47
$$ y = [268, -33, 62, 94, 13, 19, 255, 64, -224, 281, 333, 185, 7, 113, -224, 18, -112, 95, 86, -226, 25, -117, -54, 33, -153, -156, -86, 212, -79, -77, -119, -1, -76, 16, -119, -113, -47, -90, -9, -130, 97, 151, 124, -3, -22, 23, 231, 64, -326, -255, 48, 111, 32, 220, -60, 20, -76, 22, -65, 142, 82, 4, -95, -168, -7, -8, 45, -216, -233, -203, 95, -14, 55, -55, 12, 340, 9, 113, -220, 253, 25, -138, 16, 101, 40, 94, -119, -278, -140, -61, 243, -127, 231, -21, 184, -116, -143, -141, 26, 44, -184, -31, -185, 196, 203, -115, -15, 47, -100, 50, 58, 31, 7, 55, 49, -288, -213, -71, 244, 125, -86, -203, 81, -43, -77, -73, -276, 74, 100, 153, 67, -126, 169, 305, 54, -166, 109, -148, 334, -241, -279, 100, 164, 46, -180, 16, -35, 31, 30, -49, -243, -176, 37, -60, -26, 128, -133, 99, 43, -16, -32, 161, -50, 53, -97, 89, -63, -67, -175, -34, 0, 344, 35, 143, -277, 59, 5, 81, -19, 49, 174, 161, 236, -180, -90, -26, 48, -112, -304, 63, 24, 106, -41]
4931d1P7kr2J41l97J12J85L5j66L14n22K21L93l27P5J12j75K22m60J7L8M19k8
4954A51k12k11J0K16M3q2K70m22L63J35k58p8J56J14l97J8k70L56QJ99q0K2j37
4977h6J83j60J05n5PJ69o6k23J31J27p2n5J3j71J92J71k30N5P0O1j05L37l94R1
5001I5L31k34k06j00J14k4o8j01J5J93K49l23p1pK37oM8j11j04K20j06j41J63
5024F3N8n0j08lk35J87j43K08j3j2k1J05q2j73M35k53K10k0k41J04q5K94m86O8
5048a93N38k42k90l5K06M8l2L2j50J12q5Q6J54j61J88m6m4L3k97M71l00K27k98
5071g8N4k4k2J64j46Q5l35L12J20j2m56K53j40J09o1J2J37P7l9k48J77J64j30
5094b7L10k62m3R5K52n25J84l6K00m1j59K22j97K5N8j78j04J92k2L9J47J7j76
$$ y = [-41, 36, 34, -58, 83, -314, -202, -17, 18, -148, 166, -356, -135, 258, -69, 6, 118, -57, 165, -295, -278, -240, 179, 151, -61, -272, -262, -46, -3, -85, 185, -237, 126, 261, 3, -75, 81, 195, -202, -184, -454, -98, -90, 109, 29, 51, -86, 97, -63, 42, -13, -6, 163, 97, -126, 5, 132, 60, 5, 18, -153, 39, 210, -20, 35, 105, 166, 61, 398, 4, 95, 426, 192, -14, -114, 0, -24, -92, -193, -178, 15, 264, -59, -130, -137, 100, 94, 142, 31, -73, 147, 41, -100, 63, 121, 71, -37, -40, -275, -88, -231, -23, -36, -48, -69, 36, -46, -219, 216, -37, 173, 153, -88, 16, -69, 225, -261, -193, 345, 103, -187, -222, -16, 32, 0, 32, -118, -6, -91, -5, 149, -12, 176, 130, 86, 119, -178, 293, -7, 220, -78, -24, -48, -70, 94, -52, 33, -302, 10, 130, 118, -338, -85, -225, -116, -177, -165, -28, 49, 10, -238, -61, 103, -27, 283, 21, -22, 73, 325, -200, -16, -52, 148, 107, -52, 170, -27, -2, 56, -122, -226, -34, -56, -17, 130, 147, -29]
5117b9J31K0r7J13Oj59ML3j3O5m3O8k72J56J95j62Q7j29o7K06p3j05J09J43or5
5143H6k39N9L53j76j83J26j88J06J57j03l6qK6l51L04r6L81m3J06l41R5L9J21
5166A95lj79n8q9J5J32J60j27J1k48M66k38j01K87j93l72K99N5J60J38m64K34
5188H0K1M4j75Jr1k2J65R8o9m2J9m5M7j02M1p3N9J08k13L1J37j46Q5l9qR0Q5P5
5216A61k07J26j14j20J61j68K84J10k08j76K52J88l56J18R5j34O1J49k47k20K91
5237D6m6N5p4l24K63k5L04kl7o2j93Jo9K44k66M69j23k80j66M30k93L45k14k87
5261c04K44n3J91k19k21N07L3q6j49J22p9k11K66O0j86K36k44kJ20rj04L15l42
5284a15J95l0pM8j56k37M54j39J6k9k1R3k68M23j97K3M2j40p6J09o6K43o9k66
$$ y = [-29, 102, 122, 25, 138, 144, -15, -11, 22, 9, 74, 31, 99, -173, -17, 178, 16, 103, -26, -93, 113, 40, -65, 44, 187, 181, 86, -153, -94, 259, 83, -100, 26, -162, -56, 101, -2, -38, -46, -20, -371, -67, -163, 218, 175, 281, -60, 35, 74, 195, 192, 13, -45, -134, -119, 13, 173, 46, 57, -191, 275, 37, -64, 223, 30, -342, -43, 12, 172, 310, -154, 80, 101, 145, -30, -29, -120, -142, 23, 121, 52, 10, 29, -16, 31, -71, -30, -103, -44, 64, -149, -118, 19, -127, -42, -81, -89, 1, 86, 161, -46, 80, -34, -154, 7, -161, 123, 233, 25, -151, 101, 289, -67, 51, 146, 12, 73, 222, -25, -245, 46, 0, 55, -19, -343, -80, -105, 199, 197, 160, 98, -95, -94, -163, 81, -185, 284, 161, -119, -285, 145, -148, 197, -17, -304, -60, -113, 78, -141, -362, 145, 178, 92, -57, 65, -14, -225, 41, 101, -85, 151, -93, -95, 25, 16, -88, 227, -115, 80, 50, 43, 91, -65, -302, 152, 13, 29, 0, -21, 72, -196, 227, 30, 53, 95, -45, -121, -12, -78, 165, 96, -170]
5308a70J63K05l31K47q6j15K98k9j73M2O1p2lj99J61r8J02K92n35pO8K53j14J25
5332H5j49KJ07j3j10Q8l26N44j26l84M37j73j7K08j27K8Q8l29J51j05J84m0l39
5355c16K36N1j63L10k12q5K18j2J63n5j07J65l89J41K05r7J82l31M19m42K8MM4
5378d3K42k11k66j90L19L89l54J21k4n9J20Q3k7j37K52n4k00o3Q6J96j42k17m4
5401b23N18m88J18M6p4Mp0J58l20K33J3J11k30K97j43J21k10L1N1Q9j51K8J81
5424I0J58j90P9o8o8m0J98m0j23l06J31K62J38p1k77k9K67K56k69k79J89O6j24
5447e0k6l9J85j08j25L41k22K14m3K45j44k66M49k38r3k9nl6mk08K96j25K04j08
5471F5J73k31J45j59j76K9K06O8k20K26k58J78r3L83l77j24K84k47J56J39k75
$$ y = [-170, -7, 198, -133, 114, 28, -87, 211, 182, 9, 51, 112, 40, 37, -162, -1, -99, 3, 295, -240, -247, -179, 74, -40, 85, -64, -62, 45, 32, -78, 10, -316, 228, 102, -282, 155, -18, -35, 173, 46, 74, 162, -167, -16, -121, 63, 23, -316, -80, -29, -192, 118, -94, -179, 39, 27, 190, 135, 28, 193, -196, -55, 150, 53, 235, -96, 323, -119, -91, -87, -43, 199, -12, -278, -468, -149, 240, -114, 7, -17, -76, 44, 127, 100, -37, 215, 161, -39, -102, -16, 180, 38, -179, -223, 295, -193, -75, -29, -103, -99, -169, -11, -331, -98, -85, 26, -204, 93, -50, 71, -139, -108, -57, 32, -119, -91, 90, 248, 58, 137, 69, 1, -39, 159, 119, -4, -310, -179, 83, 221, 150, -127, -156, 111, 367, 98, -181, 8, 74, -50, -76, -115, 70, -38, -163, 178, -44, 170, 127, 372, 228, -38, 411, 173, 80, 51, 46, 10, 6, -202, 94, -31, 173, 65, 238, 7, 152, -7, -183, -154, 52, 120, -100, 126, -132, 46, -47, 336, -41, -165, 119, -128, 28, 167, -108]
5492a08Q4K34j23j53O4q7p8J28K71j91L2kj95K55m3l6j43k00L28J73p7j4M7l76
5516b10J99K07k04L0R7j36M8m6j46NJ83k0j80J35J81j65p9K2N9N5l65N51k84m
5540f7J43k17K53j26j61O1J87K8l3m9j74L11j84K28k47p9J92k93M78m03K24L04
5562C76m20N3J21K1j84J13q8J15j23K8j14L4r3R4K48l27J82k17J02L83j45P5l10
5585g6J29NkQ9k57K18M1n9m30M68J97l11Mj23L4O0j28P0j22P1J76j40l6L4L65
5610B77l04L2K01l61L46l67N6N7Q0m00M85k18L47p6j2p4k76M11L5l38r8J7J51
5633b9M2O3j17n2lJ70j22n7L56p0J36o46J22K29j47M28k91j82L0K8r0K70j96J64
5657C6J31N3j95l9j8J09R8q7k87n3N04k52J27l40J87M0O8jk08N5K85k40j58K02
$$ y = [-108, -24, 210, 87, -66, -2, -89, -167, -39, 232, 41, 73, 71, -124, 131, 88, 52, -91, -291, 37, 210, 133, 119, 166, -210, -11, 196, -8, 22, 119, -17, 31, -15, -161, -156, 27, 7, -173, -38, 143, -22, -101, -79, -20, 35, -330, 221, -63, -67, 76, -141, 112, -14, -175, -114, 73, 101, 68, 19, -155, 156, -28, 200, -47, -126, 66, -227, 251, -152, 72, 376, -44, 9, 130, 151, -33, 80, -8, 107, -16, 12, -102, -68, -161, -67, 181, -146, 36, -181, -79, 304, 159, 234, -76, 53, 58, 56, 145, -112, 106, 147, 88, -342, 126, 323, 12, 16, -107, -73, -13, -141, -71, -193, -122, 54, -86, -122, -88, 277, -27, 5, 206, -155, 191, -176, -120, -63, 17, -383, 102, -116, 231, 155, 143, 69, -207, 204, 239, -99, -197, -180, -29, 13, 76, -41, -93, -96, 74, -48, -105, 251, 181, 317, -329, -207, 22, -125, 303, 12, -170, -140, -112, -202, 68, -128, 36, 167, 220, 25, -14, -32, 77, 175, 88, -199, -252, 252, 0, 127, -213, -26, 14, 82, 81, -127, -72, 213, -27, -185, 17]
5681A7m4K04rL7m20J08L82m26j2nK83Lj37R1j20P8j59K88j11J6J01o0k04R4J60
5706A55j69J05j22L9k6j16J78Rj07O0m3n4J58q5j26P0m5q7L78l11J74j9k10L10
5730A16p0o9j7J20k92K55m3j44L02k79Q6K64k16nK8L4R3j95k41L75k7k87j11J73
5754a50M2N3j73m5M24j11p4J71j23k8j57J86l23J82J87mK18n21L31j73K28m39
5776b99N81N1k39J49l87L3L94m4k70j21k56M72j33L97n38K41j3j17l3K1J80oN0
5799A13k4o2j08%K01n8Q4J98o54M71m20L24k53OL66j75J92l91K41J1k14lK11j14
5823e8K15P1k25J7p3K37l88J31L35l24j4j17j72M85J1j21k10j5K67K6n5j12J93
5846A04P6k75n7J03M6J25k3r5k81J56K88j13j34J60m31J63K47l58K43J08km0p9
$$ y = [17, -27, 177, 168, 205, -215, -107, 275, -151, -163, -168, 115, 118, -19, 72, -48, 30, -129, 159, 48, 64, 165, 105, -99, -5, 155, -14, 91, -31, 8, -18, -134, 44, 53, -54, 6, -37, -91, 67, -18, -144, -74, -119, -206, 172, -139, 35, 16, -194, 116, 46, -23, -40, 80, -212, 43, 0, -144, 158, -121, -35, 229, 13, 8, 36, 70, 163, -32, -273, 102, 75, -212, -323, -150, -108, -55, -228, -273, 151, 40, -34, 137, 14, -14, -171, 15, -308, -126, 61, 57, 275, -246, 85, -88, 140, -299, 282, 333, 94, 243, -144, -111, 283, 239, -31, -152, -408, 64, -69, 328, -210, 31, 18, -99, -132, -111, 69, 63, 113, 89, 27, -81, -81, 120, 62, 146, 344, -310, 161, -259, 65, -188, -182, 184, 9, 201, -190, 51, 62, -152, -155, 56, -58, 157, 228, 3, 20, -53, 184, -204, -73, 262, -62, -76, -193, -365, 120, 131, 10, -200, -215, 52, 78, 23, -89, 104, 180, -95, -152, -49, -3, 122, 99, 4, -277, -121, 167, 54, -80, 80, -351, -188, 59, -299, -56, 52, 50, 10, -69]
5869f9K99j36K39m69J72k7J51Mj40L1j47Qm8R7NK13k77m0j60L67r4rN3J09Pk18
5895g9j32J91l71L89R1k22j60j0K60j10J91J7p0q8LN37l62l9J48l74J01J39o4
5918a4K4k9l9q8K86j97J52k23K11k69j28K92j03J76N3k31L55r0k36J41k07N5o
5941a15J96q3J8j26J18N9k13J83q7J12J62J18l25j90L4L61j40r1lj63M78k79j27
5964a03j09l4L57l61L43q3L1P7m5j17R7K1m9n4J34k65L65n90L81oj51L17l70N2
5988a62P2J82l28K98k52L13J9p0m7J51j91k07J45J45r5k5J02p1L01l83J91R4R4
6011B76m20L9N9J14M3j43p0J99j06j93K71o1k63M10m65J41J18J96Jj24J25j55
6033hj59N4j99M40n6j19K60k83L08k77K27L13l40k38O0N2rM6j54K78k41K71n60
$$ y = [-69, 230, 94, 333, -136, 36, 9, 160, 164, 24, 55, -92, -84, -132, -35, -30, 183, -94, -134, -294, 73, -21, -30, 23, 132, 139, -79, -211, -20, -391, -2, 89, -133, -293, -303, -43, -153, 38, 55, -15, -103, -100, 437, 75, 36, 184, -190, -89, 50, -14, 10, -19, -58, -146, 140, -57, 95, -128, 83, -186, -314, -22, -125, 51, 104, -127, 228, 138, -98, 43, -164, -109, -115, 81, -2, 16, -110, 8, 67, -146, 37, -50, 62, 224, 342, 17, -173, -139, 222, 82, -9, -12, -175, 303, 24, -103, -212, -246, 111, -250, 93, 10, 41, 118, 73, -44, 53, 74, 25, -29, 105, -160, 205, -385, -4, -10, -161, 156, -214, -162, -90, 92, -236, 62, -190, 123, 142, 72, 25, 176, -15, -222, -77, 68, -27, -52, 50, -21, 280, -103, 88, 182, 276, -144, -105, -46, 68, 111, -32, -102, 97, -9, -202, 69, 8, -255, 155, -310, -169, -51, 145, 146, 22, 147, -8, -167, -113, -312, 128, 72, -47, 213, -70, 238, -39, 188, 501, 161, -77, -17, 35, 26, 72, -82, 196, -45, 226, -334]
6056c34K09Q4m8M2Qj28J87J06J74m12K02n5Lr6k3j9k6K69k41Q1J21J39l07J78
6080A14P2k62p8j88M66j48J26O8k14K3j92J40K01r6n2J11l6q2o2J63l0p1J11j89
6104a05L9RR9l4K34k13P7P7l01K29k84J29J6P9J39j71R4k20n2K00n6M5k72K18
6128b4P9m21K88L29o06R1K25p7J04J14k43J38J73k45RO1J58o8j3j95J17j01K33
6151A26K99o12K20M5M3k83j6J36J64j18L71l44r3J69K82n80L76k79K55k02M2j9
6173a8k10P6K11j43k18M43j71k09J77j1l2M01l02j50J45J66j24m9O7k3j92J93
6195B7j37J51k3j63M3j20l1K81J00Pj1K37n09k3J36j92Qj7K80M8k74K42l62M79
6219A77j37j82J94Nj07L2l6%J2o4J74k24K34L4l1J29j14r1J01J43k99J00k81L85
$$ y = [-334, -125, -41, -89, -47, -39, -167, 20, 126, 300, -112, 90, 35, 38, -58, -81, -100, -126, 143, -98, -17, 104, 243, -64, 114, 186, -76, -154, -342, 124, -24, 102, 170, -44, -21, -213, -73, 128, 32, -20, 91, 55, -27, -89, 74, 44, -27, 84, -105, -66, -57, 42, 8, 242, 29, 106, 183, -118, 111, -173, -44, -28, 51, 190, 19, 113, -107, -159, 41, -15, 30, -242, -24, 55, -366, -78, 251, -355, -264, -39, -116, -12, 102, -141, -3, 170, -75, -66, -5, 153, 85, 72, -123, -6, -107, 126, 425, -187, 33, 78, 121, -162, -178, -42, 122, 4, 375, 31, -62, 107, 389, -191, 185, -94, 161, -41, 1, -18, -228, -152, 59, -84, -302, 141, -30, -239, -62, -73, -105, 296, -6, -156, -11, 155, 31, -18, 49, 26, -166, 27, -110, 41, 18, -145, -102, -222, -253, 28, 128, 135, 124, 361, -148, -171, -35, -227, -219, -236, 44, 92, -182, 60, -302, 177, 40, -142, 52, 57, -50, -18, -54, -54, -42, -106, 68, -156, 78, 112, 81, 210, 96, 5, 106, 249, -50, 50, -231, 154]
6243A54j76N2l24J42PM6K15k47K01m58M76j84L13l62j33K90Mj72J77L33l48o7
6265f1J16J08L1k20j52L73n55K21r8L50j38R1q6J62k61J59J07OK8k87J43j08K72
6288B01k79L7N3NK37p3j56J93l47n1J78J18l1l5j48K14l35K11k0M4j25q1N3L00
6312A63l50K47o0j93M3J19J6J01q2m1j15J61K30k33J73l15L56j32P5l27M75k01
6334A10jk40l5J46P5k3j18O3j50J06k7o0J12N3kJ62j67Q3j24J44q1j81J08l5K60
6359A78l09K25K4Jj80Q0J85l71M58j41R3j91j27m6K57k55J03j52J98n8k4J44m2
6382E0j01j56l7L81m9r3K06L1l43L30J57m89j15R0J59k39ML16r6p5J68K5j51j04
6406a31K55j51J28p0O0j45J11p9m8J8l42K51K65l00L99L7l16J91k54M59j71l87
$$ y = [154, -22, 30, -294, -152, -145, -99, 116, -131, 70, -388, 88, -96, 217, -145, -278, 12, 16, -156, 21, 354, 6, -61, 55, 163, 194, -26, -178, 195, -360, -139, -237, 113, -25, 66, -20, 142, -119, 40, 147, 153, 181, -106, 37, -71, 201, -78, -41, 12, 17, 254, 181, 25, 218, -129, -180, -2, 116, 85, 50, -98, 116, -219, -8, -28, 16, -109, -190, -137, 163, -187, 60, 0, -193, -150, -31, -15, 86, 4, -37, -152, 9, 239, 6, 179, -136, 220, 88, 163, -164, 311, 110, 109, -131, -166, -20, 55, 32, -86, -23, -173, -67, -94, -154, -42, 11, 9, 171, 4, 87, -37, 107, 26, -155, -47, -82, 178, -131, 94, 118, 119, -61, 19, 204, -167, 291, 150, 243, 52, -75, -121, 136, -119, -16, -168, 30, -28, -52, 92, 50, -51, -207, -244, 137, 88, -5, 201, 232, -111, 219, 376, -113, -228, -138, 21, -218, -214, 102, 6, -69, 99, 124, -27, -131, 124, -27, 101, 31, 91, -54, 57, -22, -70, -52, -394, -143, 122, -178, 221, 258, -58, 133, -121, 338, 167, -220]
6428b20M32J41l25L5j99R9j79K41J49j77n2J47o3j9j93J99j17j37P9J59j18N7
6450f1J4K37j2k40J87L5l08Q5q9j23K82m9l14L32k2R5Q5l16J98oJ49%k68o1l4
6475b04n0K40K2k4K01k38j21K52Q9M5l08J79l80K38P9J92p6k00J60k11M2j06K97
6498A18k38M9J40K30k32J9J22l80J07n5J69j00Qj34R8L2k4K57l70R7J20j27LP9
6522a2m4J85k30l5R3k6P0j09J5J89J60N3m40K65J08m50L47k55Q9j5l08J08J30
6545a12j27J03nK83j09J31k14m0J83k51K76Lk8n3k09K93M1j48j46M8n7L36j47
6568E1J51j4r3k67L59j19j49K13k50J07M4k01K64j13l6o3M5J10l5Q6k88L42r5
6591D9j05k2M4J02j06J36L7j10k4p3K26l18J06J52j36n3L5k0r2J79l4n7J28Q6
$$ y = [-220, 212, 353, 28, 63, -136, -37, -216, 25, 174, -3, -55, 92, 29, 10, -183, 16, -101, -238, -159, 0, -118, -61, -47, 190, 178, -62, 125, 160, -148, -63, -152, -275, 7, -42, -356, -24, -46, 49, 134, -182, 16, 10, 159, 159, -109, -170, -204, -254, -14, 8, -16, 185, -53, -174, 78, 167, 212, -96, 83, -297, -59, 20, 212, 136, -64, 96, -115, -73, -179, 118, -120, -71, 69, 299, 67, 86, 208, -172, -65, -120, 49, -51, -43, -177, -79, -47, -71, 186, -184, -87, 33, -94, -91, -12, -56, 129, -101, -136, -43, -69, 1, -108, -93, 96, 256, 309, -131, 134, 242, -208, 139, -116, -27, -42, -350, -242, -112, -239, -136, -141, 142, 33, 164, -50, -90, 93, -158, 118, 121, 93, 40, -169, 124, 165, 17, -129, -81, -138, 198, 51, 202, 188, 95, -172, 187, 68, -81, 132, -118, -11, 33, -168, 96, -17, -53, -116, -71, 39, 4, 90, -198, 144, 49, -56, -78, -34, 68, -38, 98, 135, 25, 1, -72, 154, -164, -58, 94, -42, -95, -60, -80, -172, 7, -27, -84, 44, 130]
6615A30Rl82J51L39m5j25L0m0r0J45nk23J32j25J90j5l94M63m3j64N6M9Kj74J75
6640D6L3j66j23K76O5J02o9l58K15j2j53J79k17J98m8k28L50j00K5k11J20j42
6662b18r1L69P1j57NL19j97j92N5L1q6k50L79Q5j61K59j20r9j82J83K35l81J57
6685A4oP5k48o6J65j24O4K52j34l8Q5j12J94N8k31Q0j11K53o0o3j15j0p8J46N3
6710D3OJ77m8k65j96L73K20k78l7p6J35O9J28j53r7J59k16q2n2K17M1j08l8rj03
6735a90O6K03J8k29M0L4r8N0R6j67L58k19K87q7m5L1j90p3J72k3k88L17n4j16
6759a07J97n2j17j22J72K18n03M19j00j60J26j83L90o2O5j14l28L45r2J61j40
6780A3L5m35M31j94J71R0J73j74k7L7j95M86m40o3N8n4j67M53k37p4R4j80L02
$$ y = [130, 139, -243, -92, 247, 202, 77, 107, 67, -23, 122, 117, -106, 26, -99, 91, 76, -318, 145, 102, -62, -6, 43, 45, -129, 46, 79, -87, -210, 66, 131, 233, 164, -194, 21, 9, -144, 35, -182, 16, -32, -260, 90, -10, 15, -196, -76, -218, -309, 60, 131, -26, -21, 298, 101, -91, -36, -5, -91, -341, 38, 123, -38, 221, 101, 2, -180, 3, 238, -143, 14, 8, 83, -165, -231, -66, -190, -126, 126, -8, -46, 39, -73, 121, 179, -52, 28, -83, 170, 110, 47, -68, -78, -156, -10, 43, 49, 226, 178, -87, -283, 90, 310, 32, -5, -81, 54, 123, 251, 98, 1, 160, -56, -138, -190, 27, 68, -40, -78, -87, -190, -124, 79, 97, -132, -92, -58, -156, -106, -10, -177, 181, -38, 249, 162, 117, 148, -42, -115, 57, 34, -254, 63, 9, -107, 90, 38, -79, -201, -29, 189, -314, 105, 5, -155, -29, -212, 178, 116, 181, 67, -261, 84, -8, 153, 13, 48, -387, 44, -150, 21, 111, 284, 110, 83, 120, -75, 411, -29, -92, -34, -88, -255, 198, -39, -113, -19, -199, 103]
6803A03k8k20L24l52K08p6MRJ45P8m78L28j79l3J46M77o24J22n6J26j65K5R4n7
6827g9K09k63L14o7l2l1o1J37q3J0k87K18oj89J68K25o3K5pK4k36J19J87n09M18
6852A41l43Q7K52J3k51m9L51l13r5L84k42M2K2L09m21m1L60k88K28j19O3K01r6
6875A95N2j16p5l30K34J5j5J64p5m1P8J40k78m1J20j45N6K1L6K24l55J39J35j91
6899e3q8k1K92j58j03K4n6K57n4q9N4J08k97j9M6L2J86j58N6J73k19L1R1m1qq8
6925a02m7K36J10p4l7Q6k18K0J39m6j12J27q0o4P6op1K83l09J48N3k54J43R0k18
6950a27j22K48L20j70k88O1K27j53N9J26j70pq9M1J33k12J35K45m00J85j40R6
6972bJ63l00J86j82L18j97nPJ16j04qr2P1J19L6O1j91K52l10j65J48j08J50j14
$$ y = [103, 75, -145, 179, -173, 35, -41, -37, -28, 117, 195, -283, 45, -134, -167, -21, 456, -168, -46, -102, 24, -141, -116, -22, -79, 130, -133, 181, 114, 82, 51, -10, 127, 44, 54, -233, -15, -21, -210, -42, 183, 120, 145, 138, 162, -74, 45, 232, -277, 141, -202, -115, 137, 150, -101, -150, 201, -112, -207, 177, -65, -23, -1, 308, -113, -154, 206, -82, 146, 27, 90, 291, 195, 247, 131, 56, -274, -40, -25, -40, 124, 49, 8, 86, 226, -52, -93, 27, -118, -62, -41, -5, 219, -136, 3, 138, -53, -141, -162, 130, -28, -131, -107, -163, 94, 40, -49, 5, 113, -184, -203, -157, -125, 61, -97, -41, 132, -87, -56, 35, -6, -14, -102, -149, 87, 197, 123, 86, 172, -46, -26, 113, 67, -45, 82, 2, -62, 14, 8, -63, 220, -89, 59, 112, -142, 1, 91, -127, -249, -1, 319, 149, -139, -78, 149, -4, 55, 181, 11, 4, -85, -44, 89, -123, 12, 257, -143, 42, -98, -2, 161, -139, 47, -135, 183, -14, -19, -12, 104, 0, -8, -100, -29, 90, 126, 187, -4, 248, -62, -227, -79, -187, -37, -151]
6996a51N04m18J07qM9n2k8p6J47J06k91k5J3J13J49l7R5k01k13K53q0K02j87L2
7020CJ91l66N81l94q2j52K18k5J69k40l2J16M1j76j05J13M76l96o9J13n9P4j71
7043a72J53k8J6l8J1O0o8J01j8k55K47%J55k65J90p6N8k92J88j21j08L15l4l45
7067c26K39K25k88J21j03Rj66q3M36m00J22L54l34K65O3M7q6j0J25k92J48j08
7089d2l0j10J88LJ90r1j18M2M8j47j41M2J78P3k26K05o6p4p4J10j53M4J00J23
7113G4l06K70Q3j45J86J36k07l09L7M7J21mR9j84m8K13J79p3l4m68M24j13M5l8
7137a5J51l4k59K51J9M7J78k88j27J45r4p0K89J14l17J47j80J93k20L86m29k1
7159a34J92j03m3m8J08O9J92l45J62K58m51M15k5j80j14K19k25K27k15J09l0R
$$ y = [-151, 353, -65, 42, 34, 83, 31, 3, -73, 74, 180, -111, -136, -123, -10, 139, 102, 197, -4, -217, 36, -44, 158, -29, 3, 194, -172, 409, 15, -67, -219, -1, -26, 143, -97, -129, -13, 28, -148, -253, -140, 336, -60, -129, -16, -75, -1, -172, -19, -47, -31, -69, -58, 2, -66, 35, 17, -238, 9, 9, 164, -101, 89, 13, 71, -221, -33, -154, -262, 53, 19, -326, -87, 138, -150, -29, -132, -123, -289, -372, 64, -336, -214, 140, -194, 71, 134, 181, 95, 85, 210, -82, 66, -42, -72, -182, 6, 9, 199, 108, -10, 32, 80, -67, -208, -166, 12, 85, -141, 64, -2, -76, -150, -40, -193, -149, -49, 74, -232, 38, 121, -24, 162, 298, 91, -218, -181, -134, -13, -17, 82, -102, -150, 63, 242, 169, 135, -333, 91, -22, 23, -15, 136, 102, -157, 94, 113, 160, 338, 50, -77, 68, -26, -96, 193, 307, -10, 137, -43, 150, -70, 316, -113, -134, 58, -45, -88, -136, -28, 41, 233, -112, 50, 308, -143, 272, 247, 67, -47, 172, -53, 174, -41, 68, 38, 47]
7181D7jj06n2L38j92k76K44p8j00J62k19L24l52K56K77l17J95j19l4K50k11n9
7203b3J52j84j87M16O5Q6n17j78M11L5K75m38J23j53J35J55k30K45j48Q6j67J68
7225A27J5r3N6l0J0q5K02R1n75K09K01k01R3k19J77K27k91J67j0l81M25q2k58
7248b25M15k78J10p7K10l05K73l4l86L13m4J67k53J06j27J23j02L28n%l73j95
7270c59L46J54m78L48j00K23j18q4q3J1L49m22K46j22J7J30j99L8o8p1K43j11
7292a10l2R5J37q3p6j0Q4J79k09rO2j97m7K74Kj69M6J48J11k43N6J9J00l45J05
7317a12J15k88K86r4J91m7l91K79p7J63J0j9J3k69K92j51K34K56m29k21L33l2
7339D2j52l11M51k16L83m62J32K28l5J00k01OJ61k51J51oRj05j42J77ON4j56L73
$$ y = [47, 46, -60, -112, 226, 34, -242, 2, -76, -176, -14, -233, 91, -261, -5, 272, -45, 150, 31, -3, 247, 36, -23, 129, -55, -242, 174, 239, 325, -192, -370, 41, 76, 351, -87, 36, -117, 18, 173, -57, 188, 40, 126, -41, 127, 142, 49, 105, 75, 85, 0, 202, 293, -282, -73, 128, -73, 20, -199, -22, 205, -86, 81, 71, -310, 115, 33, -225, 190, -88, 22, -55, 155, -150, 123, 89, -297, 16, -28, 139, -114, -8, -135, -12, -114, 214, 209, 209, -164, -359, -13, 141, -337, 11, -89, 134, 16, -68, -151, -140, 209, -213, 33, -89, -72, 58, -141, -103, -171, -242, 1, -110, -142, -47, 90, 7, -69, -79, 5, 184, -25, -34, 28, -169, -216, 58, 60, -109, -63, 85, 196, -47, 9, 28, 128, -217, -112, 3, -285, 1, -93, 98, 51, -340, -61, -138, 25, 35, 16, 29, -240, 52, -99, 135, 391, -38, -259, 74, 42, -110, -421, 30, -186, 197, -265, -133, 95, 60, 160, -41, -35, 126, -125, 26, 20, 29, -76, -218, -41, -35, 19, -137, 236]
7363B36j63k9Q3j71P6j66l8R1J50Q2l11P2J36j09j09J36M3R9Mm4K16m17Q2J20
7387F9q7k24J53J19k11L57j47j44j19K57N0k55j8K83NN0q4J38j88r4L95o2k30
7410A3j29N7J35j71j27J67K40k2J4k79N1K99R0k56j17j16L24j72Q2j86J01M1L4
7433G3q1j96K85M2K40n47J76p2J69j55j9q6K04k52K15j15j57L83k24K11j39K23
7455A78k52K57l75K28l67N4L76J67j15rk64n7k9J76J65j69j02J17R0O5j68p5L15
7478B06j47j82O2r4j30K58J07P6j62N6k74L60l36J75J52k74R1J46j05R2J61l20
7500h2K75J21l66l5K18j99rk32M94k52j9J77q7Pq4L11l33L5m6J04p7K52k31nK57
7525A94k52J76j14j30j35P12n47J41J25J87k64k04Q6lJ99j26p1J27P4n29M54p3
$$ y = [236, 73, 44, 127, -44, 32, -134, -172, -81, 69, 151, -160, -88, 48, -61, -170, -34, 9, 108, 112, 68, 284, -133, -51, 69, -18, -242, -89, 30, -181, 176, 29, -115, -234, 23, 73, -182, -200, 83, 88, 138, 54, 192, 4, -90, 305, 243, 13, -116, -59, 76, -95, -222, -55, 185, 163, 177, -102, -51, 248, 338, 82, -35, -151, 173, 1, 83, -103, -2, 39, 73, -8, -204, 81, 123, 363, -184, -8, -80, 89, -66, -85, -171, 33, -219, -4, -119, -276, 107, -117, 94, -45, 178, -74, 183, -192, 36, -331, -277, 99, 266, 151, 142, -122, -179, -208, -32, 133, -36, -138, -21, 69, 134, -34, -109, 206, 59, -123, -61, -155, -285, -27, 80, 156, -6, 50, -224, 136, -200, -25, 127, -147, -56, 90, -15, 77, 238, -82, 193, 314, -52, -87, 131, -68, -77, -309, 185, -67, -86, 91, 4, 11, -73, 238, -95, -60, -106, -2, -79, 173, -58, -63, 194, -58, 118, 4, -126, -261, 451, -96, 45, 170, 357, 93, -111, -25, -28, 171, 45, -26, 101, 175, -354, 100, 27]
7547B7PJ44j78j14K22p8J41L9j79l1L4j87J61k7m22N97k5k43J88r4J46j77j83
7570b32L10j20M7N6J25k57J94k70M8O3K69k40J82o2lj08n6n8L5o0J13r8l3J30
7594b5J38k34K5L9k52L81r8n0K01j81J22K61j89j15m6L44j90j72P6o9r9K10k10
7617a33J79j33J38K4j51Q2j22P2J81l27J97J05j10j66J06n9L77k12L07l43Q2O8
7639A62j88O4j96J74L7J55l52K68k41K62q4J57k58J09J5k52L75n2q1k45K49o7
7661A1J36K4j23M7N7j38J7j56rJ08J21j68L00j44k41J52j07R8K42k57o1NP5Q0
7685F9K10j18P0n6k59j06J48j26K06p6n7p7J79K07k36L25l02J00O3P2j56r1o0
7708g1K66k30lN5j22J08K5j64K43P7l04M08l48J00K04j38oj34N2q7j28J79O0P5
$$ y = [27, 34, 178, 0, -114, 108, 30, 171, 210, 31, 0, 34, -153, 8, -19, -441, 156, 131, -112, 76, -18, 128, -49, -232, 78, -42, 5, 61, 186, -71, 123, -147, -99, -36, 233, -7, 175, 113, 110, 2, -54, -112, -77, -137, -24, -122, -155, -25, 113, -121, -96, -57, -309, 72, -26, -76, 125, -56, 66, 327, 138, 23, -23, 321, 131, -41, 35, -34, -133, 77, -133, 46, -87, 51, 75, -76, 6, -116, -44, 137, -190, 7, 112, 2, -164, -58, -117, 260, 48, 355, 12, 94, 162, -26, 38, -158, 16, 53, 208, -144, 124, -117, 145, 61, 218, -40, 69, 84, -168, 207, 155, 74, -171, 78, 11, 147, 171, 48, 95, 152, 14, 31, -125, -134, -26, 95, -73, 227, 83, -158, -6, -113, -15, 227, -30, -91, -86, -11, 69, 279, 161, 231, 175, -84, -190, -42, -168, 38, -38, -95, -172, 7, 214, -22, 303, 1, 101, 164, 236, 80, -11, -71, 195, -35, -38, 17, -105, 3, 28, -136, 107, 184, -120, 288, -60, 40, 244, 106, 100, -34, 18, -69, -197, -18, 42, 117]
7732A17Q9l10J39J8J35k58J85K54l96M2j64j39J39J28R5j6L2m8j34K33k84Q8n5
7755a10L29l46L53j69J09j55M9k56O6P3j84L24j9j1J09l41O7j27K59R5j68K05
7777A52m0k16N2J67j35J43j19j00L05k58k15L60k39O1N1n3L00k39M1K6q1m3J0
7800g0l6R9qJ11N0p5O5j54o3L96l93J61K54j59k44QN6j65p7J45L81j26j96j8o
7825f4Q6j22K28L0m52K47J63k92J99J77k92K37l23K37L1n7j80N4J48o9k65N04
7847B25k62K9M4jr2K70j66K4r3j02J42n4k79K41Q0l14L70qJ01K05l84m9R8k07
7871a82K21k94L04j49K75j05m6j34o1K93l57L89j65k26J42j73J37K87k39k37L17
7892cK12k27k08Q7K13j0Q3pp0k26J93j5j78J40p7j59M81K4K0m35K72j05j83J86
$$ y = [117, 206, -104, 35, 53, 188, -70, 115, 369, -27, 15, -149, -288, -149, -21, 74, 58, 90, 42, -92, 141, -143, -55, -110, 219, -127, 226, 57, 166, 11, 60, -196, -130, -57, -241, 83, 64, 53, 162, -179, -112, -239, 20, 115, -53, 152, 112, -104, -52, 115, -20, 123, 4, -96, 209, -49, -264, 96, -143, -82, -31, -84, 216, -23, 18, 44, -37, -80, -70, -106, -7, -15, 96, 146, 71, 136, -18, -81, 315, -78, 83, 337, 178, -66, -58, -2, -167, -244, -99, 282, 156, -40, -58, -64, 22, -100, 128, 158, -294, -47, 116, -176, 23, 200, -92, 145, -178, 59, 90, 33, -147, -93, 55, -14, -279, 225, -37, -8, 36, 35, -57, 213, 47, 71, -22, -124, 18, -36, -315, -74, 6, -308, 62, 54, 155, 360, -24, -73, 25, -182, 39, -255, 49, -100, 175, 70, 24, -110, -171, 122, -235, 154, -11, -237, -95, -268, -131, 156, -83, -320, -3, 209, -18, -226, -139, 74, 64, 147, 140, 70, -156, 37, 22, -156, -16, -93, -252, 229, 253, 273, -162, 110, 5, -178, 8]
7916Hj93L46k44K47m00K14L14l55m6N9J17j96j5L6J06j24j3J9L2L44l97L68j89
7939C8J1p4K2O3m8j03N2q7j73J82j74J32J97L9l06M1K42p1n7j34J90o1L55m35
7963a59J01j9K04j52J17l91N14r9o3J94m06n0N09l72j06J60j14J37j68K01n4M6
7985C0m0m3J91o2l27L24j12K77j18j57J34O5l1k7k47J56j40L04j6l40J68j60K55
8008H4o3R8J2p3q8j99K14J95j61p9l4O5q9qm2K72p1j22m3K43o1k9k27J95J11k2
8034G8j42LJ33J8J82m54K98k75J52L4J72j14o3R8l0J08m67m5L87k90K87j66o9
8057a65J14k7P8r2q6J11j71J01K16k49L04j34j54J13L41j42p4l35M68j37j67j03
8079a90K4K43q1j20j54J27K73Rk18J88J8k8P9n8l1o4O6l5rmn4q5nK62O3k41J6
$$ y = [8, -185, 161, -83, 164, -236, -22, 292, -63, -109, -50, 67, -129, -144, -108, -2, -126, -139, -120, -88, 256, -141, 227, 38, 49, -25, -3, 60, 12, -91, -39, -126, -299, -117, -291, -159, 38, 77, -229, -188, 54, -17, -74, -208, -18, -79, 276, -159, -58, -77, 127, -25, 92, -299, 215, 116, 53, 247, -159, -209, 300, -72, -178, -18, -132, 5, -163, 38, -16, 30, -10, -53, 138, 76, -251, 73, -39, 238, 120, -37, 97, 162, 131, 104, -143, 13, -127, 177, 161, -179, -11, -171, 84, 21, 119, 131, 58, -30, -229, -15, 180, 19, -60, -94, -29, -118, -126, -168, 104, 33, -89, -132, 111, 50, 21, -206, -11, 100, 78, -64, -61, 72, 90, 272, -182, 116, -159, -7, 27, 199, 85, 22, 120, 90, 198, -269, -314, 73, -217, 70, -96, -165, -51, -78, 0, -92, -178, -67, -238, -137, 79, -170, 134, 0, -154, -41, 300, 158, 84, -251, 217, 80, -87, -190, -166, 77, -4, -124, -278, -151, 122, 131, -87, 101, 119, 91, 170, 112, 81, 17, 83, 48, 39, 35, -19, -104, -109, 153, 216, -25, -9]
8106ik47K19k24P4L90k41Q6q3l3j02K22l95J99l11O57L6k62K85j34m6o8LK14j09
8130A21k51K4L31j83J35j75m0J05R6l74J92N2o5J10m9k6o0K86k02k72N19j28l15
8153a69K59j40Q8J6J33p9k39K29J35l82K08J35k32O8j55J64p3j16N3J23K55m50
8175a69K14K89k16jkK7j38j77J28j10J76j81J12Q1j09R4
$$ y = [-9, -256, -37, -261, -187, 203, -38, 48, -35, -68, -170, 52, -343, -144, -455, 202, 238, -24, 261, 127, 81, 13, 16, 230, 121, -130, -106, 225, 42, 177, 2, -38, 67, 163, -211, -19, 33, -32, 78, 29, 3, -57, 229, 27, -245, 274, 146, -169, 90, -50, 38, 54, 187, 108, -131, 98, 233, -149, 59, 194, -38, 30, -125, 39, -34, -150, -97, 26, 281, -169, 45, 334, 118, 117, 115, 142, 4, -173, -45, -155, 21, -160, -48, 33, -76, 18]
8191A8
$$ Imaginary data points
##PAGE= N=2
##DATA TABLE= (X++(I..I)), XYDATA
0@%%%%%%%%%%%%%%%mJ2j6J6j6J7k5L2l4M1m8N5o4P3q3R5j10J26j42J59j78K00
37A06k25K52k81L12l46L84m26M72n21N73o31O97p70Q48r34J031j137J255j389
56g30J542j719J923k163K452k806L254l838M629n779P617j0994J9200p6497r0331
71a54240J65809P0927j10269q0562J00464P3486o7951o9263M6125L3386l8684
82c0772o56O4040j5292q2013J8424J00262k6996j29625O426J49298K6844j41905
94f1965n4416J23097O2373j09628p7386Q3452P5879n0212n0641L9336K0336m7029
106d6804m715N5244j0414o8002K6292J00530j4930j23737j1385J26408L0914j22277
118f2876m5318J17383O7719r2364p5229N9966N8389m5055l8826M2313K5869l8064
$$ y = [0, 0, 0, 0, 0, 0, 0, 0, 0, 0, 0, 0, 0, 0, 0, 0, -4, 8, -8, 8, -8, 9, -16, 16, -18, 23, -25, 30, -34, 39, -44, 51, -59, 67, -75, 84, -94, 106, -119, 133, -148, 164, -182, 202, -224, 248, -273, 300, -331, 366, -404, 444, -490, 541, -596, 659, -730, 812, -907, 1016, -1147, 1305, -1501, 1753, -2085, 2544, -3235, 4382, -6612, 12588, -63909, -154240, 11569, 82496, -27773, -108335, -7871, 65615, -2336, -71599, -25474, 7912, -30772, -31428, 32612, 17320, -64693, -46269, 53993, 26997, -102628, -96202, 53096, 79940, -61965, -116381, 6716, 69089, -40539, -117925, -34473, 41406, -8806, -59447, -20111, 225, -46804, -51519, 3725, -6689, -74691, -48399, 52131, 37201, -86536, -97921, 28487, 59401, -62876, -108194, 9189, 76908, -15456, -90685, -30719, 27670, -17385, -56211, -13898, 11971, -26093]
130b6093l309M8243j7425p4769J6770R8114K70j03354r825J11634K9268j11784
142d2260n4074R5574O8847o6754n9821N3382N1572m0749m0346K7832J6169l0328
154b0956P457N0713j0980o9517N408P8863k692r6193j4225J05074L9301r3783
166b1530n4686P4156N5044o1336n7025M5536N2916k5250l0229K3754R717l5746
178b4679K91M8224l438n7849J0191P9556K347r1439k3914Q7707L9313p7381m5789
191e6860P0020N6528n2470n6810L0110L9751k3605k2657K7251J2754l0143j328
203g459L7966r526n9218K966P3192J2725p4307k3342P3796L3271p1769m8249N5745
216d209N3490l5442m3338K6769L2287k3821k4687J8943J0141k5368M071M3112
$$ y = [-26093, -29402, 18841, 1416, -73353, -56583, 41531, 41801, -61553, -71378, 40256, 69524, -42260, -96334, -760, 68087, 1333, -58488, -5106, 46466, 5717, -34629, -6797, 9372, -20956, -13499, 37214, 26234, -43283, -37875, 40988, 38296, -57897, -72122, 32952, 72253, -21530, -76216, -2060, 52984, -8352, -65377, -19841, 33075, 7825, -22404, 1350, 11067, -24679, -24388, 23836, 20398, -37451, -27260, 52296, 54643, -36796, -60710, 26997, 66310, -11071, -56860, 13160, 69688, 17218, -39592, -9482, 30269, 6664, -15993, 11258, 24012, -6131, -7459, 30507, 20981, -38237, -35271, 37921, 50646, -23661, -47003, 26793, 60064, -11705, -59954, -4209, 49281, 13839, -29499, -2730, 29557, 5736, -18951, -8, 10133, -15235, -11164, 31948]
228C1948l060n6586o306O0912J0916o6690k2146O9756L9730n7038m7769M1495
240d838M3250l3412l8738K5970L4009j5781j7082J7778L462l0682r83M0608K822
253B6383m6309l343N7481J3814o4112l0337N5631L8145m5204l8904L7760M0097
265D1102k7329l8525J3521K3821j3104j1340K0600O789k6366l314L2379j573m6262
278b9601o039N4473J9910n0135k7134M5013L1810m1818l9331L0787M0267j6636
290A1566k8280J3844J9118j5973j3597J6354O173k1340J309L5475L549m3188j2999
303b7989M3335J8007m3621k3675M3346L4319l3571l6702K0923K9169j6539k4413
315a7411J4466K0394j0968j0540J3370J593k5592l354L1242P953l3469r800L7483
$$ y = [31948, 28888, -27698, -34004, 26908, 37824, -28866, -51012, 18744, 58474, 1436, -46333, -4838, 38412, 5000, -33738, -7768, 26241, 10460, -6622, 11156, 14618, -16064, -17047, 23561, 26383, -19926, -23269, 34212, 48026, -16086, -46423, 9208, 47353, 2149, -36755, 1005, 41102, 13773, -24752, -11231, 12590, -514, -11854, 8746, 15535, -10831, -14145, 18234, 16661, -29601, -35640, 18833, 38743, -11392, -38526, 6487, 38297, -3521, -42852, -12065, 28202, 11566, -16714, -2870, 16248, 275, -13322, 3032, 9205, -12135, -10826, 24649, 28198, -14990, -27989, 15346, 33353, -10268, -33943, 9403, 43722, 10151, -26551, -5628, 23541, 7002, -17411, -2945, 17449, 6481, -4059, 9311, 10904, -14688, -18042, 13200, 21153, -12316, -22116, 15367]
328A5367J6271m0262k7563L1692L0779k1878k7541J9253K6479j4679k3539P860
340g761J3876r318n114J8221N698k1861o543K4677N769l1556j1475L5766K1815
353C2194k9885k4893K3959K3702k1907k5845J5074K5286p379j6273P975R309j3005
366a688q979J4865O128j7773l026K5898P918k9249j6346K5640J8336k3638j9527
379b1441K2151K4270j5709k4759P947J6693p923j2747R682J0943r268o384J0598
392D053K014j8977o092K1952J1731k0358j2360K1080J5126k1641k0727J5725K1494
405A3020q736j5285R025J4522q241j3042O029P738p467l679J4875O677j6868q974
419a0406J5354Q151j8111j1746J8755J6957j3939j7532Q761J3830j0328j4468
$$ y = [15367, 31638, -8624, -36187, -4495, 26284, 4406, -23135, -3882, 22597, 7918, -15621, -7761, 6115, -3203, -8317, 9904, 15602, -6259, -12802, 11875, 17644, -13912, -25387, 10379, 32194, 2309, -22584, 1375, 25077, 3170, -22675, -7601, 17685, 10306, -5967, 2008, 11317, -1688, -10667, 4198, 10326, -7447, -10473, 15425, 23343, -5906, -22252, 3388, 21724, -1914, -21441, 710, 24980, 9271, -15488, -7541, 9152, 1229, -11518, -1836, 9107, -161, -6545, 4053, 6067, -12910, -19002, 2950, 14681, -5677, -18037, 3043, 18169, -3472, -24199, -8474, 13020, 4284, -11001, -1976, 12546, 4305, -8737, -2708, 5030, -2437, -6116, 8759, 15436, -1432, -10406, 4948, 13099, -5012, -16758, 1997, 18954, 5015, -12517, -3756, 10074, -254, -14722]
431a4722Q080J3177m557q098O328M341j1394o741J1274P842j0751n770J4836R551
445A3396j5336j4134J1064J3748q403j1243R813J3159o819j2411L501O988n873
458b550n029Q958P389q682o378Q197M821j2850p757J2706J1791q874j0430Q089
472e99R626q623j1727O188J0936k455o137N630N546p972o635O326N283o774l881
487e268J0588P022j0112j0021O317P700p255q409P792R845m644q757K132L920
501H50n014n174O654N938m436m095O281L650q762p013Q170R087m821o263N938
516I90P908n792q553J961O914j031k895M185M087n055m616L242K324o061l112
531e504Q643O468p387p804M350N859n830p773M249Q820m86n602j12K604k975k587
$$ y = [-14722, -6642, 6535, 1978, -6120, 208, 4549, -6845, -13586, -2312, 5530, -5221, -10991, 3845, 13396, -1940, -16074, -5010, 8738, 335, -10908, -1095, 12064, 5245, -7166, -3665, 3323, -2550, -7579, 1379, 8768, 86, -6292, 1905, 6726, -6124, -13881, -1175, 10616, 1742, -8688, -599, 9027, 404, -11323, -5135, 5801, 3346, -2791, 2839, 8385, 413, -6222, 104, 5387, -1387, -5268, 5320, 12342, 2230, -7791, -1474, 6226, -1029, -9438, -1646, 8199, 3555, -5202, -3070, 850, -4164, -9338, -2684, 3254, -1182, -5277, 1004, 4654, -4108, -11121, -2951, 6136, 1315, -4948, 990, 8898, 3106, -5447, -3486, 3428, 2397, -498, 3687, 7774, 2719, -1897, 1345, 3669, -2392, -5504, 3139, 9607, 2220, -5584, -1234, 4625, -1205, -8978, -4729, 4091, 3605, -1997, -2109, 495, -2480, -5067]
547e067K616K551j770K74N285J449q040m987O630N839n079n240N682Q065l853
562D355r149p27N188J087k894M48K675M9j147j28j837m534M88O962K840n423l319
579e066N777M329o673p442L977Q921R41n394j209L993N68l172k086K15J462L293
595B434K603k374n224j061M692R92o792k738P571O833m604q540N0N451R59n567
611e315j490M575M375k00l223l303q03K954L409j742l291K202O747J067q419n268
627g725N304P334j522o432P48O868J944o138n626J262M720K726j653l307n6L557
643B004J667m927n831J649Q412L301o188n134M228N836k935q013m19P511N397
658F558k623n560n09L870J748l061m284Q10O437M275l944p337%O016K562o451
$$ y = [-5067, -2451, 100, -1670, -1396, 3889, 5338, -2702, -7689, -1059, 4780, -299, -5539, 143, 8208, 4355, -4794, -5521, -333, 754, -2140, -1692, 983, 1032, -115, -243, -2080, -6614, -6126, 836, 3676, -1747, -5066, 711, 5040, -1633, -9075, -5098, 3823, 4764, -630, -1839, 2154, 2722, -450, -2536, -2321, -859, 2434, 5037, 2663, -2561, -3622, 1070, 2062, -4730, -7468, 103, 6936, 2332, -6208, -6158, -707, 252, -5315, -6805, -2230, 2145, 1945, -1278, -4581, -5384, -2430, 979, -763, -4054, -1852, 4895, 5962, -2457, -7725, -2421, 4913, 3391, -3041, -2293, 4575, 6519, 381, -5245, -3983, 737, 3463, 1810, -1497, -1553, 2004, 3671, -1256, -7087, -5438, 2974, 6275, 87, -5047, -819, 5017, 2082, -5931, -6350, 1161, 6558, 3935, -1625, -2134, 1736, 3484, 423, -3861, -3051, 3386, 7661, 3717, -3620, -3620, 2396, 4958, -1493]
674a493l996N281P678r23q082m027M663N055j783n093J12N811M225l483o798j469
690d322N356M872k495n273J135O841K625p110p038L079P703J382n456l487M177
705A989N325k347p507k489M884O629j085n872k073M687M008m316o747j39Q158
720C105M967m925o777J279O604R60o473m464M742P755O10o843m552L534N538j254
736C806o652j590O997N848l293q118j752O118M546m172o272K211P784K598p043
751A016o445J757P242J835n902l716M320O455j492q156l775N398O784j369o858
766b906j081O494L957m709q174J9P757M807m363o012J493O574J071p150n178M097
782c304P934J135o455m318M220N379k013p120k177O986O354l013p227j612N794
$$ y = [-1493, -5489, -208, 7470, 6547, -1535, -5562, -899, 4156, 2373, -2720, -2608, 3203, 7428, 3945, -2853, -4322, 1034, 5906, 3411, -1862, -727, 6114, 8739, 1629, -5409, -2330, 5373, 6755, 1299, -2188, 1989, 7314, 4967, -2540, -5029, -145, 6484, 5399, -473, -2546, 2141, 6149, 1833, -4914, -5053, 3105, 8072, 3147, -3630, -2351, 4253, 5213, -1260, -5724, -982, 6773, 7383, 540, -4012, -478, 5060, 3806, -2846, -4436, 2561, 8409, 5116, -3002, -4754, 1364, 5910, 1738, -4534, -2323, 5461, 8059, 1016, -5429, -3672, 3570, 5405, -497, -4213, 107, 6562, 5070, -3086, -6861, -1463, 5321, 3952, -2906, -3987, 2507, 6464, 1755, -6419, -6400, 1357, 6164, 1801, -4211, -2718, 3856, 4927, -2223, -7401, -3304, 4630, 5765, -690, -5008, -788, 4591, 2578, -4542, -6719, 267, 6621, 3608, -3619, -5231, 563]
797E63L886m350o340J355Q111L231o066o672J702O704J522n853l854M691O811
812E441m75p542l976M321O219j165o171j543O711M742l963p986o82O526M784m204
828A037n833J683O987J408o845o289L658P273J359o013m196M240N857j722p847
843e243k138O060O500j881o591j441N654L924m449o554J410P797L474n126n889
858d493J477O242R25o369l786M274P118kp389m073M246N359j903o397j047O643
874H25N015l950o957j229O390L957m085n348K164O819J981o237n466K425O689
889B993J247n574l061M374N513j484p310l162N676N603k082n580j048N196L493
904D794m477o650N54O844L256m162n273J618N626J020n719m345M262O495N14n815
$$ y = [563, 4449, 99, -6241, -4886, 3225, 6456, 390, -6282, -4580, 2124, 3646, -2207, -6061, -1370, 5441, 4966, -2576, -6552, -2231, 3988, 2823, -3348, -4891, 1820, 6562, 2599, -5387, -6069, 457, 5241, 1037, -4796, -3113, 3874, 5282, -1563, -7852, -4194, 3079, 4438, -1575, -5771, -1531, 4326, 2604, -5243, -7381, -1321, 5179, 3298, -3293, -4734, 920, 4844, 395, -6159, -4749, 3048, 6522, 1396, -4493, -3016, 3226, 4151, -2218, -6004, -1730, 5388, 5386, -2003, -6076, -1830, 3529, 1626, -4771, -5818, 825, 5840, 1890, -5067, -6296, 94, 4051, -34, -5382, -3218, 3601, 5582, -655, -6121, -3696, 2993, 4240, -1334, -4395, -21, 5492, 4008, -3302, -6464, -788, 4815, 2733, -2847, -3895, 1301, 4794, 317, -6333, -5779, 1065, 4321, 159, -5114, -3496, 2130, 3150, -2569, -6914, -2652, 3843, 4357, -1458]
920a458l430M128M791j914n900j012O027M741k311o660j144N190L609l986n099
935d428J544O618K165n841n648J990N810O27n065k619L920N461j389o046k937
950e838M118N209j534n024o23N201L818l489o268P3O200L194l687m636J870N544
966D128L38n439m090L298N750N14n068l276L346M243j444o128j558N214N069k311
982B586n908m85N037K404l739m518J784O052J950m405l846J763M613K63m213k592
998c254L236N273m32n481k700L231M104j565m980k70M950K850l186n700oM536
1014F06K208k858l392J437M412R57m467l541J750N145Q16m055k255K965M093j040
1030B781n442j755M604M065j714m220q0L818J758l380l943R26M376K025k644l873
$$ y = [-1458, -4888, -760, 4031, 2117, -3783, -4795, 1232, 5973, 3662, -2998, -4142, 1048, 4657, 671, -4428, -2884, 3734, 5899, 58, -5590, -3600, 2210, 2837, -2228, -4847, -927, 4534, 3145, -2901, -5838, -1720, 3489, 1955, -3069, -3692, 1509, 5327, 1838, -4430, -4357, 1843, 5037, 1350, -3286, -1416, 4128, 4466, -973, -5063, -1765, 3985, 4499, -569, -3845, -499, 3744, 2300, -3828, -5386, -172, 4897, 2586, -3322, -3807, 1230, 3634, -105, -4623, -2839, 3213, 5163, 758, -3088, -1325, 3288, 3551, -662, -3254, -18, 5255, 4823, -658, -3358, -127, 3977, 2412, -2568, -2838, 2112, 4962, 1776, -3924, -3930, 606, 2814, -44, -3436, -1999, 2413, 3370, -1097, -4638, -2888, 2257, 3073, -982, -3237, -272, 3821, 2781, -2661, -4416, 188, 4253, 2539, -1681, -1761, 2057, 3815, 435, -3508, -2582, 1794, 3819, 1175, -2698]
1046b698N51L897O01m059k771K644N112j95m777k127K953L322j701l705l54M465
1062A158K302k105l530p19L100K276k440k849J062M039J636m088l837J633M315
1077A953K85l910j702L059K995j200m642j101L075K853j184k876l15L029J972
1092B291k263l570p9L909K683k276l299J259L780J07l887k185K706L890l72l139
1108d45j313J997J890j243k929p68K838K704q86l297j169K592J809j960l434P35
1124b879M305J389l314k615J092K883J12k490j187K537K202m74k669j644J568
1139a184K771j28k756m19K509K247j810l729j91L278J989k241k059J150K364N01
1155B292k814j934J150K670O39j868j630J252K299q2l285j357K513K942p78k904
$$ y = [-2698, -2147, 1750, 2351, -1708, -4479, -1835, 3277, 3082, -1695, -3822, -869, 2453, 752, -2953, -3307, 1158, 3460, 1355, -2175, -2894, 206, 2482, 42, -2807, -1745, 2294, 3930, -158, -3995, -2362, 1953, 2238, -1672, -3374, -315, 2680, 1480, -3162, -4263, -1188, 1665, 481, -2395, -2710, 319, 2291, 28, -3542, -3621, 288, 2971, 695, -2604, -1345, 2435, 2542, -1345, -3530, -824, 3066, 2694, -445, -1758, 239, 2129, 886, -2043, -2811, 27, 2731, 1845, -1452, -2621, -29, 1780, -180, -3614, -2879, 1426, 2815, -499, -3114, -2022, 861, 973, -1517, -2704, -167, 2035, 1561, -1108, -2752, -1184, 1587, 1459, -1297, -1716, 793, 3040, 1230, -2499, -2690, 588, 2577, 336, -1723, -573, 1791, 2292, -522, -2456, -1306, 1364, 2003, 135, -1495, -243, 2056, 1974, -1311, -2668, -155, 2787, 2009, -895]
1171h95o48K533J238k144k616J057K699J548j964k157K87J702O36j537j848J203
1187i06K517P36k605k222J510K172m76k332k62K305K023j559k312k12J795J266
1203A438j248j121M41J983N06j104k202j54K340R93j283j627Q38K166l97k292
1219g23j287J737K244l92j757k94J473N73r41j866j91J689J376p16j586l70J660
1236F29M70j588j742P06K512Q22k264j042N41J548m08j379o01J450J660q9k025
1253h00r81J266J371l42j473k59J603J461j266k030J77J810N67j113j070R72J962
1270A855k55j825j150O85J231N08j356r53Q43J249R1j958r47J164J694j51j748
1287a023r7J274P70j173j450J32J457J255q91q38j11N50M94r85j039M01J922M84
$$ y = [-895, -1543, 990, 2228, 84, -2532, -1475, 1224, 2772, 808, -1349, -1062, 640, 1276, -261, -2109, -906, 1611, 2347, -258, -2480, -970, 1202, 726, -1606, -1868, 437, 2460, 901, -1411, -1623, 172, 1438, 190, -931, -490, 1493, 1999, 895, -1307, -1461, 879, 1872, 589, -1038, -200, 1966, 1569, -723, -2010, -273, 1971, 1579, -178, -472, 1001, 1574, 633, -1233, -1424, 265, 1641, 925, -661, -1031, 629, 1099, -489, -2231, -1525, 987, 1809, -455, -1497, -956, 592, 184, -1195, -1796, -346, 1314, 1225, -800, -1781, -515, 856, 514, -959, -1218, 385, 1846, 580, -1450, -1273, 537, 1104, -9, -1079, -107, 1855, 1600, -225, -1375, -690, 541, 1049, -307, -1260, -417, 832, 923, -1035, -1982, -818, 876, 725, -1023, -1120, 154, 924, -249, -1699, -1567, -110, 1145, 254, -584, -695, -145, 349, -636, -1675, -1274, 648, 1132]
1305A132j497j000M38J269j46j413m10J636J112n18j627p21J101O39j27r64J35
1322i61J170J154q56j561k03J010J327p78j399Q23J399K39j467j410Q52J659m25
1339E73r80n33Q99P10j09j373j040P08J622j20j231p36R07Q10o94j367q0J774
1357b60R86n09j622M64J059N0j237o71R59J324O41j068j176M34J233n4j019n84
1375a050J226J204j74j659o87R88Q11n29q00M0J148M85q73j144m19J258O51n01
1393b5r50O00R00N35j360j156N02J576P5p08q06Q11R84m61j388l31Q16J259l30
1412E43j178j64P72O48j014j290K16J363J303j210j050K92Q91K79j104p53J117
1429c39J334J53r56j259Q07J095L5j091l65J188J197o77j526l23R31J061q69j166
$$ y = [1132, -365, -1365, -927, 342, 196, -1217, -1627, 9, 1121, 603, -1024, -1745, -644, -5, -132, -1096, -961, 209, 1363, 507, -1054, -1257, -247, 1080, 302, -1097, -274, 1125, 1364, -103, -1513, -661, 998, 573, -407, -940, -41, 669, 560, -813, -1853, -1145, 477, 357, -874, -1610, -703, 107, -587, -1954, -2034, -260, 726, 217, -1405, -941, 118, 168, -1069, -1740, -781, 543, 1184, 116, -1060, -626, 607, 553, -466, -1050, 176, 1380, 1206, -453, -1140, -152, 659, 130, -670, -630, 518, 1003, 130, -1014, -1433, -175, 476, -25, -975, -375, 525, 1060, -300, -1456, -954, 622, 697, -11, -817, -6, 978, 517, -871, -1202, -386, 873, 543, -635, -799, -27, 621, -393, -1683, -1467, -104, 1199, -11, -1061, -769, 122, 401, -703, -1456, -339, 995, 1148, 192, -1067, -260, 835, 870, -221, -586, 602, 1799, 1122, -404, -727, 204, 1265, 396, -770]
1447g70J67J300P95j198j549J91J303M45j281q42O33J235K86j526j161O99J609
1464C36J88j006p76J257Q93q11j476Q2J609R86o45j075j49J138O07j164j434N91
1482h49J745M12j162q77L74J266q8j483o88J146J314k98j268r43J138R25m07j116
1500h59j98J236J305q43j582k39J285R64o67j384L34J565K96j613r82K19J871
1517G08L60j544r44R85J378m65j687l69Q78J419n55j387k1J012J260j242j383
1534a597J35J863P08j018j086J28J547L29j494j070R98J723J13j213j021O25J577
1551A247n41j002p29J050J453p59j611n83J422P96r76j249K50J901L68j210j356
1568a529L60J531J07j204j085J109J500K2j703q06J164J382k60j473l15J453J156
$$ y = [-770, -603, 697, 1492, 294, -1255, -1064, 239, 684, -597, -1439, -806, 429, 715, -811, -1972, -1273, 336, 524, -482, -1258, -1, 892, 81, -1395, -1313, 296, 1282, 637, -438, -587, 551, 1158, -6, -1440, -849, 896, 1308, 146, -731, -357, 909, 821, -662, -1350, -204, 1110, 812, -456, -1399, -261, 664, 257, -859, -1057, 179, 1484, 641, -941, -1180, 105, 1069, 402, -982, -648, 917, 1213, -400, -1382, -1163, 708, 1068, -476, -1420, -435, 943, 478, -1209, -1578, -700, 719, 164, -1223, -1244, -232, 1028, -214, -1597, -1462, 401, 1109, 91, -995, -867, 680, 1009, -485, -1555, -557, 1166, 1279, 66, -955, -330, 1247, 706, -296, -1025, 25, 1478, 719, -892, -1475, -53, 743, -233, -1482, -1232, 669, 1037, -173, -1529, -1169, 362, 469, -735, -1820, -711, 789, 811, -892, -1698, -534, 848, 588, -885, -1200, 253, 1409]
1585A409j049j605j08J468J468j220j338M18J369K77j336j165M71J582L07j025
1601g7j097R55Q80Lj321j000J435J556k47j764l01J425P89j195j459K45J958N82
1619A367j222j292M99J098M39j107j054M61J492N69j618j156P86J552l34j591
1635a111j93J375J270q28j665l78J523J133q60j090L94J279O66j131j971M97J709
1652F19M79r12j188P86J683k18j808j031J586J568j85j919m27J686N21q75j525
1669a160K41J494L44Oj592l41J495N63j369j269O86J555O16j528j246Q36J518
1686H49m96j278n19J467J291q93j167k54J028P40l79j202l60J712J067r47j799
1703a140K63J766N49j292j057Q49J720k6k185p78J175J355m69j273k13Q83R90
$$ y = [1409, 360, -1245, -1353, 115, 1583, 363, -975, -557, 812, 1089, -247, -1412, -941, 641, 948, -77, -1174, -219, 661, 664, -657, -1657, -222, 1334, 1087, -677, -978, 447, 1236, 41, -1418, -1173, 785, 1367, 145, -1147, -648, 450, 889, -218, -1272, -811, 681, 1250, -368, -1524, -738, 814, 480, -1111, -1304, 71, 1341, 513, -1152, -1530, -7, 1126, 266, -824, -430, 849, 1515, 384, -1587, -1090, 619, 1098, 186, -1002, -216, 1467, 1249, -559, -1590, -4, 1564, 1379, -540, -967, 719, 1240, 365, -1160, -919, 575, 919, 925, -667, -1008, 487, 1050, -319, -1588, -902, 653, 1269, -259, -1505, -669, 849, 353, -925, -1444, 23, 1314, 421, -746, -1000, 28, 768, 389, -813, -1173, 539, 1606, 659, -1140, -877, 889, 1438, 146, -911, -62, 1658, 1632, -553, -1331, -156, 1199, 730, -543, -756, 127, 1117]
1720A117l04j370o75R43J783o31j803k26J699P12j385j343N28J859J29j196o25
1737g88P99P24k55j012n91P25J370K18j456r97J072J620q42j946m0J764J368j709
1755B4j419M14J546N88j489o09Q31J014n4r75p56O03Q69M15r94p74J151J154j07
1774A432k145p24J712J576j125k065P32J474M59j530j025N69J006Q2m16r11K21
1791f78Q21M55q39j560O90J526N65j831q08J454J593j075j844L67J679N32p83
1808B64j003L57R35M60p75p85j59J008J094o94j555k17J781N93j817r80J740J473
1826A720j078j390l14J216P12j122n08O25K12L69k79o09o77R55J004j16j529k6
1844h35J685L51j277j390J223J643q31j284j90J343L55q79n17k39M81M75L32r12
$$ y = [1117, 813, -557, -1232, -289, 1494, 863, -940, -1166, 533, 1245, -140, -1483, -955, 904, 1033, -163, -788, 11, 735, 480, -532, -1123, -398, 972, 1190, -266, -1263, -191, 1429, 587, -1359, -1399, 365, 1733, 24, -1395, -981, 565, 1153, -336, -945, -114, 900, 846, -129, -885, -282, 587, 1002, 8, -766, 385, 1539, 1432, -713, -1437, 275, 1851, 726, -1339, -607, 867, 1326, -204, -1229, -660, 346, 428, 12, -899, -678, 143, 598, -241, -1801, -1111, 415, 980, -851, -1659, -205, 1388, 313, -1531, -1164, 515, 1047, 264, -739, -382, 553, 1013, 238, -547, -706, 302, 1396, 702, -853, -1070, 711, 1304, -513, -1493, 247, 1720, 642, -748, -1062, 154, 866, -256, -764, -139, 73, 442, 163, -446, -1123, -168, 836, 720, -809, -835, 850, 1201, -76, -1466, -243, 1400, 569, -715, -905, 438, 793, -86, -603, -842, -361, 114, 446, -466]
1862d66r01Q68J296k46j798m26K069J105j719j432J177J747n18j549j1J532L45
1879A073o49p68L62l3M02O8l73q18M49J211L03k051n49J465J237j414j485R47
1897f23J658l68j684m01J204L25n03J1J46k9K49O40n30j490L87J967L07j550j079
1916a363J985J022j313j752R62J670k30j386m9N20N30l91l77k33j64O67O71Rj352
1935e74l79J604P01k011p16J465J801j345j849O72J444j89r49k21P37L65j53k43
1953A60J54q09K40J024j21j566O2J464P64j425j825J341J711p05j631K19J857
1970I14j3j275n18R14j85K9M26R8o04R1O82M07j527l35J285J400j519j528J235
1989b3J824j031k041P01J502m1r43k55N69J00p61O47mq13j23J192O73j723q29
$$ y = [-466, -1367, -499, 797, 551, -1247, -1673, 396, 1501, -218, -1650, -473, 1274, 756, -793, -804, 728, 1073, 424, -344, 18, -15, 387, 455, 82, -736, -287, 924, 1227, -824, -1373, 92, 1329, -85, -1570, -623, 1035, 667, -1017, -1418, -214, 111, -392, -381, -235, -264, -15, 625, 95, -1395, -1008, 959, 1266, -284, -1363, 622, 1644, 331, -1421, -459, 1211, 981, -405, -454, 66, 596, 205, -172, -405, -569, 98, 769, 778, -574, -953, 651, 1352, -659, -1375, 90, 1891, 546, -1303, -631, 813, 624, -325, -546, 191, 556, 403, 160, 314, -495, -255, 769, 648, -918, -856, 608, 1372, -53, -1878, -537, 1174, 469, -1162, -943, 914, 901, -374, -892, 22, -163, -134, 292, 390, -214, -123, 559, 966, -561, -896, 389, 1789, 270, -1258, -23, 1801, 770, -1271, -570, 932, 891, -52, -307, 262, 362, -399, 248, 244, -569, -692, 500, 1173, -550, -1379]
2008a379J394J338j566j433J102J699l49j738K29J072Q1q67K16N72j96l18N51
2025D08J10r16n91J475N84j326j148J523J387j329j613P44K060p82j395L38Q67
2042C96n0p95R7Q1Q0j18P89J60j054n70J362Q45j642j015J094J782r64j764R05
2061c81J576n30j423P7R91M08j005M2P95q84m33R91N16j381l98J445P91j304j249
2080a356J097J667r63j545O23J280m2j363L54P86k58n52OJ069p92m38P08M93j090
2099c16r72J345J375j553j120J198J626q88j835L76J445K69j141k62J142l87m33
2116a31J33M79q43l11J150P71j272q66Q96J293j125j462Q79J693p60j870N52J546
2134G52j50j007j31J072O8r25O82J79o05o69Q16R40r18j102J159J423r82j698
$$ y = [-1379, 15, 1353, -213, -1646, -544, 1155, 806, -932, -703, 369, 450, -417, -201, 371, 175, -143, 408, 518, -398, -989, 486, 1070, -256, -1404, 119, 1506, 177, -1436, -692, 1368, 586, -809, -471, 396, 346, -449, -352, -271, -191, -309, 480, 640, -414, -984, 378, 1223, -419, -1434, -340, 1442, 478, -1286, -381, 1195, 665, -758, -681, 310, 718, -287, -245, 550, -334, -767, 224, 740, -641, -1039, 406, 1197, -107, -1356, -259, 1408, 445, -1100, -477, 803, 761, -602, -248, 538, 280, -272, -266, 803, 11, -427, 281, 774, -316, -1288, 57, 1432, -121, -1241, -43, 1583, 695, -1140, -764, 681, 950, -191, -453, 689, 302, -131, 2, 481, -362, -673, 477, 1248, -24, -890, 6, 1299, 174, -1288, -409, 1284, 524, -1346, -794, 752, 602, -405, -536, 536, 604, -321, 361, 540, -65, -734, 82, 1022, 104, -998, 161, 1584, 602, -1096]
2152a096O67J468k08j519L27J116m4j051j55O32l09k63M74O11q42o25Q66Q60r12
2171cj230Q24J643o94j774N33J638j00j400J24R84O3j126O3J115o97k40M60K97
2190D80p51l15P71J011j113j271Q71J512n83j608K27J453J28j417J61Q51J64j122
2208e51L31O62l86m39O40M84q91p43Q62J321r62j470O87J698n71j887L71J437
2226E93j73r25q5R04P8o54j30O83k60r26Q37P40p60r61R78J200o96j793M96J671
2246H17N1j456n00J614J31j129j39P41J72n37M9Q01p25m64P12O03m81j276N61
2265d55J607o86j342K37J265j65j178M4J059K91r11n4M06qo47M04N95n10m58O60
2285A54Q43o65j301O84J218l72j290J93J297n1j087k00R47J09o82m04P43j70n70
$$ y = [-1096, -429, 1039, 831, -688, -361, 755, 711, -340, -495, 137, -172, -435, 39, 650, -192, -817, 49, 909, -3, -1233, -409, 1234, 540, -1234, -701, 937, 837, -563, -439, 545, 608, -518, -455, 660, -37, -277, 183, 480, -271, -586, 185, 1196, 83, -1188, -317, 1195, 612, -996, -769, 684, 812, -605, -444, 407, 571, -551, -220, 442, 56, -383, 257, 741, -150, -893, -31, 1290, 328, -1142, -455, 1243, 672, -1215, -844, 593, 420, -505, -590, 314, 392, -262, -392, 291, 31, -895, -58, 682, -78, -1039, -61, 1139, 443, -1350, -854, 817, 868, -588, -1088, 526, 657, -472, -611, 130, 302, -235, -186, 615, -110, -574, 138, 741, 260, -1016, -455, 1152, 466, -876, -639, 626, 461, -717, -673, 386, 677, -234, -288, 118, 110, -537, -133, 462, -48, -506, 154, 997, 332, -969, -285, 933, 561, -729, -536, 761, 710, -377, -577, 370, 479, -203, -607, 136, -34, -604]
2304f04L59Q66p12o79M21R87l65j302N26J483n75j074k26J450M56j206l46P21
2322A80M64o33j68J70K73o15K21O52l68p93K89Q19k04j144L76J173K3j413j80
2341h78J174L36r91j65O73J08k69m15O25K8l98K86M52k88q94M18Q60k30j078M
2361f42J366Q6j219j87J027Q3o23p35Q86M46n53r9L96k61n58L87Q31m60r95K25
2381e99J174q1q07n73J225L99j184j05N64P69p39p13R14m18j54L40N0n1k85J50
2401a24N01j75o51L2J101l44r92K58Q29J01j067n7N04N00l78k43J25P4l25L69
2421C8K83n83k14M19M57j44p00j46J352j47j086l7P55M52r67n04P34L78q1m04
2441a45J52j38r9N50Ml80m40K38O60k48p21J48J075r3j042j01Q76L68n38q94P67
$$ y = [-604, -245, 621, -91, -770, -349, 638, 273, -1029, -503, 980, 405, -669, -895, 555, 1011, -195, -541, 180, 644, 11, -157, 13, 286, -329, -108, 544, 176, -617, -328, 491, 287, -857, -481, 692, 715, -698, -878, 296, 632, -359, -524, 149, 257, -12, -427, 198, 226, -172, 114, 566, 278, -616, -198, 662, 432, -646, -642, 724, 810, -409, -596, 431, 514, -109, -844, 42, 488, -65, -164, 232, -29, -587, -200, 631, 171, -824, -599, 575, 494, -313, -886, 339, 738, -446, -551, 13, 782, 43, -670, 244, -174, -328, 12, 62, 11, -274, -124, 377, 202, -449, -417, 684, 340, -652, -394, 435, 536, -531, -588, -84, 416, 38, -205, -80, -6, -331, 38, 321, -262, -476, -57, 400, 256, -444, -590, 762, 615, -471, -508, 247, 699, -268, -772, -38, 340, 259, -145, 7, -131, -230, 320, 324, -56, -496, -258, 402, 154, -567, -419, 656, 563, -479, -580, 296, 664, 126, -768, -1]
2462aK23R9n75M07Q6l00J26L24n97j47O6R14l48q78K02Q79J66j163l01Q82L31
2483C95k26n69L67K25k12J45q3J64k61K82J95n49j12R3O34j97p45R2Q21K66q65
2504a40m98M01P32j90p44J62K72L0k07K1L08p1O2J43k53o90L35P67k3q73j0P56
2526B90J96l11n11K95M65j94n48K91L98l31RJ16j09j60J40M5k08k34J8P96j59
2547B94o33j16L25N23k65o43M56K98J16m88p2J38J87L22k34j96k59J41K98j49
2567D3l27k3O19J46q88O4M92K28k05p79O02J41q5j54k0J32J26p5K80n54J20J41
2589B4K98l25m35L12M87ro21M1J66N64k95l50n0M32l45j08L03m01M75J16k72q4
2611g7j48J85M00N7q45J48M35L88p79j05K44M68l9m66m2K13R1k45P6m1N1K50n6
$$ y = [-1, 222, 321, -254, 153, 239, -61, 65, 389, -208, -355, -289, 625, 277, -601, -399, 480, 646, -517, -818, 64, 395, 169, -400, -33, 192, -20, 125, 42, 206, -55, 227, 422, -127, -239, -146, 488, 291, -454, -362, 459, 725, -140, -638, -237, 495, 305, -439, -277, -5, 25, -182, -161, 147, 76, 138, 281, 28, -662, -327, 440, 417, -456, -466, 290, 486, 175, -336, -41, 424, 230, -318, -27, 371, 40, 49, 165, 56, -104, 36, 81, -127, -361, -343, 453, 294, -339, -455, -130, 393, 128, -515, -59, 239, 355, -133, -205, -67, 120, 442, 208, 12, -247, -106, 192, 43, -284, -307, 312, 458, -430, -366, 126, 354, 149, -630, -28, 113, 28, -126, -146, -14, 112, 37, 317, -237, -117, 24, 322, -3, -438, -126, 361, 352, -269, -228, -62, 502, 207, -143, -193, 239, -106, -214, 89, -312, 163, 279, 7, -77, -225, -40, 360, 417, -428, -280, 155, 543, -236, -341, -97, 371, 332, -134, -176, 37, 128, -117, -41, -82, -31, 219, 163]
2634A63k27n3O3L08p0k70m99M76N21o23m41L63P62Rj035L19K29K50j64j60j1j43
2656b33L25J17o29N6N04L94j86k28o02M74K85j89m72N4O05q3k04j13q3J41L63
2677B96n83J81k11K2N53k91k78J38L69r4o4o04L57M68q5l63N0j40N82k88k21J40
2699f6K33k12m8o9k17N15J13o50K05k36M18J71k56l23K90M86l0l64o05O80L55
2720C90n64L20m17L66K16l96j42J37L29j25n3k62k9L37K07m14l29K13K21J47m54
2741c02N6K03m1l1j41j60K51N65l27l12o4L89K10l91m6n9N00R3m37k48J1M94k9
2764A84l76NJ90L10j24l36o3K26MK5j56k40L38K65m11j1J51J60J21l62l86L04
2786a82K55M85q24r1K68L67j49q2R4J04N2j12l96L00k37K86M6k92j5K61K47k88
$$ y = [163, -64, -117, -54, 254, 184, -86, -585, -109, 412, -211, -652, -289, 473, 482, -553, -234, -5, 245, 81, -79, -90, -233, 92, 209, -420, -364, 140, 534, 348, 120, -482, -8, 277, 88, -384, -330, 275, 192, -12, -125, -208, -67, 296, -287, -106, -317, -295, 258, -33, -311, -173, 196, 102, 38, -566, -209, 259, 174, -189, -139, -279, 303, 15, -206, -66, 167, -45, -93, -162, -379, 136, 249, -401, -196, -432, -14, 157, -99, -422, -132, 354, 324, -40, -645, 35, 390, -174, 146, -271, 95, 311, -85, -227, -90, 239, 114, 61, -201, -230, 107, 314, -100, -429, -216, 5, 152, -302, -246, -43, -84, -115, -256, -416, -165, 400, 73, -239, -303, 86, 296, -95, -141, -200, 300, 393, -44, -292, -281, 213, 184, -192, -187, 3, 313, 189, -147, -210, 16, 20, 45, -111, -351, -13, 252, -159, -170, -19, 141, 262, -100, -486, -182, 73, 558, -266, -357, -89, 278, 129, 47, 141, 245, 297, 185, -211, 89, -148, 138, 184, -108, -123, 138, 385, 97]
2808I7l72J76J18M44o51R0J51Q8j23k69m5K42j5J56j37j40L56O2j87j65n5K49
2830G0L90l54J09k24J94R7l98J89j96M88j21q5l68Q8J45N0j03n86O61m0R4O7k99
2853a32k2L09k6j56j17K03N9J53n97Q3J47L71l06m2j08L63l4o1j44r4K54q1k01
2876a79o6L35J82k98J92k70r9M16j86m0O5j53K29K0k91K34l8L77m89k20K90L2
2898D3K78r9l33L70l25K73o8Oj55K30j05n4m37J35N07M4o59M8J88O6J13k14k4
2921a72J49K45k8o13K39J79o5j2k45L7L18L16k93j75k77O07k0m96P6M0P9J9Q9
2944cO1l6J4K49k23k28L29l76L1m7J31j65L64m5l55K03j17L07L4m58L52k2K04
2967B04k38k40J88p0K05o2k31N31q8q1O0l25L08j94K59l84P4J42M82p67L53l6
$$ y = [97, -275, -99, 19, 463, -188, -98, 53, 141, 18, -251, -296, -54, -69, 87, -50, -190, 166, 228, 41, -124, -179, 70, 460, 106, 215, -9, 185, 282, -116, 73, -123, 365, 244, 159, -209, -121, 24, 74, -29, -615, 46, 6, 100, 167, -132, -154, 155, 129, -27, -144, 59, 118, 271, -326, -243, -96, 275, -31, -73, -181, 182, 148, 87, -57, -151, 103, 22, -179, -245, 90, 272, -26, 166, -104, -203, 213, 27, -13, 52, -101, 128, 148, -143, 91, 53, 430, -59, -279, 11, 43, 321, 222, -111, 259, -66, 207, 139, 145, -10, 220, 115, 61, -376, -241, 266, 310, -349, -301, -113, -47, 66, -148, -172, -23, 222, 194, -419, -180, -1, -66, -78, -323, -286, 32, 348, 55, -120, -397, 210, 190, -306, -230, -190, -111, -92, -3, 58, 22, 36, 285, 62, -166, 163, -213, -182, -229, -98, -263, 101, 56, -299, -96, -213, 94, 128, -330, 22, 0, 204, -34, -274, -86, -156, 49, -13, -244, 287, 199, 118, 178, -147, 161, -33, 226, -158, -84, 58, 540, -227, 126, 90]
2989I0l42P37n50K93l37k3K98l64J60J00J19j06k9k96K14N6K3L8l0j4l4J24j90
3012f3j4j61J68J73%l24L12N4n5k58M16l85J24k4j16L93j56m7l53L39j65lK51
3035A06k11q5K81o9Qj63r4K66j7j52j00JL10k56L07k60J90M7r1j85J67k3Q2m1
3059A8o0k49M65L3k2l7k19R8K39k18l21mL47p2J61J06k19j50K27j73j20j2r7O1
3083b18M53k23k28J97Q4J7j77n8L97j48j32pJ14J04l86K58k43kK52j90O0l2M04
3106B96l35M0N6j78j7K33m4j15J19L6l5j45M1j03J76k01j06jJ61J3k1p2J48J11
3130E7J65j74p6j66K50J14k56j18K20J38l70L1p0L43P1M3j99k66J75oJ62rr9J69
3154A29k6m3k28J52l5J40k89K12L8j36K02J44j04J01k90J85J3n07J79J12K73l31
$$ y = [90, -252, 485, -65, 228, -109, -132, 166, -198, -38, 62, 181, 75, 46, -250, -36, 20, 43, 81, 51, 37, 3, 127, -63, -77, -238, -70, 103, 103, -221, 91, 145, 90, -168, 248, -137, -13, -37, -153, 240, 84, 37, -316, 23, -142, -145, 106, -105, -190, 91, 22, 30, -133, -227, 39, 22, -130, -230, -229, 81, -175, 132, -128, 62, 109, 18, -167, 0, -23, 59, 18, -42, -291, 174, 207, 185, 148, -71, 27, 266, 48, -273, -277, 70, -2, 159, 265, 46, -104, 123, -50, -170, -182, -279, -218, 235, 12, -216, -19, 65, 82, -95, -153, 244, 96, -36, -43, 71, 175, -211, 47, -196, -198, 54, -136, -76, -108, 296, -39, 1, 57, -121, -138, 95, 51, -64, 55, 91, 56, -89, -48, -151, 25, -176, -282, -283, -122, -109, -130, -202, -54, 57, 222, 48, -28, -194, 56, 170, -86, -204, 16, 154, -216, -185, -255, 88, 159, 202, 3, -263, -88, -94, 68, 59, -40, 129, 103, 60, -168, -16, -51, 89, -200, 12, 50, -86, 116, 260, 156, 257, -33, 152, 165, -342, -163, -51, 222, -109]
3176a09O4k34M53j49m4k5J36K9l60j26J64L07J13j69j93J57r3R9r9j2K2Q2L91
3199D04n83j94N30K9m8j64P7j87M25k17p8p9M8L1K8pl68L80j7J59m02L37j25j30
3223a51L96m10j4L05O8m40J8J32L37n3k81O2J67j0m7Q3l33L33k12K06m01K92l09
3246b62K88l1k32J82j7n8R9k04J0K18J40j9m50L42k29M14k83q1K9K58J2k42p7
3269a93K67Oj47K17j54k83M37J39o73L59J03J36k08l6L7j23L14j87k04J4N63l70
3291A4j02j76L88j36J06j16j66J96K04k92j07P3K41o3J8k71P9M05n8l19L1m3L10
3314B16J45p8m76q3L73K46k05n14N69l89L68j47o6K52j03N7k61P9M7j22P2l2k42
3337b94N14q4Jl1l21J90nJ74l5j40J86k09J93j79K22j71J01l84P6Q9L97l31J68
$$ y = [-109, -45, -279, 174, 25, -19, -44, 92, 121, -239, -365, -201, 106, 219, 50, -143, 14, -79, 20, -79, -91, -69, 13, 404, -179, -373, 157, 186, 138, -26, 51, -136, 289, 72, -6, -85, -37, -6, 22, 15, -353, 27, 10, 169, -233, 104, -21, -151, 245, -165, -179, 126, 194, -246, -228, -96, 241, 188, -93, -31, 136, 126, 79, 162, -171, 162, -50, 156, -245, 47, -262, 26, -5, -237, -55, -72, -130, -31, -235, -225, -7, 133, 114, -336, 6, -223, 191, -92, -173, -144, 114, 126, -116, -193, 74, 80, -67, 150, -4, -287, 150, 289, -384, -25, 78, 214, 6, -30, 7, -116, 198, 11, -193, -179, 384, 14, -88, -264, 124, -12, 94, -22, -188, 8, 212, -80, -187, -114, 127, 64, 82, -189, -110, 295, 237, -82, -51, -94, 216, 361, 283, -193, -276, 97, 343, 138, -376, 193, -196, 172, 25, -41, 211, 108, 165, -96, -17, 30, -92, -20, -52, -294, 220, 136, 137, 106, -215, -25, -30, 144, 109, -31, 155, -54, 139, -40, 182, 11, 112, -272, -196, -107, 290, -41, 127]
3360A27j71J0RL5J75k72J83O9l67J12M6L1K23q2J98k75K4j08q9m0j0K18M00l91
3384E5l4k6J13j30J4j87N5M24k66L6o3L77Mo09N67l43K07q9k4k75l7J58J56j43
3408f0j67K75L5j40j19j9R3K55P4k03k15J2M26j08j65N1j14L18Q5k99r4o1J75
3431C5mP6r6O2J3k57J07o5K71l38K48j90q4Q4K7J80k68j57N74K4n89M77k9j55
3455e4Pj26J70R0k17J71l31J42L69o1j84m2JR7r8q8l6L20O0j82k38M19p4J66k36
3480D5o2j26K75k4K4j48o6L22m13N6R1K4J14l2Q8q0r0m8J08q2r9R6L6K8ok00R
3507a60N30j93k17J7J75Kl18J24j33M31j47J09n02K26J30k00N3m4J28l2K06j00
3529H5k05J61J8J00j82m1k5J45L13l73j09J53P4k06l6O4J16J95m89M49m20K41
$$ y = [127, -44, -34, -25, 10, 185, -87, 96, 165, -202, -90, -44, -13, 210, 128, 326, 51, 75, -33, -122, -162, -172, 46, 446, 55, 21, -5, 108, -22, -8, -195, -140, 284, 18, 54, -9, 368, 372, -237, 330, -13, 194, 105, 81, -194, -231, -73, 83, -60, -227, 48, 83, -57, -176, -195, -102, 153, 227, 24, -191, -179, 247, 139, -26, 25, -89, 229, 314, 15, -79, -140, 35, 31, 107, 11, 73, 86, -171, -64, -129, 142, -196, 52, -138, -222, -138, -111, 69, -199, -356, 218, 242, -347, 130, 101, -54, -47, -173, -3, 87, -130, 41, -290, -148, 221, 160, -24, -66, -65, 32, -66, -154, -190, 130, 190, 8, -230, 189, 115, 281, 45, -17, -143, 132, 108, 132, -16, -82, 240, -173, -117, -26, -2, 112, 80, 168, 88, -2, -50, 58, -24, -123, -27, 9, 37, 31, -169, -160, 370, 177, -40, -23, 152, 154, -164, -40, -173, 258, 111, 220, -282, -56, 74, -126, -73, -117, 11, -21, 185, 85, -120, 41, 59, 159, -23, -64, -89, 56, 369, -4, -113, 40, 114, -92, -128, -64, 52, 247, -242, 207, -213, 28]
3551B8J54n4l67K66L4J36j48k10L56l9K8k06j13K39J07n3j05k2K86qj08R1l89
3574i7K66K0J6k00j27J32J10n4o1J30J02O2l03j25J05K44m8k15M1nJ90j39k15
3597a71J17J07J67l03J62l72L55J40j55K12m38M99j24l36j5K33j23j22K03k95
3617b59L38O3j30k73J15L60j28k84J60pP9q8j96J53K9M0K42j93l46L07K57lp5
3640A61k47K4J42r2l6j53J23L82o0l67J57k02K31j46k21K57P2R1k66l1n3K40K44
3663B50m18j06R2J03J63j17j37K02P8m7K99n00P6L59j82j71j98M27o2N1k82M5
3685g5J37m7j64PJ22q4J52l36M9N3L25j66n6L6j52J42O6l7k12J40J11Q8l78L62
3709H3j83K58j82j06K00J93m06J17K2K99j82k67K60n32K94K45J03j40m09O13j97
$$ y = [28, 182, 128, -239, 27, 61, 197, 49, -161, 195, 156, 184, -22, -135, 104, 211, 158, 53, 31, 317, 309, 201, 292, -97, 169, 189, 205, 5, -122, 10, 120, 66, 5, 135, 237, 299, -4, -129, -24, 220, 172, -43, -2, -7, 183, 44, -171, -54, 53, 220, -83, 79, -293, 62, 202, 47, 259, -179, 320, 196, -140, -155, 78, -45, -167, 36, -259, 79, 142, 12, -261, -146, 214, 86, -198, -38, -45, 34, -54, -250, -97, -68, -28, 214, 21, -325, -18, 239, 236, 161, -86, -62, 80, -12, -48, -201, -78, 304, 244, -123, 34, -168, 63, -83, -304, -47, 25, 116, -150, -181, -234, 6, 250, -168, -274, -182, -79, 84, -33, -170, 32, 110, 63, 362, -138, -62, 297, 115, -56, -254, 173, 111, 162, -120, -75, 62, 15, -149, -142, -20, -104, 48, -288, -239, -186, 139, -27, -83, -47, -199, -57, 9, -28, -240, -100, 11, 99, -279, 83, -100, 158, -24, -130, 70, 263, -143, -26, -4, 295, 113, -154, 106, -426, -132, 113, 216, 76, -333, 280, 83]
3730H3l9k48j3J84j81K40j95K11m72M26J23n66M72NJ03j09j07O6K41p7m5l34%
3753b32K13j7J66k46P3O1J61l58K00J12l7j47j12m9K56L34l43o1N3m4j00L66o65
3776d16N11J26j10k86O9Q6OK6q6l39J74L80l25J09K80m17L07J19k22J42j82r2
3798a40L36j19l5j4J18o2q0p4J97J85m08M5J66j32P7K6j47J83Jk06O7J70j78P6
3822E2j7k30jK17K9O5k74J95K56j71j53R2J02Q8l2j54J3m5q5L9L5j51R4J66M2
3847A72R6pl22J65j73l0m2K80KQ7j96J8j32J02Mk82J33N05m69n9J27q4QLJ35m1
3873@j92R2K12j21l20J80K86qm20L49j44L1j27J2K97k06O6J90j37P8j08L3Q0q
3897A15m49N50j07kj73l7K54l40m2P0N3N0M4l0M95p87N62j40J55j22L9j61L3p1
$$ y = [83, 44, -204, -217, -33, -214, 26, -169, 42, -430, -4, 119, -447, 25, 30, 133, 24, -83, -17, 224, 147, 102, -232, -232, -19, -36, 130, -116, -43, 18, 179, -179, 21, 133, 96, -51, -163, -212, 44, 378, 35, -26, 27, -17, -117, 249, -416, 95, 221, 111, -175, -106, -20, -14, 12, -74, -413, -239, 141, -184, -75, 205, -212, 95, 214, -8, 134, -48, -140, 196, 77, 42, 28, 146, 84, 4, -70, 127, 312, -96, -51, 115, -17, 60, 86, -61, 122, 123, -83, -16, 154, -24, 52, 35, -195, -196, 21, 50, 115, -159, 36, 292, 121, -32, 60, 162, 250, 218, 64, 77, 32, -53, -14, 21, -130, -36, 130, 172, 268, 261, -61, 104, -69, -99, -141, 139, 141, 228, 32, 50, -82, 20, 24, -258, -125, 380, -89, -148, -21, -105, -97, -94, 41, 0, -192, -100, 112, -9, -329, -149, 137, 129, -291, 58, -86, -55, -182, -170, 127, -79, -13, 177, 40, 118, 10, 43, 123, 115, -334, 216, 109, 107, -66, -103, 151, -189, -231, -161, -108, -58, -14, -44, 451, -336, 226, 86, 241, 119, 158, -3, 30, -41]
3921d1l36K15K53p6l45L98lK2k44J33K05j5k64M0j03l7K95n9P8k20Q7K95q9l95
3945b06j3L43k07mj11J22J85o4R5m23K01K65j98QO3m9J21nj98J49j58L67k05l82
3969c04J95J84N6J13l09L4O4rl8m3KK06m10K18L9Ll3r8M6j6J97q5J26j98j18Q2
3995i6L31Kn36L21n2J06j93j42J39L27p4n2O0k65K32j18M5j18J43o6J05k45L01
4018A55k54K56m01N3j5L48j44j61J2L10k08l8J90j3l94L04R0j49k46J81J44l4
4040a4r1j87J10L40j00k32K56%J35j57M6k76O3n1K05O4M2k90k3J55l6k31J36K09
4064G3p0l35J79K85r8l56K58K22j25n3j73r9L82j29J19j10K36n56J68K10q0m2
4086i4K38L22l21j36l43O06p7j25m51L56K65K72l85j90p5J87J40j68km34Q55k18
$$ y = [-41, -377, -162, 91, 15, -330, 68, 65, 87, -157, -24, 181, 166, -98, -58, -161, -198, 97, 38, 116, -104, -17, 278, 189, -206, -219, 124, -83, -87, -198, -76, 109, 45, 140, -283, -82, 183, -15, -7, 56, 7, 128, 123, -75, 74, -84, 283, 78, -304, -109, 75, 131, 244, -65, -31, 33, 24, -14, -57, -55, 151, -259, -41, -2, 1, -32, -130, -84, -100, 97, 12, 138, -60, -178, -96, 235, 237, -299, 22, -30, 76, -117, -259, -120, 207, 133, 81, 141, -124, 108, -10, 35, -83, 60, -6, 99, -146, 155, -99, 157, -244, -191, -206, 142, -2, -163, -151, 159, -49, -87, 103, 90, -304, 0, 90, -59, -305, -124, 20, -14, -105, -292, -182, 158, 58, -174, 82, 82, 217, 60, 106, -170, -107, -158, 47, 111, 153, -137, -160, -5, -41, -272, -136, 73, 3, -332, -153, 132, 34, -322, -64, 158, 33, -20, -193, -292, 90, -39, 80, -30, 206, -350, -182, 28, -52, -94, 144, 466, 145, 9, -334, 272, 195, 70, -381, -25, 240, 512, 127, -63, -138, 49, 189, 21, 19, -415, 440, 222]
4108B22n77L8J70kM03o72J59M44P0m45K2mK77nK4J67k66l9J15m8r3M9L71n5l46
4133b1j77K45p4j78j5L06j45K11k48j43J06L15k03p6rJ7N7K60Nk70k99L74L0l47
4157b79J80j44M79k56J1j44L75N1p9l58J23k0J96l49m1R2J41m7L6K6o4K3M06m29
4181g1m7O0J11j96j80J92L63k20j93K83l44K89j06O0O3K1j42p0K87l31KK70J06
4204B07k31m38L04L20j44l61K36J78R2q1j6j16J94j50P0k82L10k12J06K31m34
4225b17P0j46K93J9k05J89J38K61m96k65N88k75J27k35J6K12o8K5j44l59K41J92
4247c9J61Q4m03M62j38k8k98K84l3j83k51N21j75J49j57L2q2L70k71j38L08l18
4269a43R5K7K37n28K30KM28k93l79K12L13J04m37M2J69j60l5o3J58Q1j73M10j92
$$ y = [222, -355, -317, -147, -149, 254, -418, -259, 185, 255, -190, -168, -172, 105, 100, 124, 291, 25, -14, 101, 53, -40, 9, 380, 325, -21, -198, 47, -27, -205, -220, 86, -59, 152, -96, -239, -133, 182, -21, -97, -106, -89, -32, 228, 233, -37, -336, 38, 68, -279, -99, -243, 236, -20, -9, -153, 222, 273, 194, -164, -41, -61, 135, -214, -255, -163, -22, -69, -33, -7, -71, -48, 358, -71, -118, -58, 53, -143, -323, -131, 232, 12, -181, 102, -242, 47, -59, 1, 64, 85, -57, -127, 160, -171, -169, 101, 207, -24, -462, -158, 162, 18, -343, -107, 71, 163, 82, 66, -50, 144, -6, 64, -218, 92, -120, -14, 217, -217, -147, -293, 0, 19, -186, 3, 141, 402, -94, -359, 229, -46, 81, -154, -138, 74, 6, 31, -113, -472, -231, -39, 122, 206, -197, 265, 127, 99, -199, 85, 52, -131, -382, 139, -36, 113, -44, -12, -94, 276, 5, -133, 175, -143, -48, -21, 216, -312, -82, -80, 348, 55, -324, -112, 201, 305, -132, -90, 79, -81, -116, -179, -21, 60, -113, 297, 105]
4292A05p2k99L25Q2j81j30K66N3R3m03j54K63L95l96j08K93r6L5M7j3o8l79P08
4315C66Kj79j38j39K61J7j95j36L09j46j11P9nK61j95j16O3K18j71J82k2j48j03
4338d6K6K02p2m23L93K89n66pJ97J63n5k86j17K59J63q7l02J44J09KM0o7q6mL05
4363A74j6J51l37l2j05L12k74P4K39q9l05J09o4M39k47J13j85K09k17l52N35l20
4385a88j34O15j86K35l99j12K25j29M7j1K34J30m19k02L34J96n14R3J01j32K41
4406B5J38J15m3m68L39J31l09k12L95l06M03m99n2L50k8J52j48N3J9N4R5p1L3
4429A66l43Q5J30O9k62J21J26o5j12N4pO8k8q8L37ml32P5j30n1M26p8l91K39j31
4454a26M00l5m39j20N8L35j21N2k91M51J04l63j26L13M6k22R4k85M99k03j23J36
$$ y = [105, 33, -266, 59, 141, -40, -170, 96, 149, 242, -161, -315, -52, 343, -53, -161, 132, 36, 71, 118, 105, 37, -342, 366, 368, 189, 51, -88, 173, 190, -5, -141, 168, 22, -89, -10, -15, 246, 51, -65, -2, 216, 45, 227, 205, 57, -46, -20, 182, 110, -313, 80, 369, -197, -204, -7, 156, 101, -185, -302, -43, 120, 33, -269, -125, -16, -14, 26, -41, -127, -131, 174, 158, 309, -28, -60, -165, 147, -127, -53, 186, 97, -208, -99, -163, 276, 29, 142, -43, 166, -51, -403, 132, -188, -322, 293, 107, 342, -57, -169, 56, -73, -26, -37, 197, 327, -92, -294, 40, 236, -278, -185, -84, -216, 25, 163, 278, 235, -233, 106, 237, -72, -284, 111, -195, 208, -291, -343, 7, -21, 131, -17, 36, 55, 109, 204, 133, 166, -177, -92, 38, 107, -155, -34, 92, 27, -85, -31, -38, 30, 2, -86, 251, 247, -85, -10, -140, -191, 235, 157, -234, 5, -126, 274, 239, -200, -320, -262, 73, -48, 4, -287, 164, 268, -95, -221, 92, 138, -84, 10, -275, 224, 21, -102, 34]
4476C4N6k34R3J00N0m85L58J51L4j95r8j4O9l7j14K06Lj47L8j28K83j50M42k10
4500A05r5o3j88K42k05K19J2K15L0n24J06L39j32l91L39j66K31j09L6J4m4J36
4522A07P7k23L3q9K01P4l12j46K24K90l24Mk42N08l67R0R7J28K28k90M8q0l04
4545b68L34Q0J02l64r0K32p6J39j97O7K12o1l30oN32j43m56L10J31k34J27K39
4567B80m13N8q8rQ4Q8o4J13J16m55L25q8Q5J58j36r9L6J07L8J74k74M1K17j96
4591I8k09K82k29J84M9m25j32M09J91p6j44lK43j5k97J09j16L54l27l5J45j44
4613h8J96j10qk21p1J62K96k43j38k12M21K26l00R0o0J30l13K29MJ88j17L02l76
4636a3J35m08L17J56J9n6j37J18k87l2J65J72k26J34k03J97L08l98n2L87k24l0
$$ y = [34, 90, -144, -51, 49, 99, -386, -28, 123, 157, -38, -136, -150, -81, -118, -232, -26, -23, -170, -132, -260, 23, -127, 315, 105, 10, -53, -241, 1, -204, 15, 27, 242, 272, -252, -146, 193, 61, -330, 9, -157, 74, -35, 1, 15, -29, 107, 184, -39, -6, -95, 106, 180, -132, -278, -54, 236, -88, -84, -326, 182, -185, -95, 2, 130, 358, 68, 116, 36, -268, 66, 146, 248, -116, -206, 26, -50, 89, -108, -41, 171, 110, -220, -226, 306, 163, -293, 17, 148, -86, 41, 280, -133, -75, -163, -172, -88, 0, -64, 49, 165, -290, 35, -53, 32, 190, 54, -45, -9, 98, 136, 310, 36, 77, 294, 98, -111, 171, -58, 126, 175, -250, -382, 27, 218, 142, -2, -5, 238, 223, -74, 35, -81, 273, -54, -89, 56, -88, 108, -2, -10, -231, -302, -140, 156, -87, -225, -437, -16, 210, -90, 0, -60, 70, -243, -14, -10, 178, 61, 363, -13, 122, -286, 31, 187, 206, 150, 13, 131, -156, -188, -23, 149, -77, 57, -146, 51, 359, -39, -91, 296, 72, 42]
4658D2k89L65j12J38K19m35k4rJ20K9j28l40L45L23n3k90l60K73L30k56j02K97
4680H3n9nJ36k20O6l3j3N5J64k49K6K67l48J37R5m5j09k06L47o2Q3J13m38L82
4704A67m07K30n4p9P4K22k22qk9n5J75oJ55k64q5K19N5j4l46J37J14R1m7j0K17
4729B30O2l44J63k06N4k53J75n0K7K54Omm15J58J5L76j39M0j47O5%n7j20J43j55
4754a22O7r3K98j80L11n42J11K04q9J89k61o8J30Q8K53k82q7k41J92L75k19j75
4776a41K03K8O0k33J17K50l67P3Oq2J42j5j94J93l93L83NJ60n09J76J47P4j16
4799c3n5K62q8p0k60J61l29M82n0j80j93L41J25kN8j06p2J55L0k25L48k75j63
4822a39K61k36J0K36r4k7p4lR5K9k58m2o2L93J40l46K12o1J30k7k9j28p9J51k7
$$ y = [42, -247, 118, 6, 144, 363, -72, -96, -105, 15, 44, -84, -424, -79, 244, 191, -99, -459, -186, 144, -112, -214, 83, 24, 19, 155, -65, 1, -32, -45, 10, 174, -75, -49, 218, -130, 7, 102, 57, -52, -258, 89, 27, 110, 223, -215, 167, -240, -10, -64, -143, -69, 153, -69, -77, -106, -161, 14, 8, 163, -101, -186, 33, 88, 74, -272, -135, -21, 70, 23, 13, 230, 292, -52, 111, -95, -41, -294, -119, -169, -142, 112, 118, 114, -301, -143, -128, 248, 109, 149, 2, 67, 67, 10, -110, 33, -122, -55, -148, 150, -30, 281, -261, -150, 54, -35, 154, -107, -175, -45, 43, 296, 14, -73, -314, -122, 253, 34, -141, 62, 90, 150, -83, 34, 284, -83, -10, -4, -86, 56, 41, -153, 40, -353, 30, 35, 195, -314, -138, 9, 83, -33, -88, 174, 86, 16, -244, -83, -412, 70, 20, -160, -353, -12, 113, 111, 169, 63, -9, 146, 176, -49, 299, 24, -139, 122, -114, -104, 132, 38, 11, -63, -66, 29, 58, -200, -242, -304, 89, 229, -117, 95, 34, 164, 137, 108, -20, -99, 52, 25]
4847B5l0r0L98k40k75L42kj18Q0j51j8J59R3p5j45k68L14j90K38K1j43J16q9j31
4871a79J58j72J92k0j8L3P3j4k7m7l44R7L48R8j03k34Q1J70l1j01j9kP2M5m31
4896c75J96J52L52m27L31k44N7J1n8p9r3J80J28l60K83j38j40O28l99j42J71K65
4918B99q7l20O7nj84L81l14O0pK7L11l51J01K27J39l07N7k26M14k98N8k19K58
4941H1j95K14K3k16J62NL4j15N8N3j21oJ49m21L04R9j8k50MK30J94j86j18j40
4965a76M40j47j29k6k29N09n4k17m2j82O75n61q1L91k89M3J04j99K16j49J97q2
4987A2l12J37J59j86R2J56k24J34J09m0p8m5O5K65j91J17K1l9j68m7J59j92R9
5010Ck6K54k96J17J56Q8l83N6N3j88R5j41L01l8j46R6k9q6RJ20k30K11P2lK01
$$ y = [25, -5, -95, 303, 63, -212, 130, 128, 10, 90, -61, -79, 80, 173, 98, -47, -315, -1, -191, 47, 68, -75, 41, -48, -179, -21, -193, -1, -21, -39, -6, 67, 53, 26, -21, -365, -268, 80, 178, 75, -159, -78, 92, 61, -40, -59, -61, 11, 56, -375, -179, -27, 325, -102, 229, -15, 42, 53, -5, -84, -177, 3, 131, -229, 54, -84, -224, 404, 5, -137, 34, 299, 212, -108, -41, -46, -230, 151, -163, -103, -110, -83, 228, -123, -22, 205, 344, 37, 94, -132, 282, -16, 42, -177, 81, -114, 100, 123, -93, 69, 74, 108, -7, 51, 104, -17, -23, 126, -295, 9, 108, 90, -160, -156, 74, 268, 82, -36, -176, 264, 117, -12, -38, -267, 242, 188, -29, -71, -253, 422, -139, -220, 171, -118, -75, 29, -170, 46, -103, 94, 12, -300, -163, -4, -190, -98, 58, -166, -32, 77, 37, -41, -86, -21, 244, 53, 170, 191, 152, -16, -63, 96, -96, 3, -23, 231, -65, 52, 208, 296, -87, -31, 22, -166, -71, -212, 89, 51, -95, 1, -28, -114, -105, 15, -215, -4, 68, 65, 266]
5035B66m82K74M5k12p4M2j8K82o6l8k3J08K7Q1l16j39J36K72k33o9L10k20j41
5058a88K06k18J0J13P4J04mm10J88J05j84L18j29O8Q8P0m87L62l05M0J94L9o4
5081a0K14j1j07L5p0j94j05J09K16k80k36N04j18q3m9On6K9J45m8L33j0k63N5
5105Fj30J03L07l35j58L53j19j87J42P4j04J84k16P3o3J29N1j09j46J05J20j07
5127b7P7k26Q5K56J07k84kL43k13k25J52j30K69j21k99J69m8J63J9r6O1j12L0
5150e2P9k26L20j63J29J0L1k46J75m9K8q6k11M06k20J51J77j12M6j68R0j94rK74
5174A80Nl74o9J60K95k69K52l19M25m15J77m4j4j78K74k04K09k07K48M9m12R4
5196a37M2J21M24l32j71J79o1P4k49k04M53j70j29J83j53M9L67p9l22M1qJ69q2
$$ y = [266, -216, 58, 103, -109, -183, -141, -159, 123, 57, 19, -4, 104, 131, 212, -104, -243, -107, 165, -68, -137, 173, -47, -188, 18, -200, -190, -77, -3, 101, 97, -313, -125, -20, -204, 114, -15, 53, 141, 211, -276, 86, -219, -179, 15, 54, -10, 204, 193, 86, 121, 51, -143, -248, -139, 77, -203, -439, 65, -53, -136, -185, -179, -235, -206, -61, -109, 224, 214, -49, 6, -124, -21, 286, -49, -207, 146, 27, -160, -18, 56, -48, 136, -80, -7, -70, 59, 110, 1, -145, -40, 80, -27, 50, -176, -91, 165, 272, -12, -14, 329, 116, -109, 43, -87, 182, 61, -238, -69, -117, 46, 65, -31, 30, -82, -52, 27, -199, 121, -42, 87, 97, 128, -118, 57, 8, 36, -50, -261, 145, -75, 76, 253, 141, 187, 19, 109, -85, -94, 180, 185, -189, -258, -98, 197, -72, 180, -139, 286, -129, 48, 4, -10, -188, 86, -118, 91, -116, 132, 181, -231, -137, -95, 26, 450, 118, -53, 126, 65, 139, -110, -314, 139, -31, -160, 23, -130, -81, 286, 207, -115, -74, -82, 87, 5]
5219Ep4L9J27O3k45K7J99k75L06j90mK24L8k99J72k83J01K44l17J02K5j0Q6j89
5243a28K2N1l7K63l75J72R3nj11j49L20r0K13Q4m42K40k19K16l56R8J55j19J73
5266F9j30J19j51J79J59k57L14n19M23m86J54J47j71O7K54j98j34J19K01l1ll6
5288H9J8O8m27%n5M98j36O5l16K72J4k61L46l18l2J28J49n3k44P6L55j21j99q6
5312a70K47l8q6J37j87J11J99l19J54k12K79n3K05l73J7J23N7p8j70J97n8M6k24
5335a96N3n8J30J76k04j09J60K7L12j96k25j33J98K82n8k79J82q5L8L3Q7j91J19
5358F3k78m2O7J00R3j04n2j79J70L20j74r0Q4M2j91J40j9J59M4kl10J08Q2O2J28
5383B21l04m6J34K53j93l19K60J17q3j83L08j56P7R2j98K41m22j2K79j17j25P3
$$ y = [5, -69, -30, 97, 160, -85, -58, 141, -134, 172, -18, -22, 202, 240, -59, 113, -170, -69, 175, -142, -40, -15, -25, 61, -128, -106, -55, -92, 171, -204, -32, 61, 56, -55, -204, 116, 26, 239, 323, -119, 121, -98, 118, -238, -140, 15, -104, 69, -61, 58, -93, 86, 245, -12, 302, -217, 206, -280, -126, 21, -150, -83, 171, -27, -161, -42, 159, 128, 125, 89, 107, 175, -252, -252, -307, 191, 55, 120, -196, 76, 90, -171, 175, -143, -175, -47, 102, 49, -195, -119, 236, 115, -84, -170, 77, 39, -47, 90, -97, 14, 213, -106, 48, -164, 115, 62, 267, -106, -89, 34, 91, 13, -157, 40, -18, 28, -196, -143, -201, -71, 105, -99, -208, -48, -21, 291, 95, -130, -263, -65, 217, 159, -120, 62, -23, 15, 48, 135, -56, 63, -215, -257, -190, -90, 3, -101, -153, -332, -162, 158, -16, -106, -22, 20, -171, -31, -50, 109, 153, 151, -159, -51, 31, 93, 221, -83, -129, 5, 258, 65, -254, 6, 123, 40, -143, 165, 9, 86, 178, -20, 221, -201, -213, 66, -51, -176, -103]
5405a03J92l0J22l12J0p7K38k71J77J84J85k54p4j48K09L23l18J98k99p8J36Q7
5427I7n8j7r3M39n79L25j57J54k84K24q6K2J85o3j01j15K26o2RO9j7j07M0P5k5
5452A01J6j61R3j69Q8j83J77J43k50Q8j5m1J12r0j18K22L12k58j68J84k42K49
5474I0j07j84L32k11j5K54n2k50J44o1jO4J70k78L06p5j96J03J36q2j43R1r3M1
5498a7k20L40k13J37q5rL1J79j18K16p6k45J90M7j85q5K94k48qJ10j24J28j99
5521a60K11o5j89J06J8J61k53N5J75lj2k25k47M22P8m3k80L23j57p3L66n1l12
5544a55j3J99J04m9k41R2K02j03j22K7K96l97J80Nl27R6K61n0P9j35J42L7j08
5567B0o8p4N0L53n04K14l5r8J31j81p4L69j0l22K95Pj43O2j28L93p9k46J19P6
$$ y = [-103, 89, 59, 181, -131, -121, -198, 40, -231, -54, 130, 315, 61, -13, -161, 48, 371, 53, 251, -48, -126, 10, 97, 39, 22, -71, 368, -211, 114, -43, 111, -173, 51, -35, -13, 172, 109, 8, -107, 119, 57, 66, 135, 118, 11, 51, 126, 101, 117, -44, 49, -120, -32, -215, -38, 105, -145, -57, -72, -113, -1, -91, -209, 13, 325, 67, -101, 83, -159, 90, -17, -201, 131, -80, -95, 159, 107, -143, 1, -60, -61, 3, 173, -105, 201, 126, -70, 33, 169, 87, -56, 35, -58, -17, -237, 103, -110, 27, -58, -67, -36, 143, 25, 241, 165, -80, 110, 157, -28, -113, 181, -67, -75, 35, -89, 39, -160, 51, -14, -203, -97, -79, 82, -171, -116, 59, 56, 44, -181, -428, -6, 72, 29, -251, 72, -85, -158, 208, 157, -155, -168, 31, 135, 86, -155, -63, 139, 36, -86, -59, 237, -160, 20, 25, -302, -206, 55, 5, 84, -51, 91, 128, 20, -48, -122, -72, 281, -223, -9, -44, -142, -11, -192, -266, 103, 93, -229, 66, 73, -70, -8, -136, 257, 178, -68, 51, 127]
$$ [...]
8191C83
##END NTUPLES=NMR FID
##END=
