##TITLE=1H_UK-13
 dmso-d6, 8 sc, 
 29.06.2021
##JCAMPDX= 6.0         $$ Bruker NMR JCAMP-DX V2.0
##DATA TYPE= NMR FID
##DATA CLASS= NTUPLES
##ORIGIN= UXNMR, Bruker Analytische Messtechnik GmbH
##OWNER= root
$$ XWIN-NMR		Version 3.5
$$ Tue Jun 29 10:31:32 2021 Russian Standard Time (UT+4h)  she@DPX200
##.OBSERVE FREQUENCY= 200.131506
##.OBSERVE NUCLEUS= ^1H
##.DELAY= (6, 6)
##.ACQUISITION MODE= SIMULTANEOUS
##.ACQUISITION SCHEME= undefined
##.AVERAGES= 8
##.DIGITISER RES= 18
##SPECTROMETER/DATA SYSTEM= spect
##.PULSE SEQUENCE= zg30
##.SOLVENT NAME= DMSO
##.SHIFT REFERENCE= (INTERNAL, DMSO, 0, 15.7039)
##AUDIT TRAIL= $$ (NUMBER, WHEN, WHO, WHERE, WHAT)
$$ ##TITLE= Audit trail, XWIN-NMR		Version 3.5
$$ ##JCAMPDX= 5.01
$$ ##ORIGIN= Bruker BioSpin GmbH
$$ ##OWNER= she
$$ F:/spectra/data/she/nmr/H-F/1/audita.txt
$$ ##AUDIT TRAIL=  $$ (NUMBER, WHEN, WHO, WHERE, WHAT)
(   1,<2021-06-29 10:30:14.18 +0400>,<she>,<DPX200>,
      <created by zg, POWCHK disabled, PULCHK disabled
       configuration hash MD5:
       00 E9 B6 7A A2 85 ED C7 34 08 36 98 17 FE 4E 26
       data hash MD5: 16K
       7C EB 3E B4 0D 9D 4E A1 10 59 CE 47 38 86 18 71>)
$$ ##END=
$$ 
$$ hash MD5
$$ 4D BB A1 68 1D 46 E4 9C AD 98 20 2B 09 77 B9 2F
##$RELAX= 
##$RELAX= 
##$RELAX= 
##$RELAX= 
##$RELAX= 
##$RELAX= 
$$ Bruker specific parameters
$$ --------------------------
##$DU= <F:/spectra>
##$EXPNO= 1
##$NAME= <H-F>
##$PROCNO= 1
##$TYPE= <nmr>
##$USER= <she>
##$AMP= (0..31)
100 100 100 100 100 100 100 100 100 100 100 100 100 100 100 100 100 100 
100 100 100 100 100 100 100 100 100 100 100 100 100 100 
##$AQSEQ= 0
##$AQ_mod= 1
##$AUNM= <au_zg>
##$AUTOPOS= <>
##$BF1= 200.13
##$BF2= 200.13
##$BF3= 200.13
##$BF4= 200.13
##$BF5= 200.13
##$BF6= 200.13
##$BF7= 200.13
##$BF8= 200.13
##$BYTORDA= 1
##$CFDGTYP= 0
##$CFRGTYP= 5
##$CHEMSTR= <none>
##$CNST= (0..31)
1 1 145 1 1 1 1 1 1 1 1 1 1 1 1 1 1 1 1 1 1 1 1 1 1 1 1 1 1 1 1 1 
##$CPDPRG= <>
##$CPDPRG1= <>
##$CPDPRG2= <>
##$CPDPRG3= <>
##$CPDPRG4= <mlev>
##$CPDPRG5= <mlev>
##$CPDPRG6= <mlev>
##$CPDPRG7= <mlev>
##$CPDPRG8= <mlev>
##$CPDPRGB= <>
##$CPDPRGT= <>
##$D= (0..31)
0 1.2 0 0 0 0 0 0 0 0.06 0 0.03 0 0 0 0 0.0002 0 0 0 0 0 0 0 0 0 0 0 0 
0 0 0 
##$DATE= 1624948213
##$DBL= (0..7)
120 120 120 120 120 120 120 120 
##$DBP= (0..7)
150 150 150 150 150 150 150 150 
##$DBP07= 0
##$DBPNAM0= <>
##$DBPNAM1= <>
##$DBPNAM2= <>
##$DBPNAM3= <>
##$DBPNAM4= <>
##$DBPNAM5= <>
##$DBPNAM6= <>
##$DBPNAM7= <>
##$DBPOAL= (0..7)
0.5 0.5 0.5 0.5 0.5 0.5 0.5 0.5 
##$DBPOFFS= (0..7)
0 0 0 0 0 0 0 0 
##$DE= 6
##$DECBNUC= <off>
##$DECIM= 32
##$DECNUC= <off>
##$DECSTAT= 4
##$DIGMOD= 1
##$DIGTYP= 9
##$DL= (0..7)
0 120 120 120 120 120 120 120 
##$DP= (0..7)
150 150 150 150 150 150 150 150 
##$DP07= 0
##$DPNAME0= <>
##$DPNAME1= <>
##$DPNAME2= <>
##$DPNAME3= <>
##$DPNAME4= <>
##$DPNAME5= <>
##$DPNAME6= <>
##$DPNAME7= <>
##$DPOAL= (0..7)
0.5 0.5 0.5 0.5 0.5 0.5 0.5 0.5 
##$DPOFFS= (0..7)
0 0 0 0 0 0 0 0 
##$DQDMODE= 0
##$DR= 18
##$DS= 0
##$DSLIST= <SSSSSSSSSSSSSSS>
$$ [...]
##$SUBNAM2= <"">
##$SUBNAM3= <"">
##$SUBNAM4= <"">
##$SUBNAM5= <"">
##$SUBNAM6= <"">
##$SUBNAM7= <"">
##$SUBNAM8= <"">
##$SUBNAM9= <"">
##$SW= 20.0188882624521
##$SWIBOX= (0..15)
0 0 2 0 0 0 0 0 0 0 0 0 0 0 0 0 
##$SW_h= 4006.41025641026
##$TD= 16384
##$TD0= 1
##$TE= 0
##$TE2= 300
##$TE3= 300
##$TEG= 300
##$TL= (0..7)
0 120 120 120 120 120 120 120 
##$TP= (0..7)
150 150 150 150 150 150 150 150 
##$TP07= 0
##$TPNAME0= <>
##$TPNAME1= <>
##$TPNAME2= <>
##$TPNAME3= <>
##$TPNAME4= <>
##$TPNAME5= <>
##$TPNAME6= <>
##$TPNAME7= <>
##$TPOAL= (0..7)
0.5 0.5 0.5 0.5 0.5 0.5 0.5 0.5 
##$TPOFFS= (0..7)
0 0 0 0 0 0 0 0 
##$TUNHIN= 0
##$TUNHOUT= 0
##$TUNXOUT= 0
##$USERA1= <user>
##$USERA2= <user>
##$USERA3= <user>
##$USERA4= <user>
##$USERA5= <user>
##$V9= 5
##$VALIST= <valist>
##$VCLIST= <CCCCCCCCCCCCCCC>
##$VD= 0
##$VDLIST= <DDDDDDDDDDDDDDD>
##$VPLIST= <PPPPPPPPPPPPPPP>
##$VTLIST= <TTTTTTTTTTTTTTT>
##$WBST= 1024
##$WBSW= 4
##$XGAIN= (0..3)
0 0 0 0 
##$XL= 0
##$YL= 0
##$YMAX_a= 128112
##$YMIN_a= -159419
##$ZGOPTNS= <>
##$ZL1= 120
##$ZL2= 120
##$ZL3= 120
##$ZL4= 120
##$ABSF1= 10
##$ABSF2= 0
##$ABSG= 5
##$ABSL= 3
##$ALPHA= 0
##$AQORDER= 0
##$ASSFAC= 0
##$ASSFACI= 0
##$ASSFACX= 0
##$ASSWID= 0
##$AUNMP= <proc_1d>
##$AZFE= 0.1
##$AZFW= 0.1
##$BCFW= 1
##$BC_mod= 2
##$BYTORDP= 1
##$COROFFS= 0
##$CY= 11.3945322036743
##$DATMOD= 1
##$DC= 2
##$DFILT= <>
##$DTYPP= 0
##$F1P= 15.9154993809931
##$F2P= -4.1035820241983
##$FCOR= 0.5
##$FTSIZE= 0
##$FT_mod= 4
##$GAMMA= 1
##$GB= 0.15
##$INTBC= 1
##$INTSCL= 1
##$ISEN= 128
##$LB= 0.24
##$LEV0= 0
##$LPBIN= 0
##$MAXI= 10000
##$MC2= 0
##$MEAN= 0
##$ME_mod= 0
##$MI= 1.114404
##$NCOEF= 0
##$NC_proc= 0
##$NLEV= 6
##$NOISF1= 3.799351
##$NOISF2= 2.8
##$NSP= 1
##$NTH_PI= 0
##$NZP= 0
##$OFFSET= 15.70392
##$PC= 1
##$PHC0= -11926.05
##$PHC1= 16.00101
##$PH_mod= 1
##$PKNL= yes
##$PPARMOD= 0
##$PSCAL= 0
##$PSIGN= 0
##$REVERSE= no
##$SF= 200.130013532006
##$SI= 16384
##$SIGF1= 3
##$SIGF2= 2
##$SINO= 400
##$SIOLD= 16384
##$SREGLST= <1H.CDCl3>
##$SSB= 0
##$STSI= 0
##$STSR= 0
##$SW_p= 3612.71676300578
##$SYMM= 0
##$S_DEV= 0
##$TDeff= 0
##$TDoff= 0
##$TI= <>
##$TILT= no
##$TM1= 0
##$TM2= 0
##$TOPLEV= 0
##$USERP1= <user>
##$USERP2= <user>
##$USERP3= <user>
##$USERP4= <user>
##$USERP5= <user>
##$WDW= 1
##$XDIM= 8192
##$YMAX_p= 0
##$YMIN_p= 0
$$ End of Bruker specific parameters
$$ ---------------------------------
##NTUPLES= NMR FID
##VAR_NAME=  TIME,          FID/REAL,        FID/IMAG
##SYMBOL=    X,             R,               I
##VAR_TYPE=  INDEPENDENT,   DEPENDENT,       DEPENDENT
##VAR_FORM=  AFFN,          ASDF,            ASDF
##VAR_DIM=   8192,          8192,            8192
##UNITS=     SECONDS,       ARBITRARY UNITS, ARBITRARY UNITS
##FACTOR=    0.0002496,     1,               1
##FIRST=     0,             0,               0
##LAST=      2.0444736,     0,               0
##MIN=       0,             -159419,         0
##MAX=       2.0444736,     128112,          0
$$ Real data points
##PAGE= N=1
##DATA TABLE= (X++(R..R)), XYDATA
0 0 0 0 0 0 0 0 0 0 0 0 0 0 0 1 -8 8 -8 8 -9 16 -16 18 -24 27 -33 39 -44 51 -58 68 -78 90 -101 114 -129 145
36 145 -164 184 -207 230 -255 284 -316 349 -386 427 -470 520 -572 630 -694 764 -842 929 -1028
55 -1028 1138 -1262 1405 -1571 1766 -1998 2283 -2641 3105 -3733 4639 -6060 8635 -14802 65566
70 65566 -7727 -115848 46694 128112 28755 -71976 8650 86846 48109 -13177 12905 20604
82 20604 -13903 2443 66391 29265 -59331 -22939 97275 66581 -82248 -89428 67164 108929
94 108929 -30665 -97947 20177 99646 9904 -76225 -21326 46462 19094 -14524 11660 15004
106 15004 -21169 -4398 47483 13583 -66439 -32684 79665 68184 -60681 -78395 48381
117 48381 87194 -32163 -93326 5196 80865 15792 -54394 -17736 30255 4520 -22225 1169
129 1169 5992 -23627 -4168 47795 18618 -61560 -42271 55408 53880 -51681 -68453 39309
141 39309 80360 -16110 -78370 -8539 55726 9036 -45073 -14717 25111 5990 -14806 240
153 240 -5499 -35229 -15830 34488 15836 -51777 -40232 41652 42859 -49856 -73327 16644 61292
166 61292 -10876 -62488 -7994 44489 7593 -38922 -18537 14016 3405 -5745 12166 6338
178 6338 -25202 -12644 32657 18071 -42774 -33556 42005 50385 -27952 -55900 13429 51824 -6532
191 -6532 -52413 -8136 39313 13586 -24706 -11812 8188 -4569 -10641 7236 2915 -22767 -9876
204 -9876 30641 18260 -38048 -37494 25626 39258 -22246 -46729 10764 46336 -435 -42434 -12861
217 -12861 24910 9117 -17245 -6081 9679 -651 -5403 8584 1372 -24169 -12761 27735
229 27735 22204 -25665 -28890 22961 35233 -17737 -42259 4460 39709 6354 -28456 -6827
241 -6827 22496 7723 -14370 -5710 6424 -1272 -755 15004 7763 -18463 -13095 20826 17925 -22352
255 -22352 -26566 18821 34020 -9476 -34854 -933 26980 2134 -25797 -8386 16529 7625
267 7625 -9218 -4975 846 -7767 -6400 9343 5578 -16002 -10909 18630 16780 -19860 -27110 10260
281 10260 26764 -5203 -25880 840 24923 5040 -19824 -8731 10589 5262 -5146 1508
293 1508 5038 -4057 -3426 9462 4865 -15252 -11781 16670 19017 -11252 -20977 8127 21847 -5069
307 -5069 -23954 -2616 19795 6382 -12936 -6376 6922 1505 -6775 -1656 1370 -5367 -3042 9854
321 9854 6101 -13769 -13739 9496 13433 -10482 -18284 5895 20042 -515 -18554 -4940 12626
334 12626 4081 -9815 -3890 7065 3693 -2085 1495 1400 -6375 -4248 9011 8037 -7862 -9015 9749
349 9749 14247 -6931 -16422 2409 16504 2226 -12101 -1425 11389 4387 -7760 -4471 3392
362 3392 1517 -983 4344 4037 -4390 -4042 6788 6134 -7885 -9400 7445 13739 -2510 -12215 841
377 841 11494 858 -10797 -3428 8486 4916 -3521 -2102 2137 -1131 -2859 2087 2758 -3594 -2955
392 -2955 7117 7232 -5682 -9194 3636 10167 -1050 -8935 1690 11629 3688 -6944 -2658 5312
406 5312 3536 -1415 935 4344 1314 -348 3726 2917 -4424 -3882 5655 7707 -2964 -6563 3220
421 3220 8561 -1146 -9211 -1636 7122 2950 -4609 -1728 3382 1200 -3039 -1445 760 -935 -805
436 -805 3961 3554 -3105 -4270 2954 5219 -2368 -5838 2329 8260 2066 -5556 -1282 4860 2005 -3039
452 -3039 -1082 3210 2286 -170 950 1172 -2018 -2288 2516 3435 -1991 -2934 2963 5603 -1412 -5709
468 -5709 -270 5330 1639 -3374 -455 4221 2245 -1869 -1205 1025 418 -191 2054 2325 -685 -1550
484 -1550 2175 2419 -2724 -4126 1801 5217 421 -3923 -821 3086 391 -3818 -2099 1827 1483 -246
500 -246 -181 600 -849 -1046 1111 1523 -1064 -683 2966 3932 -586 -2990 580 4045 1098 -2100 307
517 307 4012 2778 -792 -884 1020 783 15 839 1227 183 -124 1611 964 -1897 -2763 1036 2775 -461
535 -461 -2505 -7 2821 833 -2809 -1496 1493 1852 -59 -41 914 267 -120 693 -33 -1101 -30
552 -30 2411 2338 -795 -2081 842 2633 -326 -2538 -438 2714 1660 -1287 -1569 143 413 -75 -757
569 -757 -142 68 1015 1292 201 -1770 -1181 1317 1571 -753 -1409 1161 2671 645 -2108 -1202 1403
586 1403 1786 -248 -770 507 1618 631 -493 -1316 -1442 213 1138 273 -1339 -1278 743 1170 -1729 -2816
604 -2816 -427 1950 785 -1301 -1260 652 650 -669 -1649 -978 804 1275 762 -781 -1046 137 859 215
622 215 -1685 -812 1546 2001 -514 -2039 -587 1137 719 -1228 -1623 339 1482 443 -1289 -1737 -543
639 -543 291 229 -1042 -1513 147 1115 263 -1876 -1851 263 1129 -21 -1686 -673 1205 1004 -1017 -2100
657 -2100 -456 969 987 -482 -1025 -436 833 175 -1116 -1685 -588 1443 595 -892 -1724 176 1357
674 1357 -400 -2028 -1022 805 1355 -382 -1554 -752 612 443 -750 -1126 -341 1457 1507 -657 -1624
691 -1624 -421 1008 685 -742 -1133 411 1510 614 -1358 -1567 380 1169 -119 -1506 -705 977 1178
708 1178 -324 -1518 -1037 317 967 -133 -1136 -350 1247 1113 -1086 -1571 -389 1342 1312 -450 -863
725 -863 677 1354 265 -1382 -740 993 1785 697 -863 -385 689 1270 -192 -1289 -479 1431 1909
742 1909 -188 -1218 -195 1241 1043 -964 -1078 302 1796 657 -688 -1225 469 1221 213 -1040
758 -1040 -676 941 1600 412 -1525 -750 698 1257 -129 -1035 -172 1276 1094 -325 -1420 -142 1279
775 1279 829 -369 -999 367 1458 625 -944 -990 391 1395 598 -690 -349 692 795 53 -1248
792 -1248 -660 855 1220 -23 -869 -263 873 785 -557 -1013 -41 1162 877 -763 -912 78 1009 638
810 638 -755 -886 734 1323 598 -722 -685 441 1189 4 -958 -51 1026 1294 -488 -1136 -114 907
828 907 817 -320 -918 108 935 527 -760 -1306 79 968 505 -714 -664 495 1056 199 -934 -651 697
847 697 1054 87 -759 -143 863 961 -351 -993 -163 1213 993 -282 -859 21 964 243 -770 -979 133
866 133 1043 104 -581 -812 415 804 93 -987 -377 896 761 113 -1082 -320 713 861 -344 -619
884 -619 -146 915 595 -488 -843 -93 691 556 -843 -657 185 731 470 -943 -782 308 452 90 -869
903 -869 -607 514 589 -202 -1014 -512 446 491 -179 -513 -93 562 235 -791 -789 -52 733 690 -463 -453 168
924 168 872 129 -720 -550 381 961 -41 -755 -391 64 159 -486 -718 -221 397 674 -252 -743 -161 816
944 816 39 -755 -531 -137 562 124 -595 -717 216 690 257 -712 -217 430 405 -168 -531 -320 372 269 -155
965 -155 -578 45 410 333 -442 -770 -76 522 403 -567 -457 105 548 41 -473 -421 -4 641 -21 -364 -116
986 -116 411 190 -198 -464 -307 520 383 -132 -366 -55 401 9 -154 -365 -134 700 450 -296 -523 60
1006 60 352 132 -688 -218 253 635 -17 -341 -310 35 461 -210 -712 -100 466 155 -27 -623 -64 87 359
1027 359 -223 -325 71 577 233 -488 -198 190 197 278 -182 -155 472 405 120 -507 -453 35 344 -123 -322 13
1049 13 277 107 -207 -377 48 381 376 -52 -246 79 327 257 -360 -245 33 274 -21 -322 -354 106 111 -185
1071 -185 -547 -364 243 528 -261 -495 -204 391 50 52 -174 -46 33 165 -81 -337 318 228 69 -48 -153
1092 -153 -68 461 296 -76 -116 520 213 -15 -178 -63 294 225 -268 -309 -120 228 39 -118 -29 -133 367 186
1114 186 -393 -261 67 249 29 -255 -143 8 147 -260 -591 175 337 233 -138 -181 -135 -17 200 -374 -280
1135 -280 -154 71 230 -20 -144 60 65 137 -241 -145 -30 552 -181 -219 -206 27 182 14 -14 -183 186 96 2
1158 2 -255 1 231 279 -150 -167 82 248 235 -401 -496 22 438 -32 -223 -258 -76 93 56 -110 -28 201 -2
1181 -2 253 -282 -287 28 -100 -126 -262 12 184 242 -106 -178 22 166 89 -32 56 19 231 23 -114 -365 180
1204 180 38 -80 -223 -11 46 -110 15 -28 -87 184 155 -130 -548 24 31 265 -391 -117 20 91 -92 141
1226 141 -91 -96 262 12 -197 -32 11 7 -66 -180 -173 175 107 -114 23 -94 -18 -199 203 31 21 -181 53 -30
1250 -30 274 181 -19 122 15 -83 -78 -169 -106 -18 234 8 82 58 -248 -22 138 170 306 -137 -75 -33 163 7
1274 7 -77 -265 205 -23 -9 -74 225 -83 340 -8 -58 -53 97 73 -162 -120 171 28 152 -235 -122 -19 77 57
1298 57 31 -203 -8 152 56 104 29 1 69 -216 -234 -150 -40 66 -93 -96 14 204 52 -247 37 -179 180 80
1322 80 67 87 54 149 -3 119 -29 18 185 -276 -235 234 -46 213 -211 -54 -69 422 -63 -147 -136 -3 103
1345 103 -46 -122 -12 30 -49 236 -157 -138 24 -141 140 -175 178 0 -16 143 182 228 -27 -107 -137 -121 100
1368 100 168 485 -29 65 137 99 -34 30 -291 -48 85 3 -173 -80 -123 -144 -144 -296 -309 -147 45 81 -263 99
1392 99 -141 30 435 140 -74 49 124 100 167 -66 -124 121 28 -79 -222 22 -166 -5 45 -144 135 -172
1414 -172 168 -38 19 -88 -83 -20 162 -67 130 116 134 51 67 -188 118 -49 71 224 -13 -120 -125 47 254
1437 254 -58 75 163 -140 66 56 34 -129 65 65 -104 -118 111 -81 -156 -266 -274 269 180 49 -68 -84 47 114
1461 114 110 -55 26 210 -110 200 -131 84 132 68 20 -59 -64 -21 75 47 176 -30 -7 362 5 -124 78 -22
1485 -22 -8 -74 -72 -138 119 -22 -188 15 124 185 -152 -147 -171 -211 103 107 -177 -81 211 -87 86 -228 64 -4 217
1510 217 178 5 90 -80 -114 -79 87 -12 38 -60 -278 -56 11 -100 211 -25 71 -77 68 84 -283 -127 59
1533 59 133 -144 3 167 117 -78 43 -159 -6 170 231 55 112 10 32 -24 -57 -95 -262 -28 196 134 32
1556 32 -107 221 166 -12 22 -78 70 -8 -82 -145 114 -5 -146 87 -71 103 -10 -83 119 -215 -3 -22 -99
1579 -99 -78 37 104 194 -78 -173 40 -121 18 -271 -41 -33 -163 -87 -224 168 -48 179 61 -242 81 152 -68
1602 -68 -88 -48 -92 328 94 136 62 171 -249 82 35 95 -339 131 237 -299 27 30 -31 70 -42 291 106 6
1626 6 16 -218 -317 -280 43 -250 90 134 111 -50 -96 -168 -42 74 -116 -295 23 55 -251 -127 -209 -126 163 -207
1650 -207 41 -239 -178 196 -190 148 -159 141 -125 146 95 -89 148 -54 118 -53 129 85 -39 184 62
1671 62 -126 -40 150 -151 46 56 184 -112 -283 -124 -71 -51 -28 -249 -233 -68 -162 73 -84 -120 71 56 -21 57
1695 57 -177 133 141 40 -37 97 -227 72 -230 -257 97 -18 -24 165 -21 -321 -38 -50 -204 85 -114 -23 -133
1718 -133 -76 -270 -170 2 -21 44 -214 280 -71 -62 -69 16 177 238 -205 -388 -104 112 -9 -207 -124 -119 -149 -40
1742 -40 -159 -267 129 9 -106 -197 -156 134 -100 40 -176 -76 219 -124 162 -41 257 -179 44 -49 121
1763 121 20 -151 36 -2 -121 32 7 -2 -41 38 208 -8 177 -114 27 15 166 68 -70 -49 353 50 -51
1786 -51 -74 4 171 62 293 -95 -217 52 61 201 -88 147 -55 97 21 -115 -68 21 34 115 -323 -246 -62 -72
1810 -72 -177 -124 -211 172 19 -223 53 -5 101 -37 -185 113 182 -356 -51 -51 -47 128 -58 -119 123 27 -29 -48
1834 -48 -249 -179 202 179 -114 -81 -148 8 299 -311 -137 67 -71 150 163 -24 64 -92 -29 -69 65 6 -20 -24
1858 -24 118 104 -165 88 387 -292 123 54 17 2 -115 -80 204 -186 68 -27 -142 -115 -207 -59 -6 280 -328
1881 -328 207 256 -2 -131 -313 48 80 -153 -35 135 -7 -44 -69 -41 126 336 -2 7 123 -85 -60 -21 -94
1904 -94 188 -59 195 118 -9 40 71 -29 16 158 24 -67 -34 -60 -187 55 26 21 -154 26 249 183 34 -88
1928 -88 8 -94 -28 -36 -183 100 -59 66 -141 81 30 -22 264 427 230 113 -24 46 -200 76 94 185 -73
1951 -73 216 -17 17 52 28 3 -244 -141 -100 -200 189 160 -53 -72 -153 284 -70 10 217 32 85 227 37 243
1975 243 194 -47 -29 -42 -40 112 107 133 -205 -124 -313 59 80 41 -25 94 -119 186 -81 -104 -209 -196 115 -198 12
2000 12 350 12 111 -26 127 34 32 72 72 -20 27 -102 231 -166 216 -209 -198 -67 79 140 154 -158 39 -6 -46
2025 -46 161 -64 -98 30 -12 -93 265 -124 201 -17 -149 -104 -168 -333 -205 -51 -96 -188 -204 92 -10 -43 5 28
2049 28 -147 -65 125 -209 48 -78 112 34 -90 0 173 -3 -169 288 -42 -122 129 108 -159 -125 96 19 -125
2072 -125 -80 152 94 -75 -37 -41 -66 92 -168 123 56 -224 -75 -75 113 98 229 177 115 -119 94 -146 -62 100
2096 100 -63 -53 350 323 -77 140 -105 -62 -125 -108 -85 -220 -213 -49 157 70 138 119 57 -69 118 76 -37 43 35
2121 35 52 -48 340 -95 213 -81 -138 71 -116 -80 14 -66 -31 172 -80 -119 -27 -137 127 125 -23 -109 -40 -98 -195
2146 -195 -145 -226 -128 105 184 -138 -122 130 76 -20 2 38 31 -182 90 -36 -45 -39 60 362 -149 -196 -349 207 -18 65
2172 65 5 -69 172 -101 51 -44 -51 -23 -66 118 -44 -30 -28 -395 195 -219 -11 175 49 20 182 -155 32 -54
2196 -54 -138 67 -182 74 -365 80 197 81 -35 -96 -226 294 -1 -78 79 91 -33 381 164 20 -123 -58
2218 -58 211 -182 107 99 17 -60 203 130 44 -79 310 35 6 -136 86 -189 43 -114 6 -122 9 -25 139
2241 139 -106 -33 -46 -28 16 76 -30 159 62 -151 7 130 2 -113 85 94 124 -103 53 28 148 152 -84 -40
2265 -40 146 80 -145 47 -5 -24 241 -198 103 -17 47 -38 -122 64 -117 41 -89 -116 -153 -145 -129 -110 97 149 -9
2290 -9 141 166 -120 -250 -26 39 297 -199 19 152 155 -26 -178 139 62 -76 39 35 -123 56 102 -38 44 143
2314 143 78 -221 -228 28 195 254 -52 -158 43 -49 -81 18 147 36 -34 28 -43 15 7 2 46 -62 -142 161 45 154
2340 154 -27 -70 127 -48 92 -15 139 -14 -184 -52 88 85 294 98 -100 31 85 53 -287 39 25 115
2362 115 -178 -229 21 13 228 131 -25 188 158 7 92 -248 -147 113 -39 -155 -26 57 9 136 -72 25 -258
2385 -258 84 10 -135 70 -58 86 -80 211 71 52 274 185 205 -62 -75 -171 -62 -81 -7 -64 -118 -129 147 -82
2409 -82 -38 -88 -221 -61 -189 54 -176 32 -271 219 -351 172 -255 220 4 -113 -116 -40 -9 -198 -298 119
2431 119 101 -90 -297 37 -110 44 -132 -2 -130 -136 92 -27 156 -16 272 -16 -172 75 -149 -133 -40 -81
2453 -81 -27 88 94 10 -73 -153 -72 237 -41 0 -334 -93 186 -172 -123 -8 -80 34 -173 -1 -54 147 44 -28
2477 -28 113 13 78 -63 -235 121 -33 -155 -134 173 85 -25 28 102 -3 3 113 -28 86 109 -20 146 -8
2500 -8 -124 42 94 -39 92 -94 25 8 -205 312 -53 -190 12 245 -175 111 -118 -110 -11 -90 187 -266 -70
2523 -70 75 10 14 17 -115 -82 212 -6 24 95 -21 29 97 92 67 8 61 233 50 123 -1 -7 -9 43 79 134 -150 205
2551 205 63 -72 -87 201 124 -119 -94 -56 -155 2 25 52 -66 -28 13 -70 -32 55 -14 -95 139 92 144 -140 26
2576 26 -24 88 34 100 73 -23 208 56 168 -82 169 -36 222 151 15 152 -129 35 -184 39 47 -88 -43
2599 -43 -187 -4 41 -8 -183 121 98 72 -143 117 107 168 -28 -77 -67 17 -144 -175 7 -26 90 95 24 117 211 -126
2625 -126 -20 67 -48 -258 -62 -238 28 71 -109 233 -224 -7 -1 -130 41 216 -4 204 2 -152 -229 203
2647 203 84 -165 271 -13 200 -49 101 -158 -108 -69 -27 -295 346 178 -41 -60 -16 -166 -102 103 -162 -49
2669 -49 -21 -133 -93 129 214 213 -135 55 91 40 347 69 -34 94 -181 -13 27 105 165 -112 -96 102 110 10 -155
2694 -155 172 82 -225 -198 17 -34 76 -225 26 35 50 26 49 46 -130 64 119 158 34 -151 1 242 397 104
2718 104 -126 102 -74 -89 10 124 125 6 94 61 65 110 -92 89 24 70 -1 -346 -221 121 64 -123 -157 -116 88
2743 88 83 58 -123 -218 25 -60 -189 -76 99 49 2 -12 -101 -135 32 230 -214 40 62 -124 -125 -5 -152 -15 -67
2768 -67 -140 -78 167 -83 110 1 -6 76 108 -103 350 157 -219 61 -102 -87 -57 -86 140 -56 -123 -103 6 20
2792 20 -51 -92 -144 189 99 -323 -21 -127 -106 -25 66 195 135 -86 -61 -54 129 127 237 -83 251 185 119 14 143
2817 143 -86 -177 103 31 39 -182 98 75 54 56 49 -125 17 88 -90 -283 -220 197 -68 -59 52 -227 48 90 -107
2842 -107 -104 57 -213 225 -50 -225 46 137 54 -222 -226 -143 -44 133 -133 206 -127 3 -13 126 -95 34 -44
2865 -44 233 133 89 163 -100 263 -12 -63 41 349 39 119 201 43 -37 -115 180 -23 65 11 264 240 56 -150
2889 -150 -208 -55 99 -75 4 7 -94 88 382 225 -33 110 -3 46 35 202 23 41 67 116 202 70 -150
2912 -150 95 -3 64 210 96 -128 157 98 156 305 113 -74 101 140 37 218 -77 -129 -110 4 -52 -210 23
2935 23 -111 -90 353 -71 103 -99 11 -94 -174 212 -146 17 -336 232 192 -2 26 102 30 -114 224 200 73
2958 73 67 268 -3 17 131 -48 43 53 112 16 177 65 -103 -48 -60 -223 73 -48 162 321 -161 73 57 -53
2982 -53 24 -67 58 -54 104 -26 -179 -91 101 151 87 298 81 -157 78 107 -10 -57 -103 -55 -159 194 260 3
3006 3 29 -365 51 -71 -120 191 -53 100 -73 -55 52 27 28 -141 27 30 -50 -102 128 109 167 115 298 -340 22
3031 22 139 136 66 -192 -175 216 -167 -79 -171 -19 -4 -59 -140 -69 62 242 -77 29 -201 -1 136 -13 -166 -27
3055 -27 220 -264 239 -12 199 158 -55 84 -67 9 -224 161 6 101 -274 -37 153 -142 172 -110 72
3076 72 -208 258 35 -165 -121 186 -56 -57 -40 193 63 21 -40 -87 -118 -68 51 7 83 -136 -33 316 27 53
3100 53 19 -51 65 -1 -230 -124 -95 -179 -11 -21 128 -9 -35 116 -181 121 -169 -44 40 -26 -188 -238 56 -143
3124 -143 -25 -61 55 85 65 -14 187 144 -230 -33 -114 -195 -30 -130 394 101 -92 65 -120 158 113 168 169 -137
3148 -137 38 -24 116 -317 98 19 -475 -152 37 115 -286 -71 -85 171 -192 -241 79 8 48 138 56 -109 69
3171 69 141 -2 -21 201 128 -248 -298 160 -166 -173 -24 -50 131 -173 79 239 48 60 -96 179 -52 16 11 28
3195 28 127 -22 194 91 -364 109 -161 -96 358 -223 -296 -157 53 -102 -170 63 55 140 -82 -179 -44 153 -47
3218 -47 16 -42 -209 86 36 -92 89 -167 16 -28 -88 101 -199 -63 100 179 -304 63 -27 286 182 -95 -49
3241 -49 -123 -43 100 58 10 55 5 -28 58 40 -40 15 30 -91 128 -6 -82 232 84 70 181 303 -148 -70 76
3266 76 88 -6 -71 11 -42 49 -88 28 45 59 -170 -187 327 21 261 137 48 88 32 -64 9 236 -62 -26 -352
3291 -352 -21 -173 -66 16 -190 44 -185 -183 135 -178 -189 66 -195 -215 -92 -133 -18 117 -60 165 -123 67
3313 67 131 -10 36 -151 243 -16 23 46 -29 -139 282 165 -276 -320 277 -46 -22 -262 -3 38 139 -13 86
3336 86 86 52 -144 -178 -89 42 57 -152 -74 -45 101 -138 45 59 -32 -168 -90 -44 -86 -77 22 -207 -81 -87 -44 94 -59
3363 -59 115 110 -179 161 -171 41 -5 -77 38 104 -60 118 73 144 32 -206 -34 276 226 94 -74 36 292
3386 292 172 -123 -271 -80 -10 -20 -101 72 92 -211 -77 34 24 22 -2 94 -155 329 -88 9 -226 63 72 -3
3410 -3 148 -298 100 -141 92 133 89 -83 -76 138 195 154 30 -69 -279 212 91 -4 7 -267 -112 -27 54 9 -113
3435 -113 210 -9 -6 20 26 20 -160 -181 -65 -230 3 11 164 -74 -207 -5 57 -274 327 -70 125 -16 -77 -89
3459 -89 -4 95 -49 130 19 280 119 100 305 -121 -277 144 -225 133 304 -210 -111 -316 -110 -52 -7 -173
3481 -173 60 -51 321 31 117 -194 -136 -182 -153 -82 60 -141 213 151 -64 80 -134 -163 116 61 163 -201 -404
3504 -404 77 -146 55 16 23 48 -75 107 -96 -74 79 -183 115 -289 -67 194 155 -119 -196 -120 63 220 -90
3527 -90 7 -183 -185 -39 -123 -76 119 165 -9 -18 83 97 16 94 -49 -29 14 -90 -83 255 -19 132 135 277 -260 12
3553 12 83 -93 17 278 57 -76 124 52 95 106 -28 307 154 -4 221 96 151 -89 -5 145 108 198 -108
3576 -108 -183 4 170 -19 -337 44 155 -237 -137 235 -165 -149 97 -29 -142 -1 56 -179 167 -45 -96
3597 -96 111 -154 -151 157 -67 -69 366 -4 -148 -176 -215 -21 262 -36 -236 59 6 96 109 -24 -123 154 -158 42
3621 42 -113 -2 -88 -47 95 -42 -131 73 198 -147 80 43 316 6 92 198 -250 21 -76 136 7 -10 120
3644 120 -81 97 -62 -39 -170 226 28 -160 -116 -72 258 68 166 -95 6 -61 15 -106 -35 -13 -100 -108 -179 -52
3668 -52 18 136 -8 136 -209 -70 -71 -37 196 -149 198 243 181 -59 140 111 -29 -184 -80 -66 12 -98 -264
3691 -264 172 146 159 -115 -42 310 -112 41 97 43 -131 149 23 48 343 -252 16 99 -135 3 11 55 297
3714 297 79 -142 182 -29 -106 71 75 97 481 103 53 -18 -284 199 -64 -199 -220 123 179 -52 30 107 51 -277
3738 -277 307 36 103 -124 -170 63 -113 -60 56 102 344 239 44 158 130 140 -169 11 39 -258 -16 315
3760 315 6 -33 -104 139 30 64 24 -44 -97 210 93 86 -206 -280 -67 80 -148 -90 24 99 -216 98 155 -61
3784 -61 -66 298 195 67 119 261 -11 160 8 166 67 -239 -23 -288 110 -121 113 -57 -82 87 237 80
3806 80 -7 264 -3 -61 53 225 133 -144 117 57 -99 -18 -48 73 -78 -85 -47 38 -36 89 36 -37 65 -459 131
3831 131 -153 80 99 91 -67 241 32 218 -221 -29 79 42 129 -230 -66 -58 131 -1 89 -89 -60 -90 8 268
3855 268 149 -24 -294 -33 -136 45 134 -41 -5 -209 126 -169 322 164 -43 77 -174 82 95 246 144
3876 144 -31 101 90 5 -74 -29 -36 -84 167 -163 -99 -123 26 -99 -116 -129 63 -172 236 181 47 -317 -205 -68
3900 -68 76 76 -107 -364 -55 -59 -6 66 132 -81 -117 126 -182 24 -48 -25 -298 -163 194 78 -36 42 3 -155
3924 -155 -22 174 146 -316 86 -95 59 206 -248 47 49 -126 -98 -90 -411 102 4 17 20 140 91 -129 81 256
3948 256 192 -51 106 -50 -89 35 -158 -49 -107 298 -120 203 185 157 19 -6 11 77 180 248 -223 96 80
3971 80 229 215 21 3 125 -92 29 505 -110 -13 17 16 34 -305 122 -71 56 83 -24 -45 -370 89 124 -105
3995 -105 -8 111 55 -173 -200 -82 -72 -58 -179 107 30 -5 68 -37 178 -113 231 95 -58 -91 62 34 139
4018 139 32 -28 -80 215 -162 -11 -65 -179 -202 -38 -57 -38 -195 297 145 -166 133 144 106 13 21 -92 -2 63
4042 63 -44 -68 141 17 -64 1 63 175 -28 87 -332 -61 78 372 87 -60 -49 27 187 27 62 313 19
4065 19 37 98 -61 46 -11 129 222 -9 -48 139 -299 43 12 32 -76 260 -30 -34 84 -1 127 90 -16 27
4089 27 -84 69 -49 227 177 -2 -2 -90 50 29 137 -51 20 311 -79 203 38 10 79 -112 -102 -103 36 -310
4113 -310 82 40 -64 194 -139 -1 -63 24 -36 149 -95 47 -77 168 -161 208 -49 -251 148 43 -108
4134 -108 -234 -33 59 -26 -173 24 -62 -30 -228 -361 -259 -41 -63 -85 -23 240 -223 5 67 -252 60 -75 140
4157 140 146 -51 57 -240 -199 280 399 -20 10 -68 92 45 206 63 11 235 -131 320 -101 12 68 -135 41
4180 41 17 -8 82 -106 -25 133 -160 -151 -202 316 56 -186 -66 211 -209 -280 26 20 -276 -2 87 -63 111 -101
4204 -101 227 -131 -248 -17 124 63 160 -201 39 -285 -91 202 -124 -196 18 -148 -219 3 55 -83 294 -15
4226 -15 -27 62 14 -25 35 134 -73 -96 -168 204 -205 -33 -98 -18 -21 38 -3 258 156 0 232 -33 164 -127 -145
4251 -145 130 125 -59 -183 -175 99 188 -197 202 91 19 258 -183 73 -285 248 -14 -227 -3 -212 27 -138
4273 -138 -131 -180 143 45 -154 -52 -111 -112 -90 72 44 49 -167 -15 33 146 -206 -127 70 -176 18 -254 -167 107 -60
4298 -60 -88 -94 -67 -7 258 -115 246 -191 17 22 -221 199 118 17 10 83 -105 16 -87 -95 33 192 22 125 290
4323 290 -177 49 -82 -266 -134 59 87 -123 -66 38 261 -75 90 157 94 -72 -108 30 -132 234 -269 292
4345 292 104 46 33 -38 212 -77 156 104 -303 -106 130 -75 -287 111 133 58 157 -9 -119 26 -21 4 -246
4368 -246 -127 299 33 12 -68 212 -72 15 -153 -138 43 -136 10 -58 -2 372 -263 -21 116 -66 -140 219
4390 219 367 104 47 59 -148 60 -21 -262 309 -94 52 61 60 -227 -171 -312 -7 103 276 -179 14 350 -176
4413 -176 -329 108 10 -121 2 -159 125 24 112 45 83 134 34 164 38 110 -27 37 151 148 -86 18 8
4436 8 292 84 48 -174 164 -131 -36 42 91 195 152 24 -203 233 29 -155 -210 24 -57 -20 135 -95 20
4459 20 -55 -216 68 64 61 -150 167 208 -93 -19 -189 -312 -59 53 -7 50 171 -22 -189 181 -275 -255 -117 -244
4483 -244 -185 -156 -97 13 59 176 117 -25 -39 9 -4 -1 -5 54 -56 -252 -6 123 -213 -46 90 63 93 -199 0
4508 0 30 207 101 -139 128 -89 92 161 99 -99 -101 -133 -111 -110 -124 -31 -307 43 -226 -138 25 -187 -23 -145 -9
4533 -9 -166 -173 -122 -24 10 -54 -148 -189 26 -129 -110 -58 -128 35 -35 -225 -4 -59 -33 55 66 -7 -122 84 -72 -156 -58
4560 -58 -143 97 48 85 -304 -23 -94 -57 130 87 -169 -168 -93 242 -114 42 145 19 -123 90 -42 -2 -143 215
4584 215 167 -19 -81 115 -159 324 127 9 39 136 73 -173 96 260 -111 -43 -41 -110 -214 -323 -66 -297 178
4607 178 53 -99 -73 126 15 -80 161 78 17 77 332 134 24 -54 -282 -145 34 -4 213 -172 116 21 -30
4630 -30 -118 -34 15 67 65 61 -48 3 1 221 28 -291 150 108 333 44 149 116 -50 220 6 -33 28 33 -322 7
4656 7 240 -64 -51 -148 36 141 -121 72 185 -23 -77 -124 -9 183 -95 109 -25 -192 -45 -256 -200 189
4678 189 121 -153 -164 -46 -33 -147 -22 24 -72 -8 141 -64 4 12 -1 92 -73 86 51 -56 254 -149 -127 -136 126
4703 126 -81 12 63 -151 -91 -56 -39 181 19 83 32 42 -49 -117 291 -249 151 -153 48 84 -148 -99 -198 -53
4727 -53 56 -81 -29 118 -126 -239 -221 -106 22 163 -7 44 -70 152 115 -26 -45 -9 -25 -63 -58 -154 -14 -24
4751 -24 223 180 17 -11 109 110 -143 24 121 -90 21 -109 3 -9 -76 44 131 -134 50 331 14 -75 -69 -188
4775 -188 -151 -67 114 10 185 181 -71 22 -184 63 -61 121 -125 30 65 -125 -134 86 85 121 148 213 -87 -245
4799 -245 307 153 -165 64 -104 35 -105 39 11 94 0 -163 -113 76 -74 -384 -107 48 6 -214 73 -97
4821 -97 161 -469 125 231 239 24 118 127 3 -37 -96 -28 13 262 313 156 196 -45 -25 60 -227 -159 -59 43 -185
4846 -185 -233 -59 166 46 -69 -18 136 -126 -181 13 170 12 -146 -224 150 -192 -304 -102 96 80 -2 174
4868 174 36 29 -9 265 -135 -10 -189 -43 -199 330 116 126 -87 -384 80 -25 -53 194 -40 -19 -168 -75
4890 -75 48 -39 61 -98 -21 -187 -64 -52 33 50 -391 -116 -116 79 96 -1 10 -81 63 -6 74 -195 -12 327 -35
4915 -35 35 77 -54 114 126 -15 182 59 -150 164 -41 23 -20 -97 52 -128 -7 -25 50 -205 123 259 -180
4938 -180 -17 241 123 -72 -46 288 -94 101 180 75 93 -145 -130 124 -52 -39 -53 -6 -120 13 0 42 58
4961 58 12 222 -245 26 51 -103 -292 -136 36 -142 -322 145 -207 56 -263 -93 -77 135 153 0 181 28
4983 28 -9 -203 -79 54 0 -32 -82 -24 155 -106 -126 208 18 179 36 43 -52 130 -196 116 101 121 330 83
5007 83 240 73 -70 12 -20 -15 -5 -41 384 193 -228 -100 22 -202 18 -272 -139 -256 -75 212 -104 -74 169
5030 169 3 50 -176 -10 11 -118 101 103 -20 -7 158 223 205 113 35 8 -278 45 -188 15 12 -164 20 -9
5054 -9 80 88 -4 52 25 -139 201 -135 -93 -172 1 -43 -55 -133 244 -337 -52 -208 153 113 4 184 -143 50 -45
5079 -45 -361 -74 -83 239 -128 -403 -291 -196 -126 -80 -164 27 219 -32 9 -322 256 -65 -109 -74 297 117 127 79
5103 79 -37 54 18 63 90 221 137 -64 -87 -85 -102 -70 -126 -412 -179 128 -6 5 47 -29 -167 -46 -156 65 -103
5128 -103 -106 -10 125 -286 79 -110 -101 58 -135 -9 0 -44 170 74 -35 58 198 113 60 -171 6 -44 98 -54
5152 -54 116 -269 -36 145 -169 -58 18 75 102 57 -99 -58 -44 108 151 -5 132 6 -86 -12 91 -58 64
5175 64 -31 -172 -161 -46 -36 -137 168 -170 -270 7 -160 110 -62 -185 59 107 251 -49 94 26 54 12 -113
5198 -113 194 -25 -223 199 95 -54 -124 220 68 65 12 -163 -145 -327 -213 18 -47 -10 55 15 57 -93 -55 39
5222 39 -52 30 161 -14 -93 -26 -122 -202 -128 68 -61 81 115 168 13 -188 211 -168 195 -12 50 -231 -150 -213
5246 -213 -231 270 117 -175 39 83 1 42 -218 -69 159 -314 1 -151 -91 -44 -166 -217 46 73 -314 -46 -73
5269 -73 132 99 -104 -74 14 56 179 100 -29 5 -101 88 200 45 161 235 58 66 -257 -61 -118 -7 83 -25
5293 -25 77 -227 88 -129 207 130 88 -7 23 178 84 78 -33 -431 -124 75 -168 149 88 103 -59 -198 -27
5316 -27 21 -18 -239 -94 45 200 258 152 -77 -42 293 122 146 -196 -170 87 -183 -126 256 -321 14 74 -5
5339 -5 -90 -157 268 -173 10 19 30 -131 -190 -16 -79 -33 6 142 7 -229 79 30 40 -110 -237 -68 -140 7 -116
5364 -116 133 32 -136 -128 85 0 127 23 123 19 -216 45 16 299 210 -192 281 158 -45 17 109 -89
5386 -89 54 -161 -103 -51 -179 -23 -150 -181 -119 -3 371 72 -81 -37 99 74 -260 -18 -188 167 -158 63
5408 63 130 88 73 -119 163 -174 20 114 -27 230 198 -28 15 218 167 217 -19 112 -50 -7 29 44 -71 -281
5432 -281 -40 49 7 -29 -121 124 47 72 -41 158 15 -121 -111 76 36 76 -186 -310 102 214 -74 210 72
5455 72 79 -25 -15 52 -130 332 89 128 -190 -32 28 236 -189 59 53 -19 -125 29 244 -211 131 194 105 15
5479 15 -9 13 96 -42 49 -80 -186 171 -49 94 22 174 -358 -122 46 25 -81 150 168 -86 -49 29 67 10
5503 10 -106 -146 132 -112 -188 102 -75 -116 -29 85 -61 36 -149 -94 -176 32 -73 -335 8 204 88 -273 86
5526 86 -211 -1 35 -55 83 -82 -175 59 27 99 -170 -58 99 -91 -170 16 373 -150 -111 45 -134 -316 14
5549 14 9 169 80 3 75 -275 55 40 -80 8 -159 -198 -9 -160 10 -35 69 -73 137 -64 118 -251 66
5572 66 -91 163 47 64 -14 8 94 -202 -140 287 -168 115 67 33 3 -173 179 130 4 148 138 -168 -37 -120
5596 -120 41 125 29 57 124 59 -40 411 318 42 139 -117 -137 -188 39 50 -59 -228 66 184 -133 -179 183 -21
5620 -21 -8 10 -156 -17 50 92 94 -93 265 15 -37 115 -197 71 -35 -235 -28 -233 -190 114 315 -181 38
5643 38 -169 -24 17 -86 205 220 97 -47 55 133 215 -65 -7 200 12 -33 -52 -244 -41 34 275 40 61
5666 61 51 -97 -1 -127 42 -29 -2 -189 -36 -162 -320 82 -139 101 -109 -123 151 -12 -239 118 -43 -165
5688 -165 -125 24 137 -45 -14 -73 -160 113 -170 21 89 -19 -33 96 -175 172 -103 78 -72 -99 -131 -79 70
5711 70 -319 -76 18 -119 -241 179 -106 -172 -74 158 -126 149 -184 -3 168 -64 -75 250 37 76 -47 -48 -103
5734 -103 229 -158 -190 14 388 161 45 -35 -55 3 -12 126 -155 333 -198 -101 68 -14 140 307 146 68 0
5757 0 -168 75 0 -58 -59 -106 -196 -4 -117 34 -56 35 20 -138 10 -430 -159 15 69 -331 163 149 -147 -184 6
5782 6 184 256 115 -134 89 55 -178 -240 51 -142 -22 64 -104 -51 -63 69 -60 107 -100 155 32 120 -76
5805 -76 67 -94 86 90 -192 -71 -24 147 -2 -249 -61 -150 -84 -37 -124 -317 5 28 60 -150 12 -7 228 -123
5829 -123 23 -165 -46 -134 52 -228 223 -55 -71 167 135 -134 -251 139 -21 -202 23 220 -11 33 -132
5850 -132 -153 -75 -260 193 -111 -81 118 -66 -85 6 91 -333 108 -45 13 -73 -145 67 -4 355 109 4 263
5873 263 -231 -1 153 -72 82 213 38 -140 288 159 -180 -197 112 -70 -36 -25 -258 -129 -245 -310 25
5894 25 -118 -77 193 85 85 -73 230 55 36 95 -152 9 -111 151 52 -116 -84 -60 -162 -347 -3 -81 -154 -117
5918 -117 -350 17 -118 -1 18 226 -139 101 13 -32 243 182 -53 279 91 245 142 315 82 10 316 -144
5940 -144 -215 55 183 -124 186 229 59 -61 111 -420 161 -4 26 -185 35 -223 26 -53 -61 149 3 71
5962 71 42 -92 -108 75 23 -124 -12 51 113 -144 343 107 -67 201 -78 213 -42 -95 107 91 -25 173 187
5985 187 -159 45 96 -32 236 -290 -26 -254 -132 12 -85 110 -41 -154 -16 96 -81 140 -47 222 -72
6006 -72 181 -146 -101 -241 -7 -49 -5 30 -45 109 -75 132 -108 104 28 -125 -340 -140 310 174 59 127 -283
6029 -283 -195 26 -80 -130 14 81 -138 122 111 -7 159 130 240 -158 -113 -105 240 -116 131 222 133 -72 173
6052 173 -178 12 17 21 -51 -72 -39 -153 -51 -9 199 100 114 -209 -111 70 20 145 -176 19 157 40 285 55
6076 55 87 -144 -2 -28 125 99 -154 -190 -287 -245 8 38 116 68 -25 173 -135 31 21 155 -113 84 -209 -100
6100 -100 -105 10 -361 50 -82 107 -13 277 157 89 -109 224 209 -191 184 6 -124 -25 -204 65 1 -266
6122 -266 -6 -72 258 23 53 -255 182 71 -45 -49 19 -154 -10 -9 -86 -90 -13 -129 -443 -65 -18 398 -20 -106
6146 -106 -104 224 -100 -14 123 -124 -30 179 -3 -37 83 -214 36 65 -72 86 24 -18 149 -39 -66 115 184
6169 184 31 -60 107 -39 1 18 29 -207 -120 32 41 290 -155 14 -19 -160 73 -138 47 -207 -103 -64 141
6192 141 -87 41 12 39 -130 102 18 -98 -158 109 140 -192 68 -53 -199 6 -7 1 147 61 43 178 -113
6215 -113 11 186 167 -49 27 16 -100 -124 -25 169 -89 -99 181 -96 -61 -153 -106 127 -588 149 5 -340 -36
6238 -36 -61 176 45 -9 97 -35 110 141 30 204 -170 13 71 175 238 26 -207 79 14 28 73 139 18
6261 18 40 41 26 -185 -149 -149 -131 106 55 3 -87 267 -262 179 0 259 4 -34 -240 219 203 -13 -4 -166 213
6286 213 32 -207 86 -43 -66 40 -202 179 -103 37 -63 55 74 -22 245 -99 -79 130 -113 -425 187
6307 187 87 152 291 244 -159 -189 -38 -16 77 240 151 26 -26 -64 -66 -189 -195 10 -41 -79 -1 25 7 260 -174 -34
6333 -34 -133 159 10 -51 215 148 4 61 145 -185 43 -84 -30 -156 -80 67 2 -141 -124 -137 131 15 105 16
6357 16 -148 -76 184 172 -198 -51 50 -41 -87 -138 -90 -103 -204 -21 -124 -97 177 -107 130 27 -182 -119 -102 -183
6381 -183 1 96 133 -138 -28 214 42 117 -70 62 29 -56 211 -117 -110 274 117 14 -163 81 201 -43
6403 -43 -149 -1 78 34 -240 94 -26 243 -272 224 38 -121 -15 198 -70 -5 -99 -240 210 10 -156 -140
6425 -140 92 -157 411 -72 -170 -66 65 -54 210 116 -162 -32 -137 -129 -167 -58 19 128 129 83 47 75 110 10
6449 10 -3 128 -32 111 105 -47 -328 6 -37 -285 91 -11 -30 -65 0 -138 76 207 -150 -110 229 122 186
6472 186 -211 117 127 13 60 149 -253 52 -57 -335 -45 208 -47 -73 -120 -250 76 58 122 -9 -24 -132 27
6495 27 91 121 -38 0 60 -73 -92 -70 -63 -285 -34 -86 -8 -138 -117 158 -149 -95 144 -217 -194 -70 -71 -16 -12 96
6521 96 154 -9 29 -189 32 -40 -33 28 -81 188 98 -185 33 -175 -137 -86 16 -56 15 94 -14 170 -76 -79 -218
6546 -218 -36 -44 -172 -141 -271 -15 -230 9 349 248 105 17 183 -175 -124 -5 -88 -10 257 -238 -48 -173
6568 -173 -147 463 615 13 -224 -84 -12 -39 -170 97 -1 -6 36 6 -145 -60 47 23 -161 157 161 332 36 36 -263
6593 -263 -207 -192 -242 -265 88 131 115 16 -58 -27 -36 -101 40 77 78 -13 -15 40 39 178 13 -261 119 27 -9 -55 103 -100
6621 -100 -282 -4 -17 69 91 42 -105 -269 -16 -131 2 -44 -44 -75 -20 -106 -314 -11 2 128 275 -336 263 -132
6645 -132 -50 -121 -138 25 -139 46 -179 60 88 176 173 -244 -54 113 78 -87 56 78 -166 6 -114 102 5
6668 5 219 -69 4 -55 -1 37 240 -110 -225 193 -8 -46 110 -229 -26 -164 35 78 106 128 119 -49 15 66 -49
6693 -49 -54 -269 -133 -114 -68 7 101 -162 -18 62 -1 119 -268 281 -158 -216 226 25 78 116 -27 98 91 243 -109
6718 -109 -57 166 -226 -199 31 -183 -114 172 -70 63 57 -115 -91 1 -222 -36 -69 -16 28 225 4 320 -7
6741 -7 86 -65 6 -52 -222 -152 -278 -110 55 4 56 178 -121 -12 4 -130 52 32 -1 -34 170 122 -38 -65 125
6766 125 182 -127 82 -220 -84 -34 104 -80 -259 27 -115 61 54 -70 -228 -107 -65 212 -199 -142 -166 188
6788 188 77 -131 -180 39 39 34 -35 -51 255 -75 -202 168 343 165 -231 -131 -245 219 -195 -253 83 -29 -86
6811 -86 -208 251 -3 60 -126 1 5 46 29 -217 -205 63 -65 -167 -30 21 -190 129 74 -242 4 90 75 98
6835 98 -8 -37 53 0 -77 -97 -21 96 -145 224 -65 134 92 171 -47 8 43 -65 -17 -91 -146 -134 -54 -162 8
6860 8 -59 96 114 -209 -107 83 235 -43 275 -185 -92 101 -14 -163 -49 -79 -329 180 -59 338 63 -231
6882 -231 -78 -9 71 -89 -111 14 95 130 -164 -123 98 64 330 20 167 -137 73 104 -124 -13 86 -43 97
6905 97 -160 -119 69 114 -73 -135 -268 88 -8 -110 24 -118 -75 52 -67 25 188 173 45 -106 193 117 225
6928 225 -106 4 -118 294 17 34 310 -254 277 -133 -48 96 -27 -156 -202 22 27 -188 -118 -63 111 -42
6950 -42 -28 -20 -122 -27 -23 -163 -17 -107 189 -60 105 68 -8 58 -17 61 -190 69 280 147 -15 148 -193 336
6974 336 -23 61 21 183 146 -46 73 -2 -87 184 -40 17 53 74 -135 22 247 -66 -177 120 93 93 103 -33
6998 -33 -104 -132 -45 -256 -140 112 50 -9 -99 141 130 147 -91 -98 122 107 -50 57 28 -40 62 -191 -384 30 345
7023 345 -115 -37 -115 65 -69 18 -74 165 -14 -196 159 -82 -20 -32 32 -189 365 187 -122 -259 -54 -95 -210
7046 -210 -42 132 73 131 -132 -103 -199 -201 -152 -109 45 115 34 158 -323 104 -51 -2 -14 2 21 -121 -5 -65 -69 -182
7072 -182 40 263 101 -86 -244 192 -149 -121 -22 128 342 132 38 188 220 -152 50 -70 158 84 113 158
7094 158 -121 27 -253 -63 -232 -153 -32 121 47 202 -93 -215 -90 -128 -18 -170 27 -108 -238 111 299
7115 299 -129 257 86 53 -7 21 129 164 -197 -80 -13 158 -24 -128 49 -185 195 -18 64 0 -41 -120 249
7138 249 293 -199 138 -103 -104 66 102 14 -269 -63 -181 -107 4 -45 21 -78 100 31 14 17 -97 28 -274 -248 -73
7163 -73 -163 -37 -71 -145 241 -141 82 87 -169 27 4 119 -142 257 -54 24 232 -58 -29 -88 103 97 -84 -44
7187 -44 83 82 -292 2 202 96 -183 145 135 -39 -130 -163 -97 103 -206 -36 38 -309 -227 54 293 -44 -96
7210 -96 -6 -133 -157 -104 -145 -115 4 -165 217 -194 125 141 207 -16 -14 -72 93 -270 321 -259 -188 258 -224 293
7234 293 130 -70 -178 -40 -78 -120 49 -9 -44 -43 34 11 -101 27 99 27 -158 -234 184 -85 39 109 71 139 133
7259 133 -85 81 -55 -200 -157 56 173 -122 90 -65 -66 195 -82 -78 -16 -276 -75 -70 34 -96 -53 -45 114 146
7283 146 158 13 -241 3 -69 -13 324 136 4 -81 112 -102 -180 -81 -55 -76 3 -113 55 -120 85 -153 65
7306 65 64 145 -91 51 -141 39 142 58 67 48 -144 -15 87 -115 -157 86 154 -246 80 -38 -14 29 -162 79
7330 79 -136 48 -8 -106 104 -80 -183 -170 -25 216 87 -3 -129 -162 -124 82 49 47 -313 39 -30 62 137 245
7354 245 48 -309 -54 90 -115 -163 15 -16 -96 210 63 -5 215 -31 -70 -250 -155 87 102 -6 89 101 74
7377 74 -119 -6 -173 -52 63 -41 -64 221 -69 -229 201 51 237 -107 -142 -71 4 -16 288 -16 282 46
7399 46 -192 21 -15 -18 40 51 67 102 -33 268 -13 144 -282 111 32 74 61 181 -124 -168 -56 362 23 -21
7423 -21 -6 -1 154 8 -82 9 -6 8 -119 -159 15 67 183 245 66 -292 4 12 58 -199 182 125 32 41 88 -70
7449 -70 -38 135 -243 52 173 175 83 21 -264 167 -15 -96 37 -125 110 -1 -31 -219 112 -77 -285 -4 -10
7472 -10 -125 75 245 -46 -25 139 76 -49 85 -34 -30 46 -31 34 14 -182 151 95 10 -137 -218 30 87 -8 177
7497 177 -33 100 -210 11 -209 -159 -105 130 173 -60 67 84 -190 20 -182 -3 262 -32 -30 100 206 232
7519 232 99 71 38 -11 -146 230 -4 -198 106 76 -1 -8 -146 14 -152 42 25 109 262 65 42 -15 76 33
7543 33 114 224 -128 -86 109 0 35 -28 31 -101 -2 142 -90 -23 85 17 -163 -36 46 -267 108 -79 97
7566 97 -101 12 44 -260 -63 -202 114 69 -83 -166 -2 60 -106 164 136 -138 51 153 136 320 -105 -22 -257
7589 -257 -36 -164 -133 -171 -29 -63 -7 166 250 -8 87 -168 -170 -175 174 38 -166 -156 -202 26 -71 -43 169 -147 20
7614 20 157 5 -10 44 31 50 93 -195 233 -132 -316 207 13 -150 -227 146 -194 -26 -219 -111 -278 -219 -272
7637 -272 27 -68 -55 233 -12 -127 -157 83 96 -29 10 -29 26 142 -51 -124 -57 133 -39 -21 -23 -134 -12 -98
7661 -98 -45 14 -44 11 -84 2 -97 273 -44 125 -177 105 -89 139 70 101 -116 -116 158 -134 40 4 -173 60
7685 60 -78 -12 117 197 40 44 184 -16 265 -24 50 -13 17 -113 43 -206 157 -45 -39 -63 60 179 -96 27
7709 27 -79 -79 7 50 138 -143 147 152 68 54 -30 -13 -98 39 41 -112 130 6 -45 -144 -41 233 -39 61 43 -110
7735 -110 145 60 41 -73 139 73 58 74 -32 -32 186 -135 233 -11 -31 -33 -5 111 -226 -134 -15 85 -100 301
7759 301 -257 -79 -66 81 -270 137 -71 52 -137 69 -88 -16 -121 255 -37 -61 89 74 124 46 11 -298
7781 -298 257 -127 -117 -49 12 114 130 -56 -85 -150 215 48 179 -33 34 -26 -76 -27 8 311 -17 -113 -180 29
7805 29 300 205 -1 -145 -74 16 -271 -20 -25 153 12 -117 -27 -114 -91 -167 146 18 217 -163 213 -184 41
7828 41 188 -78 105 -38 72 14 -111 -21 185 -65 228 -4 -66 29 -66 102 -101 1 -91 -394 -135 -74 -78
7851 -78 -127 85 68 54 39 241 92 -39 -7 4 16 -117 -145 70 47 165 -2 -135 135 84 173 -10 43 -253
7875 -253 83 -121 -199 96 -107 93 121 30 -13 36 83 131 -39 234 60 -164 81 -255 -239 163 -182 -154 274
7898 274 -111 40 0 -160 -212 -11 -185 -119 29 -75 -261 191 -102 -63 191 -6 119 -35 11 0 -112 9
7920 9 116 65 -69 -39 70 216 188 234 -106 -7 -235 -247 -57 -112 -282 -3 34 79 -1 -249 -54 -193 0 100
7944 100 252 58 77 63 154 -82 -75 56 -64 187 94 -92 6 56 165 66 94 198 -209 -102 120 183 -51 33
7968 33 -82 105 -53 23 119 130 58 -244 -150 -107 -72 -4 -96 -85 -23 52 -58 -334 190 -243 -158 -71 7 -365 131
7993 131 -1 110 -222 -59 -127 51 193 72 -159 24 87 -181 -187 -96 116 68 240 -90 139 -107 -261 -49
8015 -49 -59 -137 117 -86 292 61 -122 57 211 -167 -56 164 30 -138 -90 113 70 -23 -59 238 -101 -13 62
8038 62 -17 -21 -75 1 167 -32 -178 207 139 142 227 210 229 58 -106 -98 174 -133 171 -76 -169 261 -43 -55 -187
8063 -187 145 359 126 -7 -101 23 -206 74 52 146 106 -83 161 171 -19 -95 136 -37 -69 18 -10 80 -120
8086 -120 -378 45 122 -204 18 265 -187 -79 -59 135 -96 185 -50 100 -47 -99 129 222 11 97 155 66
8108 66 107 31 160 -75 -174 40 -55 148 -141 -150 -58 -95 -56 -236 28 -47 -131 287 9 112 -91 54 209 80
8132 80 41 94 -18 176 -121 41 171 153 188 -79 21 -281 -193 26 -109 -62 -203 -121 -43 106 209 -54 -81
8155 -81 112 10 11 307 220 -134 -213 121 164 -24 -101 -165 -13 -87 -41 82 -20 -76 64 48 -68 -208 -38 81
8179 81 -9 -271 -374 73 -199 -71 23 257 -85 -64 23 -162
8191a62
$$ Imaginary data points
##PAGE= N=2
##DATA TABLE= (X++(I..I)), XYDATA
0 0 0 0 0 0 0 0 0 0 0 0 0 0 0 0 1 -6 8 -8 8 -8 10 -16 16 -18 24 -25 32 -34 41 -44 51 -58 66 -76 85 -95 109
37 109 -120 135 -148 165 -185 206 -226 250 -276 305 -336 370 -408 448 -495 545 -602 666 -737
56 -737 821 -916 1028 -1161 1319 -1519 1775 -2109 2582 -3286 4457 -6742 12879 -65741 -159419
71 -159419 20711 103217 -15928 -114068 -17500 69652 14709 -60717 -28415 4285 -19931 -15317
83 -15317 34871 5154 -70041 -33809 70301 32187 -103666 -91167 65260 89654 -60518
94 -60518 -118291 10591 84041 -21531 -107286 -34101 45408 7221 -44497 -20073 -3343 -33487
106 -33487 -25605 17635 -8547 -71947 -34852 63096 38943 -84249 -87429 41899 70861 -52854
118 -52854 -102332 8958 79563 -3170 -78561 -29597 30077 281 -36668 -12272 3997 -20698
130 -20698 -12496 26812 107 -66361 -39558 51475 41274 -60294 -66690 41191 70702 -33138
142 -33138 -86174 -1277 65382 8565 -50986 -12654 35063 10795 -20344 -5044 2039 -17997
154 -17997 -3918 36374 15539 -44521 -29312 45157 38144 -50321 -62326 30891 65923 -16402
166 -16402 -66215 -3804 48570 2917 -47431 -18517 22455 9326 -11059 1633 2159 -21694
178 -21694 -11076 27628 13835 -37716 -23972 45471 44594 -34484 -53109 22555 56625 -6958
190 -6958 -48816 3053 50950 15633 -28815 -11240 17882 6098 -5957 9022 9305 -12080 -2999
203 -2999 28930 14687 -34839 -27122 34001 40719 -22414 -41776 18276 48338 -4826 -45065 -6473
216 -6473 35215 13478 -19014 -6320 14322 3968 -6655 3985 2820 -15463 -5480 27854 18555
229 18555 -26704 -25857 24338 31777 -21126 -39355 12052 42658 2156 -33566 -6899 25429 7676
242 7676 -18399 -6934 11551 4183 -1143 9764 4939 -16026 -8701 21604 17352 -19753 -19910 23972
256 23972 33363 -12494 -33545 5378 32674 3538 -24642 -3570 22809 9932 -12103 -6556
268 -6556 4232 -1220 -2605 9200 6250 -12532 -8234 16951 12669 -21122 -23341 14655 26972
281 26972 -7962 -27106 2447 24863 1419 -23607 -8254 15051 7865 -7213 -1730 4916 -2761
294 -2761 -4131 6454 4024 -12127 -7024 17568 16719 -13274 -19737 10558 22464 -5501 -22095
307 -22095 2978 24049 6659 -15068 -5392 10451 4689 -5635 -442 5530 -477 -650 9125 4840
321 4840 -12184 -9852 11788 13963 -9604 -15395 9026 19458 -3848 -20356 -3023 15325 4384
334 4384 -11239 -3850 8480 3518 -4848 -1860 808 -4124 -2212 8258 6848 -8110 -8385 9246
348 9246 11431 -8658 -15204 5598 17873 1088 -13404 -1659 12280 3497 -9404 -4025 6244
361 6244 3932 -1048 1992 3189 -4078 -3805 5791 4973 -6979 -7015 8649 12448 -4601 -12907 1640
376 1640 11904 434 -10796 -1713 10347 4867 -5634 -3737 2427 -112 -2635 1241 2315 -3133
390 -3133 -2974 5167 3908 -7945 -9494 3591 9002 -3148 -10534 797 9414 -119 -10413 -4382
404 -4382 5275 2819 -3415 -1216 2960 75 -2082 1088 1743 -3756 -3074 5690 6827 -3529 -6518
419 -6518 3369 7781 -2199 -8725 52 8612 2712 -5542 -2761 3518 884 -3912 -2176 1451 -315
434 -315 -1293 1967 1227 -4410 -5143 2006 3753 -3329 -5956 2225 6906 -863 -7481 -2420 4470 1173
450 1173 -3848 -1353 3260 1862 -1642 -944 108 -1796 -1938 2372 2831 -2425 -3651 2619 3745 -2909
466 -2909 -6235 269 5506 531 -4514 -1422 3669 983 -3536 -1945 1316 876 -56 1226 1635 -1154
482 -1154 -1592 1656 2043 -2384 -2822 2744 5054 -176 -4373 -690 3414 583 -3431 -1485 2575 1891
498 1891 -1552 -1324 -234 -1513 -1633 108 319 -1683 -1676 1486 1606 -2620 -4176 283 3106 30 -2990
515 -2990 -215 3396 1493 -2489 -1820 1093 1108 58 688 1288 208 0 1002 617 -1592 -1547 2100
532 2100 3091 -268 -2496 103 2425 -72 -3301 -1570 1910 1377 -1057 -1134 -20 -187 -797 -498 -304
549 -304 -949 -204 1798 1146 -1712 -2368 606 1978 -495 -2419 167 2785 1138 -1921 -1966 338 777
566 777 -352 -741 -5 63 404 130 -525 -2404 -1489 1379 1222 -1021 -1877 568 1827 -468 -2891 -1342
584 -1342 1548 1502 -794 -1085 491 1274 137 -941 -725 -189 743 1520 389 -1117 -964 939 891 -1659
602 -1659 -2081 323 2228 414 -2224 -1863 599 748 -1274 -1559 -436 801 730 -540 -1340 -1254 83
619 83 625 51 -1409 -714 1644 1538 -1044 -2172 -480 1747 911 -677 -858 1143 1978 -74 -1461
636 -1461 -865 653 1404 673 -725 -431 743 1386 -222 -1882 -1364 1179 1865 -117 -1675 -422 1526
653 1526 798 -1272 -1663 421 1689 1057 -646 -1042 174 1344 614 -877 -905 954 2052 792 -1179
670 -1179 -1116 857 1692 -210 -1390 -160 1654 1318 -313 -1644 -288 1022 845 -702 -852 301 1698
687 1698 956 -875 -1316 159 1538 941 -817 -971 1229 1855 79 -1515 -892 1021 1545 179 -867
704 -867 -12 1390 1394 -429 -1277 45 1480 1385 -160 -1087 157 1485 796 -1160 -1333 511 1897 758
722 758 -734 -739 663 1269 -68 -1124 -549 1080 1780 101 -1245 -315 1037 1128 -663 -1037 203 1629
740 1629 1369 -704 -1343 -171 1215 680 -776 -663 610 1630 292 -1257 -919 520 1529 -18
756 -18 -767 -414 1094 1185 -219 -1595 -462 977 1252 -335 -879 -67 1012 358 -1041 -1506 23 1259
774 1259 432 -616 -787 442 1111 -95 -1415 -776 584 1123 218 -1196 -961 541 924 -294 -1332
791 -1332 -165 793 1020 -552 -1248 -346 812 330 -852 -1040 309 1006 405 -904 -1196 237 935 20
809 20 -1044 -787 783 1204 -335 -1125 -859 908 674 -373 -1156 -130 1083 837 -554 -1197 -5 989
827 989 488 -669 -939 307 967 303 -1055 -805 241 1309 134 -963 -644 559 705 -287 -1002 -388
845 -388 601 976 -398 -1022 -387 742 243 -653 -1064 141 1206 524 -604 -833 427 1117 183 -1089
863 -1089 -502 719 830 114 -843 -657 249 724 -221 -848 -246 725 795 -692 -1417 -183 445 517 -608
882 -608 -793 496 1048 261 -717 -922 27 895 232 -691 -537 483 737 -160 -860 -591 587 779 -99
901 -99 -864 -306 701 623 -616 -913 -209 681 306 -566 -988 172 812 -14 -636 -612 257 937 170 -688
921 -688 -733 678 617 2 -878 -48 663 659 -250 -924 -304 523 400 -500 -714 162 754 85 -553 -966 57
942 57 362 227 -823 -524 484 769 -39 -411 -525 339 482 -202 -546 -286 426 823 -340 -621 -62 494
962 494 670 -299 -428 75 352 244 -490 -512 352 503 346 -432 -343 140 477 385 -481 -317 252 732 172
983 172 -485 -337 362 226 -96 -442 -3 449 355 -312 -336 -169 389 132 -304 -329 204 538 65 -446 -424 330
1005 330 489 -9 -551 -289 456 415 -178 -774 -366 454 337 -441 -560 115 289 266 -283 -385 -37 392 218
1026 218 -466 -84 201 256 -128 -414 -400 342 354 -69 -179 166 243 513 -157 -451 242 507 359 -47 -463
1047 -463 -304 37 234 -73 -295 -62 429 -93 -446 -343 -61 376 61 -396 -86 221 161 -101 -467 -385 -35
1068 -35 208 -28 -228 -99 54 97 94 -380 -33 228 204 -509 -382 196 128 -72 -101 -241 -111 298 174 -149
1090 -149 -272 200 382 48 -266 -170 -2 392 -575 8 220 144 275 -347 -365 83 447 162 -257 -139 296
1111 296 275 -35 -361 1 -36 511 -103 -389 -92 -43 161 -136 -297 -105 -123 186 -263 -199 -67 63 83 -188
1133 -188 -250 177 461 52 -363 78 5 307 222 -313 -91 187 182 -116 70 -184 156 78 100 -83 69 219
1155 219 79 97 -56 -173 53 -8 -93 -59 -156 -28 282 -143 -367 -41 231 38 -125 -264 -82 314 25 -78
1177 -78 -12 125 53 98 -220 -229 9 127 225 -120 -65 415 4 -200 -92 -140 46 -60 53 -110 413 314 -164
1200 -164 -212 120 134 54 -310 -85 -179 50 110 162 -291 -172 208 239 -150 -69 161 181 152 -135 -9 -68 -28 -222
1224 -222 23 -154 166 145 -35 -151 205 257 -1 63 -187 -166 418 62 36 -154 -315 119 -38 -153 -52 -23
1246 -23 209 10 -227 69 135 248 36 -107 -185 217 191 -91 -220 -493 41 -133 -54 -59 -220 -67 125 -138
1268 -138 -154 80 362 119 -142 -298 186 126 120 -225 -31 101 -138 147 -189 225 360 245 -125 -197 13 51
1290 51 97 -236 -122 237 -259 225 68 -245 -68 206 47 -57 -16 51 93 43 98 -61 -125 349 -383 -202 -112
1313 -112 -104 110 -148 -207 -104 52 -17 1 -100 -20 271 176 48 -234 -273 2 -214 -238 -175 30 372 30 -138
1336 -138 -110 -18 222 -50 -282 67 100 -62 158 -26 -147 95 29 -80 149 -119 138 -275 -19 -80 -230 58
1358 58 51 -147 31 -123 113 -212 -79 111 -239 130 -214 -93 -254 -50 75 140 -96 130 148 126 126 201 73
1381 73 163 -91 35 -229 -104 -32 -28 -122 -185 -268 -199 2 -212 -75 80 -11 -292 -57 42 28 149 -76 190 -232
1405 -232 331 183 158 -18 -265 44 -154 -130 -81 -49 156 171 -249 -150 24 30 43 97 -49 -325 144 -208 -24
1428 -24 -213 -133 -210 192 -22 -112 -18 29 -59 55 44 35 114 -17 -349 -272 111 272 -42 21 161 99 274 177 10
1453 10 181 47 -126 123 -9 71 119 106 -339 169 123 17 38 12 -102 44 18 -70 61 1 107 -109 -27 -397
1477 -397 -113 58 -25 151 241 79 200 -73 -140 -189 -4 78 -4 39 31 68 -120 64 -70 -71 63 -127 86 -197
1501 -197 136 182 -140 85 -60 -27 43 -115 -47 -127 -93 282 -93 217 30 12 -313 -21 78 14 174 -60 -24
1524 -24 45 -48 252 169 -205 92 -86 -16 -187 -168 -66 -177 78 113 -67 255 -179 137 0 -130 105 -27
1546 -27 195 -120 304 65 97 370 -2 -284 -93 -231 -29 -105 -3 -84 110 -236 -82 -153 49 -9 -95 -107 -124
1569 -124 -155 -103 348 -31 -181 -73 47 -164 91 -121 -9 -49 -122 41 27 129 66 -150 -134 -16 86 89 -127
1592 -127 105 -34 15 -67 193 -118 -260 334 19 -151 70 115 171 -115 -8 62 -169 59 15 -75 185 59
1614 59 30 -133 -41 214 -64 41 -155 -146 -58 -51 25 155 -70 -97 236 15 20 -17 154 -25 -2 5 -123 90 -90
1639 -90 125 150 87 83 -115 -44 96 139 -53 82 -64 -21 70 -9 -35 42 287 9 -45 -111 -143 -215 -116 177 -63 35
1665 35 -202 58 347 -340 -170 -139 -154 -135 -202 140 23 87 257 -63 200 3 69 84 -103 35 32 -59 -218 -37
1689 -37 303 19 -204 99 -121 228 -27 120 -300 310 176 115 102 -111 -104 236 63 70 -90 -72 -38 -33 -271 -158
1713 -158 107 96 176 -96 104 10 79 50 -45 -201 37 -271 104 -82 46 10 166 -145 -373 -246 -107 -99 -289
1736 -289 -78 -3 65 135 8 -33 45 -20 105 -364 -261 -109 19 -96 124 -176 -108 26 196 84 -208 113
1758 113 -146 -7 7 157 69 -287 -137 -73 -45 -54 203 105 -43 264 250 -240 -325 99 145 173 -89 33 34 100 51
1783 51 -4 -50 -31 149 -61 159 -65 51 -112 186 81 -44 59 -79 116 -41 -28 -236 -140 -62 -61 131 -122
1806 -122 -45 7 -303 -234 -63 135 -48 -16 -10 25 -151 -27 -7 -167 40 229 -28 -188 19 168 114 63 186
1829 186 -172 -30 112 -177 -197 233 92 78 -331 -51 -357 135 -121 119 82 97 98 -138 1 31 35 128 -323
1852 -323 -8 30 6 -78 -103 192 120 -35 -179 61 -415 -58 60 -208 205 -89 -115 31 167 -141 9 247
1874 247 -151 -40 1 13 10 -67 -109 172 -45 -145 67 -43 -100 94 -165 44 -233 -4 -193 205 88 227
1896 227 97 -27 170 -277 -19 78 -185 -35 -224 79 -360 -159 222 -374 -200 -173 -59 -102 131 15 19 -67
1918 -67 34 15 16 -64 52 -165 92 31 -207 131 266 -110 -156 -161 -158 -244 -325 -50 -55 -228 -112 47 34 253 6
1943 6 127 -148 -38 -62 254 -55 154 163 60 -56 -20 262 139 73 41 55 -66 136 150 -78 -168 166 -448 -50
1967 -50 -121 176 58 -21 -176 99 175 -259 225 -122 -41 -41 63 94 -20 -27 -63 -26 -24 -164 177 -28 -48 325 50
1992 50 159 -228 214 179 262 78 127 216 -275 -23 -180 81 270 -73 247 15 -153 -22 -108 -165 91 -79
2014 -79 145 -34 -218 102 -257 60 161 100 -254 -109 -134 -11 -53 25 -12 169 -50 -153 -75 209 -236 -61
2036 -61 -49 -291 21 90 97 -57 -144 68 60 -14 -85 25 379 200 65 -235 5 -13 -128 -36 179 6 37 -302
2060 -302 -12 -156 -26 36 38 119 -13 100 -29 59 -123 101 -114 -33 35 184 102 -91 -18 -173 -18 -286 -56
2083 -56 162 131 155 -186 -91 -73 -76 -59 55 -26 -142 -195 101 -4 -310 54 39 16 -29 7 130 -68 -188 65 -209
2108 -209 -90 -24 275 -56 68 -73 -167 -140 71 16 -60 -138 229 -186 -262 1 -14 -14 -21 236 -131 127 71 -187
2132 -187 -131 4 -40 128 -65 -119 30 342 -245 -139 -242 91 -94 66 -10 112 45 38 84 -31 26 -206 -92
2155 -92 107 -80 76 95 -201 121 -23 194 -271 30 -131 -160 -136 -107 -70 43 -193 -97 167 152 190 0 -2 217
2179 217 -87 -279 -116 136 350 112 -286 156 -11 21 -104 26 237 13 53 77 -178 -266 -121 -209 -310 2
2201 2 -157 -34 -161 361 -36 -104 122 84 -28 128 -68 -273 193 -246 117 -245 -96 -35 109 -12 -23 -82
2223 -82 -240 103 -79 19 205 259 7 79 -90 93 -58 -250 165 180 -88 -51 108 -238 -62 -155 -249 -19 180
2246 180 106 176 57 -88 2 74 294 -113 -1 -36 -131 156 -93 227 196 -88 19 233 219 65 -100 -57 -5
2269 -5 -147 -54 37 -105 -363 80 159 114 -17 14 38 -179 -51 20 8 -4 37 -214 64 46 -95 166 107 -231 0
2294 0 55 -76 -137 99 58 -21 3 -46 -301 2 175 -201 -232 -3 -70 -58 76 136 127 -49 -157 -124 40 255 -25
2319 -25 -111 90 -142 14 -81 262 -85 -300 96 55 -40 215 -288 34 -106 167 -55 169 -111 139 -49 -40
2341 -40 -93 52 -61 -207 167 79 51 -129 71 66 97 -218 124 52 127 190 270 50 -136 -44 -188 -47 -121 235
2365 235 98 110 -27 -130 217 231 -12 -86 46 118 160 314 -89 94 75 31 -17 -173 -33 32 -157 -297 -253
2388 -253 -98 80 363 62 -39 27 114 -14 154 137 123 -257 4 -2 -156 217 -59 -70 -136 -176 58 -298 22
2411 22 -270 -59 -90 198 189 96 18 -57 -46 40 165 -14 -157 -52 -194 130 -28 65 208 11 78 -82 260 -110
2435 -110 148 -84 320 2 170 158 -14 -105 59 -364 -37 -99 -23 -145 -73 5 -233 -81 242 -5 90 37 -197
2458 -197 -175 -101 65 323 36 -80 -13 -61 -70 -291 104 -26 247 -291 -1 114 39 -201 32 70 92 -19 -125
2481 -125 138 19 81 156 -171 -99 38 -41 -39 -37 133 -66 -89 -143 49 80 173 -88 -176 296 -325 -36 -90 41 -175
2506 -175 -154 -98 242 -8 308 238 -49 85 103 -154 26 -84 -181 46 -120 199 121 185 112 -97 -55 55 -52
2529 -52 70 37 -127 50 193 259 449 -51 -251 -124 39 -141 -55 19 11 35 -57 -234 -21 -102 -111 -121 -65 34 50
2554 50 -51 11 69 67 25 69 152 57 -141 -71 -70 110 16 -247 -187 207 -56 -68 236 -90 -78 12 -83 133 -120 -39
2580 -39 -139 121 -66 -141 -144 -28 84 -164 139 -68 -95 -91 -123 85 -112 86 -239 -111 74 121 -48 -314 269
2603 269 52 -80 -141 -108 -16 -5 -80 -192 112 -29 -186 -432 77 -304 -185 -159 -308 97 -193 -2 80 63 -74
2626 -74 -308 -12 198 103 -24 -89 -102 132 -184 193 -233 -89 -52 91 -232 0 -228 105 -59 -113 223 202
2648 202 -75 -127 142 -114 -32 15 200 -31 -157 207 72 177 60 152 183 -16 -18 -91 -22 -108 -275 92 -188
2671 -188 -11 236 -201 -205 176 -80 -160 10 284 26 -70 -161 -113 401 -88 -97 39 162 176 122 -76 67 137 209
2695 209 62 126 -81 -155 -38 57 146 -2 -218 -135 -35 223 -9 -352 -50 116 -361 97 -51 138 -135 80
2717 80 51 25 37 85 -69 2 195 -67 112 158 169 112 -53 -194 106 17 39 43 -212 -215 -152 -269 -59 -74 -60 9
2743 9 224 156 -178 -155 73 -128 -267 159 19 0 -2 -67 -12 -175 -28 -60 194 76 135 36 -42 114 -278 177
2767 177 -67 -197 -79 308 7 -85 58 -180 291 -187 -259 -147 183 115 -193 -162 59 -370 203 -48 -298
2788 -298 -32 76 -81 -105 85 -76 -60 -24 -56 -227 -74 26 12 -85 57 -328 -26 -40 60 20 48 -129 163
2811 163 134 -126 246 -88 -25 -60 -60 -65 131 203 -24 32 130 -30 25 -34 131 -52 -65 -53 -45 116 -9 80 98 -21
2837 -21 30 159 -325 22 246 37 -85 -39 -41 84 -145 -8 126 207 177 11 -4 -22 -67 -72 8 -29 149 -14 102
2862 102 31 185 467 382 -148 450 296 -77 -22 -10 -23 -115 21 14 95 104 -79 -68 -158 -103 -51 296 -140 -30 44
2887 44 10 11 95 -263 1 209 -148 23 -82 -67 95 168 -66 -47 -184 189 -76 135 8 -110 -112 -4 350
2910 350 -98 -50 18 -22 116 -108 -73 155 208 -38 -43 -96 157 -271 109 119 15 211 17 19 155 33 120 -74
2934 -74 205 249 89 -79 261 24 78 -84 -4 138 98 25 -253 -140 -257 -41 -84 -131 -117 149 67 174 -256
2957 -256 -270 -281 -191 -110 -37 -93 263 508 -60 -53 99 -44 48 120 25 19 -4 -82 -233 -100 -129 155 356 262 -260 52
2983 52 -2 45 -474 -23 -34 -173 132 -45 40 137 -237 76 -421 -2 171 15 209 -172 -294 -259 315 -158
3005 -158 49 56 -158 -63 144 -152 -124 214 41 31 95 -61 100 -191 23 -55 -8 -109 97 139 -208 8 -212
3028 -212 82 -192 -242 53 18 86 153 129 -363 -95 291 105 152 123 111 32 -277 54 -19 -90 -63 7 -208 -362
3052 -362 -64 83 214 -36 103 113 203 44 -239 134 142 -182 -69 -196 77 42 351 105 276 108 56 67
3074 67 -66 18 127 272 72 -257 80 -48 128 -76 71 -24 -157 33 -98 -167 -10 -119 19 -50 102 168
3096 168 191 -182 -67 47 -45 0 -55 169 -169 86 -85 71 -247 206 -331 68 88 -21 1 146 -26 -104
3118 -104 -97 90 131 -40 150 225 218 29 -38 90 -169 74 -123 -140 -65 -29 94 18 5 -15 -152 -234 -126 -320 -51
3143 -51 -105 188 258 -142 -6 -16 -1 -87 -43 58 134 134 67 140 -239 -159 -57 21 6 -47 9 23 -123 58 94 -49
3169 -49 -182 9 -88 62 148 31 29 -168 -73 -78 233 -76 105 -69 85 19 233 -145 -81 206 34 -27 220 314
3193 314 -304 -57 -89 -175 -113 -63 -101 -144 -167 29 403 27 -125 110 -31 -21 -222 235 -36 61 59 -2 -386 -101
3217 -101 -281 31 -113 5 -290 -45 -118 -95 -1 72 178 -3 49 179 -70 32 -10 140 -62 -90 346 -115
3239 -115 75 -128 -200 248 109 -185 -86 -82 19 86 -18 -100 223 122 45 53 32 -112 23 7 -66 -55 214 28
3263 28 -40 -53 -63 -217 -70 107 35 -32 237 226 243 -164 36 -78 -228 -86 17 -87 258 57 -15 -140 -112
3286 -112 -34 61 315 -113 -19 -98 -6 -246 -193 44 19 -271 62 104 -88 -51 -195 -128 -88 -7 -6 34 51 43 188 129
3312 129 -115 52 164 -11 -175 124 -55 -116 43 -215 -53 -126 -45 29 18 143 -109 -60 -30 106 28 73 -383
3335 -383 210 108 10 -59 -90 -235 -240 -179 89 -30 192 287 -23 53 -324 -12 -41 224 253 -276 -110 171 -93
3358 -93 -79 -342 -135 -135 137 122 -113 -134 -39 -57 70 -23 -290 196 -46 230 250 84 186 97 -1 46 -41 92 -121
3383 -121 351 -73 29 -231 85 -36 -92 16 -81 -326 -76 -135 200 144 -192 -206 -76 -193 -190 53 77 -67 64
3406 64 41 117 263 -258 323 111 135 190 -158 253 -22 8 -102 79 37 -120 -57 59 102 -86 17 -62 -113 65
3430 65 -145 -31 -278 114 65 -4 -1 14 -104 178 24 -28 -97 222 121 185 69 -82 -106 -163 1 -50 174 -96
3454 -96 -122 -10 -22 -102 26 141 -137 9 91 278 -204 -82 72 41 -179 -270 -30 160 199 -59 -210 88 -35
3477 -35 -25 -34 50 -77 210 143 30 -172 -143 55 -30 23 -97 -451 -64 -131 -131 239 99 -63 -60 -86 -17 -10 -47 25 -141
3504 -141 -8 -234 11 -258 -99 -1 88 -81 3 50 -256 9 -219 226 34 -1 163 -132 33 31 95 49 137
3527 137 26 -45 28 75 140 171 53 -68 22 -54 215 182 457 -185 -43 -146 79 133 135 -249 -117 -13 96 -171
3551 -171 52 258 5 -39 96 175 126 92 256 -33 -20 182 -31 -69 -43 31 -48 -43 209 -167 63 138 -222 -14
3575 -14 -129 -97 151 -74 -54 -58 -180 -270 -49 -146 164 -154 176 -118 -200 136 -71 -24 4 123 -75 234 -131
3598 -131 -66 4 -105 27 -40 129 -168 4 212 -197 -12 98 307 47 -71 112 97 22 -4 -53 -173 -125 56
3621 56 20 -53 -88 195 -248 180 72 -85 -110 78 -80 -180 117 59 136 52 50 85 13 119 100 -188 -122 -89 -23
3646 -23 18 -3 49 157 -8 -125 -38 -87 -62 110 -12 -14 -152 44 9 123 166 -165 -125 -126 108 -256 -284 -36 -88
3671 -88 -102 -266 -97 201 82 -89 99 22 86 81 -10 -183 2 244 -60 104 -90 -270 -42 87 50 217 -133
3694 -133 1 15 -201 6 73 -88 91 110 -124 -27 121 5 60 -103 82 27 -283 -171 11 110 -49 10 265
3717 265 -109 -55 -98 -81 -1 238 -34 -242 -13 32 -194 104 90 -207 -218 49 -26 189 -86 -181 -63 -10 -1 -41
3741 -41 -37 89 -277 1 -45 52 -231 131 101 -174 -182 -98 -28 -137 -79 181 -21 -51 140 177 -161 52 -31 101 -24
3766 -24 44 183 -441 88 -74 98 96 105 -13 -43 -100 -188 11 -187 181 -129 -111 -24 130 -107 138 -5 108 -7
3790 -7 40 28 -146 68 277 -29 92 -77 -233 -136 -4 -168 -29 -183 -146 36 128 -112 -148 83 -17 -2 -164
3813 -164 -284 -48 -166 -223 -82 35 -77 -5 103 23 -101 -78 186 81 48 33 67 46 -379 0 24 14 -215
3836 -215 -145 277 -61 -6 64 -56 427 -75 -13 -141 26 133 -38 -339 85 -205 -274 22 -120 -93 18 140
3858 140 -172 84 -90 4 7 207 339 -278 -138 54 -114 -107 -77 139 110 -47 -32 9 -25 132 -140 192 -117
3881 -117 158 -2 -15 97 264 87 40 -149 -193 -47 76 253 225 -19 52 402 317 156 -56 -170 250 -185
3903 -185 -71 209 -104 142 -41 -33 -78 424 -21 -410 17 143 -252 50 49 134 164 0 -37 45 109 281 296 7
3927 7 170 -43 48 80 -91 72 18 -113 -63 -79 -7 -192 31 -38 -22 18 28 266 -7 25 232 -47 -27 -53 -163
3952 -163 -224 309 -22 85 61 -109 -120 -147 -177 42 146 -48 -30 -123 -100 -80 114 -452 122 86 112 -62 -48 15
3976 15 -224 28 -67 -147 163 115 -123 4 -129 56 -32 75 5 -123 140 92 -86 136 -138 -186 25 47 -337
3999 -337 32 57 -47 151 108 -53 245 255 257 178 -103 -173 6 1 226 -116 23 -75 260 160 -281 -72 -134 156
4023 156 -67 -79 -263 231 -127 -10 188 216 -193 171 -201 -131 166 -44 186 -176 -12 -199 59 90 141 -21
4045 -21 -225 -65 131 10 65 -294 44 86 -216 -97 -2 10 112 -144 -7 103 156 -113 -58 198 -34 -192
4067 -192 -66 -221 77 -31 26 -149 -205 -94 -170 -48 159 93 -1 409 -43 69 -164 -20 43 -52 -128 -138 -72
4090 -72 -92 19 -127 250 -97 -35 -150 90 -54 -7 159 14 -179 -178 14 182 -8 -92 -200 -27 -48 218 271
4113 271 21 91 -134 54 -190 -3 -93 53 173 72 -49 -39 -23 -38 -141 114 -116 -43 231 68 477 -19
4135 -19 7 -109 -221 157 49 120 64 75 60 45 90 61 -27 152 -192 -15 -83 -8 -111 -94 205 96 220 -84
4159 -84 -96 126 -320 -231 43 225 101 108 84 -235 -3 326 193 -108 39 -54 18 -49 -261 -146 -15 -158 -115
4182 -115 26 21 -69 236 -45 -57 -43 230 211 100 28 -346 225 -153 177 -53 114 215 56 -158 -114 -206 -10
4205 -10 -1 90 19 190 47 -77 268 -46 63 -131 322 133 -147 -58 157 -98 -113 181 -89 -194 -39 219
4227 219 -24 76 178 -172 20 -4 -286 -164 -45 -51 -91 -172 85 369 8 120 -307 58 20 -82 -151 -79 59
4250 59 -94 5 27 99 209 -169 -18 202 -47 38 -113 209 -78 15 319 -203 -1 -1 -28 131 74 102 -179 65
4274 65 -123 54 131 -58 237 65 -64 -29 148 -17 116 44 -12 121 256 148 23 -12 9 -96 -64 177 8
4297 8 45 -259 -35 41 8 5 -154 -43 -28 4 47 -58 140 100 -79 -148 -278 213 5 -27 -43 -173 -129 92 -324
4322 -324 93 42 163 -118 136 -106 39 17 40 200 32 -94 -172 50 10 56 -117 113 -33 136 -49 -81
4344 -81 122 -2 57 270 135 -93 -72 3 190 -128 -20 -146 134 27 -6 8 -208 81 40 -149 143 3
4366 3 148 177 5 -67 -94 -22 39 126 -75 -187 193 -263 32 191 281 -30 -169 86 -178 -84 -62 1 82 46 -331
4391 -331 -153 -230 -123 -70 0 -146 37 -20 -242 -168 -25 -130 141 -108 52 30 16 -2 447 -178 304 191 -114
4414 -114 80 -277 11 -124 -18 228 180 -44 46 286 119 19 -78 -280 -125 -177 136 357 -40 88 36 -6
4436 -6 339 116 -115 -193 110 248 211 148 -48 319 -42 -17 140 -5 86 50 275 -65 -248 -41 -145 73 -178
4459 -178 123 179 -151 251 65 -6 184 14 -246 215 33 -209 -66 123 65 -75 -67 -33 149 -98 -106 10 -190
4482 -190 5 93 40 8 82 -142 158 -82 198 284 -335 -46 53 -25 202 224 -206 -165 -218 -82 193 -205 11
4505 11 32 15 -197 -19 9 134 -71 -70 144 75 -157 26 -231 -30 -198 -52 24 -188 67 68 110 -4 30 114
4529 114 7 -106 -245 0 27 -152 2 -127 9 80 -69 220 95 -77 38 4 -51 94 -103 -162 -107 22
4551 22 89 2 127 -165 125 -9 -16 -113 -152 302 -68 73 116 -153 -11 -59 -119 193 -56 -131 10 -187 14 -180
4575 -180 281 104 -13 299 144 -75 -57 23 -43 171 60 -130 238 -92 -155 -30 348 1 -83 -41 168 56
4597 56 143 64 142 11 -80 -49 -99 -100 -28 -147 -118 90 127 6 -105 -83 -252 -85 219 116 358 -19 -319 -128
4621 -128 -78 -112 -226 -143 0 40 166 -204 -167 -233 82 55 194 -143 -7 91 -27 32 88 -83 -205 39 140
4644 140 72 124 -83 221 75 50 -5 -29 47 -66 81 -205 148 -74 210 129 -163 -15 -40 4 -82 -116 188 76
4668 76 70 -164 28 -50 -79 238 56 31 30 54 141 226 10 132 -9 -103 -214 -9 -86 -173 145 -257 32 195 -209
4693 -209 33 -37 14 53 -70 -10 -43 166 27 -46 -129 -142 -254 -85 -140 -108 -242 150 -52 76 244 -123 -23
4716 -23 -73 -251 -218 48 -146 51 -65 -17 -87 124 -115 -106 -113 -159 -15 -52 29 193 329 -45 7 -158 -189 -241 -26
4741 -26 -33 29 80 -291 -154 -150 222 150 37 -155 262 55 -49 -55 221 -57 -167 333 -27 -76 -89 79 13 -54 -221
4766 -221 -115 8 -263 -98 -151 160 73 -291 -148 51 143 93 347 83 148 -57 13 -51 -186 5 -101 -38 32
4789 32 106 -205 44 -61 100 -148 40 73 -61 16 13 98 -181 -153 151 185 -175 113 31 191 -224 13 37 164
4813 164 -110 275 174 133 25 50 109 225 105 28 181 303 28 -76 341 -293 -213 369 327 190 -61 -260
4835 -260 -124 -74 -57 7 -83 159 107 -163 -113 194 -205 104 31 158 42 89 8 -179 -218 35 105 -241 -48 35
4859 35 106 87 -94 -2 51 -304 131 16 175 54 -294 -109 -93 132 17 -65 152 92 -102 -235 -23 94 -82
4882 -82 -174 -132 108 190 188 145 -301 16 -185 151 190 -156 234 50 46 -62 119 -184 142 -13 71 -45 150 -47
4906 -47 135 154 128 132 -119 95 108 108 230 228 145 -106 -47 -223 120 68 -290 244 133 261 15 -15 -30 -14 44 -255
4932 -255 -187 27 87 -127 169 206 -137 124 -132 116 -34 141 199 -38 130 -78 -284 -36 75 -134 277
4953 277 -103 -136 -12 8 203 15 -48 -30 76 113 -97 238 -19 -47 -98 -171 24 17 95 -3 -128 -10 65 142 -113
4978 -113 157 144 -261 201 -85 44 57 5 54 -71 -2 34 130 140 226 -256 151 -51 -7 -223 8 -40 94 -138
5002 -138 -183 38 -181 74 124 80 -151 66 71 66 -86 -33 207 130 -72 -371 9 120 -66 -72 206 152 -232 158
5026 158 -131 75 -142 59 -157 35 -40 4 -119 146 176 28 -72 50 75 -73 131 -93 -215 -126 -110 53
5048 53 2 148 -175 -166 18 -15 -43 -58 -108 -32 39 151 88 84 50 -147 106 -186 49 -16 229 81 -119 46 146
5073 146 -129 117 -128 31 23 -24 -309 31 -45 160 41 -328 -38 24 73 -221 -94 72 -234 301 -88 -306
5095 -306 71 128 -289 -74 32 -24 -195 -24 234 -150 47 181 -55 322 -296 -149 -248 -55 83 -27 8
5116 8 -97 137 17 96 33 -78 -284 64 8 -201 78 88 119 37 -61 292 296 412 -12 150 -207 240 11 -9
5140 -9 77 50 6 32 -151 -144 206 -21 -7 52 -212 164 69 42 -17 91 200 213 75 14 -5 257 79 143 222 -41
5166 -41 116 -12 -68 -88 -24 -255 120 78 -28 149 64 -116 -42 65 91 56 -131 -343 -7 144 -41 -24 46 122
5190 122 32 -98 343 -136 6 -296 -39 -54 -319 45 65 214 52 -184 165 77 -103 -194 -38 58 -64 -228
5212 -228 102 -42 145 177 -64 120 -14 36 53 -66 146 -9 79 -107 13 -37 159 -113 -159 -24 224 -13
5234 -13 -44 246 -130 -138 -136 68 42 -18 -107 -1 210 -148 -65 20 -9 -49 211 -143 -69 112 -17 137 -23 178 -210
5259 -210 126 -101 172 -56 259 -15 -77 25 -152 163 142 -52 -62 -144 -160 205 -125 131 -150 124 -159 -131
5281 -131 318 136 121 -32 -42 75 -42 -164 45 270 192 103 -155 113 79 -97 -128 88 -94 36 17 14 139
5304 139 50 -77 -111 -10 160 119 -6 140 86 207 -91 -137 -56 101 -60 -38 66 153 -13 6 54 82 139 -269
5328 -269 -34 -259 -113 -32 306 253 7 -21 310 -146 1 119 -180 201 47 119 -98 23 77 -154 -405 86
5350 86 234 -78 -80 -17 -57 -211 -49 184 105 -23 46 70 219 149 386 -111 -58 -1 -105 67 -122 -108 -63 257
5374 257 -56 -31 239 -35 233 40 181 132 69 249 -226 2 67 -41 133 -128 -120 140 38 13 70 9 145
5397 145 -13 -205 -23 129 86 96 -263 4 -4 -30 -4 -140 70 -73 -163 15 -21 57 -153 -82 98 5 -301 -64
5421 -64 117 -225 165 6 179 -33 125 110 -11 -58 89 175 -157 53 -63 37 54 -171 30 53 -63 -17
5443 -17 22 212 112 40 -184 -71 61 40 -115 83 -167 86 -9 -105 118 -45 -163 -356 -81 52 38 174
5465 174 183 -147 179 -65 64 -140 36 85 -24 -2 -124 -104 -94 -133 71 -125 -98 -40 55 -233 243 171 42 273
5489 273 6 -42 231 204 183 -27 13 -293 22 -223 137 67 -165 -12 152 130 52 104 -188 -141 -270 78 -163
5512 -163 -37 -47 -144 -47 19 -20 -81 7 -151 207 -213 -15 -287 -107 45 -266 97 -183 110 -108 81 -107
5534 -107 240 -85 -193 -58 42 -91 -60 117 224 311 -1 271 -74 -33 93 151 202 -77 206 -199 -91 -52
5556 -52 11 80 -78 86 -51 -57 -158 -82 -43 -83 -168 0 202 65 232 25 62 231 107 68 136 52 51 97 -137
5581 -137 133 25 -142 9 -494 279 -62 128 -27 -99 13 -86 -129 181 177 -22 106 20 -80 260 161 2
5603 2 7 -4 -143 -11 83 120 17 128 86 -263 -228 -3 30 -26 254 -226 164 46 104 6 11 -226 -132 37 -168
5628 -168 26 -98 75 141 88 -91 -27 151 -198 74 35 -96 44 -128 120 51 64 74 206 -259 13 134
5650 134 -76 -34 -190 -54 8 78 -115 2 -258 -148 15 -45 87 -106 212 48 82 -182 -74 -75 -90 -120 172
5673 172 -79 108 4 -19 -240 40 207 -344 30 143 -194 -123 35 116 -196 -72 2 -3 70 -88 67 163 12
5696 12 -29 14 -228 12 -23 127 -75 155 -60 186 -106 -53 -76 17 -74 74 -6 127 37 -157 87 -53 -154
5719 -154 -49 -204 235 -78 52 214 47 -117 190 22 5 -46 -49 329 65 84 115 32 241 398 153 -81
5741 -81 99 -105 44 -88 4 -76 -75 168 -2 162 62 -6 -107 116 78 147 -37 62 215 200 109 100 217 82
5765 82 83 -85 -18 83 -198 76 41 10 10 -49 -70 19 290 11 -159 -157 193 -70 69 16 85 53 -76 16 66 84
5791 84 -236 79 -90 -68 241 88 104 -11 -204 -113 -278 -180 -100 138 -143 30 -62 182 -190 16 -75 117 7
5814 7 -56 42 141 -14 145 79 -201 -2 232 -161 233 123 179 71 -31 66 131 152 -55 195 -208 -125 19 10
5838 10 -428 91 -50 -45 -261 -82 87 -177 47 157 84 96 -47 -12 79 -57 186 245 255 -207 17 42 -125
5861 -125 191 323 114 24 123 29 73 -40 237 -122 -64 -94 151 -11 -175 217 -120 -6 5 27 27 -272 -147
5884 -147 31 -120 -4 -52 105 11 -254 35 -93 -43 280 -88 43 -53 174 69 -51 -132 98 199 -131 29
5906 29 170 -18 56 -151 193 156 -272 205 -135 -119 -108 148 -51 50 116 -330 261 337 -124 -172 -90 -120 -32 131
5930 131 -183 -16 26 22 -21 17 -55 150 65 -243 -14 -23 213 -8 151 -152 -243 204 -166 12 35 -134 51 137
5954 137 123 -44 153 -37 -107 -161 -46 31 41 -32 -58 266 -109 -189 130 92 -17 -117 108 49 244 2 -136
5977 -136 -31 22 -180 22 134 187 234 21 -369 -155 192 121 -124 262 -98 -131 233 -125 -110 -125 125 -133
5999 -133 37 -77 -8 -9 32 -166 -8 393 23 12 19 -97 69 -35 -182 -85 330 141 130 126 38 -19 -51 -35 14
6024 14 -361 -153 -180 -209 -132 -192 -96 27 -84 -17 -205 -11 -178 88 -7 -32 -16 -43 -162 54 250 -45 32 88
6048 88 326 154 -32 251 -89 1 -410 -14 -130 189 18 194 187 126 12 -132 -307 -137 192 -5 -167 105
6070 105 25 290 -56 -253 92 -4 46 107 54 -172 -22 -11 249 -40 137 -14 -131 29 -20 74 -239 80 -17
6093 -17 -54 36 -28 127 -106 -122 246 -70 -100 0 46 -190 63 -266 265 -208 21 -64 -96 38 -84 -25 56 36
6117 36 -236 -262 -47 91 305 230 0 101 253 -109 -241 8 -183 31 -60 -136 -173 -272 130 124 8 38 70 -150
6141 -150 -306 -78 97 69 128 -154 -113 115 -56 -81 -349 231 232 -254 -15 206 21 -129 -184 267 149 53 272
6164 272 164 -51 1 233 -21 135 26 9 145 96 -89 -195 -112 -242 147 -127 164 116 153 -191 12 208
6186 208 122 120 -13 -260 -52 -214 -176 -67 -14 119 38 105 -53 72 -12 122 -117 -180 -93 -248 -129 9 -2 15
6210 15 -6 -6 -162 -199 248 137 -198 238 102 68 -75 59 12 -76 13 -113 94 -314 -2 -109 -22 -249 -100
6233 -100 57 97 -100 3 -151 -157 -32 32 -35 298 -33 -142 -139 -147 13 -84 11 -91 65 -82 173 15 239 36
6257 36 -317 68 -104 126 -111 283 -359 -113 65 138 -288 -32 19 -149 -61 -190 -89 -304 209 -44 -286
6278 -286 -329 -72 239 211 -20 -71 113 53 6 280 -325 -211 72 -52 44 119 21 -4 -90 307 -200 -83 41
6301 41 5 -192 -83 68 -42 26 -158 166 -74 71 -233 137 -232 75 -151 56 -14 -58 -237 -80 -140 -44
6323 -44 -27 -47 -49 -159 20 -7 -50 32 -259 -80 -55 133 -23 210 -50 -192 349 -18 89 -124 -6 -146 69
6346 69 -66 -15 -332 -173 194 -69 -21 113 67 168 -13 -154 -158 -3 -176 -42 -170 179 228 237 61 -223 126
6369 126 -82 158 -175 -71 63 82 211 137 121 -150 -37 81 71 -136 212 48 -97 48 -2 28 191 -66
6391 -66 86 -32 -42 -84 -145 -22 20 -235 45 -86 -147 -95 87 145 -26 -91 71 -136 -50 152 59 -69 -150 -285
6415 -285 118 27 -210 -15 173 97 132 225 -135 -1 -104 10 -91 -74 -60 206 161 -33 210 108 -46 -200
6437 -200 -90 26 -156 -85 288 -284 -131 141 224 -155 -155 103 136 143 162 -56 -144 160 187 138 -101 127 -178 41
6461 41 337 40 307 138 -213 -93 59 -101 -7 -228 166 -179 64 -15 -263 14 -47 -54 -55 154 55 316 -18
6484 -18 -12 54 140 -199 9 132 -23 -157 279 210 -49 13 -78 -98 136 -153 218 -39 247 239 -130 -69 -167 -7
6508 -7 24 34 14 9 -192 11 183 162 67 143 -29 -104 23 81 -30 -18 -82 224 64 9 -77 153 191 16 53 261
6534 261 -31 -350 153 50 -53 -187 -117 -253 -47 -3 -259 -155 1 194 254 -46 -275 142 122 -133 -163 116
6556 116 2 -38 -164 -267 -237 -37 222 48 -80 -27 -14 20 28 -81 78 -81 148 -193 -96 402 345 -69 17
6579 17 -30 -17 -53 0 146 47 -108 -122 -63 210 -262 74 -89 -28 -75 47 -121 229 -9 39 277 48 89 36
6603 36 177 -104 61 113 -37 -118 -230 58 43 -125 260 221 181 -111 13 14 -57 -21 29 -202 -128 7 -125 371
6627 371 30 -94 94 -55 -22 127 142 24 169 -37 -97 -194 278 133 8 -31 -12 143 359 -83 368 348
6649 348 239 65 43 249 -101 -65 -42 -154 270 252 -59 168 -86 191 -67 20 -82 -63 70 -27 209 -13
6671 -13 255 -30 178 195 22 55 137 -85 -99 -80 -34 74 -93 -100 -227 -216 -129 -65 144 -47 -318 289 77 -9
6695 -9 -70 -143 33 -67 171 -75 110 -61 -25 225 -91 -117 258 -171 -14 13 -78 22 -162 35 330 -21 -149
6718 -149 46 -110 56 114 -125 -100 73 119 102 102 -102 -73 118 -102 -31 -335 -255 -277 -38 -36 13 159 -144 -79 119
6743 119 67 -169 70 25 -70 -51 -127 -64 -8 -63 28 -107 66 -23 41 41 -163 -312 -51 -4 93 -47 55 -97 24
6768 24 -29 134 13 -35 133 -106 77 -176 -130 -201 -122 88 213 -127 259 -158 -10 -466 -50 51 -81 9
6790 9 -49 102 -327 131 -6 36 -183 171 71 149 24 18 42 7 -84 -209 152 30 -200 -148 163 -6 -169 85
6814 85 -27 143 -167 8 41 -57 -72 -3 -55 -33 60 -82 47 -153 118 -5 128 -120 205 16 -75 123 91
6837 91 172 -104 55 -117 -24 16 50 105 -277 155 147 28 108 -14 107 325 20 -19 40 -57 -250 35 -37 -12 -37
6862 -37 -221 -274 -3 283 63 -75 -4 -349 75 19 -33 -288 79 -33 -245 231 -42 70 -47 -195 201 -13
6884 -13 83 -183 -80 130 -176 -38 -61 268 -40 15 -13 -41 -130 -274 -41 114 270 -151 138 89 -21 -59 -64 49
6908 49 245 -41 -31 135 -19 167 118 0 146 -113 -18 -10 -112 -195 -24 93 -199 -9 7 -8 -93 88 -237
6931 -237 119 208 84 -118 -207 204 54 262 -53 -155 -53 159 84 -6 -165 -359 163 -107 -115 177 -132 65
6953 65 31 -182 113 -37 -125 33 -49 150 -155 58 -65 261 292 -165 -132 -61 77 -261 -69 343 316 -315 -294
6976 -294 -1 -202 7 -115 -13 -74 -229 -145 189 176 -124 13 -183 187 56 106 185 -26 178 -57 132 -50
6998 -50 -16 -27 -218 -157 -290 6 -138 -176 78 -193 -44 7 -56 52 -164 213 196 -6 2 73 109 120 57 -48 32
7023 32 196 -7 11 46 -91 -154 380 8 -267 52 -135 -34 -64 -77 -234 -104 251 59 -89 20 222 -99
7045 -99 -106 -96 68 -115 179 81 -211 -34 -155 73 -43 30 20 236 -159 -14 47 69 22 98 208 -123 -103 -131
7069 -131 211 -107 -87 -73 -34 108 -74 -177 231 -94 -106 -139 268 65 269 206 275 158 -268 256 56 246
7091 246 -194 -217 35 -13 -211 -32 83 -21 72 -120 -197 28 -33 -91 -186 -165 -106 -104 24 -62 -32 284 114 298
7115 298 71 -110 -196 133 36 171 19 -65 6 240 174 6 -79 112 117 124 -82 -331 165 116 20 -246 -57 69
7139 69 -31 -33 -206 141 -273 83 48 17 64 -222 113 -112 -85 -46 -4 -235 120 -331 14 252 -70 111 25
7162 25 -124 -12 -21 37 -482 -104 -208 -376 -81 -215 57 144 -39 69 9 98 186 10 20 -27 18 156 107 -15
7186 -15 112 338 -94 143 -3 129 82 -7 -93 -154 80 65 61 313 226 -160 -71 -84 -3 154 -55 -203 80 -14
7210 -14 35 333 -114 -211 149 20 -259 -195 -204 33 119 -37 2 115 121 193 82 81 -111 -262 -234 -148 83 -163 -29
7235 -29 -69 -90 25 185 358 -175 171 225 -70 45 390 176 230 13 142 45 -134 63 -221 -37 -109 175
7257 175 -28 -144 6 9 -69 149 -94 -76 327 72 -305 18 -79 -234 157 -22 -116 -106 -127 24 205 -24 -98
7280 -98 -96 -157 277 134 -96 -33 27 209 -123 -111 -13 25 -227 -98 -48 -160 211 141 220 22 -76 51 -34 -31 27 122
7306 122 -24 -199 49 155 16 46 108 -202 2 14 25 117 80 36 -43 -97 -94 84 -14 127 38 -60 55 -68 56
7331 56 8 151 -21 90 198 64 -31 -56 -1 115 111 71 237 3 -37 -174 85 8 -3 107 -21 91 29 -62
7355 -62 -248 -43 102 -293 -42 -83 68 98 -99 137 228 36 97 35 -100 -27 10 -86 -16 -31 35 -175 114 174
7379 174 31 197 41 157 110 -95 10 -1 -39 264 208 166 27 218 -251 159 -267 -254 -18 67 -45 -31 -221
7402 -221 126 119 143 28 -116 -55 82 170 -299 -146 138 26 -95 93 106 -6 -85 46 -251 -94 67 153 -110
7425 -110 108 64 -16 69 89 -45 -59 -18 -183 32 19 90 221 -231 -122 55 -14 -226 27 -254 -178 186 -32
7448 -32 -37 -260 -15 -45 168 -48 -184 77 -6 67 -104 -62 170 2 143 -62 235 12 -171 -86 -47 88 353
7471 353 85 -18 -81 -2 -112 167 -74 -3 -169 74 -122 65 122 223 -177 -43 138 106 -116 -147 29 30 63
7494 63 -207 34 -101 199 -134 96 -1 -77 91 -32 -79 27 -52 -82 -165 236 -391 24 58 21 261 -130 -357
7517 -357 -273 81 120 142 -59 -208 129 25 -14 55 -253 -30 219 117 64 25 -30 110 35 21 -38 289 -115 111
7541 111 -85 115 222 48 -53 -131 -167 49 159 -234 106 -128 -73 14 -124 -8 -12 58 -29 -112 -31 -175 121
7564 121 123 181 115 -152 -63 -143 -1 180 -22 206 27 83 65 138 72 -200 -79 -159 167 86 -277 -53 -17 53 -126
7589 -126 -93 166 203 -95 -49 -54 -2 70 -24 154 164 -215 187 130 -116 -22 -379 -243 -19 122 -61 -99 -238 86
7613 86 247 98 144 -37 -105 -66 -99 -20 116 152 -35 -464 -11 -84 -151 290 33 33 -5 169 -203 73 -84 67
7637 67 -114 -20 225 -172 -66 240 95 157 -80 -191 267 111 99 -180 157 31 -22 25 167 -166 -207 -73
7659 -73 -211 5 -55 47 -37 58 90 -85 5 54 -184 -23 -218 -60 -172 25 -52 -82 18 140 67 79 -13 -129
7683 -129 81 -78 -57 -202 31 -31 13 -59 -59 -88 91 43 -84 -80 -34 21 144 61 -71 29 -66 -57 -96 -115 121 83
7709 83 132 63 190 11 70 105 185 -49 -228 -70 160 -35 0 -315 -5 26 97 115 -292 93 126 -99 -111 26
7733 26 -7 -121 -41 -56 -35 -55 201 -67 -198 12 -180 39 24 -322 -136 -65 128 107 51 -144 -44 54 86 94 113
7758 113 94 -93 78 -145 153 10 124 -89 73 8 -163 126 151 -24 -9 -16 -118 149 -14 20 58 -123 75
7781 75 -56 19 -363 256 114 -90 -56 -42 169 200 -38 -160 -100 -129 49 -262 76 -195 -4 114 83 -50 174
7804 174 67 9 56 33 -140 20 198 55 -28 82 -91 -205 62 127 -69 152 45 78 350 167 29 -135
7826 -135 -224 5 -83 36 -202 -40 41 -47 207 160 286 -22 -103 161 -413 122 -161 -62 18 -11 213 50 8
7849 8 -60 -161 5 116 62 26 -131 -37 -15 67 -153 -124 78 -64 59 23 90 -72 3 -202 -165 -218 -21 -115 -62
7874 -62 513 49 210 -103 46 -204 26 -239 56 38 -1 25 -125 -17 -59 74 112 -75 -201 301 -261 127
7896 127 15 117 164 -94 -81 6 -70 202 147 143 -130 128 135 170 -255 -135 -73 201 1 128 65 -8 46 -71 -32
7921 -32 110 -146 -121 -140 74 -122 -107 93 -130 -149 78 -7 144 32 -86 150 -206 -56 46 -53 -88 -119 -195
7944 -195 169 52 253 79 182 14 27 -65 346 59 -127 -6 -215 319 -8 -3 -145 -194 25 199 -66 -21
7966 -21 82 -83 197 45 124 67 -235 269 69 -157 -27 -36 158 -94 168 -73 83 -4 166 168 -47 80 -67
7989 -67 69 16 -171 73 36 -148 265 158 133 -158 -47 172 -45 -195 -316 45 -130 365 354 99 19 -64
8011 -64 139 105 -132 131 59 -126 -275 57 5 -60 -257 -122 230 -89 -150 -47 26 -41 130 -178 -132 66 49
8034 49 -152 -81 6 -89 -3 -242 210 -121 90 250 142 -88 -244 -19 109 237 172 138 -27 -34 -153 6 275
8057 275 -106 42 35 8 19 192 -144 111 -278 283 -89 -19 190 42 181 -352 319 215 82 -231 153 -141
8079 -141 -35 -226 100 -9 -18 318 118 -6 -68 161 -58 -127 -39 31 -7 242 -106 247 -64 -147 -56 -198 -112
8102 -112 -26 -166 -223 -161 250 99 2 193 98 -15 -249 31 -98 -30 34 69 50 150 -24 -111 156 -22 152
8125 152 106 -148 -34 -22 -47 70 13 205 7 106 -188 -30 104 -256 39 142 186 -80 108 83 -150 44
8147 44 -131 28 228 -121 -38 158 -59 34 -240 117 -20 -100 18 -226 192 -133 19 108 -55 -49 -28 -68 -268
8170 -268 62 147 -165 19 -244 -18 22 -154 30 24 -153 -113 3 80 -61 209 10 130 33 91 -105
8191a05
##END NTUPLES=NMR FID
##END=
