##TITLE=1H_UK-12
 CD2Cl2,8 sc, 
 9.03.2021
##JCAMPDX= 6.0         $$ Bruker NMR JCAMP-DX V2.0
##DATA TYPE= NMR FID
##DATA CLASS= NTUPLES
##ORIGIN= UXNMR, Bruker Analytische Messtechnik GmbH
##OWNER= root
$$ XWIN-NMR		Version 3.5
$$ Tue Mar  9 10:40:00 2021 Russian Standard Time (UT+4h)  she@DPX200
##.OBSERVE FREQUENCY= 200.131506
##.OBSERVE NUCLEUS= ^1H
##.DELAY= (6, 6)
##.ACQUISITION MODE= SIMULTANEOUS
##.ACQUISITION SCHEME= undefined
##.AVERAGES= 8
##.DIGITISER RES= 18
##SPECTROMETER/DATA SYSTEM= spect
##.PULSE SEQUENCE= zg30
##.SOLVENT NAME= CD2Cl2
##.SHIFT REFERENCE= (INTERNAL, CD2Cl2, 0, 15.7039)
##AUDIT TRAIL= $$ (NUMBER, WHEN, WHO, WHERE, WHAT)
$$ ##TITLE= Audit trail, XWIN-NMR		Version 3.5
$$ ##JCAMPDX= 5.01
$$ ##ORIGIN= Bruker BioSpin GmbH
$$ ##OWNER= she
$$ F:/spectra/data/she/nmr/H-F/1/audita.txt
$$ ##AUDIT TRAIL=  $$ (NUMBER, WHEN, WHO, WHERE, WHAT)
(   1,<2021-03-09 10:38:30.21 +0400>,<she>,<DPX200>,
      <created by zg, POWCHK disabled, PULCHK disabled
       configuration hash MD5:
       00 E9 B6 7A A2 85 ED C7 34 08 36 98 17 FE 4E 26
       data hash MD5: 16K
       26 66 BF 5E 93 67 DB 6A 13 95 B2 8B B7 74 83 32>)
$$ ##END=
$$ 
$$ hash MD5
$$ 40 DE 12 D3 61 FB 6F 6C C4 C3 BD C9 DE 1A 67 E6
##$RELAX= 
##$RELAX= 
##$RELAX= 
##$RELAX= 
##$RELAX= 
##$RELAX= 
$$ Bruker specific parameters
$$ --------------------------
##$DU= <F:/spectra>
##$EXPNO= 1
##$NAME= <H-F>
##$PROCNO= 1
##$TYPE= <nmr>
##$USER= <she>
##$AMP= (0..31)
100 100 100 100 100 100 100 100 100 100 100 100 100 100 100 100 100 100 
100 100 100 100 100 100 100 100 100 100 100 100 100 100 
##$AQSEQ= 0
##$AQ_mod= 1
##$AUNM= <au_zg>
##$AUTOPOS= <>
##$BF1= 200.13
##$BF2= 200.13
##$BF3= 200.13
##$BF4= 200.13
##$BF5= 200.13
##$BF6= 200.13
##$BF7= 200.13
##$BF8= 200.13
##$BYTORDA= 1
##$CFDGTYP= 0
##$CFRGTYP= 5
##$CHEMSTR= <none>
##$CNST= (0..31)
1 1 145 1 1 1 1 1 1 1 1 1 1 1 1 1 1 1 1 1 1 1 1 1 1 1 1 1 1 1 1 1 
##$CPDPRG= <>
##$CPDPRG1= <>
##$CPDPRG2= <>
##$CPDPRG3= <>
##$CPDPRG4= <mlev>
##$CPDPRG5= <mlev>
##$CPDPRG6= <mlev>
##$CPDPRG7= <mlev>
##$CPDPRG8= <mlev>
##$CPDPRGB= <>
##$CPDPRGT= <>
##$D= (0..31)
0 1.2 0 0 0 0 0 0 0 0.06 0 0.03 0 0 0 0 0.0002 0 0 0 0 0 0 0 0 0 0 0 0 
0 0 0 
##$DATE= 1615271909
##$DBL= (0..7)
120 120 120 120 120 120 120 120 
##$DBP= (0..7)
150 150 150 150 150 150 150 150 
##$DBP07= 0
##$DBPNAM0= <>
##$DBPNAM1= <>
##$DBPNAM2= <>
##$DBPNAM3= <>
##$DBPNAM4= <>
##$DBPNAM5= <>
##$DBPNAM6= <>
##$DBPNAM7= <>
##$DBPOAL= (0..7)
0.5 0.5 0.5 0.5 0.5 0.5 0.5 0.5 
##$DBPOFFS= (0..7)
0 0 0 0 0 0 0 0 
##$DE= 6
##$DECBNUC= <off>
##$DECIM= 32
##$DECNUC= <off>
##$DECSTAT= 4
##$DIGMOD= 1
##$DIGTYP= 9
##$DL= (0..7)
0 120 120 120 120 120 120 120 
##$DP= (0..7)
150 150 150 150 150 150 150 150 
##$DP07= 0
##$DPNAME0= <>
##$DPNAME1= <>
##$DPNAME2= <>
##$DPNAME3= <>
##$DPNAME4= <>
##$DPNAME5= <>
##$DPNAME6= <>
##$DPNAME7= <>
##$DPOAL= (0..7)
0.5 0.5 0.5 0.5 0.5 0.5 0.5 0.5 
##$DPOFFS= (0..7)
0 0 0 0 0 0 0 0 
##$DQDMODE= 0
##$DR= 18
##$DS= 0
##$DSLIST= <SSSSSSSSSSSSSSS>
$$ [...]
##$SUBNAM2= <"">
##$SUBNAM3= <"">
##$SUBNAM4= <"">
##$SUBNAM5= <"">
##$SUBNAM6= <"">
##$SUBNAM7= <"">
##$SUBNAM8= <"">
##$SUBNAM9= <"">
##$SW= 16.9725357007746
##$SWIBOX= (0..15)
0 0 2 0 0 0 0 0 0 0 0 0 0 0 0 0 
##$SW_h= 3396.73913043478
##$TD= 16384
##$TD0= 1
##$TE= 0
##$TE2= 300
##$TE3= 300
##$TEG= 300
##$TL= (0..7)
0 120 120 120 120 120 120 120 
##$TP= (0..7)
150 150 150 150 150 150 150 150 
##$TP07= 0
##$TPNAME0= <>
##$TPNAME1= <>
##$TPNAME2= <>
##$TPNAME3= <>
##$TPNAME4= <>
##$TPNAME5= <>
##$TPNAME6= <>
##$TPNAME7= <>
##$TPOAL= (0..7)
0.5 0.5 0.5 0.5 0.5 0.5 0.5 0.5 
##$TPOFFS= (0..7)
0 0 0 0 0 0 0 0 
##$TUNHIN= 0
##$TUNHOUT= 0
##$TUNXOUT= 0
##$USERA1= <user>
##$USERA2= <user>
##$USERA3= <user>
##$USERA4= <user>
##$USERA5= <user>
##$V9= 5
##$VALIST= <valist>
##$VCLIST= <CCCCCCCCCCCCCCC>
##$VD= 0
##$VDLIST= <DDDDDDDDDDDDDDD>
##$VPLIST= <PPPPPPPPPPPPPPP>
##$VTLIST= <TTTTTTTTTTTTTTT>
##$WBST= 1024
##$WBSW= 4
##$XGAIN= (0..3)
0 0 0 0 
##$XL= 0
##$YL= 0
##$YMAX_a= 71255
##$YMIN_a= -73769
##$ZGOPTNS= <>
##$ZL1= 120
##$ZL2= 120
##$ZL3= 120
##$ZL4= 120
##$ABSF1= 10
##$ABSF2= 0
##$ABSG= 5
##$ABSL= 3
##$ALPHA= 0
##$AQORDER= 0
##$ASSFAC= 0
##$ASSFACI= 0
##$ASSFACX= 0
##$ASSWID= 0
##$AUNMP= <proc_1d>
##$AZFE= 0.1
##$AZFW= 0.1
##$BCFW= 1
##$BC_mod= 2
##$BYTORDP= 1
##$COROFFS= 0
##$CY= 11.3945322036743
##$DATMOD= 1
##$DC= 2
##$DFILT= <>
##$DTYPP= 0
##$F1P= 15.9154993809931
##$F2P= -4.1035820241983
##$FCOR= 0.5
##$FTSIZE= 0
##$FT_mod= 4
##$GAMMA= 1
##$GB= 0.15
##$INTBC= 1
##$INTSCL= 1
##$ISEN= 128
##$LB= 0.24
##$LEV0= 0
##$LPBIN= 0
##$MAXI= 10000
##$MC2= 0
##$MEAN= 0
##$ME_mod= 0
##$MI= 1.114404
##$NCOEF= 0
##$NC_proc= 0
##$NLEV= 6
##$NOISF1= 3.799351
##$NOISF2= 2.8
##$NSP= 1
##$NTH_PI= 0
##$NZP= 0
##$OFFSET= 15.70392
##$PC= 1
##$PHC0= -11120.75
##$PHC1= 17.20094
##$PH_mod= 1
##$PKNL= yes
##$PPARMOD= 0
##$PSCAL= 0
##$PSIGN= 0
##$REVERSE= no
##$SF= 200.130013532006
##$SI= 16384
##$SIGF1= 3
##$SIGF2= 2
##$SINO= 400
##$SIOLD= 16384
##$SREGLST= <1H.CDCl3>
##$SSB= 0
##$STSI= 0
##$STSR= 0
##$SW_p= 3612.71676300578
##$SYMM= 0
##$S_DEV= 0
##$TDeff= 0
##$TDoff= 0
##$TI= <>
##$TILT= no
##$TM1= 0
##$TM2= 0
##$TOPLEV= 0
##$USERP1= <user>
##$USERP2= <user>
##$USERP3= <user>
##$USERP4= <user>
##$USERP5= <user>
##$WDW= 1
##$XDIM= 8192
##$YMAX_p= 0
##$YMIN_p= 0
$$ End of Bruker specific parameters
$$ ---------------------------------
##NTUPLES= NMR FID
##VAR_NAME=  TIME,          FID/REAL,        FID/IMAG
##SYMBOL=    X,             R,               I
##VAR_TYPE=  INDEPENDENT,   DEPENDENT,       DEPENDENT
##VAR_FORM=  AFFN,          ASDF,            ASDF
##VAR_DIM=   8192,          8192,            8192
##UNITS=     SECONDS,       ARBITRARY UNITS, ARBITRARY UNITS
##FACTOR=    0.0002944,     1,               1
##FIRST=     0,             0,               0
##LAST=      2.4114304,     0,               0
##MIN=       0,             -73769,          0
##MAX=       2.4114304,     71255,           0
$$ Real data points
##PAGE= N=1
##DATA TABLE= (X++(R..R)), XYDATA
$$ [...]
1908I5J42k34j0l5J74N4l02l8j59L3j9J7j54L09J15K61k18P9k78K55L19J42m5
$$ 95 237 3 -7 -42 132 186 -116 -154 -313 -280 -299 -282 -436 -127 -12 249 31 110 -168 87 406 548 503
1931E03j76r4J19j55J39m23q0Pr8j60j63L8K93J60J84j18J57j61p8l0O5L0n7L34
$$ 503 327 233 352 197 336 -87 -167 -160 -258 -418 -581 -543 -250 -90 94 -24 133 -28 -106 -136 -71 -41 -98 236
1955B36r6j92O4K93N2J48R7J53k64l29k43k67j43k61K60l30J09K65J50N71K85
$$ 236 140 -52 12 305 357 505 602 755 491 162 -81 -348 -491 -752 -492 -822 -713 -448 -298 273 558
1976E58j65j3n1K8m46M9J2k96K11J47O2k80N72l98M22K65%n21J83n79k90l14o2
$$ 558 393 380 329 357 -89 -40 -28 -324 -113 34 96 -184 388 -10 412 677 677 156 339 -240 -530 -844 -906
1999i06q2O6M64K47J45K60N82k05J99j89O7l91k20j04m73L20o5J29K47Q7J99p9
$$ -906 -988 -922 -458 -211 -66 194 776 571 770 581 648 257 37 -67 -540 -220 -285 -156 91 178 377 298
2021B98J16l26l9j23n31l0k75J29r2j03O32K02N24J81J79lr6j5m07J10k59l88
$$ 298 414 88 49 -74 -605 -635 -910 -781 -873 -976 -344 -142 382 563 742 739 643 628 221 331 72 -316
2043c16J32j28j40K32J43p5L83n7n7l50K05q0m01k00J25k9J35L30k9P11j61K57
$$ -316 -184 -312 -452 -220 -77 -152 231 174 117 -233 -28 -108 -509 -709 -584 -613 -478 -148 -177 534 373 630
2065F30J47j95J13l96L00l18k49j85k3l03K52k98J9J44j8K31o0M50l44J4m4J80
$$ 630 777 582 695 299 599 281 32 -153 -176 -479 -227 -525 -506 -362 -380 -149 -209 241 -103 -89 -133 47
2087D7j92J86n3N3lJ80m4J55P7k26KPj83K0k27r8o3J9j63K98k71J09L73j40Q9
$$ 47 -145 41 -12 41 38 218 174 329 406 180 182 189 6 26 -201 -299 -362 -343 -506 -208 -479 -370 3 -137 -48
2112d8L0K76n9k6K02j16k16J33j39M04k72j6P3k14K93l32K09j07R7k60p8j14O6
$$ -48 -18 258 199 173 375 259 43 176 37 441 169 153 226 12 305 -27 182 75 172 -88 -166 -280 -214
2135b14q9o1K30k68K20o2J84K50L8k5J21N1j30K28k38k48Q6k7k76J14R0j0R8j53
$$ -214 -303 -364 -134 -402 -182 -244 -60 190 228 203 324 375 245 473 235 -13 73 46 -230 -116 -26 -36 62 -91
2159i1J81J78k93rk27P0m1m1P2j65K65j0M58k82L20k37K58k23J46m69J16L8k76
$$ -91 90 268 -25 -34 -261 -191 -232 -273 -201 -366 -101 -111 347 65 385 148 406 183 329 -140 -24 14 -262
2182b62K59Q7n05K38r4J25K56j03j74K93m6l00J71n8K35l99P9J8K69P0J18p3L
$$ -262 -3 84 -421 -183 -277 -152 104 1 -173 120 74 -226 -55 -113 122 -277 -198 -180 89 159 277 204 207
2205B07r6N3l80J91J37j78l1o3k67L26k5j57J45K75Mj71j5j6L11m09J90K97k20
$$ 207 111 164 -216 -25 112 -66 -97 -160 -427 -101 -126 -283 -138 137 141 -30 -45 -61 250 -159 31 328 108
2228A08l5l6lj05J84l8rj54J21P6k13P3J09k04R8R6k20L06J17l11L06o2p8J88
$$ 108 73 37 34 -71 113 75 66 -88 33 109 -104 -31 78 -126 -28 68 -152 154 271 -40 266 204 126 314
2252C14k07p4o2K07k12lP0j8m8k7q5P1L0K20n9n7p7J20r7J12O8k19K75n0j02j15
$$ 314 107 33 -29 178 -34 -37 33 15 -33 -60 -145 -74 -44 176 117 60 -17 103 6 118 186 -33 242 192 90 -25
2278b5j17J53j07q4L5J11o2j45K14J2K6m2K6P3j10j74m1J99J78Q4k39J4J35M1
$$ -25 -142 11 -96 -180 -145 -34 -96 -241 -27 -15 11 -31 -5 68 -42 -216 -257 -58 120 204 -35 -21 114 155
2302A55J93m31K96Q8p3j58m86N16k58M10m07J01J39j46J22j19K60k03K76k43l8
$$ 155 348 -83 213 301 228 70 -416 100 -158 252 -155 -54 85 -61 61 -58 202 -1 275 32 -6
2323fP7K0J2j97R5K95j14k97N8J01j31n5L09l45R6o5k40J74J38j29K00K1j32J94
$$ -6 71 91 103 -94 1 296 182 -115 -57 44 -87 -142 167 -178 -82 -147 -387 -213 -75 -204 -4 17 -115 79
2347G9rP8j87K43Q2m35L67j45j98R9k8K55M1j43k84K4Rn5O8l63L49J49k28o5J7
$$ 79 70 148 -39 204 286 -149 218 73 -125 -26 -54 201 242 99 -185 -161 -152 -207 -139 -502 -153 -4 -232 -297 -280
2372b80L2J75J68j26M51j31R4m07K64nJ5qO9l6k12%j74k6J44j30K07L1m34p8J40
$$ -280 -248 -73 95 -31 420 289 383 -24 240 235 250 242 311 275 63 63 -111 -137 7 -123 84 115 -319 -397 -257
2397b57mP5J90j35M2n4L95j60J14k5L76k85l5j04j08m13O00j69k02L40r0l66K61
$$ -257 -261 -186 4 -131 -89 -143 252 92 206 181 557 272 237 133 25 -388 212 43 -159 181 91 -275 -14
2420a4n7P5K3O5k57k16k5J16O6K20Q0m6M23m26L34o8J66pJ1k32j15P8l23n1jM4
$$ -14 -71 4 27 92 -165 -381 -406 -290 -224 -4 76 30 453 27 361 293 459 452 463 231 116 194 -129 -180 -181 -137
2446a37M8J51l19K35l02M15j09R6J09k61p4j93P9PJ15K92j16L07j30J42j58k43
$$ -137 -89 62 -257 -22 -324 91 -18 78 187 -74 -148 -341 -262 -255 -140 152 36 343 213 355 197 -46
2468d6N60k46l14m8j95O8m07M83j84K43J00R0j13Q8P3m43M30l8O3q6j99NJ8j98
$$ -46 514 268 -46 -94 -289 -221 -628 -145 -329 -86 14 104 -9 79 152 -291 139 101 164 78 -121 -116 -98 -296
2492b96N22L5k05K19L7l55J24r0j43l0j95J31n5p0J49K06n2J56J46L0l43k2R5
$$ -296 226 261 56 275 312 -43 81 -9 -152 -182 -377 -246 -301 -371 -222 -16 -68 88 234 264 -79 -101 -6
2515fO8O9N5j37j86Oj03l1K04K17m0K74p0n73K04j83O3m1rJ57k13J5o8K34K09
$$ -6 62 131 186 49 -137 -131 -234 -265 -61 156 116 390 320 -253 -49 -232 -169 -210 -219 -62 -275 -260 -328 -94 115
2540A15L3J60j33KL6jl68N0K80J69k48k79Jl0P1m9K6J84o8J64m0j75K1K74k09
$$ 115 148 308 175 177 213 212 -156 -106 174 343 95 -184 -183 -213 -142 -191 -165 19 -49 115 75 -100 -79 195 -14
2565a4J50j68j33j43L27j82J06K85R9K3k73k16p4R6j63K89qk48P6J2j12K81J01
$$ -14 136 -32 -165 -308 19 -163 -57 228 327 350 77 -139 -213 -117 -280 9 1 -247 -171 -159 -271 10 111
2588A11J32L6R4l43M0k0M9J09k86Op1J33k18K28K44N5o4k52J46k35j39q3L33o8
$$ 111 243 279 373 30 70 50 99 208 -78 -72 -143 -10 -228 0 244 299 235 -17 129 -106 -245 -328 5 -63
2612f3O2N7k62J18j28L30J2K9Q2K1l41m4M4j33K69mM1k04m7k33K48J5L16M2P7
$$ -63 -1 56 -206 -88 -216 114 126 155 237 258 -83 -127 -83 -216 53 49 90 -114 -161 -394 -146 -131 185 227 304
2637C04j56k11r8L3J35O4j55L65p4o03K99J8K10QJ11J25l52k62J66j33J74L0p2
$$ 304 148 -63 -161 -128 7 71 -84 281 207 -396 -97 -79 131 139 250 375 23 -239 -73 -206 -32 -2 -74
2660g4J33K17k52j14J4L30j63J45k23J52n6k13K8R9J79j29J02j11k06qk49M31
$$ -74 59 276 24 -90 -76 254 91 236 13 165 109 -104 -76 23 202 73 175 64 -142 -150 -399 32
2682C2P7Q2j86p8q6M3L1J52K8K27k11j21l88K13J82l53M37K23o4j28k93M8J97
$$ 32 109 191 5 -73 -159 -116 -85 67 95 322 111 -10 -398 -185 -3 -356 81 304 240 112 -181 -133 64
2705F4j0L71k45k06r9j38k07M19R1J35r3M5J49j50j55Q7p7K80l67K07m28r9O6
$$ 64 54 425 180 -26 -125 -263 -470 -51 40 175 82 127 276 126 -29 58 -19 261 -106 101 -327 -426 -360
2728c60K09M14k17K11r9p4k64L81j72J9J3r6k94J9P6O4J22PM67j7j34k7l69J62
$$ -360 -151 263 46 257 158 84 -180 201 29 48 61 -35 -329 -310 -234 -170 -48 -41 426 409 275 248 -121 41
2752D1n7J26k03K46l05m2n1K71q2J56K27N6k97k81J83q1k84K24J46l69P0J40k75
$$ 41 -16 110 -93 153 -152 -194 -245 26 -56 100 327 383 86 -195 -12 -93 -377 -153 -7 -376 -306 -166 -441
2775d41O68P8K68j57O1j97j55l60q1M13j92k5%l64J63j16L94M04k1J59k84r8k02
$$ -441 227 305 573 416 477 280 125 -235 -316 97 -95 -120 -120 -484 -321 -437 -43 361 340 499 215 117 -85
2798h5p8M9l5m4K63l20K30k23K34L99n1QM25m24l06l21k08J70J20J38k85P2J1
$$ -85 -163 -114 -149 -193 70 -250 -20 -243 -9 390 339 347 772 348 42 -279 -487 -317 -197 -59 -344 -272 -261
2821b61L04k05J58M61K18j58l33J7l46J91j54O7j35J7j6j43J87K28M71k26K2o7
$$ -261 43 -162 -4 457 675 517 184 201 -145 46 -108 -41 -176 -159 -175 -318 -131 97 568 342 364 297
2843B97l85k59n0q2J97K37j72J67n6o9K46J94K50O3M8k68k37l98r7Q8O1K73k79
$$ 297 -88 -347 -397 -479 -282 -45 -217 -50 -106 -175 71 265 515 578 626 358 121 -277 -374 -286 -225 48 -231
2866b31K52l1N4J56J18K86p0j88l11k68o2j33K5L0L51j4J32J33k68J99L71J25
$$ -231 21 -10 44 200 318 604 534 346 35 -233 -295 -428 -403 -373 -22 -36 96 229 -39 160 531 656
2888F56k70j45j83l42j96N0J07J77K08Q8J08j15r8J34J85k49K43j94l79k23j41
$$ 656 386 241 58 -284 -480 -430 -323 -146 62 150 258 143 45 179 364 115 358 164 -215 -438 -579
2909e79K20R9K65J93Q3rk6m17L59R0Q1k88k68k31M8M6l1O4M03j40J53O9k16K14
$$ -579 -359 -260 5 198 281 272 246 -171 188 278 359 71 -197 -428 -380 -334 -365 -301 102 -38 115 184 -32 182
2933A82Q7j25J3O6k39r7m54K67l28M84K89K97J9k40k75J27j47K26J90k51l09M
$$ 182 269 144 157 223 -16 -113 -567 -300 -628 -144 145 442 461 221 -54 73 -74 152 342 91 -218 -214
2955b14J2j65K00J87R4J31M1j25j36j88K87k81L57l08k4J25k05j41J49K84NL92
$$ -214 -202 -367 -167 20 114 245 286 161 25 -163 124 -157 200 -108 -132 -7 -212 -353 -204 80 85 477
2977D77l92j25J28j55J38j7k3J8k24m5j88J66K84J4L18j47n0m79J42J31J25j09
$$ 477 85 -40 88 -67 71 54 31 49 -175 -220 -408 -242 42 56 374 227 177 -302 -160 -29 96 -13
2999a3J69p9k00n4K52n0K47j58J50K4l18r9Q6J3N0L43k34j20j05o5o0J73J17M82
$$ -13 156 77 -123 -177 75 25 272 114 264 288 -30 -129 -43 -30 20 363 129 9 -96 -161 -221 -48 69 551
3023E51j89k62j70k25O6N38k02K1O5m83K54l52J84J90J45J79P7m75Jk35K81L90
$$ 551 362 100 -70 -295 -229 309 107 128 193 -290 -36 -388 -204 -14 131 310 387 -88 -87 -322 -41 349
3045C49k4k05m1j82j13k7j26K35L19J52k75m9j66j05L81k01L22q7j62j05n3j25
$$ 349 325 120 79 -103 -216 -243 -369 -134 185 337 62 13 -153 -258 123 -78 244 157 -5 -110 -163 -288
3067b88R8K62J58k14J49k04r6q7J29N16L0k18p6k91k67J44J03J41J21K4k8k67
$$ -288 -190 72 230 16 165 -39 -135 -222 -93 423 453 235 159 -132 -399 -255 -152 -11 110 134 106 -161
3089a61j07M5L57J47j07K14n00N7q8k04J39J92L3J95k22L5k84K90J84j22L3J6
$$ -161 -268 -223 134 281 174 388 -112 -55 -143 -347 -208 -16 17 212 -10 25 -259 31 215 93 126 142
3111A42j43j49j03j44K15J82K58j42J65l53P7N1J67P3j34k32p6q7j97N8J68K68
$$ 142 -1 -150 -253 -397 -182 0 258 116 281 -72 5 56 223 296 162 -70 -146 -233 -430 -372 -204 64
3133F4J54j33n3L04m39J52J54K1K27o45J24j42l84L77k14M36J37Jkj0k85M30O7
$$ 64 218 85 32 336 -103 49 203 224 451 -194 -70 -212 -596 -219 -433 3 140 141 139 129 -156 274 341
3156C41lj62l35N2m06j49K26N32m0L50j53pl2m05K14J4J39k81o5o1q6j09K13K95
$$ 341 338 176 -159 -107 -513 -662 -436 96 56 406 253 246 214 -191 23 37 176 -105 -170 -231 -317 -426 -213 82
3180H2L33j88L0j00L4j66K18M3l51m6l61P1r4J56K96j23M05L5Q4k31l16L61p7
$$ 82 415 227 257 157 191 25 243 286 -65 -111 -472 -401 -495 -339 -43 -166 239 274 358 127 -189 172 95
3203I5K1j89J88l98k88K61p0M92R2J89N6l26Jl67K52j61Q9J77k11k92K25l29K47
$$ 95 116 -73 115 -283 -571 -310 -380 112 204 393 449 123 124 -243 9 -152 -63 114 -97 -389 -164 -493 -246
3226b46L20Q2O0R6q1k01J35k10k8L5j81J71j49p5n0N11K25R5J96j71k57m23k3
$$ -246 74 156 216 312 231 30 165 -45 -73 -38 -219 -48 -197 -272 -322 189 414 509 705 534 277 -146 -169
3249a69J74j78k8L8l07L85n9p9M20J97k3L5j29j72j48J10k92J7p4L07l21K5j34
$$ -169 5 -173 -201 -163 -470 -85 -144 -223 197 394 371 406 277 105 -43 67 -225 -208 -282 25 -296 -271 -405
3272d05M59J59J90n2j45J40l72k27J35j62n3L03J3l38K2J88L81M5J01lm7m54R4
$$ -405 54 213 403 351 206 346 -26 -253 -118 -280 -333 -30 -17 -355 -333 -145 236 281 382 379 332 -122 -28
3295b8j4k61K40J87k21m2k05M20n5j0J8N45j95l39j44o5k44K28K1J66j21L7lJ4
$$ -28 -42 -303 -63 124 -97 -139 -344 76 21 11 29 574 379 40 -104 -169 -413 -185 -164 2 -119 -82 -85 -71
3319g1j05M34L8K93k24j20k82p6j08p5K79j10K46j98O4j36K33K47Qn0n6m93l9
$$ -71 -176 258 296 589 365 245 -37 -113 -221 -296 -17 -127 119 -79 -15 -151 82 329 337 287 231 -262 -301
3342c01o5J77q7O33o92N12K39n77J92J65p6l8K76j10j69k87j57J22M9J75L37j55
$$ -301 -366 -189 -276 357 -335 177 416 -161 31 196 120 82 358 248 79 -208 -365 -243 -194 -19 318 163
3364A63k08j7P3R6K2J16j29p8o1l45K35m6J75K00L5k95R0j45J92L0p6L2J77k72
$$ 163 -45 -62 11 107 129 245 116 38 -23 -368 -133 -179 -4 196 231 -64 26 -119 73 103 27 59 236 -36
3388c6m95N40l15J88p1L42j1J29k10k59J12L66j70Q6l4j80M1K28l97k5N2K49k96
$$ -36 -531 9 -306 -118 -189 153 142 271 61 -198 -86 280 110 196 162 -18 23 251 -146 -171 -119 130 -166
3411a66K66Ok1k22N13k02L9j23M8l27K63j96j78L01J69k9k08j95K88J5P7L10k96
$$ -166 100 106 85 -137 376 174 213 90 138 -189 74 -122 -300 1 170 141 -67 -262 26 41 118 428 132
3434A32j67j46k50K02Q3J95J20r6k3J95l04p0J91K4J02l1J07m30j54L03k49L93
$$ 132 -35 -181 -431 -229 -146 49 169 73 50 245 -59 -129 62 86 188 157 264 -166 -320 -17 -266 127
3456A27j87J42j91Q4j61K29l3R0K3M0k21o0K6j60K88K18j08rj98j0K2j64K89J13
$$ 127 -60 82 -109 -25 -186 43 10 100 123 163 -58 -118 -92 -252 36 254 146 137 -61 -71 -49 -213 76 189
3480A89L5m9j29P1n38J87M6K24J35m8j4k35l05L52k8L93p6r4j40j4j53J25K79
$$ 189 224 175 46 117 -421 -234 -188 36 171 123 109 -126 -431 -79 -107 286 210 116 -24 -38 -191 -66 213
3503B13N0j45j49o7K25j85N9J82k22J43l3j10k04J6M11o4%P5l86J4R0OL16k42
$$ 213 263 118 -31 -98 127 -58 1 183 -39 104 71 -39 -243 -227 184 120 120 195 -191 -177 -87 -81 235 -7
3527gK12k2k9M0m87K14r2R2J44k29J57N9k8j65Q1J76r7K72k68j2j85J06N1j84
$$ -7 205 183 154 194 -293 -79 -171 -79 65 -164 -7 52 24 -141 -60 116 19 291 23 11 -174 -68 -17 -201
3551b01M20l76J38J9p8L8J93k5J29m5l44J9j90J44N1q8K23j41K69l06K39m9J2
$$ -201 219 -157 -19 0 -78 -40 153 128 257 212 -132 -113 -303 -159 -108 -196 27 -114 155 -151 88 39 51
3574E1J47nk74K7k22P1J54J21j00J07j46J34j30L59j22l36K49J22M3l97j05m0
$$ 51 198 193 -81 -54 -276 -205 -51 70 -30 77 -69 65 -65 294 172 -164 85 207 250 -147 -252 -292
3596b92N8l3M55k90J50j25Q7k39N57j47j22N10m29l26k5L2pL23n9l6J98m01K63
$$ -292 -234 -267 188 -102 48 -77 10 -229 328 181 59 569 140 -186 -211 -179 -186 137 78 42 240 -161 102
3619A02J55r3j4l37J29j67q8R9K63K5o2K86P1m32K40j38oJ09k1j21k9n5j96P4
$$ 102 257 164 150 -187 -58 -225 -313 -214 49 74 12 298 369 -63 177 39 33 142 121 0 -29 -84 -280 -206
3643b06j04L46m6J8J20j62Mj28J31Q9Oj03L2j28j6J47L3J29J54j78M5n6l04J67
$$ -206 -310 36 -10 8 128 -34 -30 -158 -27 62 68 -35 -3 -131 -147 0 33 162 316 138 183 127 -177 -10
3667a0j96K15k0L48m25m0K20l07J1K44k01K34J01k54J72j90n1L36O1l02K60o5
$$ -10 -206 9 -11 337 -88 -128 92 -215 -204 40 -161 73 174 -80 92 -98 -149 187 248 -54 206 141
3689A41j15o5m9L2PL7K98m20j76M1K95l7j7l53O80l32k34J38R3r1J91J41k99J88
$$ 141 26 -39 -88 -56 -49 -12 286 -134 -310 -269 26 -11 -28 -381 299 -33 -267 -129 -36 -127 64 205 -94 94
3713I4k0l27M86nj60R9k61l6P2J85j58L39j61j89p8K9l17L19j14J05Kj17K61k27
$$ 94 74 -253 233 228 68 167 -94 -130 -58 127 -31 308 147 -42 -120 -91 -408 -89 -203 -98 -96 -213 48 -179
3737a79M01n03J17M64k76L83l33j80L07k30J11m7K62k47j32n2K1m8K65j79P2J1
$$ -179 222 -281 -164 300 24 407 74 -106 201 -29 82 35 297 50 -82 -134 -113 -161 104 -75 -3 8
3759Hk20M0M9K18j22N7k8K37l46K3J93kj49L54l1k88N2k21J98j05J65q8K4k27
$$ 8 -212 -172 -123 95 -27 30 2 239 -107 -84 109 107 -42 312 281 -7 45 -176 22 -83 82 -6 18 -209
3783b09K00j50K94j4o2L1p5lK7p7K40o27N21k06J86j0l6k5r8RJ30q9r0N9L1j50
$$ -209 -9 -159 135 121 59 90 15 12 39 -38 202 -425 96 -110 76 66 30 5 -93 -84 46 -43 -133 -74 -43 -193
3809a93J94J52k76J57L8n8q8J03q0J84K11m56P4nm1J43o8j90K05K30j95j63N9
$$ -193 1 153 -123 34 72 14 -74 29 -51 133 344 -112 -38 -43 -84 59 -9 -199 6 236 41 -122 -63
3832f3K46k90J79j30J14m7P4j26R3l6j36L31j69j08j03J32J41l88L54j01j23L2
$$ -63 183 -107 72 -58 56 9 83 -43 50 14 -122 209 40 -68 -171 -39 102 -286 68 -33 -156 -124
3854a24j7R4n4R5n1J21j02K50l19J64M4K11k13J03j10J6j1p9j8P7j31j08O8O9
$$ -124 -141 -47 -101 -6 -57 64 -38 212 -107 57 101 312 99 202 92 108 97 18 0 77 -54 -162 -94 -25
3878b5j19P5k07N60k87l8J11j88M38l58N0R8m0J55J8k47K05k26mj75J78J21k25
$$ -25 -144 -69 -276 284 -3 -41 70 -118 320 -38 12 110 70 225 243 -4 201 -25 -29 -204 -26 95 -130
3901a30R7l6j34n1L39j24j58J34n0j19L00O7o3m2j1Q3j19p0J21Q5M3j96K10J2
$$ -130 -33 -69 -203 -254 85 -39 -197 -63 -113 -232 68 135 72 30 19 102 -17 -87 34 119 162 -34 176 188
3925A88k14j16J76j01p2J75k3on8j76M8J76j56J70k01J83o5J13j69K43l7p6P7
$$ 188 -26 -142 34 -67 -139 36 13 7 -51 -227 -179 -3 -159 11 -190 -7 -72 41 -128 115 78 2 79
3948G9j22J43J74l12O5j1J43k21J38R8k48J17p2R0J26k88j47J7J29J65j84L08
$$ 79 -43 100 274 -38 27 16 159 -62 76 174 -74 43 -29 61 187 -101 -248 -231 -102 63 -121 187
3970A87o1Lrq3Q6Q3Qk61r8K49r3K67r5k06J81k07K16j47j96m1K07r6K8J49j03
$$ 187 126 129 120 37 123 206 214 -47 -145 104 11 278 183 -23 158 -49 167 20 -176 -217 -10 -106 -78 71 -32
3995c2oj6O6o2K7M07p2n8rK4j34j54L32j35k23o7R7k30J67J7j75K80%J58k88J82
$$ -32 -38 -54 12 -50 -23 384 312 254 245 269 135 -19 313 178 -45 -112 -15 -245 -78 -61 -236 44 44 202 -86 96
4021I6k81o5J06P8J92m8j30M11j84j1K05k64K59k73j4J39k99r5o0Q7m9J36O7j76
$$ 96 -185 -250 -144 -66 126 78 -52 359 175 164 369 105 364 91 77 216 -83 -178 -238 -151 -200 -64 3 -173
4045a73K55j50K03k15J13K99l85Q0j12n2L02j22m1Q0j09mK96pj48l61K5J91k28
$$ -173 82 -68 135 -80 33 332 -53 27 -85 -137 165 43 2 82 -27 -31 265 258 110 -251 -226 -35 -263
4068b63J45l03J36J29R0P5lj7K58k01J03J68l32lnj9j82J42J47L4k74M12j52j04
$$ -263 -118 -421 -285 -156 -66 9 6 -11 247 46 149 317 -15 -18 -23 -42 -224 -82 65 99 -175 237 85 -19
4092a9J35j71J41k36J18J6j79R5lj2LP2O2N2l1l9K91k1m1o6k2J9J6l09J10M2r8
$$ -19 116 -55 86 -150 -32 -16 -195 -100 -103 -115 -112 -40 22 74 43 4 295 274 233 167 145 164 180 -129 -19 23 -75
4119g5l7L8J60k26J07QOn3j6J84r9p4R3r1k06K56M4j00K68k07J53j90N8K31j69
$$ -75 -112 -74 86 -140 -33 -25 -19 -72 -88 96 -3 -77 16 -75 -281 -25 19 -81 187 -20 133 -57 1 232 63
4144F3J29j33k43J06L4l3J21k17J26j8J25j81K92M7j88J20j03k3o2J70r9M2K0
$$ 63 192 59 -184 -78 -44 -77 44 -173 -47 -65 60 -121 171 218 30 150 47 24 -38 132 33 75 95
4167I5q2l7P6L29l55j9K03l72J0J45j93J23P7j35j20K00j27J25M7J6R4l4m3j09
$$ 95 13 -24 52 381 26 7 210 -162 -152 -7 -200 -77 0 -135 -255 -55 -182 -57 -10 6 100 66 23 -86
4191h6k09L50j20j07K22M9j72J46Mj33K56J6k65m6R2J66k36j99q7L87K34j74k50
$$ -86 -295 55 -65 -172 50 99 -73 73 77 -56 200 216 -49 -95 -3 163 -73 -272 -359 28 262 88 -162
4214a62J58j30P7Q9P6j35J84R4k33j32K24k01j28J45k30J74J4L15p5J16k37k60
$$ -162 -4 -134 -57 32 108 -27 157 251 18 -114 110 -91 -219 -74 -304 -130 -116 199 124 240 3 -257
4236b57K54q6l5K02k00P2j23N3K99k82K22k17L6J12M4k11Q9o7J90j23J96k35N2
$$ -257 -3 -89 -124 78 -122 -50 -173 -120 179 -103 119 -98 -62 50 94 -117 -28 -95 95 -28 168 -67 -15
4259a5j4j12O2J68j79Q5Kk2K00k37Q9r4J13J79k96K2R2j21k43J31m6J60K26j19
$$ -15 -29 -141 -79 89 -90 -5 -3 -25 175 -62 27 -67 46 225 -71 -49 43 -78 -321 -190 -236 -76 150 31
4283C1J27m2J08r3j44j95J56n8m1n2K34m7k36K44q5J97Jj63K10k05M6K5p7K4k04
$$ 31 158 116 224 131 -13 -208 -52 -110 -151 -203 31 -16 -252 -8 -93 104 105 -58 152 -53 -7 18 -59 -35 -239
4308b39N7j62K48K12m6J55j38N6j4J07l45O5j07l5k9MK60k39Q8J87j70J55N7N
$$ -239 -182 -344 -96 116 70 225 87 143 129 236 -109 -44 -151 -186 -215 -211 49 -190 -102 85 -85 70 127 132
4332A32lj77j17n6J5j8J83j29K37om8J07j71Q9N16m35j47R6k06K37l20K96Q5l07
$$ 132 129 -48 -165 -221 -206 -224 -41 -170 67 61 13 120 -51 38 554 119 -28 68 -138 99 -221 75 160 -147
4356a47K12j25J18K21j25Q0j71j25J65j49j57QK46J76r9q2J02Ok4K27k37k59L90
$$ -147 65 -60 58 279 154 234 63 -62 103 -46 -203 -195 51 227 128 46 148 154 130 357 120 -139 251
4379B51k92j55j24O1K66p3L9j58m0K55k4K50j58q7o0jL7P6P5K7r4J52j42k06J32
$$ 251 -41 -196 -320 -259 7 -66 -27 -185 -225 30 6 256 98 11 -49 -50 -13 63 138 165 71 223 81 -125 7
4404GR4J50l25K9l3J92j41j54j05K61j15N8J01j49L48k12P8k7j75K46L85l65r3
$$ 7 101 251 -74 -45 -78 114 -27 -181 -286 -25 -140 -82 19 -130 218 6 84 57 -118 128 513 148 55
4427E5O3j50J36k86J88p2j88J11nJ84k9K53k85N0J98l18Q6k05J08r1J92q6J24
$$ 55 118 -32 104 -182 6 -66 -254 -143 -148 36 7 260 -25 25 223 -95 -9 -214 -106 -197 -5 -91 33
4450C3q6L77m6P5m5j88K92l04p8r2n8J37l08p9J83K34j42K15J36J36l37j32j17
$$ 33 -53 324 278 353 308 120 412 108 30 -62 -120 17 -291 -370 -187 47 -95 120 256 392 55 -77 -194
4473a94K25j28k29K14l7P6L93j08j94J69K00Pk08l6o8k11q1%p5M2J06M4j2Q0P3
$$ -194 31 -97 -326 -112 -149 -73 320 212 18 187 387 394 186 150 82 -129 -210 -210 -285 -243 -137 -93 -105 -25 48
4498D8O5Q6k32K49r1rk36j41P2K10K39k05m2J08O9j22J28j73j5o9J8m32L99J23
$$ 48 113 199 -33 216 125 116 -120 -261 -189 21 260 55 13 121 190 68 196 23 8 -61 -43 -475 -76 47
4522D7k34k35L19J66r1K66l9k62K76j67j37J72p2Q8l1M3k72MK34m4q5J0J22j14
$$ 47 -187 -422 -103 63 -28 238 199 -63 213 46 -91 81 9 97 66 109 -163 -159 75 31 -54 -44 78 -36
4546c6n0O1l08J30J08n5J62N2j08M5J46m4L30k93l02M24j32l1R1k69K52k21K47
$$ -36 -86 -25 -333 -203 -95 -150 12 64 -44 1 147 103 433 140 -162 262 130 99 190 -79 173 -48 199
4569A99n1r1J2k4o0r5J73j12J41l63L42p6K6Q5j96M5k3Q7j66K88M9j45j81K0J19
$$ 199 148 57 69 45 -15 -110 63 -49 92 -271 71 -5 21 106 -90 -45 -68 19 -147 141 190 45 -136 -116 3
4594CN4P4q1J06J94k47j51k25K40p5lL70j32l24J14P1J50j0Q9J86l87Lk93qL12
$$ 3 57 131 50 156 350 103 -48 -273 -33 -108 -111 259 127 -197 -83 -12 138 128 217 403 16 19 -274 -282 30
4619C0j12K77l72J20J24K31j19j92J25n4j82J12J46l10M2l4j20K12J62k7K52l09
$$ 30 -82 195 -177 -57 67 298 179 -13 112 58 -124 -12 134 -176 -134 -168 -288 -76 86 59 311 2
4641BJ08K8p2j02j27O4k61L59J24j15OJ8q5J11j82R2n0J89j41j52M2J62L6j41
$$ 2 110 138 66 -36 -163 -99 -360 -1 123 8 14 32 -53 58 -124 -32 -82 107 -34 -186 -144 18 54 -87
4665h7P6J42mk65J54o7J70P8l47J25j18N3P1N0L5j14L86j10K0Kk66J18r3L27m18
$$ -87 -11 131 127 -138 16 -51 119 197 -150 -25 -143 -90 -19 31 66 -48 338 228 248 250 -16 102 9 336 -82
4690h2J88K4l64K14K0n8J7J74l5k12r1K92j89Lo2J22M0J59N1j74o1J2N9o4J97
$$ -82 106 130 -234 -20 0 -58 -41 133 98 -114 -205 87 -102 -99 -161 -39 1 160 211 37 -24 -12 47 -17 180
4715A80o6%j1j18L50n43J70J48pj52n6J18k79R2O0LK2l11L18K86l30O1K29N2k00
$$ 180 114 114 103 -15 335 -208 -38 110 103 -49 -105 13 -266 -174 -114 -111 -89 -400 -82 204 -126 -65 164 216 16
4740A6k0J06k67Q4J13k59J89j61m7K01J0P5J42j59jm7k75J02P6n2j81J03L05K13
$$ 16 -4 102 -165 -81 32 -227 -38 -199 -246 -45 -35 40 182 23 22 -25 -300 -198 -122 -174 -355 -252 53 266
4764B66R5j3p1O3m48K80L3n8l92J82k63J95J35o7l6J79Q2l7J07k69l18K36m5m2
$$ 266 361 348 277 340 -108 172 205 147 -245 -63 -326 -131 4 -63 -99 80 162 125 232 -37 -355 -119 -164 -206
4788b06J03k2J54k6J30j00K58K19j28j48j56J92r6j00j84J05k99N9J88j29J32
$$ -206 -103 -125 29 3 133 33 291 510 382 234 78 270 174 74 -110 -5 -304 -245 -57 -186 -54
4809e4j39L38n2J91j53r5k05Oo4J79J03J84j58J66k8N8p8o3j78J26n7j90J44j83
$$ -54 -193 145 93 284 131 36 -169 -163 -227 -48 55 239 81 247 219 277 199 136 -42 84 27 -163 -19 -202
4833b02l6N6R0l59L26R6j05J96j13L4J98k73K3L21k02J08n5k22L17j23m5K55l63
$$ -202 -238 -182 -92 -451 -125 -29 -134 62 -51 -17 181 -92 -69 252 50 158 103 -119 198 75 30 285 -78
4856g8J06r2j20R1n4Q4l8j29J91j31JP2P8M5M1R8q8K00q1k65L80k15j4o8kjK5
$$ -78 28 -64 -184 -93 -147 -63 -101 -230 -39 -170 -169 -97 -19 26 67 165 77 277 196 -69 311 96 82 14 12 11 36
4883C6N0k48nJ11j15J87R9q4k9j63Q1q4r8L19o6M1J17k23J9N3J67Q5j06p4Qk04
$$ 36 86 -162 -167 -56 -171 16 115 31 2 -161 -80 -164 -262 57 -9 32 149 -74 -55 -2 165 250 144 70 78 -126
4909a26K16j83k6r0J21r4n3R0R8L2J10K9k74J96l64L46J8q9k8l9J6J77q1Q0j2
$$ -126 90 -93 -119 -209 -88 -182 -235 -145 -47 -15 95 124 -150 46 -318 28 46 -43 -71 -110 -94 83 2 82 70
4934G0J91K05j42k19K28m02l5j19Q9L9j1j17K43J20j82p9L78j66J16l55J73l07
$$ 70 261 466 324 105 333 -69 -104 -223 -134 -95 -106 -223 20 140 -42 -121 257 91 207 -148 25 -282
4956b82J17j8l2l1K47j45L33n8n3J38K7k76k1L6Rj42J36m48N13p3r8Q8j0K51q3
$$ -282 -165 -183 -215 -246 1 -144 189 131 78 216 243 -33 -54 -18 -9 -151 -15 -463 50 -23 -121 -33 -43 208 125
4981A25P6k83n6J79n1J04q4r0Q4K33l67O5J41j07J42k57j69J22K05j66R9j19R6
$$ 125 201 -82 -138 41 -10 94 10 -80 4 237 -130 -65 76 -31 111 -146 -315 -193 12 -154 -55 -174 -78
5004g8j56L08j1jM5k67M2l1J18o8l6K35r7j24J70rk02L87r2j65k5J40k55J63q8
$$ -78 -234 74 63 62 107 -160 -118 -149 -31 -99 -135 100 3 -121 49 40 -162 225 133 -32 -57 83 -172 -9 -97
5029i7Q9n0J4N9j1J15k51J5Q1k2M2J9q7j17j8J66n7J74j38J1K23r3k67K55%R4
$$ -97 -8 -58 -44 15 4 119 -132 -117 -36 -58 -16 3 -84 -201 -219 -53 -110 64 -74 -63 160 67 -200 55 55 149
5055A49Oj91rM9j3j34L43j90Q7Q1k46Mp6J34k36l0K89j17j66K62Q0J94m47M99
$$ 149 155 -36 -45 4 -9 -143 200 10 97 178 -68 -64 -140 -6 -242 -272 17 -100 -266 -4 76 270 -177 322
5079C22K4k97L3J2K3l64L12k89L02m0Q0j64J69P5k10o4k7K81k37P9k08J61j30
$$ 322 346 49 82 94 117 -247 65 -224 78 38 118 -46 123 198 -12 -76 -103 178 -59 20 -188 -27 -157
5102a57J47K3j06j11K17K96k60J33L5j26no0j59K29r8Jn3l1j12O1L52k66l8L24
$$ -157 -10 13 -93 -204 13 309 49 182 217 91 86 26 -133 96 -2 -1 -54 -85 -197 -136 216 -50 -88 236
5126B36m89L41j86O8J07k09N03k62j59R8J26n4kl8j20J63p8Q0l03L1O1N3r9k2
$$ 236 -253 88 -98 -30 77 -132 371 109 -50 48 174 120 118 80 -40 123 45 125 -178 -147 -86 -33 -132 -154
5150a54Q2j61J59j23K57k3k6j20L97k92M3J32J34j27j9N8Nj88J51j5m1j25j82
$$ -154 -72 -233 -74 -197 60 37 11 -109 288 -4 39 171 305 178 159 217 222 34 185 170 129 4 -178
5173a78J35J91l81N4j50K04K90m62J83L34j78j26J7P7K31K5l23K74m2j6n0j30
$$ -178 -43 148 -233 -179 -329 -125 165 -297 -114 220 42 -84 -67 10 241 266 -57 217 175 159 109 -21
5195b1J92l02N6m4J52o9j39J57l4j91K85j71j07R1j18L00Q0j22L00l69K73j82
$$ -21 171 -131 -75 -119 33 -36 -175 -18 -52 -243 42 -129 -236 -145 -263 37 117 -5 295 -74 199 17
5217A7n7M31j61j67nJ02p2j41J08m06K06rl9P5l6K20k16K32j25L20l48n9L18J51
$$ 17 -40 391 230 63 58 160 88 -53 55 -351 -145 -154 -193 -118 -154 66 -150 82 -43 277 -71 -130 188 339
5241C39m78L86J47l19J54n8p0j18k0J25k5j01J19k44J05j81J8N9P8r7N8K6J55
$$ 339 -139 247 394 75 229 171 101 -17 -37 88 63 -38 81 -163 -58 -239 -221 -162 -84 -181 -123 -97 58
5264E8l7J99j29m4K7Oj86J71q2K3J54n8J85j66p4n1L1j6j82J17K8k58P1k30O30
$$ 58 21 220 91 47 74 80 -106 65 -17 6 160 102 287 121 47 -4 27 11 -171 -54 -26 -284 -213 -443 187
5289A87j90jP2k18R3O7M4J46j89k01M82l93J98j31K69k00j69K34j10n0j83P5p
$$ 187 -3 -4 68 -150 -57 10 54 200 11 -190 292 -101 97 -34 235 35 -134 100 -10 -60 -243 -168 -175
5312a75O5O5j74K43J16j36K2r5L2J02M7J18l09L69J2k13j26J07J8p2Jj10J73r8
$$ -175 -110 -45 -219 24 140 4 26 -69 -37 65 112 230 -79 290 302 89 -37 70 88 16 17 -93 80 -18
5336a8Q2r8K0j66L2J7J61j75J12k22J50M9l4R2J07P4j72k0K41q4r0J31j38O0j57
$$ -18 64 -34 -14 -180 -148 -131 30 -145 -33 -255 -105 -56 -90 2 109 183 11 -9 232 148 58 189 51 111 -46
5361d6L1R4k39K63j59k6J33nj32O3j61K22k23J68j22L12lj84m0PL2j34J39L0O5
$$ -46 -15 79 -160 103 -56 -82 51 46 -86 -23 -184 38 -185 -17 -139 173 170 -14 -54 -47 -15 -149 -10 20 85
5386H5j44q5J34J65r3R9j34p3J72k73K40k08R9km3J45L8j49j30L44j86kp2J62
$$ 85 -59 -144 -10 155 62 161 27 -46 126 -147 93 -115 -16 -18 -61 84 122 -27 -157 187 1 -1 -73 89
5410H9j18j38L11k77J13Rr4n4l3K68o2j05R2j14p6K22R5j7l55N94l06l3K40k46
$$ 89 -29 -167 144 -133 -20 -11 -105 -159 -192 76 14 -91 1 -113 -189 33 128 111 -244 350 44 11 251 5
5434EK9l46M03J17j08R2k95l55L74p3J35q9J20J43J12m90K00K0N3M0K6q9J14k22
$$ 5 34 -312 91 208 100 192 -103 -458 -84 -157 -22 -111 9 152 264 -226 -26 -6 47 87 113 24 138 -84
5458h4P0j20J86O7O7k83L16k15k07K04N2l47K93K6j53L23k21R6r9K88k43KJ27
$$ -84 -14 -134 52 119 186 -97 219 4 -203 1 53 -294 -1 25 -128 195 -26 70 -29 259 16 18 145
5481A45k9l1j82mj18K23r3j19K30Kj77O0K25k00J85k16K64k68L42m65L52l5J66
$$ 145 116 85 -97 -101 -219 4 -89 -208 22 24 -153 -93 132 -68 117 -99 165 -103 239 -226 126 91 257
5504B57m12M46qj61k2j13K4L7j58j75K62N3p7J19j16K41k3K5k65L5J72k15K21
$$ 257 -155 291 283 122 100 -13 11 48 -110 -285 -23 30 -47 72 -44 197 174 199 -66 -31 141 -74 147
5527A47j86P7p7L64l40K4j33J56J38k64L5m7N5pJ13r7j8j09k57M49j13R9j36K62
$$ 147 -39 38 -39 325 -15 9 -124 32 170 -94 -59 -106 -51 -58 55 -42 -60 -169 -426 23 -90 9 -127 135
5551A35j46J57j39K11l52K17j24j2L0Q6J64j47k6O1j42n6J94k40Kjk21K56L34
$$ 135 -11 146 7 218 -134 83 -41 -53 -23 63 227 80 54 115 -27 -83 111 -129 -127 -128 -349 -93 241
5574B41n64K44j82J45R4J1nJ6J77k35K19Km0J80j52l3o5j27J39j03P2j32k43J91
$$ 241 -323 -79 -261 -116 -22 -11 -16 0 177 -58 161 163 123 303 151 118 53 -74 65 -38 34 -98 -341 -150
5598a50J86k58K96l51J66m4P2m4J82j70J36J54o4R3m35M46q6q7J4p4j45K77j48
$$ -150 36 -222 74 -277 -111 -155 -83 -127 55 -115 21 175 111 204 -231 215 129 42 56 -18 -163 114 -34
5621c4j30l9J75l31L69j55J34k28K62j67R4J96k66P2R0J62rJ33j30O4k96M13k64
$$ -34 -164 -203 -28 -359 10 -145 -11 -239 23 -144 -50 146 -120 -48 42 204 195 328 198 262 -34 379 115
5644A15q0J23r1l8l0j07k36R2R9P8k01M1P7J00J7L0K23r8nj29L54j95k4kj25N1
$$ 115 35 158 67 29 -1 -108 -344 -252 -153 -75 -276 -235 -158 -58 -41 -11 212 114 109 -20 334 139 115 113 -12 39
5670C9P4j35J41j04J72p7q6J7R0k70j94L55l26K12L9j2j18j64J35L60J24l0K2
$$ 39 113 -22 119 15 187 110 24 41 131 -139 -333 22 -304 -92 -53 -65 -183 -347 -212 148 272 242 264
5693B64J41j71K5k65P3N4j36R2K1l0k39Q2j00J01J37q8o9j18nJ43M2J25j34P0
$$ 264 405 234 259 -6 67 121 -15 77 98 68 -171 -89 -189 -88 49 -39 -108 -226 -231 -88 -46 79 -55 15
5717A5J05n1J57k18K68j88n9L7k4jP8j88M1J5k0p9J47k09K33k2J72r5l17J41J66
$$ 15 120 69 226 8 276 88 29 66 42 41 119 -69 -28 -13 -33 -112 35 -174 59 37 209 114 -203 -62 104
5742A04k66L04J94j99LK57l76R5j68n2J61K77k17k83K67l45K78M6J86l72J33l2
$$ 104 -162 142 336 137 140 397 21 116 -52 -104 57 334 117 -166 101 -244 34 80 266 -106 27 -5
5764eJ27m43L56k56K42j32K05k05k5K5j30K07R1K34l81K7l0J59k19K88j14k4J76
$$ -5 122 -321 35 -221 21 -111 94 -111 -136 -111 -241 -34 57 291 -90 -63 -93 66 -153 135 21 -3 173
5787A73m54N06l35L4J71j37m6J8J82j96J04n1L38l59J34J76o2l47J28J14P8l62
$$ 173 -281 225 -110 -76 95 -42 -88 -70 112 -84 20 -31 307 -52 82 258 196 -151 -23 91 169 -193
5809a93K28m5J40j97O5n5J89j96J83%j38J68k29KK4M8K45j04k05K89j94k21J35
$$ -193 35 -10 130 -67 -2 -57 132 -64 119 119 -19 149 -80 -78 -54 -6 239 135 -70 219 25 -196 -61
5832f1J37P0k50J12j05K6p4J49j19K54k80K39m7k9l6Q7J61k73J69k15m2L69m78
$$ -61 76 146 -104 8 -97 -71 -145 4 -115 139 -141 98 51 22 -14 73 234 -39 130 -85 -127 242 -236
5855b36K32K01j70K82m64K66j59J46r5j29K79j32k24O5J25J89k07Q1Q7j62q7R8
$$ -236 -4 197 27 309 -155 111 -48 98 3 -126 153 21 -203 -138 -13 176 -31 50 137 -25 -112 -14
5877a4J42j58P6j41j25L31l24L08k93K92j42L1q6j95L36k32J32j8kO4L55j25k82
$$ -14 128 -30 46 -95 -220 111 -213 95 -198 94 -48 -17 -103 -298 38 -194 -62 -80 -82 -18 337 212 -70
5900g0K66N3r0k3L9kj90j41J74Qq3j64p3K58l7J26j73Q6R9N7k35N6J72j36rJ62
$$ -70 196 249 159 136 175 173 -17 -158 16 24 -59 -223 -296 -38 -75 51 -122 -36 63 120 -115 -59 113 -23 -32 130
5926A30J26l17M08l36K42j80l1l67M12j76J14j77O0M4r0J75j73O2J61J84j36Q3
$$ 130 256 -61 347 11 253 73 42 -325 87 -89 25 -152 -92 -48 -138 37 -136 -74 87 271 135 218
5948B18j39jj73O5l7N8M4J81p1J71r6rj63j10j02Q6k21K12j54J34m8L26o8j36
$$ 218 79 78 -95 -30 -67 -9 35 216 145 316 220 211 48 -62 -164 -78 -299 -87 -241 -107 -155 171 103 -33
5972c3oK7L5L16q8j21j45O3m9O5L9mJ44K8O1k08j01J85k47J12r3j49O1k06J53
$$ -33 -39 -12 23 339 251 130 -15 48 -1 64 103 99 243 271 332 124 23 208 -39 73 -20 -169 -108 -314 -161
5997a61J26K16j94j14J60K32r7J77L6j66k74J11J43k18r8K91k11P3K27j79L4L1
$$ -161 -35 181 -13 -127 33 265 168 345 381 215 -59 52 195 -23 -121 170 -41 32 259 80 114 145
6019A45m3J0r4p2K3j05j38j1L70j0J23k08J01J15L2o6k82P1K58q2j60K3j85K89
$$ 145 102 112 18 -54 -31 -136 -274 -285 85 75 198 -10 91 206 238 172 -110 -39 219 137 -23 0 -185 104
6043A04j93J0L16m05J65k68K16j77L11p9q3K47l10M64j82r7Q9N6q7J64m9k44l6
$$ 104 -89 -79 237 -168 -3 -271 -55 -232 79 0 -83 164 -146 318 136 39 128 184 97 261 212 -32 -68
6066f8j0J13Kj20J44r2O1k19r4J90O6p2K14j23j87L23p0K1q8K3K36k53q4j9L24
$$ -68 -78 35 37 -83 61 -31 30 -189 -283 -93 -27 -99 115 -8 -195 128 58 79 -9 14 250 -3 -87 -106 218
6091B18k37J27q6L4o4oqPj90K13M4k74j03K41O5O7NR7oo8L2P4k45N1K51j42K39
$$ 218 -19 108 22 56 -8 -14 -22 -15 -205 8 52 -222 -325 -84 -19 48 53 150 144 76 108 182 -63 -12 239 97 336
6118C36m29J92l21K04J06n0j48K84Ln0p6J12n6r7NJ22j90L8k11J90J54j64K68
$$ 336 -93 99 -222 -18 88 38 -110 174 177 127 51 163 107 10 15 137 -53 -15 -226 -36 118 -46 222
6141B22k07J03j24J32j28J92j49q8j14M9J93j40J84J3J45j33j79N7l16N07j38
$$ 222 15 118 -6 126 -2 190 41 -47 -161 -112 81 -59 125 138 283 150 -29 28 -288 219 81
6162H1l4p0n3J50O6l1pj3k0j26J09M5j13J93J6m37K39qJ1P7k72J56K55j96L1J77
$$ 81 47 -23 -76 74 140 109 102 89 69 -57 52 97 -16 177 193 -244 -5 -13 -2 75 -197 -41 214 18 49 226
6188B26k87k17L35j84N1j88L15K4j9j13o0J47J8Q4j1k23nP4j62K71J80m42J01
$$ 226 -61 -278 57 -127 -76 -264 51 75 56 -57 -117 30 48 132 121 -102 -107 -33 -195 76 256 -186 -85
6211h5J27q7Jq1K27j12J00j6j0l5R6k57K20k14Q8r3K88o7o2j28O1j88M82m50J02
$$ -85 42 -45 -44 -125 102 -10 90 74 64 29 125 -132 88 -126 -38 -131 157 90 28 -100 -39 -227 255 -195 -93
6236i3J27J09k96K23R2j01J20k05j00N06j70m67K55j76J48J8L7O5pl63K15qm3
$$ -93 34 143 -153 70 162 61 181 -24 -124 382 212 -255 0 -176 -28 -10 27 92 85 -278 -63 -71 -114
6259a14OK02m7l93N63r7k9l07L76r1K69k33j8L1p8p8K81k02q5R0o9m8qQ7l3R8
$$ -114 -108 94 47 -346 217 120 91 -216 160 69 338 105 87 118 40 -38 243 41 -44 46 -23 -71 -79 8 -25 73
6285G3j52J69P3pj18l48L82j62N0K40j87O8o0J56j30J12r5OO9l8o3j73n5JJ7J3
$$ 73 -79 90 163 156 38 -310 72 -90 -40 200 13 81 21 177 47 159 64 70 139 101 38 -135 -190 -189 -172 -159
6311a59J28j54K43Q3M7j14l4N9K6J07q2r1q6J43n2Mm1p8lJ01j17N5j02p4K53R
$$ -159 -31 -185 58 141 188 74 40 99 125 232 150 59 -27 116 64 68 27 -51 -54 47 -70 -15 -117 -191 62 71
6337G1j50O0K47m02K59K07r4k67J48J00k25J72m7l2J77j14j97O0k0J04j07j25
$$ 71 -79 -19 228 -174 85 292 198 -69 79 179 -46 126 79 47 224 110 -87 -27 -47 57 -50 -175
6359a75j7K05j13L4k1j1O2j46L99k87j49N8P9N8J38j28J80k19L26j62n7j02j89
$$ -175 -192 13 -100 -66 -87 -98 -36 -182 217 -70 -219 -161 -82 -24 114 -14 166 -53 273 111 54 -48 -237
6382b37K50K7k23l5J33K29l05J77j40p7J63Q9N5k81O0N7J02J5j23P2J65j12J83
$$ -237 13 40 -183 -218 -85 144 -161 16 -124 -201 -38 51 106 -175 -115 -58 44 59 -64 8 173 61 244
6405B44k34M3m4J11J8N4Qj99k3J78l48K01j67j43M38j86k53K63K15m12L21M0k40
$$ 244 10 53 9 120 138 192 200 1 -22 156 -192 9 -158 -301 137 -49 -302 -39 176 -236 85 125 -115
6428a15J8K39k77J53J1r9L08k94M0q3Q6O9j01K9l81K01P4o3J32p2J10j96J58R4
$$ -115 -97 142 -135 18 29 -70 238 -56 -16 -99 -13 56 -45 -16 -397 -196 -122 -185 -53 -125 -15 -211 -53 41
6452D1J36P4l30L02n4k50P1J2oJ04j91M5O4J34l84K87J6k66J70o8j11K29j33l3
$$ 41 177 251 -79 223 169 -81 -10 2 -4 100 -91 -46 18 152 -232 55 71 -195 -25 -93 -204 25 -108 -141
6476a41L1L3o8Q5L46j44J3r3k1k6L1J39k07j5j41L47l22M2J52l78M26j38L3O4
$$ -141 -110 -77 -145 -60 286 142 155 62 41 15 46 185 -22 -37 -178 169 -153 -111 41 -337 89 -49 -16 48
6500D8j24k2K78lk25J03l36L51J30j41K14k00m6lR2N2k37J64mk38q4K85L3k31
$$ 48 -76 -98 180 177 -48 55 -281 70 200 59 273 73 27 24 116 168 -69 95 91 -147 -231 54 87 -144
6524a44j35J92jl4J92j03k8J03R3j88N3N8j43J37j58K00L5j64J71k40K35j5r8
$$ -144 -279 -87 -88 -122 70 -33 -61 42 135 -53 0 58 -85 52 -106 94 129 -35 136 -104 131 116 18
6547A8pj09J87J52j79q1K32j32p8j48R5J14R1K2N0k31N0j62J49J16q5Nm7j76M6
$$ 18 11 -98 89 241 62 -19 213 81 3 -145 -50 64 155 177 227 -4 46 -116 33 149 64 69 22 -154 -108
6572a08n0J89pO0P5j52j63k3L32k16J17q9K86k45j7j05J07j08L54j68O3k55MJ97
$$ -108 -158 31 24 84 159 7 -156 -179 153 -63 54 -35 251 6 -11 -116 -9 -117 237 69 132 -123 -119 78
6596G8j05J79p5Mk27ML02r0j25J59k0J41k79K93l47J43k11K45m4K38k38J01k72
$$ 78 -27 152 77 81 -146 -142 160 70 -55 104 84 225 -54 239 -108 35 -176 69 25 263 25 126 -146
6619a46K26p7n1M5R6r4O9j89j21L57Q7q2k53J85K7k11Q2J50p9j69K97k96L61k62
$$ -146 80 3 -48 -3 93 -1 68 -121 -242 115 202 120 -133 52 79 -132 -50 100 21 -148 149 -147 214 -48
6643d8N5l4o2J77j08j19R0N9n1M7O7P5m85N68l40pn1L2K25Nl00J89R6R0l09n7
$$ -48 7 -27 -89 88 -20 -139 -49 10 -41 6 73 148 -337 231 -109 -116 -167 -135 90 95 -205 -16 80 170 -139 -196
6669a96L28j29L44m04J05R3k70j6J86p4r9K33o7R7k57Q7k1J22J1j1j13J83j2j58
$$ -196 132 3 347 -57 48 141 -129 -145 41 -33 -132 101 34 131 -126 -39 -60 62 73 62 -51 132 120 -38
6693c8R5K63k19j59l5o6J4PK67j48o9jJ32l28J53L31k15Q0J27j15k89J41J79N6
$$ -38 57 320 101 -58 -93 -159 -145 -138 129 -19 -88 -89 43 -285 -132 199 -16 64 191 76 -213 -72 107 163
6717A63Lr6N1m0K8j45J23j05o2J79k34Q4j5j13J34l4K06j93o5P8J12j7j25p8K59
$$ 163 166 70 121 81 109 -36 87 -18 -80 99 -135 -51 -66 -179 -45 -79 127 -66 -131 -53 59 42 -83 -161 98
6742I8p3J14m4k46P3K8J14Q3l09J56nj6M9p2J24k40j06K73J31k82Q7M3j7J9j63
$$ 98 25 139 95 -151 -78 -50 64 147 -162 -6 -11 -27 22 -50 74 -166 -272 1 132 -150 -63 -20 -37 -18 -181
6767a81n8L69K9L7k87R3j43J52l6J04J80l27j33R2J55j82j7J89J7j57O2J47k72
$$ -181 -239 130 159 196 -91 2 -141 11 -25 79 259 -68 -201 -109 46 -136 -153 36 53 -104 -42 105 -167
6790a67M5N6O9j03J45N2J15j62J95k73QJ88k33J47k63L29p6k16J55j11L1M2J12
$$ -167 -122 -66 3 -100 45 97 212 50 245 -28 -20 168 -65 82 -181 148 72 -144 11 -100 -69 -27 85
6813H5j1l66L91j77n3J0l3Q5R7j32K82pl3k59M5O3J91q1k4J38M8k22j37N6j9K74
$$ 85 74 -292 99 -78 -131 -121 -154 -69 28 -104 178 171 138 -121 -76 -13 178 97 73 211 259 37 -100 -44 -63 211
6839B11k00k58J16J71n2j37J88J13k24k6K22R2j38kJ4q6j71P7K59P0k74k94K48
$$ 211 11 -247 -131 40 -12 -149 39 152 -72 -98 124 216 78 76 90 4 -167 -90 169 239 -35 -329 -81
6862h1k17L44J02k83j43M83k2k44J24j21j1j8n9J69J18j93K83m65M81k11J13p4
$$ -81 -298 46 148 -135 -278 205 183 -61 63 -58 -69 -87 -146 23 141 -52 231 -234 247 36 149 75
6884G5k62J98j35Q3l9K86j87l19K30r7J23MK96l53N9m0o2Q2k41N39q5l2L2j78
$$ 75 -187 11 -124 -41 -80 206 19 -300 -70 -167 -44 -40 256 -97 -38 -78 -140 -58 -299 240 155 123 155 -23
6908b3q7K21r5Q7m2j26L3O6j73N5K40j34k6J9Q9o5j7O5p7k16J98K12k83M0LJ00
$$ -23 -110 111 16 103 61 -65 -32 34 -139 -84 156 22 -4 15 104 39 22 87 10 -206 -8 204 -79 -39 -36 64
6934F4j67P2J94j65j5J40j51k02N7L08j29j24J27r5K51l44nK05o4KM8J16j38j2
$$ 64 -103 -31 163 -2 -17 123 -28 -230 -173 135 6 -118 9 -86 165 -179 -184 21 -43 -41 7 123 -15 -27
6958b7K12k68L1JP2rj82M96l66K59q4k18M8J30j13K9Q9j45M8R7j34L1Q0o2kk8
$$ -27 185 -83 -52 -51 21 12 -170 326 -40 219 135 -83 -35 95 -18 11 100 -45 3 100 -34 -3 77 15 13 -15
6984a5J2J1P8N5o0j63L86m08K91l97L32j48m3K03j17l1K95j01j48m6O2Q9N4j33
$$ -15 -3 8 86 141 81 -82 304 -104 187 -210 122 -26 -69 134 17 -14 281 180 32 -14 48 137 191 58
7008E8Q9L4k77P5Ll36L27K8J39O8k72L6q3J60j69J54j3jP4k88K86k47J34R1k70
$$ 58 147 181 -96 -21 -18 -354 -27 1 140 208 -64 -28 -111 49 -120 34 21 20 94 -194 92 -155 -21 70 -200
7033b00J61l0o2O1P2j7J35k22J16n5p1l4L61l03p5K85j90K33K3j71J74q2k44J30
$$ -200 -39 -69 -131 -70 2 -15 120 -102 14 -41 -112 -146 215 -88 -163 122 -68 165 188 17 191 109 -135 -5
7057eO4N2k5k00P6j91L62r6k50J33l0K56k22N5O2j89J15J32r7J00k43J7R0m4j7
$$ -5 59 111 86 -114 -38 -229 133 37 -213 -80 -110 146 -76 -21 41 -148 -33 99 2 102 -141 -124 -34 -78 -95
7082i5J95M6r2%J24m4j54O1L2k07J62J82k26j45J86r5Qk70K48J81O9k20K53j29
$$ -95 100 146 54 54 178 134 -20 41 73 -134 28 210 -16 -161 25 -70 -62 -332 -84 97 166 -54 199 70
7106G0K7k19M67k72l25L25j14K50rk13j10J23P9o6j30Q1K4k5k16L42j7q3M9k83
$$ 70 97 -122 345 73 -252 73 -41 209 200 -13 -123 0 79 13 -117 -36 -12 -37 -253 89 72 -11 38 -245
7130b45KJ59J24J76j73j01K10j57J47NO2j24p0n9J36P0P8k98k7K5j4J29j5J12
$$ -245 -243 -84 40 216 43 -58 152 -5 142 147 209 85 15 -44 92 162 240 -58 -85 -60 -74 55 40 152
7154A52k51j0K26k21K78l27j9K17J4k95K2L74j71J27n8K13j60J25l74J69o5j1
$$ 152 -99 -109 117 -104 174 -153 -172 45 59 -236 -214 160 -11 116 58 271 111 236 -138 31 -34 -45
7176d5o6M0l0J49l26J68J58j7JOr0K40l29O7O2q8K21O0k57K66O9k97K22k01J21
$$ -45 -111 -71 -101 48 -278 -110 48 31 32 38 -52 188 -141 -74 -12 -100 121 181 -76 190 259 -38 184 -17 104
7201A04j08J88j95Pj02K42n36M72j42K03L9J2k31m4J92n9M8p6j48R5O6O6j4m6
$$ 104 -4 184 -11 -4 -106 136 -400 72 -70 133 172 184 -47 -91 101 42 90 14 -134 -39 27 93 79 33
7225C3K53l36m0K09l48O3J15K84l53K1k7J53j91K84r3k98L06n9J08j56J07L4N9
$$ 33 286 -50 -90 119 -229 -166 -51 233 -120 -99 -126 27 -164 120 27 -271 35 -24 84 -72 35 69 128
7248A28j5o4k04J61K8k14L18j70j90K36j73L08l1j80j2k26K53J28n9l4j57K52
$$ 128 113 49 -155 6 34 -180 138 -32 -222 14 -159 149 118 -62 -74 -300 -47 81 22 -12 -169 83
7270H3N1m8l3j33K48k28R2J36l28J01J34j25j2p6k9J4N5K24j58N1K7j0l06K05
$$ 83 134 86 53 -80 168 -60 32 168 -160 -59 75 -50 -62 -138 -167 -153 -98 126 -32 19 46 36 -270 -65
7294f5J90k94J21R5m4j03L05j91j45J51J02k5q0Q2j60J56j76r3O3L03l06rR8J04
$$ -65 125 -169 -48 47 3 -100 205 14 -131 20 122 97 17 99 -61 95 -81 -174 -111 192 -114 -123 -25 79
7318G9j55J70r2j19O3j0p0J50j25J15j21J59P8k43L52k88K94m06O7K83k02J39
$$ 79 -76 94 2 -117 -54 -64 -134 16 -109 6 -115 44 122 -121 231 -57 237 -169 -102 181 -21 118
7340A18l47K55J7j20j8N5k78M15N2j01J65r9M6j04K9l2j11J58j36j0J35m6j38
$$ 118 -229 26 43 -77 -95 -40 -318 97 149 48 213 114 160 56 85 53 -58 100 -36 -46 89 43 -95
7363i5L36q4k06J16Kj31M6n3K52m3k87J16m6N8J55k16p4k7K65k60L02k0j10J58
$$ -95 241 157 -49 67 69 -62 -16 -69 183 140 -147 -31 -77 -19 136 -80 -154 -181 84 -176 126 106 -4 154
7387A54k46k4o2j29L23j85O5K29k54J15N4lk19j34K28P2k64L38L6L4k31j43K14
$$ 154 -92 -116 -178 -307 16 -169 -104 125 -129 -14 40 37 -182 -316 -88 -16 -280 58 94 128 -103 -246 -32
7410c2k9K26l54K25J67j72rQj58J24L19k78k7n4j27K0K89m33K67K19n8k27K51
$$ -32 -61 165 -189 36 203 31 22 30 -128 -4 315 37 10 -44 -171 -151 138 -295 -28 191 133 -94 157
7433A57k41K26j17r2J89n6n8J10l20K03j83P8K37l10M00l62J22K3J70J16k71k42
$$ 157 -84 142 25 -67 122 66 8 118 -202 1 -182 -104 133 -177 223 -139 -17 6 176 292 21 -221
7455b21M26k91J8J35o7j4q6r1L01R7k5l82J35O7p5l4j6K52k16n2M45k25L2k4j84
$$ -221 205 -86 -68 67 0 -14 -100 -191 110 207 182 -200 -65 2 -73 -107 -123 129 -87 -139 306 81 113 89 -95
7480i5j3J6P7K81J17l13%k04j22L17l47J18L52k82K95l13J79j62O0N2J23k52J07
$$ -95 -108 -92 -15 266 383 70 70 -134 -256 61 -286 -168 184 -98 197 -116 63 -99 -39 13 136 -116 -9
7503ik46J62J65m2j21r9L94J0k21j0M3R1j03J10nl21K80p7J88k66P8k07K33O5
$$ -9 -255 -93 72 30 -91 -190 204 214 -7 -17 26 117 14 124 119 -202 78 1 189 -77 1 -206 27 92
7527I2k55J15L2j01L01l0q7l0o5M2k9l9M9l6J13m3k05J29P0j00q7K36j09q8K29
$$ 92 -163 -48 -16 -117 184 154 67 37 -28 14 -15 -54 -5 -41 72 29 -176 -47 23 -77 -164 72 -37 -125 104
7552A04q1j27J24K02k42J51J41j48N8k69J74n9p2J52j35M1m4L0n3n5L4P9k3J12
$$ 104 23 -104 20 222 -20 131 272 124 182 -87 87 28 -44 108 -27 14 -30 0 -53 -108 -74 5 -18 94
7576I4k62r4K37l4M1p8R0P5k37L19n5Q7k22L6J59p6Nl4j09J53k87M62j97o7q3
$$ 94 -168 -262 -25 -59 -18 -96 -6 69 -168 151 96 183 -39 -3 156 80 85 51 -58 95 -192 270 73 6 -77
7601g7k9Q9J92l55J23k5K03Ok05J87l09J73L50k46j19J71j35L9K0J9k90J88k1
$$ -77 -106 -17 175 -180 -57 -82 121 127 -78 109 -200 -27 323 77 -42 129 -6 33 53 72 -218 -30 -51
7624e1j29J05k01K22J93j59O0M6o4J37r6j10j82J8L84l32J43J94k36L0K17l1k0
$$ -51 -180 -75 -276 -54 139 -20 40 86 22 159 63 -47 -229 -211 173 -159 -16 178 -58 -28 189 158 138
7647A38M2j68J4lL2k97J78K10l07J52p0K59k56m4J44J04%J44n06K99p8p4j05R8
$$ 138 180 12 26 23 55 -242 -64 146 -161 -9 -79 180 -76 -120 24 128 128 272 -234 65 -13 -87 -192 -94
7671i4QK05j31J66k30j48L18M3j83mQJ49j94j00J1R9q0J7J99j16N5J45j87K0K11
$$ -94 -86 119 -12 154 -76 -224 94 137 -46 -50 -42 107 -87 -187 -176 -77 -157 -140 59 -57 -2 143 -44 -24 187
7696A87j02k4qj06Q8l8J27n2r2J80l26J97L4J5k05J43j06J2J87kj59O6Q6m4j29
$$ 187 85 61 53 -53 35 -3 124 72 -20 160 -166 31 65 80 -125 18 -88 -76 111 109 -50 16 102 58 -71
7721g1KK01j99J71j14l4M6j94J70k5Q7k0j6J5Q1k23K35k56R8L01o05K88JJ56J08
$$ -71 -69 132 -67 104 -10 -44 2 -192 -22 -47 40 20 4 19 100 -123 112 -144 -46 255 -350 -62 -61 95 203
7746B03k49J17p6j03L37m64K24p3O0J94k28K5O9k80K07k6K23r5j10J87k57L03
$$ 203 -46 71 -5 -108 229 -235 -11 -84 -24 170 -58 -33 36 -244 -37 -63 160 65 -45 142 -115 188
7768A88j06K60m05j1K35j18rk50K78q0m5j90P7L20l50J64k35J40l0J22P8pk71
$$ 188 82 342 -63 -74 161 43 34 -216 62 -18 -63 -253 -176 144 -206 -42 -277 -137 -167 -45 33 26 -245
7791b45L99k2l43K61r0m8JJ08j52l7L58k30k7o2J75k63J93Q9l41M06p4j45L49
$$ -245 154 132 -211 50 -40 -88 -87 21 -131 -168 190 -40 -67 -129 46 -217 -24 65 -276 130 56 -89 260
7814B60m66K00K22M3j24j42j02K23J48k85p8q1J08K96k48j13K03j5p1K05j84k6
$$ 260 -206 -6 216 259 135 -7 -109 114 262 -23 -101 -182 -74 222 -26 -139 64 49 -22 183 -1 -27
7836b7J36l3j17n8QK92j02r5r9M0n9l1K49k7L6l14J69j75K5J66J47j8j90K59J06
$$ -27 109 76 -41 -99 -91 201 99 4 -95 -55 -114 -145 104 77 113 -201 -32 -207 -182 -16 131 113 -77 182 288
7861B88k94N4l8j41J50p1j06J2K33J6J33k86N1r4mn4L18m1j61J69k6k2j17o4p8
$$ 288 -6 48 10 -131 19 -52 -158 -146 87 103 236 -50 1 -93 -97 -151 167 126 -35 134 108 86 -31 -95 -173
7886a73L39k88M3jk5J98j65l3J85rk2r9O5l2J36j68R9K6Q0j30r9K15j64O6J26
$$ -173 166 -122 -79 -80 -105 93 -72 -105 80 71 49 -50 15 -17 119 -49 50 76 156 26 -73 142 -22 44 170
7911A70k35K58r9j11k7m4j39K40O1j72J76l89K22J20J88k61K6j13J55n5J41j12
$$ 170 -65 193 94 -17 -44 -88 -227 13 74 -98 78 -311 -89 31 219 -42 -16 -129 26 -29 112 0
7933@j08J53q8O7J58l43K6J13J48Q5j65q7RL6o7o2K43k79J03J36j04j51K5L16
$$ 0 -108 45 -43 24 182 -161 -135 -22 126 211 46 -41 -32 4 -63 -125 118 -161 -58 78 -26 -177 -152 164
7957A64k10J38K7o2J23n71L68p1J54p5M0j40K10j21j83K37J9J60j36O6l1j67J30
$$ 164 -46 92 119 57 180 -391 -23 -94 60 -15 25 -115 95 -26 -209 28 47 207 71 137 106 -61 69
7980F9k35L05l8j35J22j55J73k91M33l76M38j66K2m60L20J36n01P5K92j94K08
$$ 69 -166 139 101 -34 88 -67 106 -185 248 -128 310 144 166 -294 26 162 -339 -264 28 -166 42
8001D2j11o7K24l14R0R7J71j8l6M4j91O2r0l9M6J59O8O2m02L66r9j43K84k05K
$$ 42 -69 -136 88 -226 -136 -39 132 114 78 122 -69 -7 -97 -136 -90 69 137 199 -203 163 64 -79 205 0 2
8026BK0J71l00K00r2l20K47K08J79l77P7o1J94j03j76J91r8r2K26m5L04k48j80
$$ 2 22 193 -107 93 1 -319 -72 136 315 -62 15 -46 148 45 -131 60 -38 -130 96 51 355 107 -73
8049g3J30pM7j00K13m03L7R4j19N9L09j30j3k02K56k78K76J02j67j38J19L93n57
$$ -73 57 50 97 -3 210 -193 -156 -62 -181 -122 187 57 44 -158 98 -180 96 198 31 -107 12 405 -152
8072a52RM4J49q5k12L3L74j40Q3R3n0l25L56k64L1l4K11P0m31J38J78Nk45R5O2
$$ -152 -143 -99 50 -35 -247 -214 160 20 103 196 146 -179 177 -87 -56 -90 121 191 -240 -102 76 81 -164 -69 -7
8097gN1m9l8J36K9j94k5K49j62j16JN3j9J86k32L45j75J44k72K50k64q3Q6J06
$$ -7 44 -5 -43 93 122 -72 -97 152 -10 -126 -125 -72 -91 95 -137 208 33 177 -95 155 -109 -192 -106 0
8121@j19j0J00j96K80K5k55J83l8J41k98K15J11J1k36J83j1R4m01J59J94j44J60
$$ 0 -119 -129 -29 -225 55 80 -175 8 -30 111 -187 28 139 150 -86 97 86 180 -221 -62 132 -12 148
8144A48k99K87k42R8L0k19K16n3n1J01K6JL02j77q9k80M51j83J70k18j52J28q9
$$ 148 -151 136 -106 -8 22 -197 19 -34 -85 16 42 43 345 168 79 -201 250 67 237 19 -133 -5 -94
8167i4K65j77J85r7K3j0j99J56p1k01K87R2R4m73K64j6j59J49n0J76j94M7p7J2
$$ -94 171 -6 179 82 105 95 -104 52 -19 -220 67 159 253 -220 44 28 -131 18 -32 144 -50 -3 -80 -68
8191f8
$$ Imaginary data points
##PAGE= N=2
##DATA TABLE= (X++(I..I)), XYDATA
0@%%%%%%%%%%%%%%%%jRj6J6j6J6j8K5l1L3l8M6n2O0o9P8r0J02j15J30j46J64j83
$$ 0 0 0 0 0 0 0 0 0 0 0 0 0 0 0 0 0 -1 8 -8 8 -8 8 -10 15 -16 17 -21 25 -27 33 -36 42 -48 54 -61 69 -77 87 -96
39i6K04k27K53k83L13l44L80m22M67n14N65o23O86p54Q32r19J017j129J255j400
$$ -96 108 -119 134 -149 164 -180 200 -222 245 -269 296 -327 359 -395 437 -482 535 -594 661 -739
59g39J571j774K021k330K724l254M006n167P227j2019M8138L0851j1602K80k8580
$$ -739 832 -942 1079 -1251 1473 -1781 2225 -2942 4285 -7734 40404 71255 59653 59933 31353
74C1353O96j8075k0755j2953j9330j6239J1715R980K1980K7076J0979j831m942
$$ 31353 32049 13974 -6781 -19734 -39064 -55303 -43588 -33608 -11628 15448 26427 24596 19654
87A9654k0390j5620o335n943r87M039l094L555J0659J3570K3273K6821J2915M595
$$ 19654 -736 -16356 -22691 -28634 -29621 -25582 -28676 -25121 -14462 -892 22381 49202 62117 66712
101F6712p655k3899k3656j7872j6238l151k46m646J647K25m26J4112J3318J0441
$$ 66712 59057 35158 11502 -6370 -22608 -25759 -26005 -30651 -29004 -28779 -29205 -15093 -1775 8666
115H666J2388l280j1954j1029j4834m204O883P460J2824R939J735K721K416J957
$$ 8666 21054 17774 5820 -5209 -20043 -24247 -17364 -9904 2920 12859 14594 17315 19731 21688
129B1688N970L253m122r542j6148j7704j1342m147L822R730Q107L845j15j637
$$ 21688 27658 30911 26789 17247 1099 -16605 -27947 -32094 -28272 -18542 -10435 -6590 -6705 -8342
143h342j719L381P573N725L891j339o735m072j175L746J0736P667L179n51r781
$$ -8342 -10061 -6680 893 6618 10509 9170 2435 -1637 -2812 934 11670 19337 22516 21965 12184
158A2184r656o429m069K530L288p79j569n851n636Q48L512O473P081J688l506
$$ 12184 2528 -3901 -7970 -5440 -2152 -2931 -4500 -10351 -15987 -15139 -11627 -5154 1927 3615 109
173A09n568n159l42N697R056J0116N762k44l559n206l262m82M21r25n513q024
$$ 109 -5459 -10618 -10960 -5263 3793 13909 19671 19427 15868 10662 7400 6918 7339 6414 901 -7123
189g123q542o199J184P284R513R706L698j129m215o598k593J136Q22J692l81l939
$$ -7123 -15665 -21864 -20680 -13396 -3883 5823 9521 8392 4177 -2421 -5014 -3878 -3056 -1364 -1745 -5684
205e684j231K84N470J0287Q656O271p6q087j0432j0141p008j805O87J198M80j386
$$ -5684 -6915 -6631 -1161 9126 17782 24053 23977 15890 5458 -4683 -11691 -13496 -12809 -11611 -11131 -12517
221a2517K86L879O444R676Q060K882l225q839r889p450l118L102N395M158L396
$$ -12517 -12231 -8352 -1908 7768 15828 18710 15485 6646 -3243 -10693 -13811 -10709 -5314 -1156 2240
236B240N39j51K109L348M537J963l386o650j0070r695m407J248O262Q376O258
$$ 2240 2779 2628 4737 8085 12622 14585 11199 4549 -5521 -15216 -19623 -18375 -12113 -3737 2521
251B521L705N55j710O02J434J548O60m016o635p585n563l25N130P611Q212M513
$$ 2521 6226 6781 5071 5673 7107 8655 9315 5299 -1336 -8921 -14484 -14809 -9679 -2068 6144 10657
267A0657n24l394m663k505n05L10Q60j494l838k899q36K597P132P057N186P47
$$ 10657 10133 6739 2076 -429 -934 -624 236 -1258 -5096 -7995 -8831 -6234 898 7955 13141 13888
283A3888m487o459o749m039M62J600K143P99j467j165Q71L165N999M684J513k003
$$ 13888 9401 2942 -3807 -7846 -7384 -5784 -3641 -2842 -4309 -5474 -4603 -1438 4561 9245 10758 8755
299H755o321p140m443p36M153N653M987K508k18k048o98K83P17L22l022n059p054
$$ 8755 2434 -4706 -9149 -9885 -5732 -79 4908 7416 7198 5150 4452 4735 5452 5774 2752 -2307 -9361
316i361o354j680L037O313Q561N889K554p61k249j693q75N5M40k354m124l655
$$ -9361 -15715 -17395 -14358 -8045 516 6405 8959 8198 5949 4256 3381 3436 3876 1522 -2602 -6257
332f257k531J645N603P275O832K583k419n019p263n997l385j403j86r89j517Q
$$ -6257 -8788 -7143 -1540 5735 12567 15150 12731 7712 449 -5548 -8933 -10336 -10522 -11511 -13028 -13020
348a3020J729N143Q408P770O493J532l545o042o823m657j179L98J570N88n53k42
$$ -13020 -11291 -6148 2260 10030 16523 18055 14510 8468 1645 -3012 -4191 -3793 -2223 -1635 -2188 -2430
364b430J340K644M315L434M31l600p335p919o162k551J573M879M872M444K811
$$ -2430 -1090 1554 5869 9303 9734 6134 -1201 -9120 -15282 -17833 -16260 -11381 -6509 -2065 746
379G46K485L296L779M217K675j322m543o760p619m684j274J875L925L148J331
$$ 746 3231 6527 10306 14523 17198 15876 11333 4573 -3046 -7730 -9004 -7129 -3204 -56 1275
394A275n15j970n92N71Q25P37j525l400m362k978P4L923N737P064M769J983l75
$$ 1275 760 -1210 -1802 -1231 -406 331 -1194 -4594 -8956 -11934 -11860 -7937 -2200 4864 9633 11616 11241
411A1241j733p30l48j36m15k753m665n080m006j636J845K976L566J165j234k185
$$ 11241 9508 8778 8430 8294 7879 5126 461 -4619 -8625 -10261 -8416 -5440 -1874 -709 -1943 -4128
427d128k039k81J753K867K771J250o91j500k91J184L343L868K225L49k749l624
$$ -4128 -6167 -6448 -4695 -1828 943 2193 1502 2 -289 895 4238 8106 10331 10680 7931 4307
443D307l315j482O82Q62k27j658l123m317k487o30K313L244K095J459q11k77J465
$$ 4307 992 -490 192 1054 827 -831 -3954 -8271 -10758 -11388 -9075 -5831 -3736 -2277 -3088 -3365 -1900
460a900K695M281M121J925l89l025m005k267j113K24J685M83j056k322k422o85
$$ -1900 795 5076 9197 11122 10733 7708 3703 1436 323 547 2232 2715 1659 -663 -3085 -3770
476c770O02J349J454o21k543l503l614j116J973L614N174M019K130J454P26J060
$$ -3770 -3168 -1819 -365 -986 -3529 -7032 -10646 -11762 -9789 -6175 -1001 3018 5148 6602 7328 8388
492H388J737J363q2k441m593n629m802k605R84K383K738K022L62j124r96l19L37
$$ 8388 10125 11488 11406 8965 4372 -1257 -6059 -8664 -7680 -5297 -2559 -537 -175 -1299 -2295 -2614 -2277
509b277O04O3j189k134k120l44J998M478N967M935K802J6k251k405k519j834j585
$$ -2277 -1673 -1610 -2799 -4933 -7053 -7397 -5399 -921 5046 9981 12783 12799 10548 8143 5624 3790 2205
526B205k298l206m106l262n50J524M096M513L208J129q10k485j835q05K46J301
$$ 2205 -93 -3299 -7405 -10667 -11217 -9693 -5597 -1084 2124 3253 2443 -42 -1877 -2682 -2436 -1135
542a135M45K30L1l84J873L078L409L113P38j830l897m852m162k332j058L56L00
$$ -1135 -690 -460 -429 -813 1060 4138 7547 10660 11398 9568 5671 819 -3343 -5675 -6733 -6377 -6077
559f077n92j1J84J281L191L502K820P68j217k461k657j374P01J784K443J728j21
$$ -6077 -6669 -6680 -6496 -5215 -2024 1478 4298 5066 3849 1388 -1269 -2643 -1942 -158 2285 4013 3892
576C892l63q02R8P44P77k78j823l261l682k885o49O84K848K217K124K19l12M4
$$ 3892 3529 2727 2825 3569 4346 4068 2245 -1016 -4698 -7583 -8232 -7548 -4700 -2483 -359 -140 -452 -408
594d08L66J621J490P57l50j739j987j015K75J999J975J541j99j576k486j930q97
$$ -408 -42 1579 3069 3826 3476 1737 -250 -1265 -990 1009 2984 4525 4326 2750 264 -1666 -2563
611b563K1P65K10o54p86j430J96J522K293K690J464m9j637j772j076j95J087J574
$$ -2563 -2542 -1777 -1567 -2221 -3007 -4437 -4241 -2719 -426 2264 3728 3679 2042 270 -806 -1001 86 1660
629A660O77j40j097j275k44M19J093J107m07j706j832k125q36R38J696J902J555
$$ 1660 2337 2197 1100 -175 -419 0 1093 2200 1793 87 -1745 -3870 -4706 -3768 -2072 -170 1385
646A385K36o05n67l54P38J066J79j34j570j934j304m61J651J778J602R55o03j372
$$ 1385 1621 1016 449 95 833 1899 2078 1944 374 -1560 -2864 -3325 -1674 104 1706 2661 2058 686
664F86p99r55K60Q12M28k19r58j289k01P01J693J804J662p8j012j977j525j137
$$ 686 -113 -1068 -808 4 432 213 -745 -2034 -2235 -1534 159 1963 3625 3547 2535 558 -967 -2104
682b104K79R12J9l03n32r16K17R40J430K174Q33J53j215j621j020o0P05J204M16
$$ -2104 -1825 -913 -894 -1197 -1729 -2645 -2428 -1488 -58 2116 2949 3102 1887 266 -754 -814 -109 1095 1511
701A511j87p54q68l31M13P80P72n5j255j744j475o64J94J324J230J519K00l47
$$ 1511 1324 570 -298 -629 -216 564 1336 1281 26 -1718 -3193 -3857 -3663 -2339 -1109 410 610 263
719B63k45J28J169J258J007j6o84j634r43q42K56Q91M04K08j033j337j289n31
$$ 263 18 146 1315 2573 3580 3564 2880 1246 303 -539 -283 608 1012 1220 187 -1150 -2439 -2970
737b970K44P81M93K59n29q01L7O32J195K024J247P89j77p49p49J02K26Q12K72
$$ -2970 -2726 -1945 -1452 -1193 -1722 -2523 -2486 -1854 -659 1365 2612 3401 3224 2475 1726 1828 2054 2866 3138
756C138n69j328j673j162k80Q9L66K94r75n21j522J18L12J019J951J159N20M43
$$ 3138 2569 1241 -432 -1594 -1874 -1785 -1419 -1125 -2100 -2621 -4143 -4025 -3713 -2694 -743 416 936 1379
774A379j74q9Q74J158Q62K32n70p82j667q13q6Q8r3k35j298r64j206r46L58P78
$$ 1379 1205 1116 1990 3148 4010 4242 3672 2890 1223 410 324 412 319 84 -1214 -2178 -3384 -4330 -3972 -3194
794c194M62Q06J04k75J86P38J507J521J569J008k68m67m13j055L6K62j25m81j160
$$ -3194 -2732 -1926 -1822 -2097 -1911 -1173 334 1855 3424 4432 4164 3697 3284 2229 2265 2527 2402 1921 761
813G61j555j206n80l30L23J90r4n93o24j52N21J107J345J441O41N30J37K85P88
$$ 761 -794 -2000 -2580 -2910 -2587 -2397 -2491 -3084 -3708 -3860 -3339 -2232 -887 554 1195 1725 1862 2147 2935
832B935N01J106o1m50j025j473j231q70l87n9j18r03n93j197j49L95K71P56P86
$$ 2935 3436 4542 4481 4031 3006 1533 302 -568 -955 -1014 -1132 -2035 -2628 -3825 -3974 -3579 -3308 -2552 -1766
851a766K17J57K42M95J227J315J282O33J84m5l45q43P3n96k65o24j627j207j109
$$ -1766 -1549 -1392 -1150 -655 572 1887 3169 3802 3986 3941 3596 2753 2826 2230 1965 1341 -286 -1493 -2602
870b602r06r4K62N54N34j70J86l45M63P94J069Q25P50J93J71M88j48R90Q75K72
$$ -2602 -3508 -3602 -3340 -2786 -2252 -2422 -2236 -2581 -2118 -1324 -255 570 1320 1513 1684 2172 2024 3014 3889 4161
890D161k91p33j364r79j188p56n81o33m02n81o26jN28J108J372P79P05K40q6j03
$$ 4161 3870 3137 1773 794 -394 -1150 -1731 -2364 -2766 -3347 -3973 -3974 -3446 -2338 -966 -187 518 758 672 569
910E69L81M32L43M48J94jl25j14J94J40j68l39r09j352j449j364l28l99L25O71
$$ 569 950 1382 1725 2173 2367 2366 2041 1927 2121 2261 2093 1754 845 -507 -1956 -3320 -3648 -4047 -3722 -3051
930c051L19P03Q65M86J283R91O45N47o03l31n78o25j71L36K03M90j88r7r4n35
$$ -3051 -2732 -2029 -1164 -678 605 1596 2241 2788 2185 1854 1276 651 480 816 1019 1509 1321 1224 1130 595
950E95l28j48o68q47r23j221l64J18N09J167R69J546R54N19O05J35K97n14r7q18
$$ 595 267 119 -549 -1396 -2319 -3540 -3904 -3786 -3277 -2110 -1141 405 1359 1878 2483 2618 2915 2401 2304 1486
970A486p79j060j15l85J42Q89J55K47J74n45n04l09p58k21j49o75K07j22O26R65
$$ 1486 707 -353 -468 -853 -711 178 333 580 754 209 -295 -604 -1362 -1583 -1732 -2407 -2200 -2322 -1696 -731
990g31J273J092P52N24j44l47p53k67r96m01n23l10m03L5r3R19L98K70M02m67
$$ -731 542 1634 2386 2910 2766 2419 1666 1399 403 2 -521 -831 -1234 -1199 -1292 -373 25 295 697 230
1010B30k31p63n85j00l1K67L53N05N37M84M89L67M72O4m27o26q75m80o35k76o0
$$ 230 -1 -764 -1349 -1449 -1480 -1213 -860 -355 182 666 1155 1522 1994 2058 1631 1005 130 -350 -985 -1261 -1321
1031a321M61K92N87k99M63L22j61P5l82k16l00k15j80M37J45O66M55K80r2j88
$$ -1321 -860 -568 19 -280 183 505 344 419 37 -179 -479 -694 -874 -437 -292 374 829 1109 1017 829
1051H29j23m40m90l17k94l10J6J06M51K66N90N47K07J53q1m43l12n52m04l15J06
$$ 829 706 266 -224 -541 -835 -1145 -1129 -1023 -572 -306 284 831 1038 1191 1110 667 355 -197 -601 -916 -810
1072h10K91m2M16L39L97L60K03n31l78p84m58k62l53p6K51O23O63Q36O79N36J07
$$ -810 -519 -561 -145 194 591 951 1154 623 245 -539 -997 -1259 -1612 -1688 -1437 -814 -151 685 1364 1900 2007
1093B007J45m08p69p23q91l61l65k82J34J39O30M53N18M29O7l37p6o99m32k96
$$ 2007 2152 1744 975 252 -639 -1000 -1365 -1647 -1513 -1374 -744 -291 227 656 723 386 310 -389 -821 -1117
1113a117j66J12L97O06P41P10P49K40P3k27j12p79j088r95o03o59n1l7K37O68
$$ -1117 -1283 -1171 -774 -168 573 1283 2032 2272 2345 2118 2006 1227 139 -856 -1459 -2118 -2169 -2206 -1969 -1301
1133a301N35O62K73J54J73q3l04j46l71R6J52J50P14O99P2M10k08l8m62j81p55
$$ -1301 -766 -104 169 323 496 413 109 -37 -408 -312 -160 -10 704 1403 1475 1885 1677 1639 1177 996 241
1154B41m77q21o10j52l54K93OM51M03M02M6M15J69J60L89R7N98P7J81Q4Q1m3n
$$ 241 -236 -1057 -1667 -1819 -2173 -1880 -1874 -1423 -1020 -618 -572 -157 12 172 561 658 1256 1333 1514 1598 1679 1636 1631
1177A631m81n50l90n30l92m58l91K03m6J88K2L14PJ53lj70J70N9N5M65P99L19
$$ 1631 1150 600 210 -320 -712 -1170 -1561 -1358 -1404 -1216 -1194 -880 -873 -720 -723 -893 -723 -664 -609 -144 655 974
1199I74Q45N52O58nj18o96r11j104p23j032m60q24k21N39L35N66J104P23M21L96
$$ 974 1819 2371 3029 3024 2906 2210 1299 195 -528 -1560 -2020 -2844 -3065 -2526 -2191 -1625 -521 202 623 1019
1219A019l31m91j89o32k21J44L33K89Q90O81Q74P95K57N5n78j126j492j598j445
$$ 1019 688 197 8 -624 -845 -701 -368 -79 811 1492 2366 3161 3418 3473 2895 1769 277 -1321 -2766
1238b766r56p78N44L06R66J248R52J414J053L53J89n38p92r17p69o45N6L75P49
$$ -2766 -3722 -4500 -3956 -3650 -2684 -1436 -484 930 1983 2336 2525 1987 1195 278 -491 -1136 -1080 -705 44
1257D4Q70R48M65M53K9n18q00j234j373j640j136p01L4K98J251J426J648J214
$$ 44 914 1862 2327 2780 2809 2291 1491 257 -1116 -2756 -3892 -4593 -4559 -4261 -3010 -1584 64 1278
1275A278J161O97q2j2p23j020q21p95j106J1K7J193O97R05M04L6k52p98o45j215
$$ 1278 2439 3136 3054 3042 2319 1299 478 -317 -1423 -1412 -1385 -192 505 1410 1814 1850 1598 800 155 -1060
1295a060j065l82q07k59K5Q66J368J151J840R29O62J18k42q41n83r75j31j186
$$ -1060 -2125 -2507 -3314 -3573 -3548 -2682 -1314 -163 1677 2606 3268 3386 3144 2303 1720 745 614 -572
1313e72l33j93K05k6L95P90L06ql18l21r26o07l59K86m3K13P32J79P37L65R25
$$ -572 -905 -1098 -893 -919 -524 266 572 564 246 -75 -1001 -1608 -1967 -1681 -1724 -1511 -779 -600 137 502 1427
1334A427O74L94j51k60o97n87m19l54n25M9K22n50l10j79k0J25M69j4J22ln7R1
$$ 1427 2101 2495 2344 2084 1387 800 381 27 -498 -449 -227 -777 -1087 -1266 -1286 -1161 -692 -706 -584 -587 -644 -553
1356e53K27M51O23M4L87l38j75j52k9j81M50K3o1k72m05o8n4Mj56k37l93l38n03
$$ -553 -326 125 748 792 1179 841 666 514 485 304 754 777 716 444 39 -29 -83 -79 -235 -472 -865 -1203 -1706
1379a706k07J04N76N66R76M53N13K43j56J58n30j49k40n82l55o85J12k6O71N33
$$ -1706 -1913 -1809 -1233 -667 309 762 1275 1518 1362 1520 990 841 601 19 -336 -1021 -909 -935 -264 269
1399B69N42J65j74j61n32n23o0k52l35n23n1k3N58P08J245Q87K80J04n04m44p38
$$ 269 811 976 802 641 109 -414 -474 -726 -1061 -1584 -1635 -1658 -1100 -392 853 1740 2020 2124 1620 1176 438
1420D38n45l60n10k42j7k17N14P89M11P05K84O7k90o89o47o31j06j40K24K80M35
$$ 438 -107 -467 -977 -1219 -1236 -1453 -939 -150 261 966 1250 1317 1027 338 -309 -940 -1046 -1186 -962 -682 -247
1441b47M1L84N61L08P00j90m18q03n79p17m07N9M29K33O18J93M0L64K88J88m6
$$ -247 -206 178 739 1047 1747 1557 1139 336 -243 -960 -1367 -1308 -879 -646 -28 165 205 569 857 1045 999
1462I99l14o32m89n72J6J83L23M12L75K84Q9k5k14l05r7k27l25m7l13j88L59N04
$$ 999 685 53 -436 -1008 -992 -809 -486 -74 301 585 674 649 435 130 33 -194 -519 -566 -879 -1067 -708 -204
1484b04Q47M08M02j58m82k88n36k91k11j5l1l26J74K18M13N45L09q1Rp66n77l60
$$ -204 643 1051 1453 1295 813 525 -11 -302 -513 -528 -559 -885 -711 -493 -80 465 774 693 702 -64 -641 -1001
1506a001k87l2K49N62M83L94L33N38O25O6j8q18m32j066r50m40M2J3Q02L64Q69
$$ -1001 -1288 -1320 -1071 -509 -26 368 701 1239 1864 1930 1912 1094 662 -404 -1354 -1794 -1752 -1739 -937 -573 296
1527B96J29L57J04l56K74m02p61o58l85l25J21N35Q02J030J003K87K92j74k56
$$ 296 425 782 886 530 804 402 -359 -1017 -1402 -1727 -1606 -1071 -269 761 1764 2051 2343 2169 1913
1546A913q58q24n66n95j085j98k82N08N98J178P19Q06L13l04o17k06o18m77k68
$$ 1913 1055 231 -335 -930 -2015 -2213 -2495 -1987 -1389 -211 508 1314 1627 1323 706 500 -118 -595 -863
1565h63o6j98J37N08O88R59O92M10J81o09r99q92o77o86n80p4l1N1K33Q00N37
$$ -863 -929 -1127 -990 -482 206 1165 1857 2267 2448 1839 840 -52 -729 -1415 -1995 -2069 -2100 -2049 -1816 -1016 -479
1586d79J054Q04J25j21k74o26l38m74o5J93M9L52m7J01M60P5J30M68k29p14o98
$$ -479 575 1379 1504 1383 1109 483 145 -329 -394 -201 -152 200 153 254 714 789 919 1387 1158 444 -254
1607b54o52o06n94J28N11M40K74L03M52M83L93K04J30K25k1o15k19l23j66lK4
$$ -254 -906 -1512 -2106 -1978 -1467 -1027 -753 -450 2 485 878 1082 1212 1437 1416 801 582 259 93 90 114
1628A14Qn9j33l07J36j74J50J95l11l12J5k27j3K93K42J48J66O9j6J85K77O65
$$ 114 122 63 -70 -377 -241 -415 -265 -70 -381 -693 -678 -905 -918 -625 -383 -235 -69 0 -16 169 446 1111
1650A111O7K58q2k04n57j27n90n01J40o09l38J59j23J84N43K58O39K72J56j7n63
$$ 1111 1178 1436 1354 1150 593 466 -124 -625 -485 -1094 -1432 -1273 -1396 -1212 -669 -411 228 500 656 639 76
1671G6J46k29j98J53j72R7P4R5M88M26L15K60M3l05n48j186o87m21l25J74O3J62
$$ 76 222 -7 -205 -52 -224 -127 -53 42 530 956 1271 1531 1574 1269 721 -465 -1152 -1573 -1898 -1724 -1661 -1499
1693a499J67O73N25Q66N09N03j04l52p42n75o30n6R8J81L48L56J67L93J50J76
$$ -1499 -1332 -659 -134 732 1241 1744 1640 1288 546 -29 -659 -715 -617 -436 -88 268 435 828 978 1154
1713A154J72m52l99p62r51m30o95L60J59Q78N96R55M35L26L80J74m45k4j015j82
$$ 1154 1326 874 475 -287 -1238 -1668 -2363 -2003 -1844 -966 -370 585 1020 1346 1726 1900 1455 1431 416 234
1733B34j076j99l28N68J84O72L51J77K14k00j14k91j81l48p82m75j23O3L56O92
$$ 234 -842 -1041 -1369 -801 -617 55 406 583 797 597 483 192 11 -337 -1119 -1594 -1717 -1654 -1298 -606
1753f06R79O00M01N0O5l64p5o81p7m54m70l25L8K74O7L60M51J78l9N8l15n63J93
$$ -606 373 973 1374 1424 1489 1125 1050 369 292 -162 -632 -957 -919 -645 -578 -218 233 411 372 430 115 -448 -255
1776b55l37R3o1J92r7Q8L95L53L62L15J70l45p01l2j00j70o8j19j04m2oK67O7
$$ -255 -592 -499 -560 -368 -465 -377 18 371 733 1048 1218 873 172 140 40 -130 -198 -317 -421 -463 -469 -202 -135
1799a35J31J06L26k80m5m83oJ64j1J47M68J64j60J9q8p9k20L87k51k7m36r7k5
$$ -135 -4 102 428 148 103 -380 -386 -222 -233 -86 382 546 386 405 317 238 18 405 154 127 -309 -406 -431
1822d31J73P7Q2K83Q0j38K5l73K16p9J1k37J6R5N0J78Q4M4J76J82k39L4n72K5
$$ -431 -258 -181 -99 184 264 126 151 -222 -6 -85 -74 -311 -295 -200 -150 28 112 156 332 514 275 309 -263 -238
1846b38kq4J39L0j34Q2K59L74K9J12l45J61j37k95n49M15j29K3L63r8K02L7n4
$$ -238 -240 -324 -185 -155 -289 -207 52 426 455 567 222 383 246 -49 -598 -183 -312 -289 74 -24 178 215 161
1869A61R5R5M9j07l15k19j84r4P9O1M10K61L5J12P8m30L12k59j73J07r3l34k29
$$ 161 256 351 400 293 -22 -241 -425 -519 -440 -379 31 292 327 439 517 87 399 140 -33 74 -19 -353 -582
1892e82J96J15J14N8J86J20j69Q9j77k9K75j46lk02P3nj35L46K68l1L3j0l59J9
$$ -582 -386 -271 -157 -99 87 207 38 127 -50 -79 196 50 47 -155 -82 -87 -222 124 392 361 394 384 25 44
1916D4r7j93K12k66L65k48J4J10j29j88K15L0J19oj44K76k85L06K27J08KM3j46
$$ 44 -53 -246 -34 -300 65 -183 -169 -59 -188 -376 -161 -131 -12 -18 -162 114 -171 135 362 470 472 515 369
1939C69k57o3j72N6j39NJ0nj87L05O3J07j0j22J91l41j75l5p8K65J35J6J55N2
$$ 369 112 49 -123 -67 -206 -201 -191 -196 -383 -78 -15 92 82 -40 151 -190 -365 -400 -478 -213 -78 -62 93 145
1963A45L94J28p0J39k85o6l48k38l63o6r5j1K60J50k5J97L48k07M34k34J45m00
$$ 145 539 667 597 736 451 385 37 -201 -564 -630 -725 -736 -476 -326 -351 -154 194 -13 421 187 332 -68
1985f8l95P0n5J14J68J83K99J11L63O5j47k2j81k13l84l61j70k37j91N56J61l9
$$ -68 -463 -393 -448 -334 -166 17 316 427 790 855 708 686 505 292 -92 -453 -623 -860 -1051 -495 -334 -373
2007c73L91K10J54Q4J6j31j8l29j75p1j94M42j17R9M67Q3K22J4m0l12l18j87k79
$$ -373 18 228 382 466 482 351 333 4 -171 -242 -436 6 -111 -12 455 538 760 774 734 422 104 -83 -362
2030c62k47j32m5k92K80L10R4K23O74KQ0j62n7m2k1k35j69J18j19J3N0J60J39
$$ -362 -609 -741 -786 -1078 -798 -488 -394 -171 503 505 585 423 366 324 303 68 -101 17 -102 -89 -39 121 260
2053B60r2K63k66o6l22k09j95k37J44j7K20J08LK26M29L35k74M67j89j68p2o5
$$ 260 168 431 165 99 -223 -432 -627 -864 -720 -737 -517 -409 -406 -180 249 584 310 777 588 420 348 283
2075B83k17j5o8j21N2j69J44m1j26L26j90j89m4N7j45ML15j40J44J0L41p0K8J06
$$ 283 66 51 -17 -138 -86 -255 -111 -152 -278 48 -142 -331 -375 -318 -463 -459 -144 -284 -140 -130 211 141 169 275
2099B75J82jj02L7k32J07j55rp3l43P5j73K57l25K42r7M3J6J12J05K09j56l0k5
$$ 275 457 456 354 391 159 266 111 102 29 -314 -239 -412 -155 -480 -238 -335 -292 -276 -164 -59 150 -6 -36 -61
2123f1J63J17O2l42J91mJ61Q3k70M29l16j84l5K60l32j40j26Q1j42r5K00J03R6
$$ -61 102 219 281 -61 130 126 287 370 100 529 213 29 -6 254 -78 -218 -344 -263 -405 -500 -300 -197 -101
2146a01q5J97K84k01%O9J3J43k70j4j37J53k8J71j19N8o8J40k29Qk50K14k0r8
$$ -101 -186 11 295 94 94 163 176 319 49 35 -102 51 23 194 75 133 65 205 -24 -16 -266 -52 -72 -170
2170a70J03m17L9J06Q9K00R2Q6K89k01j36O1J98l69J01l85M85l29K18l28K53P5
$$ -170 -67 -484 -445 -339 -250 -50 42 128 417 216 80 141 339 -30 71 -314 171 -158 60 -268 -15 60
2192F0j43n6N2J90l05k7K00j38j43L03j85M37l08Q0J77Jk02J05J19k45K38k30
$$ 60 -83 -139 -87 103 -202 -229 -29 -167 -310 -7 -192 245 -63 17 194 195 -7 98 217 -28 210 -20
2214b0J71k51m2K13j17j65j13L73m8j05L03o6k46j9o2k34M11%pJ3O6m4L7K9M0
$$ -20 151 -100 -142 71 -46 -211 -324 49 1 -104 199 133 -113 -132 -194 -428 -17 -17 -24 -11 55 11 48 77 117
2239A17k65K49mp8j7l28K28Q2k03L18l6N9J59m18J58m9J61Q5j42j68K08k78K56
$$ 117 -148 101 97 19 2 -326 -98 -16 -219 99 63 122 281 -137 21 -28 133 218 76 -92 116 -162 94
2262I4k04K73O0l73K50j02k14K96j51j59J91j59J20l5k6QL36j46Kj72M4nk8O9
$$ 94 -110 163 223 -150 100 -2 -216 80 -71 -230 -39 -198 -78 -113 -139 -131 205 59 61 -111 -67 -72 -100 -31
2286c1k01K10J08l97L76l2J7J46j11Jj07j04Kn4J73J43l0o2p6k1J42p2K5k5J46
$$ -31 -232 -22 86 -311 65 33 50 196 85 86 -21 -125 -123 -177 -4 139 109 47 -29 -50 92 20 45 20 166
2311A66j25n6j56J31l29J91Q8k6K44l28J03m9k9N8J32o3KJ23k09J84Q3O2J9j04
$$ 166 41 -15 -171 -40 -369 -178 -90 -116 128 -200 -97 -146 -175 -117 15 -48 -46 77 -132 52 135 197 216 112
2335A12J79p2K2j24n6m2j04K15l14k02L95m11Q9J13L8K65l1J0j87j11J07J38n5
$$ 112 291 219 241 117 61 19 -85 130 -184 -386 9 -402 -313 -200 -162 103 72 82 -105 -216 -109 29 -26
2358b6K49k12L1K24j16j24J40J6m3oj49j72k02J1J53R6N5k32K66k24J99L17J0
$$ -26 223 11 42 266 150 26 166 182 139 133 -16 -188 -390 -379 -226 -130 -75 -307 -41 -265 -66 251 261
2381B61k29L35k46N9J37m93K91j04J03J34J5k57J7J24j52p3L1O2j74m8j50l3K04
$$ 261 32 367 121 180 317 -176 115 11 114 248 263 6 23 147 -5 -78 -47 15 -159 -207 -357 -390 -186
2404a86n9M13l26N9O9J32M9J31q6kQ2n1n7j93J98L8k82J70J02j65r9j11J86L3
$$ -186 -245 168 -158 -99 -30 102 151 282 196 194 276 225 168 -25 173 211 -71 99 201 36 -63 -174 12 45
2428D5j81k7k03Oj78L68k22N39M5oJ79k02L35l32p6J63p3j22K9j02n3j51K89k01
$$ 45 -136 -163 -366 -360 -538 -170 -392 147 192 186 365 163 498 166 90 253 180 58 87 -15 -68 -219 70 -131
2452a31K31J70j38k48N5k41Q8J86O5J32m97p5p1M69K39kj44L19o4n8r8j90N1J07
$$ -131 100 270 132 -116 -61 -302 -214 -28 37 169 -328 -403 -474 -5 234 232 88 407 343 285 187 -3 48 155
2476A55k02k41j41M1J74o9K04J62K12j89q3k69oJ40l1JJ29M0K49m49J88J80K64
$$ 155 -47 -288 -429 -388 -214 -283 -79 83 295 106 23 -246 -252 -112 -143 -142 -13 27 276 -173 15 195 459
2499D59o3l08K95l32n5j6l16J33K73p2j53k14K56q8R7M38L2k41J45k20Rk36k1
$$ 459 396 88 383 51 -4 -20 -336 -203 70 -2 -155 -369 -113 -201 -104 334 366 125 270 50 59 -177 -198
2522a98K81K6J11L5l60M4J45m7J59K03j90k60K62l60m8q9K50o8J06J79l24J48
$$ -198 83 109 220 255 -105 -61 84 37 196 399 209 -51 211 -149 -197 -286 -36 -104 2 181 -143 5
2544EN7J07p4K40p6o4j14q9L7p1J92N5l03rj17K36l7o3J17J45o1q6l33k05M29
$$ 5 62 169 95 335 259 195 81 -8 29 -42 150 205 -98 -107 -224 12 -25 -88 29 174 113 27 -306 -511 -82
2569h2P4l1K58l55L37j71p1K46MJ91P4l44k09J0j45K31p9P6ol94N4K80j22L33
$$ -82 -8 -39 219 -136 201 30 -41 205 209 400 474 130 -79 -69 -214 17 -62 14 8 -386 -332 -52 -174 159
2593A59J73k9O1m01j58K99l54J42K03m3n4j8p3o6J94K37l61J95J49k00k87j60
$$ 159 332 303 364 -37 -195 104 -250 -108 95 52 -2 -20 -93 -159 35 272 -89 106 255 55 -232 -392
2615c92L25k78K80n3Q2j7p8J13p1J80J75J26k14l02j7j00m2M07j19J56j38r8Q8
$$ -392 -67 -345 -65 -118 -36 -53 -131 -18 -89 91 266 392 178 -124 -141 -241 -283 124 5 161 23 -75 13
2638A3n6j81L40J82k66k42J50k54J17K40j34L15r2M8n6l67PJ42J14J41K8l26N8
$$ 13 -43 -224 116 298 32 -210 -60 -314 -197 43 -91 224 132 180 124 -243 -236 -94 20 161 189 -137 -79
2661g9j5r0k44M86J87j39k33K67q0l74J24M08o4j02n3K20j97q5J43P1j0j21p9
$$ -79 -94 -184 -428 58 245 106 -127 140 60 -314 -190 218 154 52 -1 219 22 -63 80 151 141 20 -59
2684e9n2j57J35O5J22J09J20n4l22mnK38j04L4r4j3Ml84L02K49L16j72Jj01m31
$$ -59 -111 -268 -133 -68 54 163 283 229 -93 -97 -102 136 32 66 -28 -41 -37 -421 -119 130 446 274 275 174 -257
2709b57J74O3Ql9J14j40J66m52J37J22J39J97K9K38o28M8N5l6Q5Q1j75M6r1nR
$$ -257 -83 -20 -12 -51 63 -77 89 -363 -226 -104 35 232 261 499 -129 -81 -26 -62 23 104 -71 -25 -116 -121 -112
2734a12L98q4L69o9l38k30j81j0n0O2R0j2j64K00k0K66m2L65j56R4J6l67n5j87
$$ -112 286 202 571 502 164 -66 -247 -257 -307 -245 -155 -167 -331 -131 -151 115 73 438 282 376 392 25 -30 -217
2758b17J62KJ38k90k51M09k04K93M30j14Q9k5n29j29l20K17J59O7J53R7j10j76
$$ -217 -55 -53 85 -205 -456 -47 -251 42 472 358 447 422 -107 -236 -556 -339 -180 -113 40 137 27 -149
2780a49K66K68k15K76K4p7n03j33j51K76r8n5M15j67J21j69O3K59J13K13k65l36
$$ -149 117 385 170 446 470 393 -110 -243 -394 -118 -216 -271 144 -23 98 -71 -8 251 364 577 312 -24
2802b4m42M8J0K19O7R8Q5J1M2O5K49j95K46j08j19l28j40j73N8JJ88q7M8J88k23
$$ -24 -466 -418 -408 -189 -122 -24 61 72 114 179 428 233 479 371 252 -76 -216 -389 -331 -330 -142 -229 -181 7 -216
2827b16JK23K49J47L5l80M4n95Q4j7J2N57j16mK00j35M6J47L38n9l60j83l85n0
$$ -216 -215 8 257 404 439 59 103 -492 -408 -425 -413 144 28 24 224 89 135 282 620 561 201 18 -367 -417
2851d17j88J72J49K16K80K09k47r2J42R8J93k25R5m09k21j82Q9N9L8K48j89Q06
$$ -417 -605 -433 -284 -68 212 421 174 82 224 322 515 290 385 -24 -245 -427 -338 -279 -241 7 -182 624
2873F24l09j51J98M4j52J0m48j91j79j13J44P0M15P4L22j18k5r5L9O2j49M33n09
$$ 624 315 164 362 406 254 264 -184 -375 -554 -667 -523 -453 -38 36 358 240 215 120 159 221 72 505 -4
2896dl76k39J86M3J15K64L64J38l31l4n6j3k15N22k48l69j73l27K94K5M58L15
$$ -4 -380 -619 -433 -390 -275 -11 353 491 160 126 70 57 -158 364 116 -253 -426 -753 -459 -434 24 339
2918C39K00Q9l53q3j10J38o7p1j77j51K3l87J94K67L59K1M29j92k76j96r5k4J87
$$ 339 539 628 275 192 82 220 153 82 -95 -246 -223 -610 -416 -149 210 231 660 468 192 -4 -99 -123 64
2941F4j85r9K83l58Q8q2J73L84P3K52j27l12k35q7r9O3J49j09O3k18J52l9K41
$$ 64 -121 -220 63 -295 -207 -289 -116 268 341 593 466 154 -81 -168 -267 -204 -55 -164 -101 -319 -167 -206 35
2964C5L07R7o4o8m49P5k23J69J76J20k99Rn9r1J60K51L99j21k15l46L0m3k62M32
$$ 35 342 439 375 307 -142 -67 -290 -121 55 175 -124 -115 -174 -265 -105 146 545 424 209 -137 -107 -150 -412 20
2988B0J12j52j13j80n8L48j67M59K7o8j16j66J66k40o9M54j13j36R1ql84J65L1
$$ 20 132 -20 -133 -313 -371 -23 -190 269 296 228 112 -54 112 -128 -197 257 144 8 99 91 -293 -128 -97
3011i7L56L9j49k41J7n2j76K51J28KJ31k42N6j14JQ3L30j11l7q1k9k11J45NJ60
$$ -97 259 298 149 -92 -75 -127 -303 -52 76 78 209 -33 23 -91 -90 -7 323 212 175 94 65 -146 -1 4 164
3036A64N6o0k28k25rn4M00J59J66j59q1k24p2j46M01q1J80o0k05k0k97L86KQ7
$$ 164 220 160 -68 -293 -302 -356 44 203 369 210 129 -95 -167 -313 88 7 187 127 -78 -98 -395 -9 -7 80
3060H0J31m1lj90Mj7K90Q5q6k00k70k9JK55n7K81r2l44K05p7N8K03j36K7K37l04
$$ 80 211 170 167 -23 -19 -36 254 339 253 53 -217 -246 -245 10 -47 234 142 -202 3 -74 -16 187 51 78 315 11
3086A1k85j06J27o9L33P5J4K26m83K3J83j84L42j23j71M19n89j22O2J45K49k0
$$ 11 -274 -380 -253 -322 11 86 100 326 -157 -134 49 -135 207 84 -87 332 -257 -379 -317 -172 77 57
3108E7J86q3j94k5J88R6m6Q8l20j36j34K2M1L3M13O3N1j85M6q5N8k36K74j47J08
$$ 57 243 160 -34 -59 129 225 179 267 -53 -189 -323 -301 -260 -227 186 249 300 115 161 76 134 -102 172 25 133
3133A33l76l4p8P1M37j33M14l0p1j05j25k05J95j23Lp0l0q1k44L90J75M07p6J8
$$ 133 -243 -277 -355 -284 153 20 434 404 333 228 103 -102 93 -30 -27 -97 -127 -208 -452 -62 113 520 444 462
3157D62k05k80K4R8m2j08r6k55K51j95M0j9O33Q2m1o1O5k76j43K7j67J05Q2k34
$$ 462 257 -23 1 99 57 -51 -147 -402 -151 -346 -306 -325 308 390 349 288 353 77 -66 -39 -206 -101 -19 -253
3181b53j29O6J49K19K48K29m8j10Rl35r5r7R0j01N8Q1m00L31j72M61K31J49k68
$$ -253 -382 -316 -167 52 300 529 481 371 380 45 -50 -147 -57 -158 -100 -19 -419 -88 -260 201 432 581 313
3204C13p6l35N8l25M8L82L4k76J48n56M74K16O6M17O4j97l51j27j89R0N4j13n5
$$ 313 237 -98 -40 -365 -317 65 99 -177 -29 -585 -111 105 171 588 652 455 104 -23 -212 -122 -68 -181 -236
3227b36J2P8J06J53K3n0M26J68o11o7l39k19J71L74o8j3k06J12M6J57K80L46j12
$$ -236 -224 -146 -40 113 136 86 512 680 69 2 -337 -556 -385 -11 -79 -92 -298 -186 -140 17 297 643 531
3250E31j41k64j27l53P8j74K34K35k52K70j36l2K81Q0K00J6j80p1l92p1L3k77
$$ 531 390 126 -1 -354 -276 -450 -216 19 -233 37 -99 -131 150 230 430 446 266 195 -197 -268 -235 -512
3272e12M47j94L98j51L23k20j02L88m9K10n82p3m22L10j45l5K72J03L0j03K97
$$ -512 -65 -259 139 -12 311 91 -11 377 328 538 -44 -117 -539 -229 -374 -409 -137 -34 -4 -107 190
3293A90p6Q3kK11J7l23l01k96J96n4J47J07J60Q0q9k6J88j39K07po5k86o7l84
$$ 190 114 197 195 406 423 100 -201 -497 -301 -355 -208 -101 59 139 50 24 212 73 280 273 208 -78 -145 -529
3317e29L27k3L00K32j64q7k5K7m3K12j22K60k00k13k36k09J45P9J10L23L00l95
$$ -529 -202 -225 75 307 143 56 31 58 15 227 105 365 165 -48 -284 -493 -348 -269 -159 164 464 69
3339F9NNj25K75n8n36L77k15j03K3r2M10L68l08K06J29k87kj40m3J64j28o6k41
$$ 69 74 79 -46 229 171 -365 12 -203 -306 -283 -375 35 403 95 301 430 143 141 1 -42 122 -6 -72 -313
3363c13J3J30p1L83J29J13k72j68j56J25MK04J20j88j45L8j81K09opL83k46l2
$$ -313 -300 -170 -241 142 271 384 112 -56 -212 -87 -83 121 241 53 -92 -54 -235 -26 -32 -39 344 98 66
3386F6l8j18J64k04j57M78O8l60q7r1JrJ06K70K74m60J88Oj85J58j35L81l75K26
$$ 66 28 -90 74 -130 -287 191 259 -101 -188 -279 -278 -287 -181 89 363 -97 91 97 -88 70 -65 316 -59 167
3410A67n30K3K02R5k30L43k30R7j97K72q4J78J41l92L51j10k71k9K94J15m5k7
$$ 167 -363 -340 -138 -43 -273 70 -160 -63 -260 12 -72 106 247 -145 206 96 -175 -204 90 205 160 133
3432A33N3j87m4J67r2J21n4J85j39k64%k01K15J49q9K59j73l4J13j34P4OL9k8
$$ 133 186 -1 -45 122 30 151 97 282 143 -121 -121 -322 -107 42 -47 212 39 5 118 -16 58 64 103 75
3456G5o0j30k0k70J22M07j0J16k67k83K04R7k2J70k6N8k41J00nk45K46N6j09J94
$$ 75 15 -115 -135 -405 -283 124 114 230 -37 -320 -116 -19 -41 129 103 161 -80 20 15 -230 16 72 -37 157
3480A57K9j95j92m9L18K4J73k04j43k19K60j44O2K18k03K85l26L7j02K01J8J74
$$ 157 186 -9 -201 -250 68 92 265 61 -82 -301 -41 -185 -123 95 -108 177 -149 -112 -214 -13 5 179
3502A79L1j52j87K20j38j18K67R2K03m54J87j90P9k32L38r4R0o2k00j27K7K62
$$ 179 210 58 -129 91 -47 -165 102 194 397 -57 130 -60 19 -213 125 31 121 59 -141 -268 -241 21
3524B1r6J57k99Q6M6J9K04q5M4K14j24j47j9p9j33o5J18L49n3j37R8J48m54J19
$$ 21 -75 82 -217 -131 -85 -66 138 53 97 311 187 40 21 -58 -191 -256 -138 211 158 21 119 267 -187 -68
3548f8K62M7p1l03l49J40k9L96p0O2m5J32p7J24j01K44N6j14Pl36j48l25K60J47
$$ -68 194 241 170 -133 -482 -342 -371 25 -45 17 -28 104 27 151 50 294 350 236 243 -93 -241 -566 -306 -159
3572a59K4J88M1j17J25j87J46m5Q7p8j6m3l9J60r9J32n1K06J17j18j85J98k59
$$ -159 -135 53 94 -23 102 -85 61 16 103 25 9 -34 -73 87 -12 120 69 275 392 274 89 287 28
3595B8n0Q0m5j03l73J63j34K31K22J92j29j16K5j20K04J49Lk01R2m0j68l7j21
$$ 28 -22 58 13 -90 -463 -300 -434 -203 19 211 82 -34 -9 -129 75 224 227 26 118 78 -90 -127 -248
3618b48K96K07r0k5p8k59P4k2K02k57oN0J64j81j22J59L7L88Q4k48K41k79L4J02
$$ -248 48 255 165 140 62 -197 -123 -145 57 -200 -206 -156 8 -173 -295 -136 -99 289 373 125 366 87 121 223
3642B23k40J5J64Q3l27L8mk38K14Q9M24n97p1K05k52K09o9l1J64n2J46n3PJ04
$$ 223 -17 -2 162 245 -82 -44 -48 -286 -72 17 441 -156 -227 -22 -274 -65 -134 -165 -1 -53 93 40 47 151
3666A51Q5N6o2N0j15k79k2J18p5R0k23K25k35qj04J78J19R7K12k88N0l61K67p9
$$ 151 236 292 230 280 165 -114 -136 -18 -93 -3 -226 -1 -236 -244 -348 -170 -51 46 258 -30 20 -341 -74 -153
3690a53L29j18j1j66K36j30kL61l42L81l41O8k57J63o4l5L2J18k4rk49K04J07
$$ -153 176 58 47 -119 117 -13 -15 346 4 385 44 112 -145 18 -46 -81 -49 69 45 36 -213 -9 98
3713I8k97L68%j76M3j21J4J35M9m5P8l10k4K81j36k32L33L1N6k18J52j96k69K44
$$ 98 -199 169 169 -7 36 -85 -71 64 113 68 146 -164 -188 93 -43 -275 58 89 145 -73 79 -117 -386 -142
3737a42L41lj45j38Qj53O6J48K55j06p2j46J54L2pm9L5j8K49k60O9j14j0K54j14
$$ -142 199 196 51 -87 -79 -232 -166 -18 237 131 59 -87 67 99 92 43 78 60 309 49 118 4 -6 248 134
3762A34j84o2j11L33j46k06J17K12n9j71J63R3k49K13k7J60l22K85j59K8j14L9
$$ 134 -50 -112 -223 110 -36 -242 -125 87 28 -143 20 113 -136 77 50 210 -112 173 14 42 -72 -33
3784c3K18k08L1N0n0k1K4O2p7j26J75j13j32O1K64k86K43k44J38K34k63j29K63
$$ -33 185 -23 8 58 8 -13 11 73 -4 -130 45 -68 -200 -139 125 -161 82 -162 -24 210 -53 -182 81
3807H1j68N5K58k1j61j07l9m3J57j3n9q6K78j96M7J0r6J52o1J8L9k10N9J5M1J80
$$ 81 -87 -32 226 205 44 -63 -102 -145 12 -1 -60 -146 132 -64 -17 -7 -103 49 -12 6 45 -165 -106 -91 -50 130
3833A30j79P4r2P8J62l52J59J52n3r2l7J34k34K40k52L21j7j3J24l19n6J79j41
$$ 130 -49 25 -67 11 173 -179 -20 132 79 -13 -50 84 -150 90 -162 159 142 129 253 -66 -122 57 -84
3856h4J48J36l58J64m1q8Q6J50j0MK7j74j38M01l45K04L4o3J03m1p4k04J74j36
$$ -84 64 200 -158 6 -35 -123 -37 113 103 107 134 -40 -178 223 -122 82 116 53 156 115 41 -163 11 -125
3880a25K94Pl06J11j49LK42m2q2J52N3l51Q0J68R7k70M21k84J65k25J53ml18L61
$$ -125 169 176 -130 -19 -168 -165 77 35 -47 105 158 -193 -113 55 152 -118 303 19 184 -41 112 108 -210 151
3904A51j93j25o2J80j08j11K26l2M7J92j92L5Ol90M00K7Q5r6j98O0L1J20J13j90
$$ 151 -42 -167 -229 -49 -157 -268 -42 -74 -27 165 -27 8 14 -376 24 51 136 40 -158 -98 -67 53 166 -24
3928b4R3J62l11L64k40k9J02k63N9l8o6K61k27K49l8n6j36L41j60j05N3K23k02
$$ -24 69 231 -80 284 44 15 117 -146 -87 -125 -191 70 -157 92 54 -2 -138 203 43 -62 -9 214 12
3951A2K52k60J75j36j46oK46K32l90Q0M7J41l39L08l32R6k36M31k09j90J39L1
$$ 12 264 4 179 43 -103 -109 137 369 -21 59 106 247 -92 216 -116 -20 -256 175 -34 -224 -85 -54
3973e4k76K21J34K26j45k62K28N0l4j44J6J1K5j09k1m9J81K52l9j04j32j3j91
$$ -54 -330 -109 25 251 106 -156 72 122 88 -56 -40 -29 -4 -113 -134 -183 -2 250 211 107 -25 -38 -229
3996b29R6oq6Q7j26K83k01L42k06J06K20j86K2k6Q0j11k7O6j45Q8k01J60L00k60
$$ -229 -133 -139 -225 -138 -264 19 -182 160 -46 60 280 94 116 90 170 59 32 98 -47 41 -160 0 300 40
4020D0n0%P7r9p8J29k13L2Q7j14K05LO9J2o5K3K03P1k25r3J58k44j7J67j81j64
$$ 40 -10 -10 67 -32 -110 19 -194 -162 -75 -189 16 19 88 100 35 58 261 332 107 14 172 -72 -89 78 -103 -267
4046b67K99o6n1O9qJ45N1j30m3j77N0K4RK71l94L44L4J37j41L2j0r0k04J96R3
$$ -267 32 -34 -85 -16 -24 121 172 42 -1 -178 -128 -104 -95 176 -218 126 160 297 156 188 178 88 -116 80 173
4071A73j78k33J62j59O5j32M12k43Q5K28o3j15n2J0O1O8o4J04j45Q4J74j87p6
$$ 173 -5 -238 -76 -235 -170 -302 110 -133 -48 180 117 2 -50 -40 21 89 25 129 -16 68 242 55 -21
4094b1J77p5p4J27l82K53n5q0R0k15J09o7K78l03J31J45o3J46N3k93J25N5J79
$$ -21 156 81 7 134 -248 5 -50 -130 -40 -255 -146 -213 65 -238 -107 38 -25 121 174 -119 6 61 240
4117B40k85L3N2Q5j0j11K1o7L7MJ15j8Nj03N4k56L54j63n1k47J54O2k6J07l3J51
$$ 240 -45 -12 40 125 115 4 25 -42 -5 -1 114 96 101 -2 52 -204 150 -13 -64 -311 -157 -95 -121 -14 -47 104
4143A04P6k90K94j9K5J2j44l34J93K30j06j33K3j00j12L00j23j03L46j22m3Q0
$$ 104 180 -110 184 165 190 202 58 -276 -83 147 41 -92 -69 -169 -281 19 -104 -207 139 17 -26 54
4165E4j8j45J32P1p6M3j58O9Q5L3Q7j06L7l2J93l31j95K49k16R8L0M9j8L3K10
$$ 54 36 -109 23 94 18 61 -97 -28 57 90 177 71 108 76 269 -62 -257 -8 -224 -126 -96 -47 -65 -32 178
4190A78J31j02n2Qj74j9R4M9l06L34k0qn7j06M3l1J68r0k80M77l59Lpk27J81K1
$$ 178 309 207 155 163 -11 -30 64 113 -193 141 121 113 56 -50 -7 -38 130 40 -240 237 -122 -119 -126 -353 -172 -151
4216a51J26nNJ60j75oj08ML00J08l77J38k52L00nj2K3o8k26K47Q9n11J52K60r8
$$ -151 -25 -30 -25 135 -40 -46 -154 -150 150 258 -119 19 -233 67 62 50 73 5 -221 26 115 -396 -244 16 -82
4241h2k9O5j07L27p3n3J41J0k83J53N8p3j46j56M14l40J55R9j23j02L17l03J50
$$ -82 -111 -46 -153 174 101 48 189 199 -84 69 127 54 -92 -248 166 -174 -19 80 -43 -145 172 -131 19
4264A9j2K56l13J11J38J46l48J18p4m3J50j97L1k15J67J2J11j97L7J50j73J74
$$ 19 7 263 -50 61 199 345 -3 115 41 -2 148 -49 -18 -233 -66 -54 57 -140 -103 47 -126 48
4286D8R2L1k38L27J1j57Q7k37r3k4K55k04j28J70L1L9j94M44j51p3m7j25L3j73
$$ 48 140 171 -67 260 271 114 201 -36 -129 -153 102 -102 -230 -60 -29 10 -184 260 109 36 -11 -136 -103 -276
4310b76M47k65q8M5M5K60r3m4K08L4n1k08Q3k64K81j08m0p7J98p1J67j42L68l06
$$ -276 171 -94 -182 -137 -92 168 75 31 239 273 222 14 97 -167 114 6 -34 -111 87 16 183 41 409 103
4334A03Q8j67Rk12J25l33K12j82K09q0J12K09j50J84n2K04j71j15J15k51O2j56
$$ 103 191 24 33 -179 -54 -387 -175 -357 -148 -228 -116 93 -57 127 75 279 108 -7 108 -143 -81 -237
4356b37J50J62J3p8p4j01L97k47l5M2k66j21K26MJ40j15m9M08q5J52J07r6K8m31
$$ -237 -87 75 88 10 -64 -165 232 -15 -50 -8 -274 -395 -169 -165 -25 -140 -189 219 134 286 393 297 325 -106
4380a06J79Q0R9j00K48o42K29j58J88k34L41j13j75J00K6L0q8R4K08j44k01L96
$$ -106 73 153 252 152 400 -242 -13 -171 17 -217 124 11 -164 -64 -38 -8 -96 -2 206 62 -139 257
4402B57j02l56K64J7J10o5N0r9J69k72J5k17Q0K21k00l9K4J28k10M1k3M3J36J17
$$ 257 155 -201 63 80 190 125 175 76 245 -27 -12 -229 -149 72 -128 -167 -143 -15 -225 -184 -207 -164 -28 89
4426H9o8N7L3o3N9J25l45M4j42K49M3P0k4p9n5J00j9rJ8k68L15l85n1J27j24K5
$$ 89 21 78 111 48 107 232 -113 -69 -211 38 81 151 127 48 -7 93 74 65 83 -185 130 -255 -306 -179 -303 -278
4452b78LK27J86Q4R8k2j92J51o9L4k88q0j9J32O1k31p9K83l9J01NQ9l7k08q0K22
$$ -278 -275 -48 138 222 320 298 106 257 188 222 -66 -146 -165 -33 28 -203 -282 1 -38 63 68 157 120 -88 -168 54
4478E4q8p8j8o5J03J98J21o1K36j23J96k47l9j44n6p8j9pJ42j03k23K55ORL96
$$ 54 -34 -112 -130 -195 -92 106 227 166 402 279 475 228 189 45 -11 -89 -108 -115 27 -76 -299 -44 -38 -29 367
4503C67k55k09J7N3j34nJ45k4Q9n7J70L4O9j24K67jj67j58l43K52j27JK26k61
$$ 367 112 -97 -80 -27 -161 -166 -21 -45 44 -13 157 191 260 136 403 402 235 77 -266 -14 -141 -140 86 -175
4527a75J99j35OL36j64j9n6O3q3J86m36J36K03k10K47k62L16l45K37Q2k39J49
$$ -175 24 -111 -105 231 67 48 -8 55 -28 158 -278 -142 61 -149 98 -164 152 -193 44 126 -113 36
4549C6j3K3j56L2O0k77K21nQ0k25K69J43k1j84O0O9j18j20j05L16R4m5K3j2O3
$$ 36 23 46 -110 -78 -18 -295 -74 -79 1 -224 45 188 167 -17 43 112 -6 -126 -231 85 179 134 157 145 208
4574B08j27L37l50n13M66o7L2K6j16Q3O0o4q2M9O6J40k57q5K70l0n2P8K9M2l07
$$ 208 81 418 68 -445 21 -46 -14 12 -104 -21 39 -25 -107 -58 8 148 -109 -194 76 46 -6 72 101 143 -164
4599a64K53l2q9MJ13K06k40Pk6K0P4k17K2J88j2k43K45j93J67j75n2J2O7r6K60
$$ -164 89 57 -32 -28 85 291 51 58 32 52 126 -91 -69 119 107 -136 109 -84 83 -92 -144 -132 -65 -161 99
4624I9p6j8J11j42M4J02K3l04K33p9J18k1j40j61R3k7m7K81P7j35J31k25K60j31
$$ 99 23 5 116 -26 18 120 143 -161 72 -7 111 90 -50 -211 -118 -145 -192 89 166 31 162 -63 197 66
4648F6k28k26O51k46L5r4J48j0j09J45K7j03k08J01o4m1J73P2j20j14K30j44%
$$ 66 -162 -388 263 17 52 -42 106 96 -13 132 159 56 -152 -51 -115 -156 17 89 -31 -145 85 -59 -59
4671e9K26Q2j94n8k5k5j6j22J9J07P6l11L30L0l9J60j98m7K47J21n36J69k13L03
$$ -59 167 249 55 -3 -28 -53 -69 -191 -172 -65 11 -300 30 60 21 181 -17 -64 183 304 -232 -63 -276 27
4695B7J2n5J39ol62J17kJ7N2j53L29k65j78L11j49L7K24J5p4k86L36k46J2K74
$$ 27 39 -16 123 117 -245 -128 -130 -113 -61 -214 115 -150 -328 -17 -166 -129 95 110 36 -250 86 -160 -148 126
4719A26j76J36m3Q3j93K54J21k56P7p4L0j20J8r9j89o4J10J67q7M32l53K97j50
$$ 126 -50 86 43 126 -67 187 308 52 129 55 85 -35 -17 -116 -305 -369 -259 -92 -179 253 -100 197 47
4742D7J02k0p0n2o9l7M9l4L37j08k5J11j88l1j06k5K12k03j23o6P2%K25m07N72
$$ 47 149 129 59 7 -62 -99 -50 -84 253 145 120 231 43 12 -94 -119 93 -110 -233 -299 -227 -227 -2 -409 163
4767A63j43K56Q1k5j57K03l18j10q0P5K81m71Q3K6J26q6K97j06j34P8r3n5k86
$$ 163 20 276 357 332 175 378 60 -50 -130 -55 226 -245 -162 -136 -10 -96 201 95 -39 39 -54 -109 -395
4790c95K18k95M09j6j13J55j0L49q9J8J93j08j56N7k40j00L3o1J71j77m5J63l7
$$ -395 -177 -472 -63 -79 -192 -37 -47 302 213 231 424 316 160 217 -23 -123 -90 -151 20 -157 -202 -39 -76
4813g6l0K48j07j4r4k13J60Q0o7K50j10j88J54J91k75J04J41P2j50J08r2K05k85
$$ -76 -106 142 35 21 -73 -286 -126 -46 -113 137 27 -161 -7 184 -91 13 154 226 76 184 92 297 12
4836A2m21J39L5l4N0J40O3k08K78N2k77J02K63l11kN5J79N0o0jJ59j61J84j12
$$ 12 -409 -270 -235 -269 -219 -79 -16 -224 54 106 -171 -69 194 -117 -119 -64 115 165 105 104 263 102 286 174
4860A74j36j27Q1k4L86m02km0O9m7j92j8K63O5k26O0L32j75r5nJ26J26m4k78J53
$$ 174 38 -89 -8 -32 354 -48 -50 -90 -21 -68 -260 -278 -15 50 -176 -116 216 41 -54 -59 67 193 149 -129 24
4885B4n4j53L2J37j80J07K87m88K88j53lj1N3p0Q6k13J34L52J15l16L7QO1J67
$$ 24 -30 -183 -151 -14 -194 -87 200 -288 0 -153 -156 -167 -114 -184 -98 -311 -177 175 290 -26 11 19 80 247
4909B47m6m7n7K90k53o6k76j9O8J00j66Q6K61%p6J12q7nJ58l37Q4j41JL7K37o0
$$ 247 201 154 97 387 134 68 -208 -227 -159 -59 -225 -139 122 122 46 158 71 66 224 -113 -29 -170 -169 -132 105 45
4935D5L68k80l8K32j34Q1O8k62j40r2L1p0l0K16M9k74J19J56p5J83J24k22j31
$$ 45 413 133 95 327 193 274 342 80 -60 -152 -121 -191 -221 -5 44 -230 -111 45 -30 153 277 55 -76
4958g6K97l34K79j99o5k6J30K53j79L08m15l2J82o4k72J99Q0k12k36M07k4k35
$$ -76 221 -113 166 -33 -98 -124 6 259 80 388 -27 -59 123 59 -213 -14 66 -146 -382 25 1 -234
4980b34m4L83n7mj01K80m75L42l3k24L47k58P3Q4j18J82l43M79R2m01J74q5J83
$$ -234 -278 105 48 44 -57 223 -252 90 57 -167 180 -78 -5 79 -39 143 -200 279 371 -30 144 59 242
5003B42k61l42K55J87P5j06p9M5J7n3jM7j80K86p2k16q8J54J37p3Jj08K90k00
$$ 242 -19 -361 -106 81 156 50 -29 16 33 -20 -21 26 -154 132 60 -156 -244 -90 47 -26 -25 -133 157 -43
5027d3k76L56j16K45r3m9n3J43k50J94n2j01R3R9q4J48j55k2r1K25n6r1J83n0
$$ -43 -319 37 -79 166 73 24 -29 114 -136 58 6 -95 -2 97 13 161 6 -16 -107 118 62 -29 154 104
5051A04P3l49K09J02J96j56m02M14j40k7K51j39N5J51k64k24J53J36j37j06o4
$$ 104 177 -172 37 139 335 179 -223 191 51 24 275 136 191 342 78 -146 7 143 6 -100 -164
5072a64o0O1J07J8k23K64r5O8J28n5L3K52m85J04J3J20Q2k02M8l4J50j19R2m2
$$ -164 -224 -163 -56 -38 -261 3 -92 -24 104 49 82 334 -151 -47 -34 86 168 -34 14 -20 130 11 103 61
5096F1K5k18m7R0j00K72j42j11R9j06K44k8j2lP9qQ8K1l66J95r3M3J72j78J11
$$ 61 86 -132 -179 -89 -189 83 -59 -170 -71 -177 67 39 27 24 103 95 183 204 -162 33 -60 -17 155 -23 88
5121H8L7j57k56K69m2o0L4j0r2J95j1j32q7L04N7J27k24P1q6l8K69l28K18k17
$$ 88 125 -32 -288 -19 -61 -121 -87 -97 -189 6 -5 -137 -224 80 137 264 40 111 25 -13 256 -72 146 -71
5145g1L57k62J9P5j76J72k61J46k4j11j53k5J65k1J59n0K17p7m2J76j41K15j98
$$ -71 286 24 43 118 -58 114 -147 -1 -25 -136 -289 -314 -149 -170 -11 -61 156 79 37 213 72 287 89
5168H9j4P0n2N6k88L90l65l6m4r8L04O9m37M1P2J64r5k31K66k36M85o6p3rJ68
$$ 89 75 145 93 149 -139 251 -114 -150 -194 -292 12 81 -356 -315 -243 -79 -174 -405 -139 -375 110 44 -29 -38 130
5193A30J87l32J06Rnl7n5N5K24m36L10k38K30q1Q1m03R8K35l01j02J69K8O4K36
$$ 130 317 -15 91 100 95 58 3 58 282 -154 156 -82 148 67 148 -255 -157 78 -223 -325 -156 -128 -64 172
5217A72k12Q1J76k31K26K96k15j58j89K65k87K62l7k28P4Q7Q1r3l14K6K25k61
$$ 172 -40 41 217 -14 212 508 293 135 -54 211 -76 186 149 -79 -5 82 163 70 -244 -218 7 -254
5239b54J26j73N2J23R6O7l8k07Q0K41R4k02J93L1J52j66j13j8Rj04J6l9j33K02
$$ -254 -128 -301 -249 -126 -30 37 -1 -208 -128 113 207 5 198 229 381 215 102 84 93 -11 5 -34 -167 35
5263C5k05N8J73k13J6J97j06N5J89l37J45qQ0Q4R5m34M70n2l37M94k36j99M5k20
$$ 35 -170 -112 61 -152 -136 61 -45 10 199 -138 7 -1 79 163 258 -176 294 242 -95 399 163 -36 9 -211
5287b11j34K40k1Q1k9j30J83j5k83K46k7R4J4j82J42J8J67Ql2J29j00n5L6j57
$$ -211 -345 -105 -126 -45 -74 -204 -21 -36 -319 -73 -100 -6 8 -174 -32 -14 153 161 129 258 158 103 139 -18
5311a8n1M1j5N2o8n1J3R0o7k08K27J65j55J88j45o8K23J69m46J41j00K02k00J79
$$ -18 -69 -28 -43 9 -59 -110 -97 -7 -74 -282 -55 110 -45 143 -2 -70 153 322 -124 17 -83 119 -81 98
5335I8j46J56j06J15J24m20L15m35K05n1O4J60k65L00j24k0K10k71J09L4k16K96
$$ 98 -48 108 2 117 241 -179 136 -299 -94 -145 -81 79 -186 114 -10 -30 180 -91 18 52 -164 132
5357A32r0P3j40J04J51k59r0J41k02N1J99j59O4o9J14l5p4K6j5J37j54J89j8l26
$$ 132 42 115 -25 79 230 -29 -119 22 -180 -129 70 -89 -25 -94 20 -15 -89 -63 -78 59 -95 94 76 -250
5381b50L88k01L38k77J41mRJ8k08o2J69p4L5j82J67J26l39K15m5k2m9J14K4M6
$$ -250 138 -63 275 -2 139 135 144 162 -46 -108 61 -13 22 -160 7 133 -206 9 -36 -58 -107 7 31 77
5405G7J50k64K44k00l9M8N9P4p3M9l18J21j05J31k4K03k0j94K71j97j0n7J39j99
$$ 77 227 -37 207 7 -32 16 75 149 76 125 -193 -72 -177 -46 -70 133 113 -81 190 -7 -17 -74 65 -134
5429a34J01j44K12J80j72r4J45j20L79m79K35j5j10l2j05M14j71k97L09k4pJ91
$$ -134 -33 -177 35 215 43 -51 94 -26 353 -126 109 94 -16 -48 -153 261 90 -207 102 78 71 262
5451B62l60Q4j7K64j03r8q5J58k88J6L29p1j05j80K36L17j14j36N9j50k53M05
$$ 262 -98 -14 -31 233 130 32 -53 105 -183 -167 162 91 -14 -194 42 359 245 109 168 18 -235 170
5473A70l44J94j12j63J92o4Q8J44K20j83J06p9K5k78j8Q6j1K69j87j71L04k67
$$ 170 -174 20 -92 -255 -63 -127 -39 105 325 142 248 169 194 -84 -102 -16 -27 242 55 -116 188 -79
5495g9K5K10k80J55l26K66ok5J33l49K34J79j58M6M3N1j2N6k6j1j91n3K94l45
$$ -79 -54 156 -124 31 -295 -29 -35 -60 73 -276 -42 137 -21 25 68 119 107 163 137 126 -65 -118 176 -169
5519a69J59q4Q0m9M6O0k96J76K7p1J4m3l8P1J90J31j61Q9Pj96L18j59j86L41k28
$$ -169 -10 -94 -14 -63 -17 43 -253 -77 -50 -121 -107 -150 -188 -117 73 204 43 132 139 -57 261 102 -84 257 29
5544B9j20o5k10M20j40R5j95j4L49k05R8J67q3k37J68k47L42k67K48J55j3m25
$$ 29 -91 -156 -366 54 -86 9 -186 -200 149 -56 42 209 126 -111 57 -190 152 -115 133 288 275 -150
5566a50L67j98R6M8o4N7k82j74M02r9k39R7N0j0J94j47N2N3j88J26J17K51j56
$$ -150 217 19 115 163 99 156 -126 -300 102 3 -236 -139 -89 -99 95 -52 0 53 -135 -9 108 359 203
5589B03k57J09J15k6L66m69m0J78r4l0m9r6Rr7O6J12l5M1o8J74p8r1R0j79K87
$$ 203 -54 55 170 144 510 41 1 179 85 55 6 -90 -81 -178 -112 0 -35 6 -62 112 34 -57 33 -146 141
5614A41Q8j63J00j1Q6l02K15p9J7K9k5l5k46N4M7J10j40q8J60J23j74J22Qo3q9
$$ 141 229 66 166 155 241 -61 154 75 92 121 96 61 -185 -131 -84 26 -114 -202 -42 81 -93 29 37 -26 -115
5639a15J86l0j46L69k92K1K2nJ15k31L04r2K91m19R4Qk13n9j0Q5o7N9oN9P1k20
$$ -115 71 41 -105 264 -28 -7 15 10 125 -106 198 106 397 -22 72 80 -133 -192 -202 -117 -184 -125 -131 -72 -1 -221
5665b21L20j51J20M1n5k5M9j20J43p4O5M9Q5Lk19J06k22k3k18K10k4k38K37j16
$$ -221 99 -52 68 109 54 29 78 -42 101 27 92 141 226 229 10 116 -106 -129 -347 -137 -161 -399 -162 -278
5689b78M36k16p1j75L15M5K1m8J08j60J98l31n3K79P8j31nP8k32J92J4P8j96n5
$$ -278 158 -58 -129 -304 11 56 77 29 137 -23 175 -156 -209 70 148 17 12 90 -142 50 64 142 -54 -109
5713a09%J43k52K95m47K89J05M5m5O4qj28K4KL5J43J30l68m9M98n44K71k45K07
$$ -109 -109 34 -218 77 -370 -81 24 69 24 88 80 -48 -24 -22 13 156 286 -82 -131 367 -177 94 -151 56
5737E6k1j77K40j39M0K51l78L2K02k35P7J20o4K05j43M9M5r8L7r5j78J65j70J0
$$ 56 35 -142 98 -41 -1 250 -128 -96 106 -129 -52 68 4 209 66 115 160 62 99 4 -174 -9 -179 -169
5761a69J4j02m2K70L0j60K78p5q2k03m5J22j3J47l5J97j61K53p1j25J73k60K13
$$ -169 -155 -257 -299 -29 1 -159 119 44 -38 -241 -286 -164 -177 -30 -65 132 -29 224 153 28 201 -59 154
5784A54j55j66L4J80p8J46j76J40N2Qn8n9l32K14K30L4j18N2q9j54K38p7J23K0
$$ 154 -1 -167 -133 47 -31 115 -61 79 131 139 81 22 -310 -96 134 168 50 102 13 -141 97 20 143 163
5808A63k53O2J66o0k6j25N4j77K54l18L17j27l7J23K17k13r1J60p0k1o8J32l21
$$ 163 -90 -28 138 78 52 -73 -19 -196 58 -260 57 -70 -107 16 233 20 -71 89 19 -2 -70 62 -259
5831b59K17R5pK46j28k19o9J54R9k36m3J68j65J09J62o0J76j88J09k26j10L31
$$ -259 -42 53 46 292 164 -55 -124 30 129 -107 -150 18 -147 -38 124 64 240 52 161 -65 -175 156
5853A56k12J70j13k24J94j1j53Q2J75k9J13k99K13k26nJ22M9r6P2L12k95J02j28
$$ 156 -56 114 1 -223 -29 -40 -193 -111 64 35 148 -151 62 -164 -169 -47 2 -94 -22 290 -5 97 -31
5876c1n3N1Jl8J34Nk51R5p0J2J57j37r6L1K65j05J43k87K26k60J56O2o6K0j71
$$ -31 -84 -33 -32 -70 64 69 -182 -87 -157 -145 12 -125 -221 -190 75 -30 113 -174 52 -208 -52 10 -56 -36 -207
5901b07J52J54n7J74J6J21j60j28L7K37n32R3L3J0J30l6k32K59j74j30K05J13
$$ -207 -55 99 42 216 232 353 193 65 102 339 -193 -100 -67 -57 73 37 -195 64 -110 -240 -35 78
5923G8k08J91k13o9R5J79j01K1L60m69J60J56J19k09j08N4m0L2j88M5J61q3j88
$$ 78 -130 61 -152 -221 -126 53 -48 -27 333 -136 24 180 299 90 -18 36 -4 28 -160 -115 46 -37 -225
5946b25K68n4PL8j89Mj30j60K75J51K17K3R9j87j19K87l79M83l25j43J82j20j93
$$ -225 43 -11 -4 34 -155 -151 -281 -441 -166 -15 202 225 324 137 18 305 -74 409 84 -59 123 3 -190
5969a90j74K71k0j05L58M1j73j62K66K3j03m5J12k20L16l04o2L23O1m9j13J21
$$ -190 -364 -93 -113 -218 140 181 8 -154 112 135 32 -13 99 -121 195 -109 -171 152 213 164 51 172
5991A72n9K13l30O3N7k66n6J50r4QN9J05j46O9J17L0j00J02j80q3P9p6j1J16M2
$$ 172 113 326 -4 59 116 -150 -206 -56 -150 -142 -83 22 -124 -55 62 92 -8 94 -86 -169 -90 -166 -177 -61 -19
6016a9L8j65K07p0M30l43N4j22k22J93j51k51M02j91j64L40QR1j41K63j24O9j63
$$ -19 19 -146 61 -9 421 78 132 10 -212 -19 -170 -421 -19 -210 -374 -34 -26 65 -76 187 63 132 -31
6039c1J82r2l22J88J31K53m02J77J60l64K56k23m8L4J96l52J42r4J76k15N03l5
$$ -31 151 59 -263 -75 56 309 -93 84 244 -120 136 -87 -135 -101 95 -257 -115 -209 -33 -248 255 220
6061B20l32J40J82l23J60O0j47K67l5J44l24j37J64J60J6J9n43K93j57o0J31P2
$$ 220 -112 28 210 -113 47 107 -40 227 192 336 12 -125 39 199 215 234 -309 -16 -173 -233 -102 -30
6083c0o4J38pK2O5m9j87O1r0K17j36j9J00K31k90P4M1J65k01Q4O1l52K33J2k27
$$ -30 -94 44 37 59 124 75 -112 -51 -141 76 -60 -79 21 252 -38 36 77 242 41 125 186 -166 67 79 -148
6108a48J95J02k33K36j69j52J5K87j21o4J21N4R1j84j37J47l7j54K07k00q0M06
$$ -148 47 149 -84 152 -17 -169 -154 133 12 -52 69 123 214 30 -107 40 3 -151 56 -144 -224 182
6130A82k11j91K35j16o9J65k01q8m9M05j12m0J3M2j39K80j14J17pk24L0m8N64
$$ 182 -29 -220 15 -101 -170 -5 -206 -294 -343 62 -50 -90 -77 -35 -174 106 -8 109 102 -122 -92 -140 424
$$ [...]
8191B29
##END NTUPLES=NMR FID
##END=
